##TITLE=1H_TG-2341-1
 CDCl3
 8 sc, 
 15.12.2021
##JCAMPDX= 6.0         $$ Bruker NMR JCAMP-DX V2.0
##DATA TYPE= NMR SPECTRUM
##DATA CLASS= NTUPLES
##ORIGIN= UXNMR, Bruker Analytische Messtechnik GmbH
##OWNER= root
$$ XWIN-NMR		Version 3.5
$$ Wed Dec 15 13:27:56 2021 Russian Standard Time (UT+4h)  she@DPX200
##.OBSERVE FREQUENCY= 200.131346
##.OBSERVE NUCLEUS= ^1H
##.ACQUISITION MODE= SIMULTANEOUS
##.ACQUISITION SCHEME= undefined
##.AVERAGES= 8
##.DIGITISER RES= 18
##SPECTROMETER/DATA SYSTEM= spect
##.PULSE SEQUENCE= zg30
##.SOLVENT NAME= CDCl3
##.SHIFT REFERENCE= (INTERNAL, CDCl3, 0, 15.7315)
##AUDIT TRAIL= $$ (NUMBER, WHEN, WHO, WHERE, WHAT)
$$ ##TITLE= Audit trail, XWIN-NMR		Version 3.5
$$ ##JCAMPDX= 5.01
$$ ##ORIGIN= Bruker BioSpin GmbH
$$ ##OWNER= she
$$ F:/spectra/data/she/nmr/H-F/1/pdata/1/auditp.txt
$$ ##AUDIT TRAIL=  $$ (NUMBER, WHEN, WHO, WHERE, WHAT)
(   1,<2021-12-15 13:26:24.98 +0400>,<she>,<DPX200>,
      <created by zg, POWCHK disabled, PULCHK disabled
       configuration hash MD5:
       00 E9 B6 7A A2 85 ED C7 34 08 36 98 17 FE 4E 26
       data hash MD5: 16K
       6B 1D 66 42 AA 11 3C 70 47 EF 08 51 B8 B3 DF E4>)
(   2,<2021-12-15 13:26:27.23 +0400>,<she>,<DPX200>,
      <Start of raw data processing
       efp BC_mod = 2 LB = 0.24 FT_mod = 6 PKNL = 1 PHC0 = -15876.09 PHC1 = 16.40079 SI = 16K 
       data hash MD5: 16K
       7C 18 56 4D F6 DB D8 51 66 F4 55 48 A2 9B 4C CA>)
(   3,<2021-12-15 13:26:51.59 +0400>,<she>,<DPX200>,
      <pk PHC0 = 6.009012 PHC1 = -6.999999 
       data hash MD5: 16K
       24 5A 63 9E D3 A2 FD 04 71 18 B5 4D 03 62 CB 62>)
(   4,<2021-12-15 13:26:54.75 +0400>,<she>,<DPX200>,
      <abs ABSG = 5 
       data hash MD5: 16K
       29 6D A6 1A 27 29 8F 8A 85 39 41 B6 20 C0 15 8C>)
$$ ##END=
$$ 
$$ hash MD5
$$ 4A F2 61 1C 92 9C 80 D3 04 5C 2F C6 DB DA A9 C2
##$RELAX= 
##$RELAX= 
##$RELAX= 
##$RELAX= 
##$RELAX= 
##$RELAX= 
$$ Bruker specific parameters
$$ --------------------------
##$DU= <F:/spectra>
##$EXPNO= 1
##$NAME= <H-F>
##$PROCNO= 1
##$TYPE= <nmr>
##$USER= <she>
##$AMP= (0..31)
100 100 100 100 100 100 100 100 100 100 100 100 100 100 100 100 100 100 
100 100 100 100 100 100 100 100 100 100 100 100 100 100 
##$AQSEQ= 0
##$AQ_mod= 1
##$AUNM= <au_zg>
##$AUTOPOS= <>
##$BF1= 200.13
##$BF2= 200.13
##$BF3= 200.13
##$BF4= 200.13
##$BF5= 200.13
##$BF6= 200.13
##$BF7= 200.13
##$BF8= 200.13
##$BYTORDA= 1
##$CFDGTYP= 0
##$CFRGTYP= 5
##$CHEMSTR= <none>
##$CNST= (0..31)
1 1 145 1 1 1 1 1 1 1 1 1 1 1 1 1 1 1 1 1 1 1 1 1 1 1 1 1 1 1 1 1 
##$CPDPRG= <>
##$CPDPRG1= <>
##$CPDPRG2= <>
##$CPDPRG3= <>
##$CPDPRG4= <mlev>
##$CPDPRG5= <mlev>
##$CPDPRG6= <mlev>
##$CPDPRG7= <mlev>
##$CPDPRG8= <mlev>
##$CPDPRGB= <>
##$CPDPRGT= <>
##$D= (0..31)
0 1.2 0 0 0 0 0 0 0 0.06 0 0.03 0 0 0 0 0.0002 0 0 0 0 0 0 0 0 0 0 0 0 
0 0 0 
##$DATE= 1639560384
##$DBL= (0..7)
120 120 120 120 120 120 120 120 
##$DBP= (0..7)
150 150 150 150 150 150 150 150 
##$DBP07= 0
##$DBPNAM0= <>
##$DBPNAM1= <>
##$DBPNAM2= <>
##$DBPNAM3= <>
##$DBPNAM4= <>
$$ [...]
##$SUBNAM2= <"">
##$SUBNAM3= <"">
##$SUBNAM4= <"">
##$SUBNAM5= <"">
##$SUBNAM6= <"">
##$SUBNAM7= <"">
##$SUBNAM8= <"">
##$SUBNAM9= <"">
##$SW= 18.0517287032376
##$SWIBOX= (0..15)
0 0 2 0 0 0 0 0 0 0 0 0 0 0 0 0 
##$SW_h= 3612.71676300578
##$TD= 16384
##$TD0= 1
##$TE= 0
##$TE2= 300
##$TE3= 300
##$TEG= 300
##$TL= (0..7)
0 120 120 120 120 120 120 120 
##$TP= (0..7)
150 150 150 150 150 150 150 150 
##$TP07= 0
##$TPNAME0= <>
##$TPNAME1= <>
##$TPNAME2= <>
##$TPNAME3= <>
##$TPNAME4= <>
##$TPNAME5= <>
##$TPNAME6= <>
##$TPNAME7= <>
##$TPOAL= (0..7)
0.5 0.5 0.5 0.5 0.5 0.5 0.5 0.5 
##$TPOFFS= (0..7)
0 0 0 0 0 0 0 0 
##$TUNHIN= 0
##$TUNHOUT= 0
##$TUNXOUT= 0
##$USERA1= <user>
##$USERA2= <user>
##$USERA3= <user>
##$USERA4= <user>
##$USERA5= <user>
##$V9= 5
##$VALIST= <valist>
##$VCLIST= <CCCCCCCCCCCCCCC>
##$VD= 0
##$VDLIST= <DDDDDDDDDDDDDDD>
##$VPLIST= <PPPPPPPPPPPPPPP>
##$VTLIST= <TTTTTTTTTTTTTTT>
##$WBST= 1024
##$WBSW= 4
##$XGAIN= (0..3)
0 0 0 0 
##$XL= 0
##$YL= 0
##$YMAX_a= 464753
##$YMIN_a= -655003
##$ZGOPTNS= <>
##$ZL1= 120
##$ZL2= 120
##$ZL3= 120
##$ZL4= 120
##$ABSF1= 15.71384
##$ABSF2= -2.33801
##$ABSG= 5
##$ABSL= 3
##$ALPHA= 0
##$AQORDER= 0
##$ASSFAC= 0
##$ASSFACI= 0
##$ASSFACX= 0
##$ASSWID= 0
##$AUNMP= <proc_1d>
##$AZFE= 0.1
##$AZFW= 0.1
##$BCFW= 0
##$BC_mod= 2
##$BYTORDP= 0
##$COROFFS= 0
##$CY= -3
##$DATMOD= 1
##$DC= 0
##$DFILT= <>
##$DTYPP= 0
##$F1P= 0
##$F2P= 0
##$FCOR= 1
##$FTSIZE= 16384
##$FT_mod= 6
##$GAMMA= 0
##$GB= 0
##$INTBC= 1
##$INTSCL= 0
##$ISEN= 128
##$LB= 0.24
##$LEV0= 0
##$LPBIN= 0
##$MAXI= 10000
##$MC2= 0
##$MEAN= 0
##$ME_mod= 0
##$MI= 1.114404
##$NCOEF= 0
##$NC_proc= -6
##$NLEV= 6
##$NOISF1= 3.799351
##$NOISF2= 2.8
##$NSP= 0
##$NTH_PI= 0
##$NZP= 0
##$OFFSET= 15.73146
##$PC= 1
##$PHC0= -15870.08
##$PHC1= 9.40079
##$PH_mod= 1
##$PKNL= yes
##$PPARMOD= 0
##$PSCAL= 0
##$PSIGN= 0
##$REVERSE= no
##$SF= 200.130004021016
##$SI= 16384
##$SIGF1= 3
##$SIGF2= 2
##$SINO= 5.538805
##$SIOLD= 16384
##$SREGLST= <1H.CDCl3>
##$SSB= 0
##$STSI= 16384
##$STSR= 0
##$SW_p= 3612.71676300578
##$SYMM= 0
##$S_DEV= 0
##$TDeff= 16384
##$TDoff= 0
##$TI= <>
##$TILT= no
##$TM1= 0
##$TM2= 0
##$TOPLEV= 0
##$USERP1= <user>
##$USERP2= <user>
##$USERP3= <user>
##$USERP4= <user>
##$USERP5= <user>
##$WDW= 1
##$XDIM= 16384
##$YMAX_p= 349346584
##$YMIN_p= -243622
$$ End of Bruker specific parameters
$$ ---------------------------------
##NTUPLES= NMR SPECTRUM
##VAR_NAME=  FREQUENCY,     SPECTRUM/REAL,   SPECTRUM/IMAG
##SYMBOL=    X,             R,               I
##VAR_TYPE=  INDEPENDENT,   DEPENDENT,       DEPENDENT
##VAR_FORM=  AFFN,          ASDF,            ASDF
##VAR_DIM=   16384,         16384,           16384
##UNITS=     HZ,            ARBITRARY UNITS, ARBITRARY UNITS
##FACTOR=    0.220516191357247, 1,           1
##FIRST=     3148.33707652969, 0,            0
##LAST=      -464.37968647609, 0,            0
##MIN=       -464.37968647609, -243622,      0
##MAX=       3148.33707652969, 349346584,    0
$$ Real data points
##PAGE= N=1
##DATA TABLE= (X++(R..R)), XYDATA
$$ [...]
$$ plain form
7075 24980988 25483200 26297084 27369623 28742450 30335167 32379951 34703485 37227318
7067 37227318 40139841 43063328 45894792 48357565 50569801 52577777 53981192 54434802
7059 54434802 53413368 50600435 46520825 41555551 36697881 32215592 28381343 25209018
7051 25209018 22632247 20458922 18611423 16986657 15709463 14593169 13614687 12722539
7043 12722539 11966123 11293923 10621965 10131860 9651303 9255499 8824291 8494185 8203392
7034 8203392 7912465 7601939 7310503 6983922 6763118 6626192 6402045 6098913 5899421 5697407
7024 5697407 5528930 5346204 5074525 4934397 4829083 4592329 4503785 4367645 4143111 4077372
7014 4077372 4075912 3981672 3867915 3676059 3529582 3379579 3292420 3290693 3226690 3150765 3062907
$$ packed form
7075B4980988N02212Q13884J072539J372827J592717K044784K323534K523833
7067C7227318K912523K923487K831464K462773K212236K007976J403415M53610
7059E4434802j021434k812933m079610m965274m857670m482289l834249l172325
7051B5209018k576771k173325j847499j624766j277194j116294r78482q92148
7043A2722539p56416o72200o71958m90105m80557l95804m31208l30106k90793
7034H203392k90927l10526k91436l26581k20804j36926k24147l03132j99492k02014
7024E697407j68477j82726k71679j40128j05314k36754q8544j36140k24534o5739
7014D077372j460r4240j13757j91856j46477j50003q7159j727o4003p5925q7858
$$ plain form
7003 3062907 3035034 2855501 2804586 2709228 2653521 2577284 2528066 2470274 2349149 2375610 2301973
6992 2301973 2259110 2211802 2139677 2024825 2001225 2087378 2018273 2035075 1963070 1872397 1822998
6981 1822998 1753311 1796014 1707653 1664523 1659463 1570238 1528789 1605847 1528038 1398000 1442157
6970 1442157 1400811 1372097 1356559 1364227 1431649 1404457 1276946 1233510 1208123 1200465 1182845 1212965
6958 1212965 1238290 1214053 1273565 1237808 1182652 1144646 1152185 1068067 1037483 1151505 1100475
6947 1100475 1027471 943201 989768 1027972 1069955 1089314 1110071 1067016 1014000 1044073 894391
6936 894391 917357 976503 930170 981069 973074 889637 937772 899019 909570 908174 937496 994721
6924 994721 1050911 930499 886053 923191 865176 852564 872938 909987 881737 898419 864512
$$ packed form
7003C062907k7873j79533n0915r5358n5707p6237m9218n7792j21125K6461p3637
6992B301973m2863m7308p2125j14852k3600Q6153o9105J6802p2005r0673m9399
6981A822998o9687M2703q8361m3130n060q9225m1449P7058p7809j30038M4157
6970A442157m1346k8714j5538P668O7422k7192j27511m3436k5387p658j7620L0120
6958A212965K5325k4237N9512l5757n5156l8006P539q4118l0584J14022n1030
6947A100475p3004q4270M6567L8204M1983J9359K0757m3055n3016L0073j49682
6936H94391K2966N9146m6333N0899p995q3437M8135l8753J0551j396K9322N7225
6924I94721N6190j20412m4446L7138n8015j2612K0374L7049k8250J6682l3907
$$ plain form
6913 864512 798399 847831 840006 869189 819113 815599 781915 785876 768956 714339 740350 767295
6901 767295 742923 668564 659358 705095 771642 804107 776736 714324 706109 781814 823682 788087
6889 788087 708098 697577 749689 699084 659799 619447 606955 620351 628397 527386 521922 682420
6877 682420 671308 684161 764498 786572 713926 623883 603032 597622 583243 572781 601712 561053
6865 561053 614659 624927 672498 696617 639252 651835 634479 629155 591397 477955 499372 433002
6853 433002 476919 578622 611541 612763 575211 563668 494137 522202 557686 463623 516467 623473
6841 623473 633065 520532 554406 567039 500010 529077 423337 507267 499927 466225 526041 529373
6829 529373 401828 483389 616365 585879 480449 534463 549148 501469 487201 418388 437945
$$ packed form
6913H64512o6113M9432p825K9183n0076l514l3684L961j6920n4617K6011K6945
6901G67295k4372p4359r206M5737O6547L2465k7371o2412q215P5705M1868l5595
6889G88087p9989j0521N2112n0605l9285m0352j2492J3396Q046j01011n464J60498
6877F82420j1112J2853Q0337K2074p2646r0043k0851n410j4379j0462K8931m0659
6865E61053N3606J0268M7571K4119n7365J2583j7356n324l7758j13442K1417o6370
6853D33002M3917J01703L2919J222l7552j1543o9531K8065L5484r4063N2844J07006
6841F23473R592j12533L3874J2633o7029K9067j05740Q3930p340l3702N9816L332
6829E29373j27545Q1561J32976l0486j05430N4014J4685m7679j4268o8813J9557
$$ plain form
6818 437945 458608 425058 434328 541216 460421 391366 485370 566626 452150 441776 524287
6807 524287 583396 554935 651877 567056 437938 364626 450080 554061 653916 631022 590317
6796 590317 514450 501974 492187 477518 521580 502549 532144 504513 463719 474577 440566 479850
6784 479850 558268 521282 569664 588183 529703 525614 534208 642785 640318 656693 638537 541406
6772 541406 573335 570606 501988 433836 527726 513288 418224 346117 398723 392542 475037 461934
6760 461934 503893 519484 489485 483415 522594 486352 391537 502195 558983 462864 476856 484451
6748 484451 459442 484290 616778 658941 595475 510373 512895 526241 619781 670537 615893 589868
6736 589868 550744 672252 645189 669206 595353 501120 527162 527255 543605 603888 636912 606146
$$ packed form
6818D37945K0663l3550R270J06888q0795o9055R4004Q1256j14476j0374Q2511
6807E24287N9109k8461R6942q4821j29118p3312Q5454J03981R9855k2894m0705
6796E90317p5867j2476r787j4669M4062j9031K9595k7631m0794J0858l4011L9284
6784D79850P8418l6986M8382J8519n8480m089Q594J08577k467J6375j8156r7131
6772E41406L1929k729o8618o8152R3890j4438r5064p2107N2606o181Q2495j3103
6760D61934M1959J5591k9999o070L9179l6242r4815J10658N6788r6119J3992P595
6748D84451k5009K4848J32488M2163o3466q5102K522J3346R3540N0756n4644k6025
6736E89868l9124J21508k7063K4017p3853r4233K6042R3J6350O0283L3024l0766
$$ plain form
6724 606146 530689 573497 617687 568453 699639 633993 616011 632570 690551 719296 758496
6713 758496 740798 672366 620943 690613 741706 839579 891774 840555 793840 768826 916733
6702 916733 886682 844091 907599 933925 961283 917559 956154 985078 896784 914329 931276 887553
6690 887553 911967 1025819 965777 921042 943836 911119 888329 800420 917198 903718 893304
6679 893304 945951 1001009 1001531 868722 945922 947074 993111 934206 903201 928269 1036498 1050287
6667 1050287 1089839 1081552 1125480 1069547 1135428 1202312 1156391 1124244 1137884 1211255 1221492 1211245
6655 1211245 1196829 1169045 1110128 1151628 1175074 1092705 1057409 1151634 1057442 1064266 1120676 1047907
6643 1047907 1050042 1044717 1111017 1176415 1102266 1089113 1075897 1086304 1040644 1002407 1009904 1070345
$$ packed form
6724F06146p5457M2808M4190m9234J31186o5646j7982J6559N7981K8745L9200
6713G58496j7698o8432n1423O9670N1093R7873N2195n1219m6715k5014J47907
6702I16733l0051m2591O3508K6326K7358m3724L8595K8924q8294J7545J6947m3723
6690H87553K4414J13852o0042m4735K2794l2717k2790q7909J16778j3480j0414
6679H93304N2647N5058N22j32809P7200J152M6037n8905l1005K5068J08229J3789
6667A050287L9552q287M3928n5933O5881O6884m5921l2147J3640P3371J0237j0247
6655A211245j4416k7784n8917M1500K3446q2369l5296R4225r4192O824N6410p2769
6643A047907K135n325O6300O5398p4149j3153j3216J0407m5660l8237P497O0441
$$ plain form
6631 1070345 1165758 1203587 1179823 1134241 1103414 1103246 1003773 1142853 1249840 1240710 1208990 1116231
6619 1116231 1154295 1091479 1136234 1208284 1217299 1176302 1185170 1248072 1185096 1227201 1251143 1214337
6607 1214337 1120881 1035043 1227369 1258528 1333512 1214978 1237001 1240635 1138238 1216362 1277242
6596 1277242 1263861 1301098 1221411 1179869 1235203 1266761 1296208 1308398 1375677 1260199 1266852
6585 1266852 1254053 1259948 1249019 1303998 1250950 1308521 1374553 1378833 1373866 1421863 1393262 1360978
6573 1360978 1390579 1403055 1377500 1374211 1393542 1314799 1361275 1389402 1400801 1390737 1444216 1467168
6561 1467168 1347296 1347829 1451103 1514889 1507036 1445717 1428229 1518372 1566040 1625422 1698011 1635242
6549 1635242 1651592 1685496 1682202 1731578 1739492 1679525 1704148 1749034 1766483 1709913 1662806 1605407
$$ packed form
6631A070345R5413L7829k3764m5582l0827j68r9473J39080J06987r130l1720r2759
6619A116231L8064o2816M4755P2050R015m0997Q868O2902o2976M2105K3942l6806
6607A214337r3456q5838J92326L1159P4984j18534K2023L634j02397P8124O0880
6596A277242j3381L7237p9687m1542N5334L1558K9447J2190O7279j15478O653
6585A266852j2799N895j0929N4979n3048N7571O6032M280m967M7997k8601l2284
6573A360978K9601J2476k5555l289J9331p8743M6476K8127J1399j0064N3479K2952
6561A467168j19872N33J03274O3786p853o1319j7488R0143M7668N9382P2589o2769
6549A635242J6350L3904l294M9376P914n9967K4623M4886J7449n6570m7107n7399
$$ plain form
6537 1605407 1674517 1728019 1856788 1914335 1898656 1890537 1909956 2021538 1969698 1949003 1976248
6526 1976248 1971559 2127648 2195296 2160874 2223205 2234021 2213809 2191913 2109850 2229651 2263661
6515 2263661 2209978 2358026 2296956 2105153 2089736 2216369 2269255 2383592 2331717 2376649 2385640
6504 2385640 2315618 2436309 2507196 2398654 2400373 2461882 2480342 2443313 2601575 2651493 2653965
6493 2653965 2769762 2910115 2884443 2755640 2757393 2743745 2844372 2937278 2947951 2909176 2922928
6482 2922928 2949635 2974526 2868213 2961102 3063491 3000145 3123435 3166102 3179259 3219355 3272917
6471 3272917 3407086 3378374 3401315 3406253 3427316 3493104 3499951 3604002 3745275 3784253 3827074
6460 3827074 3906680 3852976 3892548 3991415 4060203 4025486 4052927 4153777 4115193 4256143 4366053
$$ packed form
6537A605407O9110N3502J28769N7547j5679q119J9419J11582n1840k0695K7245
6526A976248m689J56089O7648l4422O2331J0816k0212k1896q2063J19801L4010
6515B263661n3683J48048o1070j91803j5417J26633N2886J14337n1875M4932Q991
6504B385640p0022J20691P0887j08542J719O1509J8460l7029J58262M9918K472
6493B653965J15797J40353k5672j28803J753j3648J00627R2906J0673l8775J3752
6482B922928K6707K4891j06313R2889J02389o3346J23290M2667J3157M0096N3562
6471C272917J34169k8712K2941M938K1063O5788O847J04051J41273L8978M2821
6460C827074P9606n3704L9572R8867O8788l4717K7441J00850l8584J40950J09910
$$ plain form
6449 4366053 4374346 4497375 4623422 4614268 4666694 4792513 4846016 4952084 4988321 4992178 5061453
6438 5061453 5133505 5310646 5455676 5482142 5583271 5725883 5758836 5773156 5832657 5831257 5909801
6427 5909801 5971552 5988126 6226158 6332061 6385276 6513545 6545525 6580912 6684351 6822754
6417 6822754 6951136 7042935 7133684 7217303 7259161 7490807 7694196 7757210 7764740 7917867 8095525
6406 8095525 8163048 8276383 8491963 8650110 8738817 8811153 8900234 9092359 9273059 9526416
6396 9526416 9550143 9664026 9865275 10029668 10253678 10436789 10565892 10733365 10969954 11167897
6386 11167897 11356750 11486944 11637900 11861136 12047627 12219839 12398367 12515837 12729707
6377 12729707 12954903 13093199 13264929 13616481 13888231 13977234 14163614 14416234 14667232 14947963
$$ packed form
6449D366053Q293J23029J26047r154N2426J25819N3503J06068L6237L857O9275
6438E061453P2052J77141J45030K6466J01129J42612L2953J4320N9501j400P8544
6427E909801O1751J6574K38032J05903N3215J28269L1980L5387J03439J38403
6417F822754J28382R1799R0749Q3619M1858K31646K03389O3014P530J53127J77658
6406H095525O7523J13335K15580J58147Q8707P2336Q9081J92125J80700K53357
6396I526416K3727J13883K01249J64393K24010J83111J29103J67473K36589J97943
6386A1167897J88853J30194J50956K23236J86491J72212J78528J17470K13870
6377A2729707K25196J38296J71730L51552K71750Q9003J86380K52620K50998K80731
$$ plain form
6367 14947963 15194868 15506261 15757272 15998896 16284884 16556969 16805477 17127877 17439240
6358 17439240 17714870 18118512 18418868 18711405 18991230 19366346 19704854 20008548 20421782
6349 20421782 20817415 21305624 21700853 22055548 22483856 23032180 23555229 24006336 24391475
6340 24391475 24766561 25361711 25881441 26399895 26792107 27331131 27899051 28444537 29019233
6331 29019233 29662185 30193416 30720280 31342213 31852310 32364864 33018764 33608896 34202818
6322 34202818 34820583 35394188 35994630 36637894 37249639 37724449 38211388 38701341 39253081
6313 39253081 39742203 40225567 40820649 41289692 41678760 42065050 42332594 42745374 43123817
6304 43123817 43394911 43574514 43767647 43960832 44213822 44265608 44227745 44220304 44319515 44359494
$$ packed form
6367A4947963K46905L11393K51011K41624K85988K72085K48508L22400L11363
6358A7439240K75630M03642L00356K92537K79825L75116L38508L03694M13234
6349B0421782L95633M88209L95229L54695M28308N48324N23049M51107L85139
6340B4391475L75086N95150N19730N18454L92212N39024N67920N45486N74696
6331B9019233O42952N31231N26864O21933N10097N12554O53900N90132N93922
6322C4202818O17765N73605O00442O43264O11745M74810M86939M89953N51740
6313C9253081M89122M83364N95082M69043L89068L86290K67544M12780L78443
6304D3123817K71094J79603J93133J93185K52990N1786l7863p441R9211L9979
$$ plain form
6294 44359494 44330517 44247798 44075748 43902531 43709141 43585472 43278090 43073020 42742537 42332264
6284 42332264 42069914 41799011 41473650 41060080 40684191 40333857 39962472 39581525 39081912
6275 39081912 38586751 38271719 37782572 37358123 36870886 36389410 36022030 35585132 35158893
6266 35158893 34736556 34320399 33898360 33327029 32597449 32000213 31532687 31116479 30677327
6257 30677327 30236854 29843767 29322196 29044583 28554290 28017236 27676868 27189804 26795067
6248 26795067 26359703 25810918 25231139 24690313 24222392 23733730 23356534 22868681 22412325
6239 22412325 22034445 21610911 21299137 20952458 20507118 20179952 19851980 19532371 19137125
6230 19137125 18729032 18343783 18086137 17803984 17503307 17264165 16998611 16708293 16438097
$$ packed form
6294D4359494k8977q2719j72050j73217j93390j23669l07382k05070l30483m10273
6284D2332264k62350k70903l25361m13570l75889l50334l71385l80947m99613
6275C9081912m95161l15032m89147m24449m87237m81476l67380m36898m26239
6266C5158893m22337m16157m22039n71331p29580n97236m67526m16208m39152
6257C0677327m40473l93087n21571k77613m90293n37054l40368m87064l94737
6248B6795067m35364n48785n79779n40826m67921m88662l77196m87853m56356
6239B2412325l77880m23534l11774l46679m45340l27166l27972l19609l95246
6230A9137125m08093l85249k57646k82153l00677k39142k65554k90318k70196
$$ plain form
6221 16438097 16167049 15909611 15800040 15596667 15376339 15163938 14874689 14631055 14391397
6212 14391397 14133102 14112820 13871836 13639487 13428525 13180168 12958540 12733137 12618728 12468654
6202 12468654 12216728 12017045 11742297 11531115 11378568 11298317 11181543 11077373 10971736 10903391
6192 10903391 10737141 10497341 10321798 10239646 10107171 10037342 9906147 9749924 9737959 9708299
6182 9708299 9433143 9342117 9303547 9130183 8983439 8920719 8802029 8640085 8640349 8545682 8433064
6171 8433064 8218535 8063434 8005988 7958015 7923491 7920339 7815260 7592727 7477512 7380908 7304425
6160 7304425 7274400 7257407 7237067 7146339 7117999 7070946 7060311 7030567 6980367 6914825 6932221
6149 6932221 6981730 6951530 6984253 6927361 6800565 6650960 6616884 6593780 6521028 6416164 6452889
$$ packed form
6221A6438097k71048k57438j09571k03373k20328k12401k89249k43634k39658
6212A4391397k58295k0282k40984k32349k10962k48357k21628k25403j14409j50074
6202A2468654k51926j99683k74748k11182j52547q0251j16774j04170j05637o8345
6192A0903391j66250k39800j75543q2152j32475o9829j31195j56223j1965k9660
6182I708299k75156r1026l8570j73364j46744o2720j18690j61944K64r4667j12618
6171H433064k14529j55101n7446m7973l4524l152j05079k22533j15215r6604p6483
6160G304425l0025j6993k0340r0728k8340m7053j0635k9744n0200o5542J7396
6149F932221M9509l0200L2723n6892j26796j49605l4076k3104p2752j04864L6725
$$ plain form
6138 6452889 6543294 6465534 6428516 6432857 6433633 6495367 6510050 6476735 6217979 5983386 5915547 5820747
6126 5820747 5889125 5998947 5923343 5729244 5714323 5754784 5701953 5672192 5703956 5765881 5692726
6115 5692726 5640844 5475715 5470407 5499396 5382917 5269854 5082210 5041570 4952650 4835382 4628182
6104 4628182 4653825 4646479 4636871 4622353 4487644 4451638 4432590 4446463 4523607 4494550 4473549 4425178
6092 4425178 4505485 4588126 4553929 4483395 4483755 4400974 4426743 4428479 4448997 4461692 4466455 4519208
6080 4519208 4570042 4451866 4365124 4422594 4420473 4378609 4390882 4395982 4481777 4500276 4340759
6069 4340759 4326669 4332685 4404973 4352529 4369164 4354211 4275236 4395377 4412278 4337494 4330659 4344302
6057 4344302 4242970 4359169 4470898 4527289 4602769 4610813 4598794 4660969 4779456 4816954 4796720
$$ packed form
6138F452889R0405p7760l7018M341P76O1734J4683l3315k58756k34593o7839r4800
6126E820747O8378J09822p5604j94099j4921M0461n2831k9761L1764O1925p3155
6115E692726n1882j65129n308K8989j16479j13063j87644m0640q8920j17268k07200
6104D628182K5643p346r608j4518j34709l6006j9048J3873P7144k9057k1001m8371
6092D425178Q0307Q2641l4197p0534L60q2781K5769J736K0518J2695M763N2753
6080D519208N0834j18176q6742N7470k121m1864J2273N100Q5795J8499j59517
6069D340759j4090O016P2288n2444J6635j4953p8975J20141J6901p4784o835J3643
6057D344302j01332J16199J11729N6391P5480Q044j2019O2175J18487L7498k0234
$$ plain form
6046 4796720 4853446 4989406 4985319 4960891 4956704 5018623 5210653 5165104 5233586 5387826 5268373
6035 5268373 5302599 5506618 5717251 5647539 5676595 5726930 5902716 5985839 6089261 6083541 6159677
6024 6159677 6163229 6304043 6550735 6735547 6775556 6870431 7050933 7158408 7434797 7555545
6014 7555545 7722016 7863734 8012398 8146184 8252728 8381326 8440910 8479741 8549976 8474094
6004 8474094 8463921 8573299 8646174 8756021 8730953 8781858 8846736 8959760 8979048 9046117 9247616
5993 9247616 9370177 9595747 9764396 9813982 9978126 10123160 10282883 10456191 10606067 10790566
5983 10790566 10925986 11145967 11277561 11562973 11914028 12252157 12670687 13039541 13454856
5974 13454856 13979445 14356723 14709564 14977713 15285921 15526323 15771766 16010152 16140786
$$ packed form
6046D796720N6726J35960m087k4428m187O1919J92030m5549O8482J54240j19453
6035E268373L4226K04019K10633o9712K9056N0335J75786Q3123J03422n720P6136
6024F159677L552J40814K46692J84812M0009R4875J80502J07475K76389J20748
6014G555545J66471J41718J48664J33786J06544J28598N9584L8831P0235p5882
6004H474094j0173J09378P2875J09847k5068N0905O4878J13024J9288O7069K01499
5993I247616J22561K25570J68649M9586J64144J45034J59723J73308J49876J84499
5983A0790566J35420K19981J31594K85412L51055L38129M18530L68854M15315
5974A3454856N24589L77278L52841K68149L08208K40402K45443K38386J30634
$$ plain form
5965 16140786 16219488 16152460 16103920 16307970 16525334 16738709 17053000 17275262 17643613 18021878
5955 18021878 18446545 18763088 19071975 19297410 19495196 19513104 19469414 19408824 19374906 19278482
5945 19278482 19135922 19088963 19025955 19034321 19063414 19240901 19454351 19747122 19943475 20190832
5935 20190832 20515031 20655609 20797142 20896816 21099041 21167194 21056540 20889408 20597767 20221327
5925 20221327 19754065 19406192 19094383 18872567 18685722 18535267 18380559 18452676 18506900 18508246
5915 18508246 18563023 18544279 18415074 18368190 18366205 18203410 18019366 17604639 17193473 16893759
5905 16893759 16672320 16346234 16022386 15844676 15669646 15446676 15318134 15146219 15176296 15060928
5895 15060928 15057470 15071930 14980405 14747014 14560915 14408924 14104051 13972103 13697038 13482110
$$ packed form
5965A6140786P8702o7028m8540K04050K17364K13375L14291K22262L68351L78265
5955A8021878M24667L16543L08887K25435J97786J7908m3690o0590l3918r6424
5945A9278482j42560m6959o3008Q366K9093J77487K13450K92771J96353K47357
5935B0190832L24199J40578J41533R9674K02225O8153j10654j67132k91641l76440
5925B0221327m67262l47873l11809k21816j86845j50455j54708P2117N4224J346
5915A8508246N4777j8744j29205m6884j985j62795j84044m14727m11166k99714
5905A6893759k21439l26086l23848j77710j75030k22970j28542j71915L0077j15368
5895A5060928l458J4460r1525k33391j86099j51991l04873j31948k75065k14928
$$ plain form
5885 13482110 13182394 13053237 12955886 12781924 12676684 12654794 12595769 12654896 12646630 12788095
5875 12788095 12758686 12877523 12955688 13004033 13092210 13240950 13331467 13314597 13293722 13427684 13460455
5864 13460455 13566542 13780712 13891712 13991489 14074270 14276514 14631288 14906835 15043793 15407274
5854 15407274 15711750 16161573 16485736 16872824 17288263 17577596 18013073 18359571 18696537
5845 18696537 19164364 19619962 20274124 20743886 21392003 22141106 22856092 23489465 24072292
5836 24072292 24637560 24989854 25280739 25622980 25989662 26403517 26957087 27490844 27943032
5827 27943032 28451238 28922121 29593949 30119644 30753789 31461905 32236995 33251997 34240014
5818 34240014 35556218 37129440 38929912 40747752 42906621 45275080 47764580 50479223
$$ packed form
5885A3482110k99716j29157r7351j73962j05240k1890n9025N9127q266J41465
5875A2788095k9409J18837P8165M8345Q8177J48740R0517j6870k0875J33962L2771
5864A3460455J06087K14170J11000R9777Q2781K02244L54774K75547J36958L63481
5854A5407274L04476M49823L24163L87088M15439K89333M35477L46498L36966
5845A8696537M67827M55598O54162M69762O48117P49103P14986O33373N82827
5836B4072292N65268L52294K90885L42241L66682M13855N53570N33757M52188
5827B7943032N08206M70883O71828N25695O34145P08116P75090J015002R88017
5818C4240014J316204J573222J800472J817840K158869K368459K489500K714643
$$ plain form
5810 50479223 53346090 56214543 59083296 61960228 64703812 67026730 68648430 69659389
5802 69659389 70252308 70318783 69996578 69505703 68604868 67806158 67473997 67387803 66629230 64777811
5792 64777811 62524060 60570760 59246516 58480385 58152858 57943051 57905683 57767409 57386622
5783 57386622 56841954 55986663 55044732 54068211 52954849 51578425 50179928 48749745 47083397
5774 47083397 45332204 43482409 42036720 40677622 39312975 38008787 36884920 35921571
5766 35921571 34960530 34021128 33339755 32796456 32134615 31644809 31182662 30691606 30318034
5757 30318034 29985792 29730387 29432121 29072431 28898523 28693977 28547142 28446210 28404544 28346661
5747 28346661 28417507 28492495 28695329 28804386 28824594 28862216 29024132 29018335 29024411 29071126 29078679
$$ packed form
5810E0479223K866867K868453K868753K876932K743584K322918J621700J010959
5802F9659389N92919O6475l22205m90875r00835p98710l32161q6194p58573j851419
5792F4777811k253751j953300j324244p66131l27527k09807l7368j38274l80787
5783E7386622n44668q55291r41931r76521j113362j376424j398497j430183j666348
5774D7083397j751193j849795j445689j359098j364647j304188j123867r63349
5766C5921571r61041r39402o81373n43299o61841m89806m62147m91056l73572
5757C0318034l32242k55405k98266l59690j73908k04546j46835j00932m1666n7883
5747B8346661P0846P4988K02834J09057K0208L7622J61916n797O076M6715P553
$$ plain form
5736 29078679 29083291 29131133 29044376 29080488 29146678 29010349 28942830 28910224 28865049 28818511 28823549
5725 28823549 28700443 28651382 28543693 28428837 28526099 28635249 28912601 29280396 29622122 30186259
5715 30186259 30777912 31407756 31953534 32640475 33265414 33729703 34190383 34482700 34689038
5706 34689038 34785994 34705825 34573863 34539414 34230498 34053029 33922838 33862190 33893380 33977421
5696 33977421 34158058 34435331 34893070 35440485 36068088 36834073 37747511 38637245 39484620
5687 39484620 40409345 41182333 41774162 42376044 42800096 42882443 42571995 42012447 41262558 40290736
5677 40290736 39063430 37996416 36829075 35770244 34596570 33698689 32796293 32085705 31333931
5668 31333931 30562086 29890171 29244797 28696946 28087923 27650955 27126557 26598761 26129036
$$ packed form
5736B9078679M612M7842q6757L6112O6190j36329o7519l2606m5175m6538N038
5725B8823549j23106m9061j07689j14856R7262J09150K77352L67795L41726N64137
5715C0186259N91653O29844N45778O86941O24939M64289M60680K92317K06338
5706C4689038R6956q0169j31962l4449l08916j77469j30191o0648L1190Q4041
5696C3977421J80637K77273M57739N47415O27603P65985R13438Q89734Q47375
5687C9484620R24725P72988N91829O01882M24052Q2347l10448n59548p49889r71822
5677D0290736j227306j067014j167341j058831j173674q97881r02396p10588p51774
5668C1333931p71845o71915o45374n47851o09023m36968n24398n27796m69725
$$ plain form
5659 26129036 25684781 25190167 24887565 24616975 24310930 23891036 23555930 23275547 23015288
5650 23015288 22720230 22362794 22094948 21913367 21669418 21551274 21466474 21307467 21197262 20943767
5640 20943767 20713574 20621469 20514568 20277776 20143791 19934036 19651167 19383737 19203025 18927401
5630 18927401 18699729 18467349 18274962 17968675 17791908 17553185 17315279 17213430 17008578
5621 17008578 16826709 16573610 16414507 16080084 15784976 15556717 15294088 15117373 14937123
5612 14937123 14740925 14377599 14112693 13841055 13685008 13449849 13133657 13007462 12724039
5603 12724039 12464413 12209089 11894094 11638506 11425805 11077116 10922763 10741373 10511685
5594 10511685 10427289 10335490 10174774 10082913 9975752 9759489 9683802 9593832 9540093 9381663
$$ packed form
5659B6129036m44255m94614l02602k70590l06045m19894l35106k80383k60259
5650B3015288k95058l57436k67846j81581k43949j18144q4800j59007j10205k53495
5640B0943767k30193r2105j06901k36792j33985k09755k82869k67430j80712k75624
5630A8927401k27672k32380j92387l06287j76767k38723k37906j01849k04852
5621A7008578j81869k53099j59103l34423k95108k28259k62629j76715j80250
5612A4937123j96198l63326k64906k71638j56047k35159l16192j26195k83423
5603A2724039k59626k55324l14995k55588k12701l48689j54353j81390k29688
5594A0511685q4396r1799j60716r1861j07161k16263p5687q9970n3739j58430
$$ plain form
5584 9381663 9279271 9165204 8920598 8908401 8918119 8755951 8629132 8578639 8584692 8663136 8653412
5573 8653412 8704356 8664076 8620718 8788578 8937004 8875999 8936633 9070095 9166611 9249106 9446153
5562 9446153 9617386 9709153 9835049 10012432 10257265 10628986 10918934 11287403 11592589 12135659
5552 12135659 12808161 13657703 14609204 15614192 16738939 18243230 19945090 21280869 22092433
5543 22092433 23123923 25138840 27023542 26916637 24443110 21164414 18448393 16460207
5535 16460207 14900686 13801645 12971461 12315291 11740659 11431050 11161954 10770385 10604789
5526 10604789 10561829 10569518 10560894 10484314 10707793 10853562 10832292 11012058 11214460 11514026 11871554
5515 11871554 12286157 12321940 12052682 11606372 11076133 10729969 10561741 10432445 10545808 10798247
$$ packed form
5584I381663j02392j14067k44606j2197R718j62168j26819n0493O053P8444r724
5573H653412N0944m0280m3358J67860J48426o1005O0634J33462R6516Q2495J97047
5562I446153J71233R1767J25896J77383K44833L71721K89948L68469L05186N43070
5552A2135659O72502Q49542R51501J004988J124747J504291J701860J335779Q11564
5543B2092433J031490K014917J884702j06905k473527l278696k716021j988186
5535A6460207j559521j099041q30184o56170n74632l09609k69096l91569j65596
5526A0604789m2960P689q624p6580K23479J45769k1270J79766K02402K99566L57528
5515A1871554M14603L5783k69258m46310n30239l46164j68228j29296J13363K52439
$$ plain form
5505 10798247 10934350 11201386 11599854 12060737 12512876 12898593 13009077 13273828 14077946
5496 14077946 14797972 14455423 13057186 11534419 10512525 9699778 9062946 8657595 8229250
5487 8229250 8068348 7823385 7522643 7398763 7336515 7215334 7202446 7257210 7146662 7206331
5477 7206331 7309259 7375908 7345012 7308062 7337715 7433944 7469421 7538009 7506882 7400364 7181608
5466 7181608 6983619 6920449 6863297 6923579 6905725 6978237 7162504 7394782 7605145 7815507
5456 7815507 8268830 8668952 9209097 9622288 9985952 10493096 11173268 11273824 10624979 9939973
5446 9939973 9488926 9166970 8829518 8502858 8302314 8194719 8305911 8511366 8667610 8675299
5436 8675299 8304366 7716768 7215864 6775014 6570748 6322119 6106348 6042510 5914957 5671659
$$ packed form
5505A0798247J36103K67036L98468M60883M52139L85717J10484K64751Q04118
5496A4077946P20026l42549j398237j522767j021894q12747o36832m05351m28345
5487H229250j60902k44963l00742j23880o2248j21181j2888N4764j10548N9669
5477G206331J02928O6649l0896l6950K9653R6229L5477O8588l1127j06518k18756
5466G181608j97989o3170n7152O0282j7854P2512J84267K32278K10363K10362
5456G815507M53323M00122N40145M13191L63664N07144O80172J00556o48845o85006
5446I939973m51047l21956l37452l26660k00544j07595J11192K05455J56244P689
5436H675299l70933n87598n00904m40850k04266k48629k15771o3838j27553k43298
$$ plain form
5426 5671659 5533746 5515489 5523033 5539260 5580105 5627731 5678136 5548197 5680926 5731750 5839509
5415 5839509 5955392 6203246 6391136 6543196 6478453 6523601 6648793 6854173 7079685 7193046
5405 7193046 7120610 6706527 6324541 5865327 5457332 5268115 5087832 4847604 4728211 4645167
5395 4645167 4651188 4574030 4572327 4574616 4613869 4573970 4667155 4796195 4900101 4849027 5025830
5384 5025830 5154760 5374258 5520037 5714984 5818042 5877581 5820584 5843235 5828075 6018541
5374 6018541 6072824 6001185 5823036 5725792 5601620 5490013 5307351 5317610 5294416 5265797 5137657
5363 5137657 5096720 5026474 4950783 4911539 5006568 4988145 4861952 4813543 4739558 4756782 4669191
5352 4669191 4663738 4653368 4581493 4650161 4637101 4512398 4317267 4195271 3940730 3770262 3743798
$$ packed form
5426E671659j37913j8257P544J6227M0845M7626N0405j29939J32729N0824J07759
5415E839509J15883K47854J87890J52060o4743M5148J25192K05380K25512J13361
5405G193046p2436m14083l81986m59214m07995j89217j80283k40228j19393q3044
5395D645167O021p7158j703K289L9253l9899R3185J29040J03906n1074J76803
5384E025830J28930K19498J45779J94947J03058N9539n6997K2651j5160J90466
5374F018541N4283p1639j78149r7244j24172j11607j82662J0259k3194k8619j28140
5363E137657m0937p0246p5691l9244R5029j8423j26193m8409p3985J7224q7591
5352D669191n453j0370p1875O8668j3060j24703j95131j21996k54541j70468k6464
$$ plain form
5341 3743798 3674672 3623865 3542656 3485588 3420254 3304483 3194198 3383489 3337417 3403859 3369850
5330 3369850 3303127 3402664 3414609 3426230 3549794 3502627 3492695 3460257 3434359 3377599 3407353
5319 3407353 3411521 3331921 3253117 3158253 3181352 3215469 3191600 3169733 3055178 3227417 3240506
5308 3240506 3387126 3514731 3563258 3651143 3715007 3806933 3938453 4015913 4085557 4120262 4176855
5297 4176855 4142706 4190349 4240712 4290677 4308177 4242982 4249678 4170286 4210273 4294413 4264507 4213491
5285 4213491 4159072 4028477 4014076 3844852 3686499 3725013 3727524 3622171 3495225 3463978 3363847
5274 3363847 3347191 3294083 3264920 3300121 3324403 3268876 3265468 3314965 3210629 3209194 3225178 3188464
5262 3188464 3180338 3110102 2960574 2885688 2844049 2882590 2803885 2661900 2670432 2625951 2564954
$$ packed form
5341C743798o9126n0807q1209n7068o5334j15771j10285J89291m6072O6442l4009
5330C369850o6723R9537J1945J1621J23564m7167r932l2438k5898n6760K9754
5319C407353M168p9600p8804r4864K3099L4117k3869k1867j14555J72239J3089
5308C240506J46620J27605M8527Q7885O3864R1926J31520P7460O9644L4705N6593
5297D176855l4149M7643N0363M9965J7500o5195O696p9392L9987Q4140k9906n1016
5285D213491n4419j30595j4401j69224j58353L8514K511j05353j26946l1247j00131
5274C363847j6656n3108k9163L5201K4282n5527l408M9497j04336j435J5984l6714
5262C188464q126p0236j49528p4886m1639L8541p8705j41985Q532m4481o0997
$$ plain form
5251 2564954 2585685 2578244 2529011 2615480 2620915 2622477 2608562 2606960 2580182 2665509 2761987 2857411
5239 2857411 3034434 3144484 3272610 3481973 3873679 4110166 4294761 4742352 5277336 5595202
5229 5595202 5883998 6392076 6828014 6565211 5850325 5201342 4656142 4230730 3906802 3644276
5219 3644276 3372709 3219311 3141416 3019676 2902983 2755806 2593165 2596799 2526125 2522670 2469337
5208 2469337 2364515 2420782 2348169 2276820 2364047 2312262 2152080 2176673 2226061 2222637 2154171
5197 2154171 2156277 2147408 2214508 2214941 2326797 2257158 2222049 2309097 2246855 2197043 2221526 2231473
5185 2231473 2253334 2277034 2260874 2310382 2298854 2264723 2219647 2099545 2035952 1973938 1903586
5174 1903586 1913587 1978972 1945963 1880998 1853551 1784637 1644249 1755587 1809560 1840731 1813617
$$ packed form
5251B564954K0731p441m9233Q6469N435J562j3915j602k6778Q5327R6478R5424
5239B857411J77023J10050J28126K09363L91706K36487J84595M47591N34984L17866
5229E595202K88796N08078M35938k62803p14886o48983n45200m25412l23928k62526
5219C644276k71567j53398p7895j21740j16693j47177j62641L634p0674l455n3333
5208B469337j04822N6267p2613p1349Q7227n1785j60182K4593M9388l424o8466
5197B154171K106q869O7100M33J11856o9639l5109Q7048o2242m9812K4483R947
5185B231473K1861K3700j6160M9508j1528l4131m5076j20102o3593o2014p0352
5174A903586J0001O5385l3009o4965k7447o8914j40388J11338N3973L1171k7114
$$ plain form
5163 1813617 1848843 1821877 1870898 1882098 1725187 1796405 1876782 1926169 1977999 2074702 2059160
5152 2059160 2013624 2035596 2069225 2033340 2059524 2124586 2038307 2010747 1931922 1826649 1834710
5141 1834710 1872790 1866174 1862883 1982399 1987444 1981933 1991072 1993117 1958041 1935588 1955322 2081845
5129 2081845 2090779 2008897 2113064 2152103 2115013 2123279 2160459 2158067 2112920 2104161 2158098 2259177
5117 2259177 2269402 2321405 2342069 2444635 2566637 2671484 2724558 2801882 2956074 3139191
5107 3139191 3312964 3398066 3299715 3094927 2987603 3016959 2948085 2829804 2830299 2770325 2953276
5096 2953276 3099575 3003542 3057773 3143899 3142714 3106550 3091643 3193538 3289775 3374985 3435283
5085 3435283 3542453 3693087 3728641 3667608 3571591 3499484 3464951 3375438 3425271 3529229 3502719
$$ packed form
5163A813617L5226k6966M9021J1200j56911P1218Q0377M9387N1830R6703j5542
5152B059160m5536K1972L3629l5885K6184O5062q6279k7560p8825j05273Q061
5141A834710L8080o616l291J19516N045n511R139K045l5076k2453J9734J26523
5129B081845Q934q1882J04167L9039l7090Q266L7180k392m5147q759N3937J01079
5117B259177J0225N2003K0664J02566J22002J04847N3074P7324J54192J83117
5107C139191J73773Q5102r8351k04788j07324K9356o8874j18281M95n9974J82951
5096B953276J46299r6033N4231Q6126j185l6164j4907J01895R6237Q5210O0298
5085C435283J07170J50634L5554o1033r6017p2107l4533q9513M9833J03958k6510
$$ plain form
5074 3502719 3566714 3555354 3621562 3760114 3736140 3889748 3968696 3923574 3986854 4123028 4276582
5063 4276582 4280669 4363982 4465864 4465341 4398376 4379602 4191264 4009289 3857194 3629546 3621894
5052 3621894 3484491 3395644 3378821 3231701 3188391 3199414 3219912 3237149 3191961 3198631 3231698
5041 3231698 3249330 3267178 3316647 3389508 3396808 3491987 3473844 3355519 3358191 3257396 3214235
5030 3214235 3209389 3201755 3257483 3134342 3046282 3020332 3043432 2982553 2935237 2873192 2893213 2859649
5018 2859649 2912695 2981863 3078710 3029199 2979670 2929675 2978868 3035592 2975754 2914443 2973736
5007 2973736 3017862 2988678 3009758 3036740 3079787 3072808 3090670 3161722 3151799 3237932 3242814 3275645
4995 3275645 3362146 3294935 3316288 3257855 3291956 3371464 3539420 3584478 3532808 3431754 3571974
$$ packed form
5074C502719O3995j1360O6208J38552k3974J53608P8948m5122O3280J36174J53554
5063D276582M087Q3313J01882n23o6965j8774j88338j81975j52095k27648p652
5052C621894j37403q8847j6823j47120m3310J1023K0498J7237m5188O670L3067
5041C231698J7632J7848M9469P2861P300R5179j8143j18325K672j00795m3161
5030C214235m846p634N5728j23141q8060k5950K3100o0879m7316o2045K0021l3564
5018B859649N3046O9168R6847m9511m9529m9995M9193N6724n9838o1311N9293
5007B973736M4126k9184K1080K6982M3047o979J7862P1052r923Q6133M882L2831
4995C275645Q6501o7211K1353n8433L4101P9508J67956M5058n1670j01054J40220
$$ plain form
4984 3571974 3689349 3727327 3764724 3820910 3854111 3828162 3822627 3797045 3869369 4028959 4035892
4973 4035892 4121413 4054668 4018934 4132678 4296806 4415770 4433387 4449377 4446713 4549384 4601025
4962 4601025 4658847 4858644 5033917 5155736 5275007 5509487 5652940 5866166 6110450 6403454
4952 6403454 6534556 6758756 7003304 7190355 7467252 7714690 7905240 8167886 8273758 8259278
4942 8259278 8320711 8323926 8391796 8524735 8581604 8497481 8439991 8529124 8681503 8702755 8628740
4931 8628740 8653915 8661366 8579092 8513460 8422081 8328597 8195073 8016561 7802428 7634931 7437621
4920 7437621 7274471 7137120 7051256 6993200 6926561 6767393 6541093 6333722 6275164 6256829
4910 6256829 6216567 6098742 6097158 6058405 5896254 5865561 5917705 5892276 5843266 5870688 5907212
$$ packed form
4984C571974J17375L7978L7397N6186L3201k5949n535k5582P2324J59590O933
4973D035892Q5521o6745l5734J13744J64128J18964J7617J5990k664J02671N1641
4962D601025N7822J99797J75273J21819J19271K34480J43453K13226K44284K93004
4952F403454J31102K24200K44548J87051K76897K47438J90550K62646J05872j4480
4942H259278O1433L215O7870J32939N6869q4123n7490Q9133J52379K1252p4015
4931H628740K5175P451q2274o5632r1379r3484j33524j78512k14133j67497j97310
4920G437621j63150j37351q5864n8056o6639j59168k26300k07371n8558j8335
4910F256829m0262j17825j584l8753j62151l0693N2144k5429m9010K7422L6524
$$ plain form
4899 5907212 5927642 5982040 5979261 6108612 6246950 6258440 6440867 6558293 6639996 6854417 7007215
4888 7007215 7145023 7424117 7656759 7886227 8126331 8439581 8649415 8895577 9152589 9470335
4878 9470335 9753059 9897264 10145203 10220657 10393500 10458510 10533562 10560497 10570608 10588707 10542358
4867 10542358 10457480 10410433 10319244 10216518 10123981 9988282 9759798 9539374 9314283 9130154
4857 9130154 8845231 8754912 8561950 8318132 8287833 8039997 7784090 7679082 7622980 7499001
4847 7499001 7382916 7307008 7159098 7121405 7142949 7123655 7134957 7028140 7007493 6998538 7127784
4836 7127784 7247083 7362373 7517227 7614954 7808733 7993898 8182308 8455082 8797020 9039796
4826 9039796 9482259 9959558 10363757 10760615 11269964 11897095 12394610 12859788 13295286 13588518
$$ packed form
4899E907212K0430N4398k779J29351J38338J1490J82427J17426Q1703K14421J52798
4888G007215J37808K79094K32642K29468K40104L13250K09834K46162K57012L17746
4878I470335K82724J44205K47939P5454J72843O5010P5052K6935J0111J8099m6349
4867A0542358q4878m7047r1189j02726r2537j35699k28484k20424k25091j84129
4857I130154k84923r0319j92962k43818l0299k47836k55907j05008n6102j23979
4847G499001j16085p5908j47910l7693K1544j9294J1302j06817k0647q955J29246
4836G127784J19299J15290J54854R7727J93779J85165J88410K72774L41938K42776
4826I039796M42463M77299M04199L96858N09349O27131M97515M65178M35498K93232
$$ plain form
4816 13588518 13795521 14035004 14082858 14007009 13913762 13833236 13719829 13659529 13708225 13815341
4806 13815341 13936656 14079846 14242751 14399940 14496130 14591967 14531031 14336308 14030281 13537512
4796 13537512 12956183 12440445 11969816 11637951 11334484 11067500 10820559 10626662 10423653
4787 10423653 10286230 10312733 10397831 10353484 10492179 10570517 10603730 10799744 11042659 11374250
4777 11374250 11740031 12118027 12535345 13011987 13636321 14278834 14934994 15810341 16643637
4768 16643637 17477455 18379511 19303790 20112127 20946697 21736129 22304830 22824874 23173976
4759 23173976 23159764 23074346 22915054 22652101 22214898 21930278 21813466 21568936 21499364 21528384
4749 21528384 21471202 21335028 21270901 21157379 20808121 20255968 19565949 18737962 17776450 16733773
$$ packed form
4816A3588518K07003K39483M7854p5849r3247q0526j13407o0300M8696J07116
4806A3815341J21315J43190J62905J57189R6190R5837o0936j94723l06027m92769
4796A3537512n81329n15738m70629l31865l03467k66984k46941j93897k03009
4787A0423653j37423K6503Q5098m4347J38695P8338L3213J96014K42915L31591
4777A1374250L65781L77996M17318M76642O24334O42513O56160Q75347Q33296
4768A6643637Q33818R02056R24279Q08337Q34570P89432N68701N20044L49102
4759B3173976j4212q5418j59292k62953m37203k84620j16812k44530o9572K9020
4749B1528384n7182j36174o4127j13522l49258n52153o90019q27987r61512j042677
$$ plain form
4739 16733773 15735948 14956252 14124201 13423484 12783213 12323395 11947880 11453534 11023329
4730 11023329 10649040 10268290 10058747 9858968 9651983 9544329 9368920 9275647 9175805 9205159
4720 9205159 9182262 9079896 8976864 8852375 8700052 8651708 8463900 8351534 8329608 8377986
4710 8377986 8420882 8324956 8206725 8219607 8265561 8222706 8189874 8124121 8031915 7983784 8097343
4699 8097343 8193476 8342845 8458752 8481900 8529328 8695547 8803823 8925203 9063621 9284320
4689 9284320 9410199 9615589 9803525 9924904 9909893 10078599 10311203 10400179 10658806 11004877
4679 11004877 11313388 11602747 11995553 12399895 12825038 13214879 13653148 14149206 14836408
4670 14836408 15473956 16097412 16790290 17568337 18338764 19083020 19886592 20763213 21478851
$$ packed form
4739A6733773r97825p79696q32051p00717o40271m59818l75515m94346m30205
4730A1023329l74289l80750k09543j99779k06985j07654j75409r3273r9842K9354
4720I205159k2897j02366j03032j24489j52323m8344j87808j12366k1926M8378
4710H377986M2896r5926j18231J2882M5954m2855l2832o5753r2206m8131J13559
4699H097343R6133J49369J15907K3148M7428J66219J08276J21380J38418K20699
4689I284320J25879K05390J87936J21379j5011J68706K32604Q8976K58627L46071
4679A1004877L08511K89359L92806M04342M25143L89841M38269M96058O87202
4670A4836408O37548O23456O92878P78047P70427P44256Q03572Q76621P15638
$$ plain form
4661 21478851 22231568 22969105 23452408 23780279 23921733 23686001 23083450 22226677 21367340
4652 21367340 20449720 19509250 18614837 17820055 17032214 16422503 15870605 15394631 15073761
4643 15073761 14805513 14667432 14456937 14402596 14447628 14576781 14573868 14686799 14912954 15075776
4633 15075776 15380134 15789369 16229374 16687754 17162687 17805059 18485451 19163146 19895298
4624 19895298 20708650 21669762 22409374 23105041 23781288 24199492 24521061 24620942 24551644 24318441
4614 24318441 24046041 23800449 23636245 23473653 23576624 23706109 23774536 23964654 24244374 24470386
4604 24470386 24553656 24612239 24590098 24379726 23868891 23208909 22547530 21886228 21201827 20511061
4594 20511061 19910339 19332474 18796121 18201657 17621260 16958965 16460349 15996990 15462449
$$ packed form
4661B1478851P52717P37537M83303L27871J41454k35732o02551q56773q59337
4652B1367340r17620r40470q94413p94782p87841o09711n51898m75974l20870
4643A5073761k68248j38081k10495n4341M5032J29153k913J12931K26155J62822
4633A5075776L04358M09235M40005M58380M74933O42372O80392O77695P32152
4624A9895298Q13352R61112P39612O95667O76247M18204L21569R9881o9298k33203
4614B4318441k72400k45592j64204j62592J02971J29485O8427J90118K79720K26012
4604B4470386Q3270N8583k2141k10372n10835o59982o61379o61302o84401o90766
4594B0511061o00722n77865n36353n94464n80397o62295m98616m63359n34541
$$ plain form
4585 15462449 15006051 14477204 14113477 13888593 13647063 13431445 13231801 13083777 13055600 13005040
4575 13005040 12951095 13028887 13288045 13446299 13674339 13875321 14218076 14598557 14842151 15136249
4565 15136249 15327321 15553934 15524095 15462392 15100476 14612732 14187889 13529598 12998171 12539356
4555 12539356 12108628 11689338 11398978 11092959 10755775 10524168 10221809 10054655 9916501
4546 9916501 9843703 9823609 9585963 9376182 9315344 9341322 9245674 9250984 9271614 9272909 9216134
4535 9216134 9266525 9195661 9145863 9099389 8930621 8888517 8867706 8884989 8952334 8882900 8939931
4524 8939931 8850706 8801881 8983464 9078575 9170783 9309968 9295410 9335408 9480922 9594847 9734577
4513 9734577 9765388 9915706 10145255 10327897 10579463 10732220 10638229 10827133 10880819 11008934
$$ packed form
4585A5462449m56398n28847l63727k24884k41530k15618j99644j48024k8177n0560
4575A3005040n3945P7792K59158J58254K28040K00982L42755L80481K43594K94098
4565A5136249J91072K26613k9839o1703l61916m87744m24843o58291n31427m58815
4555A2539356m30728m19290k90360l06019l37184k31607l02359j67154j38154
4546I916501p2798k0094k37646k09781o0838K5978r5648N310K0630J295n6775
4535I216134N0391p0864m9798m6474j68768m2104k0811J7283O7345o9434N7031
4524H939931q9225m8825J81583R5111R2208J39185j4558L9998J45514J13925J39730
4513I734577L0811J50318K29549J82642K51566J52757r3991J88904N3686J28115
$$ plain form
4503 11008934 11055903 10841145 10779454 10622866 10466963 10306794 10097621 9785410 9680280 9502217
4493 9502217 9264939 9052850 9050066 8998936 8726163 8535994 8518033 8550199 8430148 8438675 8420448
4482 8420448 8449580 8470074 8435392 8515667 8551730 8637035 8716553 8885586 8987682 9082586 9185615
4471 9185615 9336775 9531054 9651369 9801249 9934876 10070215 10247815 10308883 10348151 10408606
4461 10408606 10424917 10361372 10213345 10111227 10030073 10014098 9869236 9705037 9716872 9649953
4451 9649953 9706989 9871355 9770281 9757974 9902332 10065931 10231610 10304896 10287080 10524468
4441 10524468 10619610 10596504 10492194 10378155 10238602 9872447 9585398 9463694 9305724 9103259
4431 9103259 8829993 8632906 8445728 8398138 8233681 8128401 8142461 8112594 8075136 8030313
$$ packed form
4503A1008934M6969k14758o1691j56588j55903j60169k09173l12211j05130j78063
4493I502217k37278k12089k784n1130k72773j90169j7961L2166j20051Q527j8227
4482H420448K9132K0494l4682Q0275L6063Q5305P9518J69033J02096R4904J03029
4471I185615J51160J94279J20315J49880J33627J35339J77600O1068L9268O0455
4461A0408606J6311o3545j48027j02118q1154j5975j44862j64199J1835o6919
4451I649953N7036J64366j01074j2307J44358J63599J65679P3286j7816K37388
4441A0524468R5142k3106j04310j14039j39553l66155k87049j21704j57970k02465
4431I103259k73266j97087j87178m7590j64457j05280J4060k9867l7458m4823
$$ plain form
4421 8030313 7976133 7999283 7909737 7924271 7973033 7991032 7894007 7856605 7961009 8074175 8189406
4410 8189406 8313262 8330152 8444090 8528737 8734028 8967399 9030847 9299616 9521222 9667205
4400 9667205 9844664 10046044 10148113 10278347 10348987 10496126 10553761 10475609 10549035 10612477
4390 10612477 10562364 10623166 10660180 10532019 10475117 10544933 10556282 10510868 10493684 10378664 10242514
4379 10242514 10157918 10077674 10036991 9911362 9723635 9522995 9421675 9317136 9205935 9032612
4369 9032612 9076091 8981802 8879831 8843887 8825912 8752345 8743770 8613379 8583000 8688877 8843135
4358 8843135 8834133 8787314 8906210 9026678 9095692 9218805 9303154 9313311 9414388 9445293 9594429
4347 9594429 9635697 9582097 9561556 9448201 9441887 9465860 9337530 9337929 9287530 9143966 9052883
$$ packed form
4421H030313n4180K3150q9546J4534M8762J7999r7025l7402J04404J13166J15231
4410H189406J23856J6890J13938Q4647K05291K33371O3448K68769K21606J45983
4400I667205J77459K01380J02069J30234P0640J47139N7635p8152P3426O3442
4390A0612477n0113O0802L7014j28161n6902O9816J1349m5414j7184j15020j36150
4379A0242514q4596q0244m0683j25629j87727k00640j01320j04539j11201j73323
4369I032612M3479r4289j01971l5944j7975p3567q575j30391l0379J05877J54258
4358H843135r002m6819J18896J20468O9014J23113Q4349J0157J01077L0905J49136
4347I594429M1268n3600k0541j13355o314K3973j28330L99n0399j43564r1083
$$ plain form
4336 9052883 8845652 8766377 8774608 8681365 8649467 8511626 8469890 8563648 8593422 8667799 8572759
4325 8572759 8631648 8733281 8824315 8938267 8980114 9079203 9193929 9292550 9328994 9358430 9398458
4314 9398458 9448986 9455339 9338941 9173125 9007849 8864859 8812507 8791200 8750590 8704233 8671224
4303 8671224 8515168 8328724 8263694 8221323 8188930 8178071 8126024 8171778 8230478 8136814 8201078
4292 8201078 8399610 8463295 8532811 8584820 8607215 8715937 8782992 8827329 8864654 8860075 8958908
4281 8958908 9021463 9059427 9090999 9215517 9259078 9298694 9267899 9284633 9224688 8959196 8894448
4270 8894448 8945969 8877981 8750575 8549937 8599786 8590711 8472632 8470646 8433838 8363239 8345437
4259 8345437 8379662 8455897 8459009 8510057 8523073 8375462 8456242 8476834 8527357 8579385 8512196
$$ packed form
4336I052883k07231p9275Q231r3243l1898j37841m1736R3758K9774P4377r5040
4325H572759N8889J01633R1034J13952M1847R9089J14726R8621L6444K9436M0028
4314I398458N0528O353j16398j65816j65276j42990n2352k1307m0610m6357l3009
4303H671224j56056j86444o5030m2371l2393j0859n2047M5754N8700r3664O4264
4292H201078J98532O3685O9516N2009K2395J08722O7055M4337L7325m579R8833
4281H958908O2555L7964L1572J24518M3561L9616l0795J6734n9945k65492o4748
4270H894448N1521o7988j27406k00638M9849r075j18079j986l6808p0599j7802
4259H345437L4225P6235L112N1048J3016j47611Q0780K0592N0523N2028o7189
$$ plain form
4248 8512196 8547250 8591312 8620361 8683579 8856980 8934754 8990548 9079603 9222245 9370968 9553593
4237 9553593 9648209 9791275 9949466 10142954 10328244 10468251 10712781 11012289 11278214 11438171
4227 11438171 11778500 12083608 12402253 12656913 13012923 13361912 13416650 13593318 13858305 14151663
4217 14151663 14531319 14748078 15058913 15416389 15735991 16161875 16456342 16688518 17092079
4208 17092079 17505453 17946237 18344305 18783805 19362268 19805521 20278108 20784787 21233979
4199 21233979 21725911 22198203 22661457 23308094 23965853 24504208 25381773 26228658 27045186
4190 27045186 28050313 28998884 30133176 31228520 32353278 33525260 34949089 36474997
4182 36474997 37839807 39432084 41182288 43169867 45375027 47818760 50438061 53468001
$$ packed form
4248H512196L5054M4062K9049O3218J73401P7774N5794Q9055J42642J48723J82625
4237I553593R4616J43066J58191J93488J85290J40007K44530K99508K65925J59957
4227A1438171L40329L05108L18645K54660L56010L48989N4738J76668K64987K93358
4217A4151663L79656K16759L10835L57476L19602M25884K94467K32176M03561
4208A7092079M13374M40784L98068M39500N78463M43253M72587N06679M49192
4199B1233979M91932M72292M63254O46637O57759N38355Q77565Q46885Q16528
4190B7045186J005127R48571J134292J095344J124758J171982J423829J525908
4182C6474997J364810J592277J750204J987579K205160K443733K619301L029940
$$ plain form
4174 53468001 56793352 60603518 64828041 69455945 74822088 81003403 88090786 96253949
4166 96253949 105606969 116414242 129119102 143670995 160130071 178679140 199171529
4159 199171529 221363412 245460441 270538890 294641873 316926571 336125233 348759624
4152 348759624 349346584 335058719 308744066 276288988 243562308 214203254 189551739
4145 189551739 169310159 152936173 139378963 128033235 118479266 110310788 103439841
4138 103439841 97700858 92678944 88105326 83893185 79887238 76181579 72676062 69275186
4130 69275186 66142802 63301401 60831209 58644664 56620674 54685050 52987026 51393804
4122 51393804 49741374 48117261 46528268 45257449 43965226 42724235 41760319 40796937
$$ packed form
4174E3468001L325351L810166M224523M627904N366143O181315P087383Q163163
4166I6253949R353020J0807273J2704860J4551893J6459076J8549069K0492389
4159A99171529K2191883K4097029K5078449K4102983K2284698J9198662J2634391
4152C48759624N86960j4287865k6314653l2455078l2726680k9359054k4651515
4145A89551739k0241580j6373986j3557210j1345728r553969q168478o870947
4138A03439841n738983n021914m573618m212141m005947l705659l505517l400876
4130F9275186l132384k841401k470192k186545k023990j935624j698024j593222
4122E1393804j652430j624113j588993j270819j292223j240991r63916r63382
$$ plain form
4114 40796937 39819472 38858759 37923576 37067099 36142345 35221477 34428600 33663876 32799098
4105 32799098 31783118 30610438 29391440 28423228 27425478 26535725 25800321 25132586 24512340
4096 24512340 23912477 23327321 22657873 22273467 21954321 21628314 21124801 20774391 20521982
4087 20521982 20347717 20083793 19876088 19662198 19450541 19391506 19218210 19115971 19084555 19060559
4077 19060559 19021797 18974827 18998030 19133067 19272215 19415993 19695149 20065471 20483694 20884162
4067 20884162 21167504 21596961 21980850 22313631 22853034 23439067 23598982 22971021 21940219
4058 21940219 21141913 20679410 20306786 20029572 19945969 19854076 19903469 19916350 19908140 19958303 20137927
4047 20137927 20301580 20595711 20754735 20874372 21142339 21419504 21799318 22065343 22338083
$$ packed form
4114D0796937r77465r60713r35183q56477r24754r20868p92877p64724q64778
4105C2799098j015980j172680j218998r68212r97750q89753p35404o67735o20246
4096B4512340n99863n85156o69448l84406l19146l26007n03513l50410k52409
4087B0521982j74265k63924k07705k13890k11657n9035j73296j02239l1416k3996
4077A9060559l8762m6970K3203J35037J39148J43778K79156L70322M18223M00468
4067B0884162K83342M29457L83889L32781N39403N86033J59915o27961j030802
4058B1940219p98306m62503l72624k77214q3603r1893M9393J2881q210N0163J79624
4047B0137927J63653K94131J59024J19637K67967K77165L79814K66025K72740
$$ plain form
4038 22338083 22698734 23135949 23529320 24004026 24499075 24920412 25395170 25885948 26412981
4029 26412981 27050775 27830423 28709589 29301709 30057492 30918492 31815840 32754932 33689761
4020 33689761 34678590 35782812 37019869 38208148 39486125 40780412 42270369 43713375
4012 43713375 45210549 46744031 48537255 50278366 52106232 53856994 55641426 57480592
4004 57480592 59452641 61522318 63513354 65453563 67371174 69277778 71252222 73270178
3996 73270178 75200417 77053425 78772256 80523755 82107105 83610466 85112507 86611609
3988 86611609 87919562 89139959 90337329 91393894 92187661 92924558 93620467 94120968 94477056
3979 94477056 94714706 94733562 94692654 94541969 94245233 93813072 93277554 92582688 91980004 91183247
$$ packed form
4038B2338083L60651M37215L93371M74706M95049M21337M74758M90778N27033
4029B6412981O37794P79648Q79166N92120P55783Q61000Q97348R39092R34829
4020C3689761R88829J104222J237057J188279J277977J294287J489957J443006
4012D3713375J497174J533482J793224J741111J827866J750762J784432J839166
4004E7480592J972049K069677J991036J940209J917611J906604J974444K017956
3996G3270178J930239J853008J718831J751499J583350J503361J502041J499102
3988H6611609J307953J220397J197370J056565P93767P36897O95909N00501L56088
3979I4477056K37650J8856m0908j50685k96736m32161n35518o94866o02684p96757
$$ plain form
3969 91183247 90288891 89434167 88517469 87470114 86347957 85271135 84081930 82888440 81659836
3960 81659836 80591094 79425384 78226991 77042020 75919876 74875733 73736039 72545205
3952 72545205 71434311 70315084 69231609 68209247 67161516 66091788 64994999 63895684
3944 63895684 62914381 61942720 60804315 59809730 58670323 57674749 56641708 55631811 54629003
3935 54629003 53454173 52354811 51269059 50181864 49233392 48193328 47107463 45978708
3927 45978708 44883904 43780037 42616098 41579288 40517972 39495976 38481255 37468884
3919 37468884 36508078 35538902 34520108 33653386 32842832 31955265 31116283 30337856 29535364
3910 29535364 28757440 27929981 27274659 26638810 25869042 25289676 24817404 24225359 23667277
$$ packed form
3969I1183247q94356q54724r16698j047355j122157j076822j189205j193490j228604
3960H1659836j068742j165710j198393j184971j122144j044143j139694j190834
3952G2545205j110894j119227j083475j022362j047731j069728j096789j099315
3944F3895684r81303r71661j138405r94585j139407r95574j033041j009897j002808
3935E4629003j174830j099362j085752j087195r48472j040064j085865j128755
3927D5978708j094804j103867j163939j036810j061316j021996j014721j012371
3919C7468884r60806r69176j018794q66722q10554q87567q38982p78427q02492
3910B9535364p77924q27459o55322o35849p69768n79366m72272n92045n58082
$$ plain form
3901 23667277 23123826 22693748 22369629 21911360 21526780 21141569 20868539 20539004 20256490
3892 20256490 19860460 19375713 19202302 18994766 18677220 18331356 18076904 17911228 17734334
3883 17734334 17545158 17351695 17189549 16989717 16782994 16601902 16395120 16251864 16162683 16037886
3873 16037886 16039810 16016053 15907691 15804296 15725590 15798194 15782543 15754408 15741198 15842442 15810974
3862 15810974 15718470 15655682 15450543 15196991 15022077 14805904 14653679 14490290 14343099 14271159
3852 14271159 14204503 14162969 14105949 14073829 13995574 13882385 13942267 13964068 13875226 13902713 13766309
3841 13766309 13814164 13849373 13819788 13839768 13776300 13796869 13735780 13770717 13831242 13730864 13692432
3830 13692432 13595003 13416430 13390245 13234124 13120162 13024723 12891977 12829226 12667245 12495646
$$ packed form
3901B3667277n43451m30078l24119m58269l84580l85211k73030l29535k82514
3892B0256490l96030m84747j73411k07536l17546l45864k54452j65676j76894
3883A7734334j89176j93463j62146j99832k06723j81092k06782j43256q9181j24797
3873A6037886J924k3757j08362j03395p8706P2604j5651k8135j3210J01244l1468
3862A5810974r2504o2788k05139k53552j74914k16173j52225j63389j47191p1940
3852A4271159o6656m1534n7020l2120p8255j13189N9882K1801q8842K7487j36404
3841A3766309M7855L5209k9585J9980o3468K0569o1089L4937O0525j00378l8432
3830A3692432r7429j78573k6185j56121j13962r5439j32746o2751j61981j71599
$$ plain form
3820 12495646 12496277 12458293 12264161 11990011 11814601 11772764 11675767 11634611 11525395 11516272 11428552
3809 11428552 11250863 11186578 11048321 10946861 10790606 10663408 10488271 10398311 10299890 10166171
3799 10166171 10008387 9924298 9989519 9886973 9877340 9870376 9738597 9690701 9606762 9690002 9583277
3788 9583277 9448467 9436659 9293492 9401200 9486852 9421914 9439798 9486419 9502041 9577220 9579897
3777 9579897 9735260 9712454 9850272 9961127 10024236 10153518 10106875 10189727 10305586 10460981
3767 10460981 10486802 10531795 10600795 10805943 10969553 10950212 11133666 11280990 11464322 11571745
3757 11571745 11684581 11846818 11924836 12064923 12280360 12433025 12539935 12740437 12991548 13069081
3747 13069081 13107117 13264210 13478029 13649456 13842365 14092212 14220592 14438928 14749489 15064363
$$ packed form
3820A2495646O31l7984j94132k74150j75410m1837r6997m1156j09216r123q7720
3809A1428552j77689o4285j38257j01460j56255j27198j75137q9960r8421j33719
3799A0166171j57784q4089O5221j02546r633o964j31779m7896q3939Q3240j06725
3788I583277j34810j1808j43167J07708Q5652o4938J7884M6621J5622P5179K677
3777I579897J55363k2806J37818J10855O3109J29282m6643Q2852J15859J55395
3767A0460981K5821M4993O9000K05148J63610j9341J83454J47324J83332J07423
3757A1571745J12836J62237P8018J40087K15437J52665J06910K00502K51111P7533
3747A3069081L8036J57093K13819J71427J92909K49847J28380K18336L10561L14874
$$ plain form
3737 15064363 15282649 15693255 16023114 16350892 16634810 16902011 17325442 17807690 18154511
3728 18154511 18568123 19047444 19584897 20058951 20644127 21315930 21817209 22308846 22970816
3719 22970816 23593792 24271897 24828685 25344466 26075331 26620114 27235991 27821804 28337053
3710 28337053 28843239 29540407 30037401 30531126 31073298 31631609 32340479 32953506 33336217
3701 33336217 33876740 34455938 35039165 35694184 36331340 36853868 37460184 38205743 38961267
3692 38961267 39787663 40636598 41420253 42358583 43320980 44452479 45679372 46981505 48439459
3683 48439459 50062826 51804468 53618592 55614991 57919702 60363936 62945971 65876893
3675 65876893 68861767 72040289 75575163 79391189 83420781 87855400 92540736 97510500
$$ packed form
3737A5064363K18286M10606L29859L27778K83918K67201M23431M82248L46821
3728A8154511M13612M79321N37453M74054N85176O71803N01279M91637O61970
3719B2970816O22976O78105N56788N15781P30865N44783O15877N85813N15249
3710B8337053N06186O97168M96994M93725N42172N58311P08870O13027L82711
3701C3336217N40523N79198N83227O55019O37156N22528O06316P45559P55524
3692C8961267Q26396Q48935P83655R38330R62397J131499J226893J302133J457954
3683D8439459J623367J741642J814124J996399K304711K444234K582035K930922
3675F5876893K984874L178522L534874L816026M029592M434619M685336M969764
$$ plain form
3667 97510500 102760133 108186510 113855416 119790465 125847963 132182015 138645322 144965878
3659 144965878 151255110 157354849 163191881 168702658 173829321 178497525 182502581 185936414
3651 185936414 188756391 190879492 192454044 193416197 193974218 193966977 193358753 192250549 190662078
3642 190662078 188534922 185886133 182905047 179515523 175799595 171687357 167546404 163251789
3634 163251789 158913433 154645374 150229151 145973438 141968545 138167176 134618591 131228497
3626 131228497 128089193 125349064 122883325 120736386 118857227 117349689 116158439 115266062
3618 115266062 114689545 114360178 114400222 114676678 115217529 115912912 116937801 118052821 119401965
3609 119401965 120922935 122488775 124262659 126199126 128261896 130242716 132245785 134346251
$$ packed form
3667I7510500N249633N426377N668906N935049O057498O334052O463307O320556
3659A44965878O289232O099739N837032N510777N126663M668204M005056L433833
3651A85936414K819977K123101J574552R62153N58021p241o08224j108204j588471
3642A90662078k127156k648789k981086l389524l715928m112238m140953m294615
3634A63251789m338356m268059m416223m255713m004893l801369l548585l390094
3626A31228497l139304k740129k465739k146939j879159j507538j191250q92377
3618A15266062n76517l29367M0044K76456N40851O95383J024889J115020J349144
3609A19401965J520970J565840J773884J936467K062770J980820K003069K100466
$$ plain form
3601 134346251 136490600 138543487 140453489 142357277 144121638 145819595 147347641 148825800
3593 148825800 150179147 151361923 152412520 153247643 153861813 154370327 154798084 154873107 154847627
3584 154847627 154621416 154183134 153517437 152692289 151732872 150740147 149719286 148591242 147554774
3575 147554774 146460142 145528374 144577725 143636746 142787493 142087253 141607784 141084205 140790096
3566 140790096 140682631 140694780 140860176 141097681 141611466 142222268 142892165 143623826 144503070
3557 144503070 145464447 146488221 147488384 148486127 149632952 150683124 151573055 152522997 153409563
3548 153409563 154270469 155213747 155919982 156405190 156849391 157094287 157235212 157232659 156968477 156541125
3538 156541125 156032189 155266457 154230952 153101994 151781121 150353642 148835643 147113729
$$ packed form
3601A34346251K144349K052887J910002J903788J764361J697957J528046J478159
3593A48825800J353347J182776J050597Q35123O14170N08514M27757P5023k5480
3584A54847627k26211m38282o65697q25148r59417r92725j020861j128044j036468
3575A47554774j094632r31768r50649r40979q49253p00240m79469n23579k94109
3566A40790096j07465J2149J65396K37505N13785O10802O69897P31661Q79244
3557A44503070R61377J023774J000163R97743J146825J050172Q89931R49942Q86566
3548A53409563Q60906R43278P06235M85208M44201K44896J40925k553k64182m27352
3538A56541125n08936p65732j035505j128958j320873j427479j517999j721914
$$ plain form
3530 147113729 145321331 143432026 141366408 139074273 136758813 134470756 132075368 129627362
3522 129627362 127086977 124584248 122085869 119710931 117095092 114621528 112221625 109984721
3514 109984721 107867920 105760414 103685472 101778362 100064019 98461196 96888679 95471480
3506 95471480 94204194 93085316 92085737 91165840 90262573 89558156 88795935 88100808 87487735
3497 87487735 86968853 86486756 85932902 85386395 84908197 84411597 83805214 83275993 82688955
3488 82688955 82080222 81404984 80663776 79837183 79064626 78056698 76949300 76040275 75003954
3479 75003954 73976711 72771791 71609705 70438778 69053581 67902178 66718559 65398112
3471 65398112 64160915 62871209 61568287 60290077 58958536 57646306 56403064 55082686
$$ packed form
3530A47113729j792398j889305k065618k292135k315460k288057k395388k448006
3522A29627362k540385k502729k498379k374938k615839k473564k399903k236904
3514A09984721k116801k107506k074942j907110j714343j602823j572517j417199
3506I5471480j267286j118878r99579r19897r03267p04417p62221o95127o13073
3497H7487735n18882m82097n53854n46507m78198m96600o06383n29221n87038
3488H2688955o08733o75238p41208q26593p72557j007928j107398r09025j036321
3479G5003954j027243j204920j162086j170927j385197j151403j183619j320447
3471F5398112j237197j289706j302922j278210j331541j312230j243242j320378
$$ plain form
3463 55082686 53653917 52388195 51285755 50118186 48895928 47673430 46673681 45710907
3455 45710907 44590664 43665830 42747521 41830311 40979019 40208286 39343920 38578563 37857138
3446 37857138 37099791 36399036 35772259 35158416 34524822 33917405 33311664 32665097 32143546
3437 32143546 31596631 31094648 30590913 30111032 29630687 29064312 28626713 28250000 27779350
3428 27779350 27281986 26932859 26604613 26178099 25726759 25194012 24872044 24531808 24085490
3419 24085490 23737159 23333190 22904400 22499283 21949815 21479515 21057274 20778748 20327788
3410 20327788 19902699 19525981 19033772 18598843 18194909 17717059 17264368 16836546 16440686
3401 16440686 15963346 15478260 15112694 14723001 14348310 14047036 13652556 13196109 12972599
$$ packed form
3463E5082686j428769j265722j102440j167569j222258j222498r99749r62774
3455D5710907j120243r24834r18309r17210q51292p70733q64366p65357p21425
3446C7857138p57347p00755o26777o13843o33594o07417o05741o46567n21551
3437C2143546n46915n01983n03735m79881m80345n66375m37599l76713m70650
3428B7779350m97364l49127l28246m26514m51340n32747l21968l40236m46318
3419B4085490l48331m03969m28790m05117n49468m70300m22241k78526m50960
3410B0327788m25089l76718m92209m34929m03934m77850m52691m27822l95860
3401A6440686m77340m85086l65566l89693l74691l01274l94480m56447k23510
$$ plain form
3392 12972599 12728699 12394956 12092753 11847575 11580496 11233853 10983745 10873599 10637524
3383 10637524 10487103 10403351 10128925 9866855 9574028 9392395 9304295 9224578 9153680 8963424
3373 8963424 8879068 8785918 8767855 8617943 8486915 8463974 8395369 8370357 8250777 8168502 8084869
3362 8084869 8036835 7951810 7784169 7718677 7661184 7528344 7430983 7414152 7174093 7054284 7003184
3351 7003184 6942142 6827846 6697208 6617421 6598368 6585831 6468171 6380386 6430725 6347379 6280187
3340 6280187 6109738 6015080 6085729 6000008 5966542 5869937 5754509 5744358 5656171 5643656 5656896
3329 5656896 5728296 5723982 5636004 5554845 5418117 5556288 5561657 5511524 5448529 5466888 5566870
3318 5566870 5576961 5589177 5475046 5610052 5731021 5571943 5429846 5420511 5502922 5508111 5519010
$$ packed form
3392A2972599k43900l33743l02203k45178k67079l46643k50108j10146k36075
3383A0637524j50421q3752k74426k62070k92827j81633q8100p9717p0898j90256
3373H963424q4356r3150j8063j49912j31028k2941o8605k5012j19580q2275q3633
3362H084869m8034q5025j67641o5492n7493j32840r7361j6831k40059j19809n1100
3351G003184o1042j14296j30638p9787j9053j2537j17660q7785N0339q3346o7192
3340F280187j70449r4658P0649q5721l3466r6605j15428j0151q8187j2515J3240
3329E656896P1400m314q7978q1159j36728J38171N369n0133o2995J8359R9982
3318E566870J0091J2216j14131J35006J20969j59078j42097r335Q2411N189J0899
$$ plain form
3307 5519010 5577825 5601152 5657751 5705831 5709524 5801964 5906830 5896000 5995618 6113000 6219219
3296 6219219 6351785 6396630 6604707 6733968 6825659 6930250 6990384 7141345 7248579 7430342
3286 7430342 7507510 7500810 7329216 7270406 7240756 7218405 6955427 6769891 6808716 6675297 6696873
3275 6696873 6755547 6754824 6742863 6755860 6892362 6945555 7046811 7036723 7176016 7403278 7571855
3264 7571855 7740190 7968469 8282584 8542878 8732519 8857423 9030223 8997795 8869583 8731638
3254 8731638 8759240 8763580 8795883 8847803 8968251 9038378 8856739 8752071 8777534 8585857 8501059
3243 8501059 8436406 8208918 8078028 7963828 7701025 7518156 7305108 7163122 7067182 7045143
3233 7045143 6918845 6945497 6975507 6994132 6979124 7085351 7298433 7327455 7439126 7556264
$$ packed form
3307E519010N8815K3327N6599M8080L693R2440J04866j0830R9618J17382J06219
3296F219219J32566M4845K08077J29261R1691J04591O0134J50961J07234J81763
3286G430342P7168o700j71594n8810k9650k2351k62978j85536L8825j33419K1576
3275F696873N8674p23j1961J2997J36502N3193J01256j0088J39293K27262J68577
3264G571855J68335K28279L14115K60294J89641J24904J72800l2428j28212j37945
3254H731638K7602M340L2303N1920J20448P0127j81639j04668K5463j91677q4798
3243H501059o4653k27488j30890j14200k62803j82869k13048j41986r5940k2039
3233G045143j26298K6652L0010J8625j5008J06227K13082K9022J11671J17138
$$ plain form
3223 7556264 7637766 7706567 7670640 7720479 7951686 8213252 8473616 8276972 7833731 7387450
3213 7387450 6994278 6648473 6482523 6365010 6185519 6112578 6046580 5969055 5789068 5813217
3203 5813217 5841303 5837030 5843845 5890623 5866934 6027008 6367340 6663388 7000340 7397477 7906127
3192 7906127 8492517 8963708 9082711 9174847 9514885 10048369 10813248 11258762 10872363 9980639
3182 9980639 9134803 8412403 7759720 7334692 6919202 6702438 6507059 6348699 6126479 6049379
3172 6049379 6023104 6020100 6060755 5980058 6036106 6261806 6475441 6696647 6995218 7518494 8090774
3161 8090774 8556174 9171946 9642493 10074919 10855662 11655711 12338155 13124725 13638292 13620887
3151 13620887 13129476 12286604 11371538 10254530 9270862 8472866 7802135 7151132 6767917
$$ packed form
3223G556264Q1502O8801l5927M9839K31207K61566K60364j96644m43241m46281
3213G387450l93172l45805j65950j17513j79491p2941o5998p7525j79987K4149
3203E813217K8086m273O815M6778k3689J60074L40332K96048L36952L97137N08650
3192G906127N86390M71191J19003R2136L40038N33484P64879M45514l86399q91724
3182I980639q45836p22400o52683m25028m15490k16764j95379j58360k22220p7100
3172F049379k6275l004M0655q0697N6048K25700K13635K21206K98571N23276N72280
3161H090774M65400O15772M70547M32426P80743Q00049O82444P86570N13567j7405
3151A3620887m91411q42872r15066j117008r83668p97996o70731o51003l83215
$$ plain form
3142 6767917 6464877 6173130 6129627 6054556 5994314 5855189 5888656 5999381 6195406 6411688
3132 6411688 6763200 7102609 7417514 7898831 8220472 8621944 8953755 9251119 9555557 9516777
3122 9516777 9045371 8209984 7387943 6588063 5894785 5369374 4967213 4639299 4384463 4106082
3112 4106082 3912621 3757158 3528176 3359478 3243288 3129976 3032262 2971579 2806821 2699784
3102 2699784 2708073 2672719 2541999 2486536 2408025 2337384 2250562 2267767 2240180 2216533 2285759
3091 2285759 2150834 2071974 2049038 1988732 1948160 2012500 2000802 1967857 1966167 1801755 1764310
3080 1764310 1780010 1696724 1691351 1708505 1554660 1453058 1574164 1605373 1547491 1492761 1361779
3069 1361779 1351588 1371294 1324786 1273774 1315955 1215339 1218872 1237922 1322552 1254825 1091539
$$ packed form
3142F767917l03040k91747m3503p5071o0242j39125L3467J10725J96025K16282
3132F411688L51512L39409L14905M81317L21641M01472L31811K97364L04438l8780
3122I516777m71406q35387q22041p99880o93278n25411m02161l27914k54836k78381
3112D106082j93461j55463k28982j68698j16190j13312r7714o0683j64758j07037
3102B699784Q289l5354j30720n5463p8511p0641q6822J7205k7587k3647O9226
3091B285759j34925p8860k2936o0306m0572O4340j1698l2945j690j64412l7445
3080A764310J5700q3286n373J7154j53845j01602J21106L1209n7882n4730j30982
3069A361779j0191J9706m6508n1012M2181j00616L533J9050Q4630o7727j63286
$$ plain form
3058 1091539 1134507 1241781 1209360 1161474 1148704 1169538 1150048 1015755 949180 912951 990964
3047 990964 939622 1000133 994388 959543 938536 837044 776801 802845 830165 888347 845861 771171
3035 771171 702356 717286 694553 824248 863479 822058 722631 753136 806816 748215 819175
3024 819175 823124 828143 787624 746187 699220 714531 673748 696318 711671 726703 805002 814872
3012 814872 766280 776854 776796 747585 770292 724896 657642 722122 679788 644077 620683 552694
3000 552694 559215 556418 632134 657988 718208 634220 664391 662112 481157 521127 577945 617272
2988 617272 644899 658647 621729 595361 616421 628674 548894 609833 652614 654254 620977 568716
2976 568716 596676 555902 626164 610294 658832 681039 667527 639814 570902 481291 516348 573289
$$ packed form
3058A091539M2968J07274l2421m7886j2770K0834j9490j34293o6575l6229P8013
3047I90964n1342O0511n745l4845k1007j01492o0243K6044K7320N8182m2486p4690
3035G71171o8815J4930k2733J29695L9231m1421r9427L0505N3680n8601P0960
3024H19175L949N019m0519m1437m6967J5311m0783K2570J5353J5032P8299R870
3012H14872m8592J0574n8k9211K2707m5396o7254O4480m2334l5711k3394o7989
3000E52694O521k797P5716K5854O0220q3988L0171k279j80955L9970N6818L9327
2988F17272K7627J3748l6918k6368K1060J2253p9780O0939M2781J640l3277n2261
2976E68716K7960m0774P0262j5870M8538K2207j3512k7713o8912q9611L5057N6941
$$ plain form
2964 573289 667284 709961 699905 590552 536933 607937 732922 764116 681935 677963 615120
2953 615120 597313 575908 612756 575334 571030 569945 662947 645493 663221 703054 691544 711543
2941 711543 679543 725798 723966 704361 652281 696238 759252 742390 705478 693638 747458 741074
2929 741074 672792 711053 774528 809236 775457 826484 859461 773205 802161 747111 709266 806635
2917 806635 904302 781815 791127 874565 960101 920298 839124 844981 867165 845405 834913 1036317
2905 1036317 1072966 987807 940708 938409 958722 904215 895727 837553 898070 823632 768234 849255
2893 849255 775945 836770 818962 850407 837257 791561 835190 719046 765221 731859 698352
2882 698352 766839 775448 731788 670221 739141 794747 792965 787740 804564 747517 679694 711334
$$ packed form
2964E73289R3995M2677j0056j09353n3619P1004J24985L1194q2181l972o2843
2953F15120j7807k1405L6848l7422m304j085R3002j7454J7728L9833j1510J9999
2941G11543l2000M6255j832j9605n2080M3957O3014j6862l6912j1840N3820o384
2929G41074o8282L8261O3475L4708l3779N1027L2977q6256K8956n5050l7845R7369
2917H06635R7667j22487R312Q3438Q5536l9803q1174N857K2184k1760j0492K01404
2905A036317L6649q5159m7099k299K0313n4507q488n8174O0517p4438n5398Q1021
2893H49255p3310O0825j7808L1445j3150m5696M3629j16144M6175l3362l3507
2882F98352O8487Q609m3660o1567O8920N5606j782n225J6824n7047o7823L1640
$$ plain form
2870 711334 813936 739434 719498 674023 569016 570119 535068 530530 540715 639352 579171 538620
2858 538620 600203 530649 591205 457793 475921 538789 489936 521561 508964 527386 539584
2847 539584 622811 533281 507635 474818 543225 500387 477915 455902 360220 444623 462614 482860
2835 482860 493929 445896 361335 379600 336234 295067 303069 342650 372022 341381 333755 384514
2823 384514 358115 353694 397680 337756 274764 266403 281645 254861 238453 278248 282351 286966
2811 286966 242369 305134 201437 115241 199739 166755 70325 40501 112944 142539 127274
2800 127274 111569 157153 82512 122227 203855 161060 184322 176109 222802 162742 127132 197206
2788 197206 210336 181233 190636 110662 224089 266150 242148 164062 98377 129122 101025 176480
$$ packed form
2870G11334J02602p4502j9936m5475j05007J103l5051m538J0185R8637o0181m0551
2858E38620O1583o9554O0556j33412J8128O2868m8853L1625j2597J8422J2198
2847E39584Q3227q9530k5646l2817O8407m2838k2472k2013r5682Q4403J7991K0246
2835D82860J1069m8033q4561J8265m3366m1167Q002L9581K9372l0641p626N0759
2823C84514k6399m421M3986n9924o2992q361J5242k6784j6408L9795M103M615
2811B86966m4597O2765j03697q6196Q4498l2984r6430k9824P2443K9595j5265
2800A27274j5705M5584p4641L9715Q1628m2795K3262q213M6693o0060l5610P0074
2788A97206J3130k9103R403p9974J13427M2061k4002p8086o5685L0745k8097P5455
$$ plain form
2776 176480 170681 121102 162193 192701 175409 201829 121260 63050 12101 135274 44860 3274
2764 3274 93927 71135 -24607 31042 76807 57412 144477 180456 183742 111106 27696 79973
2752 79973 161647 205778 100878 29751 -12770 -69540 -30201 37420 160124 82049 69102
2741 69102 78327 -36656 -8036 14622 31598 130981 181078 138337 102052 95831 102742 201845
2729 201845 197625 144553 187413 163060 93300 132627 103104 93147 2394 -48666 -46925 54859
2717 54859 113840 69986 -24535 -37642 26176 48745 48832 14820 -3025 53554 135858 -9415
2705 -9415 -109928 -80022 -129614 -144965 -127396 -27161 45935 17471 52762 46899 -7848 -49058
2693 -49058 42478 73579 65592 -11407 -33768 29572 -37185 30519 -34662 -71140 -42348 -47281
$$ packed form
2776A76480n799m9579M1091L0508j7292K6420q0569n8210n0949J23173r0414m1586
2764C274R0653k2792r5742N5649M5765j9395Q7065L5979L286p2636q3410N2277
2752G9973Q1674M4131j04900p1127m2521n6770L9339O7621J22704p8075j2947
2741F9102R225j14983K8620K2658J6976R9383N0097m2741l6285o221O911R9103
2729B01845m220n3072M2860k4353o9760L9327k9523r957r0753n1060J741J01784
2717E4859N8981m3854r4521j3107O3818K2569Q7l4012j7845N6579Q2304j45273
2705i415j00513K9906m9592j5351J7569J00235P3096k8464L5291n863n4747m1210
2693d9058R1536L1101p987p6999k2361O3340o6757O7704o5181l6478K8792m933
$$ plain form
2681 -47281 65979 121796 42236 2305 -31434 -83570 -17013 21912 -14410 -18862 17695 -49508
2669 -49508 -25019 28936 25750 23358 59912 23168 9850 -67379 -78876 -39617 -22330 20243
2657 20243 22654 18792 -49355 -2808 71030 77874 -26392 -72732 59010 21363 12093 46054
2645 46054 120699 93635 148174 97720 -805 106347 2485 -53335 -23965 -44149 13919
2634 13919 46366 57592 13242 4290 977 58327 96331 100256 34523 -3147 65766 -17259
2622 -17259 -748 -16830 -26632 5479 88742 154242 97576 49583 131180 101770 -45017 -86002
2610 -86002 -77406 -72885 -19201 -2291 51726 63430 -49437 -134832 -116093 -100848 -64442 19319
2598 19319 -96361 -141885 -142307 -140009 -137446 -78300 -4452 -52851 7811 92631 103834 110109 42878
$$ packed form
2681d7281J13260N5817p9560l9931l3739n2136O6557L8925l6322m452L6557o7203
2669d9508K4489N3955l186k392L6554l6744j3318p7229j1497L9259J7287M2573
2657B0243K411l862o8147M6547P3838O844j04266m6340J31742l7647r270L3961
2645D6054P4645k7064N4539n0454r8525J07152j03862n5820K9370k0184N8068
2634A3919L2447J1226m4350q952l313N7350L8004L925o5733l7670O8913q3025
2622a7259J6511j6082r802L2111Q3263O5500n6666m7993Q1597k9410j46787m0985
2610h6002Q596M521N3684J6910N4017J1704j12867q5395J8739J5245L6406Q3761
2598A9319j15680m5524m22K298K563N9146P3848m8399O0662Q4820J1203O275o7231
$$ plain form
2585 42878 2560 64835 30379 -84022 -113804 -108172 -45501 -27993 -93651 -20047 -147868 -225037
2573 -225037 -178249 -37404 15016 38315 91598 34189 -44245 -137987 -81489 -26124 56162
2562 56162 193879 186293 43578 -29532 36974 7297 60643 -52164 -125483 49891 27800
2551 27800 26110 -89571 -68477 -51196 -115579 -120660 -63406 -63927 -86271 -65921 -64522 -96070 -85804
2538 -85804 -110603 -73633 -23047 -122064 -46844 -24905 -49393 -13630 68565 57822 90100 87438
2526 87438 85656 58925 -56299 -115607 -106332 -81280 -63124 -79279 -54012 -35123 67618 -4071
2514 -4071 -50849 21480 67447 46215 -39939 -5871 -1554 -50360 4990 53445 39301 -34949
2502 -34949 -64605 49469 53770 -17868 -108483 -105383 -166884 -78840 -36507 -59324 31652 23116
$$ packed form
2585D2878m0318O2275l4456j14401k9782N632O2671J7508o5658P3604j27821p7169
2573b25037M6788J40845N2420K3299N3283n7409p8434r3742N6498N5365Q2286
2562E6162J37717p586j42715p3110O6506k9677N3346j12807p3319J75374k2091
2551B7800j690j15681K1094J7281o4383n081N7254n21k2344K0350J399l1548J0266
2538h5804k4799L6970N0586r9017P5220K1939k4488L5763Q2195j0743L2278k662
2526H7438j782k6731j15224n9308R275K5052J8156j6155K5267J8889J02741p1689
2514d071m6778P2329M5967k1232q6154L4068M317m8806N5350M8455j4144p4250
2502c4949k9656J14074M301p1638r0615L100o1501Q8044M2333k2817R0976q536
$$ plain form
2490 23116 -62326 -69732 -94083 -39243 -34372 -158850 -92142 2155 -27528 -70592 -84728 -32717
2478 -32717 47148 51055 -6185 20202 40529 134224 120112 -5506 -33586 -33626 -10071 -103660
2466 -103660 -93387 -5320 -64100 -123483 -66978 -9325 15641 52427 13844 2606 -4597 55034
2454 55034 36983 -98001 -69305 -61763 -57810 -71967 -67613 -78593 -119271 -10786 -55758 -107120
2442 -107120 -30091 92490 36106 -36084 -84431 -54811 -20320 24273 20918 -59405 -64084 -138320
2430 -138320 -61965 -34442 -43442 16826 -26786 -92157 -19262 39634 -67942 -91996 -5811 137131
2418 137131 98053 39654 -78511 -112186 -22229 -12196 -3681 -31432 29026 -31127 -83999 -28675
2406 -28675 12894 29437 125437 60666 20961 -44663 -65223 -3380 68748 103987 -2280 -34562
$$ packed form
2490B3116q5442p406k4351N4840M871j24478O6708R4297k9683m3064j4136N2011
2478c2717P9865L907n7240K6387K0327R3695j4112j25618k8080m0K3555r3589
2466a03660J0273Q8067n8780n9383N6505N7653K4966L6786l8583j1238p203N9631
2454E5034j8051j34984K8696P542L953j4157M354j0980m0678J08485m4972n1362
2442a07120P7029J22581n6384p2190m8347K9620L4491M4593l355q0323m679p4236
2430a38320P6355K7523r000O0268m3612o5371P2895N8896j07576k4054Q6185J42942
2418A37131l9078n8399j18165l3675Q9957J0033Q515k7751O0458o0153n2872N5324
2406b8675M1569J6543R6000o4771l9705o5624k0560O1843P2128L5239j06267l2282
$$ plain form
2394 -34562 -74940 51645 59835 65970 117268 162654 91793 38995 28921 27218 171408 174114
2382 174114 91438 71919 145534 165329 169005 103071 170734 139508 150160 128090 154300 145907
2370 145907 222045 160655 132342 84252 47067 133897 -6688 8876 -12860 -7710 11802 6478
2358 6478 60687 69931 73513 41689 -47412 -35008 16960 -34765 29038 52945 83298 68972
2346 68972 47058 -44035 -123347 -40327 -57879 11920 40085 -37099 -43189 64283 99475 100100
2334 100100 78412 -6459 14889 71669 65327 66448 -16621 -16313 96459 158777 148325 85623
2322 85623 -27013 38284 5331 -11890 -60770 -39959 54185 -29303 -46609 128138 117647
2311 117647 75995 84515 -6828 113504 129353 88953 -18649 -26969 14342 -16941 -61370 29347
$$ packed form
2394c4562m0378J26585Q190O135N1298M5386p0861n2798j0074j703J44190K706
2382A74114q2676j9519P3615J9795L676o5934O7663l1226J0652k2070K6210q393
2370A45907P6138o1390k8313m8090l7185Q6830j40585J5564k1736N150J9512n324
2358F478N4209R244L582l1824q9101J2404N1968n1725O3803K3907L0353j4326
2346F8972k1914r1093p9312Q3020j7552O9799K8165p7184o090J07472L5192O25
2334A00100k1688q4871K1348N6780o342J121q3069L08J12772O2318j0452o2702
2322H5623j12636O5297l2953j7221m8880K0811R4144q3488j7306J74747j0491
2311A17647m1652Q520r1343J20332J5849m0400j07602q320M1311l1283m4429R0717
$$ plain form
2299 29347 43378 -40283 -2485 -22082 52829 65577 -13971 -27401 72247 70660 116474 89797
2287 89797 6486 -14882 25050 17897 59515 84552 5012 78190 187218 143877 57622 32599
2275 32599 123704 96031 70354 68635 48325 -2479 38376 161935 131878 120666 45098 9877
2263 9877 -72419 -7840 28416 106266 80849 7320 7845 32132 121748 111360 126496 109241
2251 109241 224044 280973 217779 145092 47400 57098 76422 142974 118106 31611 27480 80807
2239 80807 123720 188154 235437 158304 93408 123173 171667 182402 141387 219167 193564 193420
2227 193420 184040 80440 147130 219064 278368 288117 270941 187655 183235 237779 241400 209758
2215 209758 220971 263973 215970 213612 292278 271756 267296 245988 234811 256848 251891 238664
$$ packed form
2299B9347J4031q3661L7798j9597P4911J2748p9548j3430R9648j587M5814k6677
2287H9797q3311k1368L9932p153M1618K5037p9540P3178J09028m3341q6255k5023
2275C2599R1105k7673k5677j719k0310n0804M0855J23559l0057j1212p5568l5221
2263I877q2296O4579L6256P7850k5417p3529N25K4287Q9616j0388J5136j7255
2251A09241J14803N6929o3194p2687r7692R698J9324O6552k4868q6495m131N3327
2239H0807M2913O4434M7283p7133o4896K9765M8494J0735m1015P7780k5603j44
2227A93420r380j03600O6690P1934N9304R749j7176q3286m420N4544L621l1642
2215B09758J1213M3002m8003k358P8666k0522m460k1308j1177K2037m957j3227
$$ plain form
2203 238664 234786 227826 176895 271535 379900 454705 397805 409573 381084 426887 438070 431470
2191 431470 393250 369043 396675 401042 400828 451972 532996 532953 557377 642266 802532 751022 710899
2178 710899 720210 713559 636467 692068 799498 852022 722207 668219 756697 776592 880898
2167 880898 824446 869638 970575 1025019 1111196 1121348 1162686 1120078 1143460 1221527 1312440
2156 1312440 1381789 1331800 1348686 1427268 1549818 1531122 1479190 1481015 1534402 1686620 1730095
2145 1730095 1880879 2052958 2126270 2140777 2165537 2200441 2309082 2500598 2625728 2845822
2135 2845822 2960777 3070935 3261493 3428839 3726299 4010384 4306202 4568858 4873568 5182838
2125 5182838 5607696 6090502 6668568 7372902 8207199 8827720 9393068 10307318 11517273
$$ packed form
2203B38664l878o960n0931R4640J08365P4805n6900J1768k8489M5803J1183o600
2191D31470l8220k4207K7632M367k14N1144Q1024m3K4424Q4889J60266n1510m0123
2178G10899R311o651p7092N5601J07430N2524j29815n3988Q8478J9895J04306
2167H80898n6452M5192J00937N4444Q6177J0152M1338m2608K3382P8067R0913
2156A312440O9349m9989J6886P8582J22550j8696n1932J825N3387J52218M3475
2145A730095J50784J72079P3312J4507K4760L4904J08641J91516J25130K20094
2135B845822J14955J10158J90558J67346K97460K84085K95818K62656L04710L09270
2125E182838M24858M82806N78066P04334Q34297O20521N65348R14250J209955
$$ plain form
2116 11517273 12958978 14745865 16714522 19034676 21727880 24955660 28913490 33498870
2108 33498870 37444380 42420198 46842001 44273056 35991393 28220022 22787410 18695231
2100 18695231 15891079 13708296 12169915 10888656 9924608 9039196 8392205 7846985 7443037
2091 7443037 7060492 6644330 6144150 5587697 5185318 4829547 4565509 4236493 4015636 3909566
2081 3909566 3718170 3557534 3411870 3193600 3166820 3026603 2866053 2818231 2656887 2572711
2071 2572711 2485878 2450345 2369339 2211867 2156729 2086851 1966984 1925584 1829947 1741188 1703925
2060 1703925 1698288 1576661 1517376 1492357 1416726 1403168 1302913 1274853 1197260 1212875 1201258
2049 1201258 1141982 1122260 1125749 1104731 1044399 1030080 938546 935425 952940 928720 878826 856057
$$ packed form
2116A1517273J441705J786887J968657K320154K693204L227780L957830M585380
2108C3498870L945510M975818M421803k568945q281663p771371n432612m092179
2100A8695231k804152k182783j538381j281259r64048q85412o46991n45220m03948
2091G443037l82545m16162n00180n56453m02379l55771k64038l29016k20857j06070
2081C909566j91396j60636j45664k18270k6780j40217j60550m7822j61344q4176
2071B572711q6833l5533q1006j57472n5138o9878j19867m1400r5637q8759l7263
2060A703925n637j21627n9285k5019p5631j3558j00255k8060p7593J5615j1617
2049A201258n9276j9722L489k1018o0332j4319r1534l121J7515k4220m9894k2769
$$ plain form
2037 856057 918454 906509 798391 781405 842851 915381 734423 660862 745991 781725 747469
2026 747469 647146 673020 765842 743639 616967 454761 407147 434297 429300 451818 421509
2015 421509 389687 402216 435780 450145 482706 442274 477832 571546 609057 410203 377179
2004 377179 473478 367769 416091 383081 254021 178688 202383 308565 316021 336964 270026
1993 270026 362222 357323 338339 304653 232106 180239 306343 290095 262461 328337 227262
1982 227262 278356 286565 226359 238201 207915 186588 142917 188217 174339 234936 370582 338444
1970 338444 278916 229007 176206 189694 154059 68579 75759 126631 145263 136225 184789 191004
1958 191004 110153 33375 91526 124054 104370 190672 213353 66642 62227 133498 90808 104953
$$ packed form
2037H56057O2397j1945j08118j6986O1446P2530j80958p3561Q5129L5734l4256
2026G47469j00323K5874R2822k2203j26672j62206m7614K7150m997K2518l0309
2015D21509l1822J2529L3564J4365L2561m0432L5558R3714L7511j98854l3024
2004C77179R6299j05709M8322l3010j29060p5333K3695J06182P456K0943o6938
1993B70026R2196m899j8984l3686p2547n1867J26104j6248k7634O5876j01075
1982B27262N1094Q209o0206J1842l0286k1327m3671M5300j3878O0597J35646l2138
1970C38444n9528m9909n2801J3488l5635q5480P180N0872J8632r038M8564O215
1958A91004q0851p6778N8151L2528j9684Q6302K2681j46711m415P1271m2690J4145
$$ plain form
1946 104953 107091 88597 174547 140646 134315 156308 76352 55946 144460 148115 136269 97655
1934 97655 115773 159785 91705 130681 12259 51712 174239 97734 72167 64797 88576 143600
1922 143600 100508 58534 13787 1664 26984 42818 87793 22815 33719 73105 145326 98321
1910 98321 23052 -78250 -28600 57828 34933 -99593 -87114 72326 117247 123662 100438
1899 100438 135510 156010 206205 182499 110891 71958 91425 156544 115640 150484 120537 384
1887 384 81313 123587 22314 23947 -2368 2505 -28652 33871 75335 93817 86273 162437 132888
1874 132888 65417 -23191 -45395 -42655 -20462 66042 -47412 -123445 -81092 1467 35877 -32568
1862 -32568 -29873 8489 -34558 -22985 -59249 29565 66624 111889 120204 12013 1345 63441
$$ packed form
1946A04953K138j8494Q5950l3901o331K1993p9956k0406Q8514L655j1846l8614
1934I7655J8118M4012o8080L8976j18422L9453J22527p6505k5567p370K3779N5024
1922A43600m3092m1974m4747j2123K5320J5834M4975o4978J0904L9386P2221m7005
1910I8321p5269j01302M9650Q6428k2895j34526J2479J59440M4921O415k3224
1899A00438L5072K0500N0195k3706p1608l8933J9467O5119m0904L4844k9947j20153
1887C84Q0929M2274j01273J633k6315M873l1157O2523M1464J8482p544P6164k9549
1874A32888o7471q8608k2204K740K2193Q6504j13454p6033M2353Q2559L4410o8445
1862c2568K695L8362m3047J1573l6264Q8814L7059M5265Q315j08191j0668O2096
$$ plain form
1850 63441 127878 32731 -23396 16720 49893 154171 118851 68398 79459 154770 175865 103561
1838 103561 103965 276312 251313 153425 164096 156457 154505 83224 164477 116496 -62913 38010
1826 38010 65507 63558 100114 -26799 60430 69048 45256 51637 27529 91622 -24277 -36594
1814 -36594 -29515 17885 24254 111162 107808 205021 155575 103884 15926 82489 38978 -6015
1802 -6015 22263 65088 20611 -37033 -20058 -34459 -15627 -749 -50216 -79900 -34130 -64765
1790 -64765 -60131 -69108 65239 119904 67120 9923 9168 -61853 -65096 -89567 -6459 15108 74365
1777 74365 95604 53913 22586 108294 76527 -60004 -102253 -57908 -27143 69662 -104309
1766 -104309 -178849 -96455 -58516 -108436 -38778 -85439 -78545 -10799 -29620 -39344 -48542 -13775
$$ packed form
1850F3441O4437r5147n6127M0116L3173J04278l5320n0453J1061P5311K1095p2304
1838A03561M04J72347k4999r7888J0671p639j952p1281Q1253m7981j79409J00923
1826C8010K7497j949L6556j26913Q7229Q618k3792O381k4108O4093j15899j2317
1814c6594P079M7400O369Q6908l354R7213m9446n1691q7958O6563m3511m4993
1802f015K8278M2825m4477n7644J6975j4401J8832J4878m9467k9684M5770l0635
1790f4765M634q977J34347N4665n2784n7197p55p1021l243k4471Q3108K1567N9257
1777G4365K1239m1691l1327Q5708l1767j36531m2249M4345L0765R6805j73971
1766a04309p4540Q2394L7939m9920O9658m6661O894O7746j8821r724r198L4767
$$ plain form
1754 -13775 -106509 -87177 -83281 667 -48023 -73546 -115899 -31995 31355 -111631 -87069 -99251
1742 -99251 -76376 -75108 -139123 -51444 22846 51938 86101 28028 -53857 -51775 -39679 -997
1730 -997 -56441 -54893 67286 6594 -170649 -90702 -35507 -18744 -41169 -39663 5969 34215
1718 34215 58823 12614 -125027 -145419 -11713 62486 15699 51460 -13353 -120714 -10178
1707 -10178 16596 2769 -43847 -56367 -89285 -69150 39851 11606 -115749 -39036 -91751
1696 -91751 -99901 -46010 -12828 -51142 -77250 -110930 12860 57537 -122559 -134583 -117277 -32656
1684 -32656 -42559 -94164 -157176 -16576 -53251 -91390 -39331 -94148 -27078 -6624 33795 -106685
1672 -106685 -23897 68326 22566 -24896 -11983 22327 -3243 -60 -112870 -58620 -59280 -50012
$$ packed form
1754a3775r2734J9332L896Q3948m8690k5523m2353Q3904O3350j42986K4562j2182
1742i9251K2875J268o4015Q7679P4290K9092L4163n8073q1885K082J2096L8682
1730i97n5444J548J22179o0692j77243P9947N5195J6763k2425J506M5632K8246
1718C4215K4608m6209j37641k0392J33706P4199m6787L5761o4813j07361J10536
1707a0178K6774j3827m6616j2520l2918K0135J09001k8245j27355P6713n2715
1696i1751q150N3891L3182l8314k6108l3680J23790M4677j80096j2024J7306Q4621
1684c2656r903n1605o3012J40600l6675l8139N2059n4817O7070K0454M0419j40480
1672a06685Q2788R2223m5760m7462J2913L4310k5570L183j12810N4250o60R268
$$ plain form
1660 -50012 -10453 36559 -112978 -77902 -30662 34486 -9912 -25032 -6093 -9244 15886 -103855
1648 -103855 -55737 64995 86041 81349 41710 63771 94971 -35255 -107359 -89861 -35088
1637 -35088 -80947 -36961 -49200 -49535 -65667 -97643 2894 65270 -23166 -37511 12625 19167
1625 19167 -20063 23228 37315 64785 58408 6774 -100931 -47099 -102150 -141119 -57941 -99509
1613 -99509 -37967 -67525 -72951 -42941 -105165 -60072 -15345 -87328 -82887 -93556 -75036 -110287
1601 -110287 -73593 -135601 -92955 -105227 -199979 -175828 -37186 31574 -34303 -69925 -106843
1590 -106843 5419 103922 -11330 22383 29578 -84525 -31275 -22468 -14062 -58034 18345 -370
1578 -370 -16818 -21031 -66515 -11281 -76396 -53153 -112602 -77439 -57309 -94733 -31221 -119939
$$ packed form
1660e0012L9559M7012j49537L5076M7240O5148m4398j5120J8939l151K5130j19741
1648a03855M8118J20732K1046m692l9639K2061L1200j30226p2104J7498N4773
1637c5088m5859M3986j2239l35j6132l1976J00537O2376q8436j4345N0136O542
1625A9167l9230M3291J4087K7470o377n1634j07705N3832n5051l8969Q3178m1568
1613i9509O1542k9558n426L0010o2224M5093M4727p1983M441j0669J8520l5251
1601a10287L6694o2008M2646j2272r4752K4151J38642O8760o5877l5622l6918
1590a06843J12262R8503j15252L3713P195j14103N3250Q807Q406m3972P6379j8715
1578c70j6448m213m5484N5234o5115K3243n9449L5163K0130l7424O3512q8718
$$ plain form
1566 -119939 -151759 -40719 49882 47431 -19623 -66653 -8461 -22967 -16224 577 -15515 -74028
1554 -74028 -54630 -57053 -48885 14585 -118545 -144401 -26424 -22757 2706 11819 10771 -67036
1542 -67036 -65537 -142680 -95199 -84851 -81258 -90317 -177376 -26505 -36217 -78993 68635 -1275
1530 -1275 -30550 13469 -6483 -79027 -33571 21378 5981 -75268 -114096 -138690 -126206 -18748
1518 -18748 -22942 -39120 -134771 -32539 15476 -56200 -54697 -111945 -71740 -28987 -56088 -19751
1506 -19751 -16597 17317 -41662 540 20722 4294 -36683 33744 4556 -12781 -7139 -35076
1494 -35076 -60697 -88189 -38934 53257 -2628 -95464 -142093 8435 40273 -46647 -134068 -39032
1482 -39032 78979 102747 139748 133768 95263 60923 18665 -39343 -58475 -7966 62344 -13314
$$ packed form
1566a19939l1820J11040R0601k451o7054m7030N8192j4506O743J6801j6092n8513
1554g4028J9398k423Q168O3470j33130k5856J17977L667K5463R113j048p7807
1542f7036J499p7143M7481J0348L593r059q7059J50871r712m2776J47628o9910
1530a275k9275M4019j9952p2544M5456N4949j5397q1249l8828k4594J2484J07458
1518a8748m194j6178r5651J02232M8015p1676J503n7248M0205M2753k7101L6337
1506a9751L154L3914n8979M2202K0182j6428m0977P0427k9188j7337N642k7937
1494c5076k5621k7492M9255R2191n5885r2836m6629J50528L1838q6920q7421R5036
1482c9032J18011K3768L7001n980l8505l4340m2258n8008j9132N0509P0310p5658
$$ plain form
1470 -13314 9187 -28971 -101587 -137753 -180604 -46272 -29092 -26366 22333 -17074 37297 57951
1458 57951 -42299 -106939 -65676 -38515 3765 -970 107109 27773 -58646 -39556 21063 -76915
1446 -76915 -74561 13838 -48985 20566 23181 -65073 -75561 -149083 -101109 -53276 -71783 -132518
1434 -132518 -115950 -92844 -143498 -47715 -46381 -86712 -92004 -49306 -94488 -155220 -48323 -39891
1422 -39891 -115398 -101774 -31366 -63775 -95078 -14843 -70164 -86240 -27997 7845 49710 -20223
1410 -20223 -46724 12106 -69479 -145580 -76949 -80710 -36068 -3880 -31961 -34416 -56607 4743
1398 4743 -61932 -30058 -30413 -122067 -139449 -118193 -101220 -92486 -46766 26444 24879 -80899 78343
1385 78343 110487 92112 78376 30361 -106959 -32669 -108916 -141281 6036 -41597 -142606
$$ packed form
1470a3314K2501l8158p2616l6166m2851J34332J7180K726M8699l9407N4371K0654
1458E7951j00250o4640M1263K7161M2280m735J08079p9336q6419J9090O0619r7978
1446g6915K354Q8399o2823O9551K615q8254j0488p3522M7974M7833j8507o0735
1434a32518J6568K3106n0654R5783J334m0331n292M2698m5182o0732J06897Q432
1422c9891p5507J3624P0408l2409l1303Q0235n5321j6076N8243L5842M1865o9933
1410b0223k6501N8830q1585p6101O8631l761M4642L2188k8081k455k2191O1350
1398D743o6675L1874l55r1654j7382K1256J6973Q734M5720P3210j565j05778J59242
1385G8343L2144j8375j3736m8015j37320P4290p6247l2365J47317m7633j01009
$$ plain form
1374 -142606 -154070 -139858 -59639 28006 31243 -42747 -52333 23665 6706 -21916 -126764 -42847
1362 -42847 -78715 -41031 -57731 -78953 -52801 7997 -61854 -82083 -44513 -82352 -62977 -104209
1350 -104209 -44838 -8536 -60715 -33969 -40251 -42224 -27274 -15611 -8904 18012 -15485 -42150
1338 -42150 -114457 -225517 -138797 -108012 -52771 21970 16549 -64072 -77084 -73798 36111 -50266
1326 -50266 -49941 19053 42276 41316 80223 86452 -47633 14237 75020 -5845 -80855 -112783 -95602
1313 -95602 -39488 -99053 -89973 -69767 -188531 -46720 38967 -50404 -45172 -22163 -30314 -143681
1301 -143681 -167789 -131203 -148291 -110741 -42140 -38295 -13711 -54118 -51832 -14852 4845 -36634
1289 -36634 -101176 -88986 -23967 76521 135622 67287 -30827 -27205 -11849 -119690 -72846 -109651
$$ packed form
1374a42606j1464J4212Q0219Q7645L237p3990r586P5998j6959k8622j04848Q3917
1362d2847l5868L7684j6700k1222K6152O0798o9851k0229L7570l7839J9375m1232
1350a04209N9371L6302n2179K6746o282j973J4950J1663O707K6916l3497k6665
1338d2150p2307j11060Q6720L0785N5241P4741n421q0621j3012L286J09909q6377
1326e0266L25O8994K3223r60L8907O229j34085O1870O0783q0865p5010l1928J7181
1313i5602N6114n9565R080K0206j18764J41811Q5687q9371N232K3009q151j13367
1301a43681k4108L6586j7088L7550O8601L845K4584m0407K286L6980J9697m1479
1289c6634o4542J2190O5019J00488N9101o8335r8114L622J5356j07841M6844l6805
$$ plain form
1277 -109651 -104498 -46360 94900 32298 -22403 -47312 21970 -5017 109620 108417 17106 -11473
1265 -11473 21703 21769 -45004 -144538 -96644 60206 37482 35126 6514 -19831 -61147 39137
1253 39137 25612 86669 100020 82080 55422 75994 60316 49050 36232 -9892 58479 85121
1241 85121 38975 9173 -872 -33280 -66790 57871 67758 -23325 5959 -1006 12044 8709
1229 8709 -86263 -68156 -19201 -35973 -88016 -13772 -8797 78720 77542 62342 -36412 -69517
1217 -69517 64817 30990 17646 16286 -42125 87221 166781 114605 61580 -19663 -9691 -14554
1205 -14554 18895 79320 12448 -33362 -62240 2478 -28030 -64032 -85382 -51434 -11733 50910
1193 50910 23892 -53199 -69987 -16731 8300 22689 33147 -3423 -100614 -32638 69090 2426
$$ packed form
1277a09651N153N8138J41260o2602n4701k4909O9282k6987J14637j203r1311k8579
1265a1473L3176O6o6773r9534M7894J56850k2724k356k8612k6345m1316J00284
1253C9137j3525O1057J3351j7940k6658K0572j5678j1266j2818m6124O8371K6642
1241H5121m6146k9802j0045l2408l3510J24661R887r1083K9284o965J3050l335
1229H709r4972J8107M8955j6772n2043P4244M975Q7517j178j5200r8754l3105
1217f9517J34334l3827j3344j360n8411J29346P9560n2176n3025q1243R972m863
1205a4554L3449O0425o6872m5810k8878O4718l0508l6002k1350L3948L9701O2643
1193E0910k7018p7091j6788N3256K5031J4389J0458l6570r7191O7976J01728o6664
$$ plain form
1181 2426 -22187 -44742 38793 -21208 -95723 -21283 119763 82347 47373 99552 40231 50040
1169 50040 -14980 -96293 -114400 -89599 19084 44577 -8821 58249 -10634 -71449 -104276 -47995
1157 -47995 -2530 -30433 -55400 -26714 -33508 -52652 66731 86401 91647 52688 -14452 -54350
1145 -54350 -8727 60310 113810 42908 42566 43261 111973 88762 75482 99334 60158 -6483 3973
1132 3973 -68825 -103556 -75248 -83912 -36002 76757 58711 40664 24317 40743 82080 -58728
1120 -58728 -144778 -82503 -135699 -89525 -106148 -47163 -45898 -28491 19543 32032 46505 61486
1108 61486 41298 -39401 -688 16125 -76905 -89295 -140593 -163436 -125583 -67009 -17276 -109785
1096 -109785 8887 -120369 -149899 -48755 -109351 -43516 -47154 -108728 -140814 -177969 -34773
$$ packed form
1181B426k4613k2555Q3535o0001p4515P4440J41046l7416l4974N2179n9321R809
1169E0040o5020q1313j8107K4801J08683K5493n3398O7070o8883o0815l2827N6281
1157d7995M5465k7903k4967K8686o794j9144J19383J9670N246l8959o7140l9898
1145e4350M5623O9037N3500p0902l42O95O8712k3211j3280K3852l9176o6641J0456
1132C973p2798l4731K8308q664M7910J12759j8046j8047j6347J6426M1337j40808
1120e8728q6050O2275n3196M6174j6623N8985J265J7407M8034J2489J4473J4981
1108F1486k0188q0699L8713J6813r3030j2390n1298k2843L7853N8574M9733r2509
1096a09785J18672j29256k9530J01144o0596O5835l638o1574l2086l7155J43196
$$ [...]
##END NTUPLES=NMR SPECTRUM
##END=
