##TITLE=1H_TG-2340-XVc
 CDCl3
 8 sc, 
 3.10.2023
##JCAMPDX= 6.0         $$ Bruker NMR JCAMP-DX V2.0
##DATA TYPE= NMR SPECTRUM
##DATA CLASS= NTUPLES
##ORIGIN= UXNMR, Bruker Analytische Messtechnik GmbH
##OWNER= root
$$ XWIN-NMR		Version 3.5
$$ Tue Oct  3 13:45:40 2023 Russian Standard Time (UT+4h)  she@DPX200
##.OBSERVE FREQUENCY= 200.13135
##.OBSERVE NUCLEUS= ^1H
##.ACQUISITION MODE= SIMULTANEOUS
##.ACQUISITION SCHEME= undefined
##.AVERAGES= 8
##.DIGITISER RES= 18
##SPECTROMETER/DATA SYSTEM= spect
##.PULSE SEQUENCE= zg30
##.SOLVENT NAME= CDCl3
##.SHIFT REFERENCE= (INTERNAL, CDCl3, 0, 15.7425)
##AUDIT TRAIL= $$ (NUMBER, WHEN, WHO, WHERE, WHAT)
$$ ##TITLE= Audit trail, XWIN-NMR		Version 3.5
$$ ##JCAMPDX= 5.01
$$ ##ORIGIN= Bruker BioSpin GmbH
$$ ##OWNER= she
$$ F:/spectra/data/she/nmr/H-F/1/pdata/1/auditp.txt
$$ ##AUDIT TRAIL=  $$ (NUMBER, WHEN, WHO, WHERE, WHAT)
(   1,<2023-10-03 13:44:15.51 +0400>,<she>,<DPX200>,
      <created by zg, POWCHK disabled, PULCHK disabled
       configuration hash MD5:
       00 E9 B6 7A A2 85 ED C7 34 08 36 98 17 FE 4E 26
       data hash MD5: 16K
       33 BE 93 96 89 C2 C9 1B 9A 9F 08 F5 C9 8B 4A DE>)
(   2,<2023-10-03 13:44:17.67 +0400>,<she>,<DPX200>,
      <Start of raw data processing
       efp BC_mod = 2 LB = 0.24 FT_mod = 6 PKNL = 1 PHC0 = -21707.31 PHC1 = 8.85271 SI = 16K 
       data hash MD5: 16K
       32 FB ED CD 14 E6 56 A6 5A 14 BE 2E 6E 5E D2 B1>)
(   3,<2023-10-03 13:44:38.39 +0400>,<she>,<DPX200>,
      <pk PHC0 = -2.311729 PHC1 = 3 
       data hash MD5: 16K
       CD 36 2E A4 65 B2 44 A3 D9 F4 EF 44 BC AF 43 32>)
(   4,<2023-10-03 13:44:41.46 +0400>,<she>,<DPX200>,
      <abs ABSG = 5 
       data hash MD5: 16K
       82 21 F9 C6 76 52 36 F9 B2 7F FD 94 D0 C2 3B 67>)
$$ ##END=
$$ 
$$ hash MD5
$$ 1F CB 39 2A 4B 13 EC D8 4D 87 E6 FE 6F A5 FC 58
##$RELAX= 
##$RELAX= 
##$RELAX= 
##$RELAX= 
##$RELAX= 
##$RELAX= 
$$ Bruker specific parameters
$$ --------------------------
##$DU= <F:/spectra>
##$EXPNO= 1
##$NAME= <H-F>
##$PROCNO= 1
##$TYPE= <nmr>
##$USER= <she>
##$AMP= (0..31)
100 100 100 100 100 100 100 100 100 100 100 100 100 100 100 100 100 100 
100 100 100 100 100 100 100 100 100 100 100 100 100 100 
##$AQSEQ= 0
##$AQ_mod= 1
##$AUNM= <au_zg>
##$AUTOPOS= <>
##$BF1= 200.13
##$BF2= 200.13
##$BF3= 200.13
##$BF4= 200.13
##$BF5= 200.13
##$BF6= 200.13
##$BF7= 200.13
##$BF8= 200.13
##$BYTORDA= 1
##$CFDGTYP= 0
##$CFRGTYP= 5
##$CHEMSTR= <none>
##$CNST= (0..31)
1 1 145 1 1 1 1 1 1 1 1 1 1 1 1 1 1 1 1 1 1 1 1 1 1 1 1 1 1 1 1 1 
##$CPDPRG= <>
##$CPDPRG1= <>
##$CPDPRG2= <>
##$CPDPRG3= <>
##$CPDPRG4= <mlev>
##$CPDPRG5= <mlev>
##$CPDPRG6= <mlev>
##$CPDPRG7= <mlev>
##$CPDPRG8= <mlev>
##$CPDPRGB= <>
##$CPDPRGT= <>
##$D= (0..31)
0 1.2 0 0 0 0 0 0 0 0.06 0 0.03 0 0 0 0 0.0002 0 0 0 0 0 0 0 0 0 0 0 0 
0 0 0 
##$DATE= 1696326254
##$DBL= (0..7)
120 120 120 120 120 120 120 120 
##$DBP= (0..7)
150 150 150 150 150 150 150 150 
##$DBP07= 0
##$DBPNAM0= <>
##$DBPNAM1= <>
##$DBPNAM2= <>
##$DBPNAM3= <>
##$DBPNAM4= <>
$$ [...]
##$SUBNAM3= <"">
##$SUBNAM4= <"">
##$SUBNAM5= <"">
##$SUBNAM6= <"">
##$SUBNAM7= <"">
##$SUBNAM8= <"">
##$SUBNAM9= <"">
##$SW= 18.05172834244
##$SWIBOX= (0..15)
0 0 2 0 0 0 0 0 0 0 0 0 0 0 0 0 
##$SW_h= 3612.71676300578
##$TD= 16384
##$TD0= 1
##$TE= 0
##$TE2= 300
##$TE3= 300
##$TEG= 300
##$TL= (0..7)
0 120 120 120 120 120 120 120 
##$TP= (0..7)
150 150 150 150 150 150 150 150 
##$TP07= 0
##$TPNAME0= <>
##$TPNAME1= <>
##$TPNAME2= <>
##$TPNAME3= <>
##$TPNAME4= <>
##$TPNAME5= <>
##$TPNAME6= <>
##$TPNAME7= <>
##$TPOAL= (0..7)
0.5 0.5 0.5 0.5 0.5 0.5 0.5 0.5 
##$TPOFFS= (0..7)
0 0 0 0 0 0 0 0 
##$TUNHIN= 0
##$TUNHOUT= 0
##$TUNXOUT= 0
##$USERA1= <user>
##$USERA2= <user>
##$USERA3= <user>
##$USERA4= <user>
##$USERA5= <user>
##$V9= 5
##$VALIST= <valist>
##$VCLIST= <CCCCCCCCCCCCCCC>
##$VD= 0
##$VDLIST= <DDDDDDDDDDDDDDD>
##$VPLIST= <PPPPPPPPPPPPPPP>
##$VTLIST= <TTTTTTTTTTTTTTT>
##$WBST= 1024
##$WBSW= 4
##$XGAIN= (0..3)
0 0 0 0 
##$XL= 0
##$YL= 0
##$YMAX_a= 324631
##$YMIN_a= -465929
##$ZGOPTNS= <>
##$ZL1= 120
##$ZL2= 120
##$ZL3= 120
##$ZL4= 120
##$ABSF1= 15.77553
##$ABSF2= -2.27632
##$ABSG= 5
##$ABSL= 3
##$ALPHA= 0
##$AQORDER= 0
##$ASSFAC= 0
##$ASSFACI= 0
##$ASSFACX= 0
##$ASSWID= 0
##$AUNMP= <proc_1d>
##$AZFE= 0.1
##$AZFW= 0.1
##$BCFW= 0
##$BC_mod= 2
##$BYTORDP= 0
##$COROFFS= 0
##$CY= -3
##$DATMOD= 1
##$DC= 0
##$DFILT= <>
##$DTYPP= 0
##$F1P= 0
##$F2P= 0
##$FCOR= 1
##$FTSIZE= 16384
##$FT_mod= 6
##$GAMMA= 0
##$GB= 0
##$INTBC= 1
##$INTSCL= 3.70164e-10
##$ISEN= 128
##$LB= 0.24
##$LEV0= 0
##$LPBIN= 0
##$MAXI= 10000
##$MC2= 0
##$MEAN= 0
##$ME_mod= 0
##$MI= 1.114404
##$NCOEF= 0
##$NC_proc= -5
##$NLEV= 6
##$NOISF1= 3.799351
##$NOISF2= 2.8
##$NSP= 0
##$NTH_PI= 0
##$NZP= 0
##$OFFSET= 15.74248
##$PC= 1
##$PHC0= -21709.62
##$PHC1= 11.85271
##$PH_mod= 1
##$PKNL= yes
##$PPARMOD= 0
##$PSCAL= 0
##$PSIGN= 0
##$REVERSE= no
##$SF= 200.130005814708
##$SI= 16384
##$SIGF1= 3
##$SIGF2= 2
##$SINO= 5.538805
##$SIOLD= 16384
##$SREGLST= <1H.CDCl3>
##$SSB= 0
##$STSI= 16384
##$STSR= 0
##$SW_p= 3612.71676300578
##$SYMM= 0
##$S_DEV= 0
##$TDeff= 16384
##$TDoff= 0
##$TI= <>
##$TILT= no
##$TM1= 0
##$TM2= 0
##$TOPLEV= 0
##$USERP1= <user>
##$USERP2= <user>
##$USERP3= <user>
##$USERP4= <user>
##$USERP5= <user>
##$WDW= 1
##$XDIM= 16384
##$YMAX_p= 305438272
##$YMIN_p= -128979
$$ End of Bruker specific parameters
$$ ---------------------------------
##NTUPLES= NMR SPECTRUM
##VAR_NAME=  FREQUENCY,     SPECTRUM/REAL,   SPECTRUM/IMAG
##SYMBOL=    X,             R,               I
##VAR_TYPE=  INDEPENDENT,   DEPENDENT,       DEPENDENT
##VAR_FORM=  AFFN,          ASDF,            ASDF
##VAR_DIM=   16384,         16384,           16384
##UNITS=     HZ,            ARBITRARY UNITS, ARBITRARY UNITS
##FACTOR=    0.220516191357247, 1,           1
##FIRST=     3150.5426695771, 0,             0
##LAST=      -462.174093428685, 0,           0
##MIN=       -462.174093428685, -128979,     0
##MAX=       3150.5426695771, 305438272,     0
$$ Real data points
##PAGE= N=1
##DATA TABLE= (X++(R..R)), XYDATA
$$ [...]
$$ plain form
7127 9909098 10268332 10660849 11065762 11517122 12071149 12759376 13428424 14236973 15130584 16117403
7117 16117403 17364349 18710272 20275677 21972356 23877585 26077227 28442958 31228683
7109 31228683 34285181 37581404 41236285 45338628 50025468 55989116 63468579 72114676
7101 72114676 79536396 82250648 78537770 68805014 55717700 43228863 33365989 26247727
7093 26247727 21471157 18148942 15778908 14015149 12617253 11521547 10678459 9920884
7085 9920884 9326819 8731201 8173404 7731647 7360164 7070064 6851573 6604799 6416192 6189465
7075 6189465 5959279 5773119 5569569 5389127 5227923 5116770 5027030 4925940 4841814 4800115
7065 4800115 4745362 4712356 4767979 4861258 4880264 5039691 5183331 5307082 5531272 5737693
$$ packed form
7127I909098L59234L92517M04913M51360N54027O88227O69048Q08549Q93611R86819
7117A6117403J246946J345923J565405J696679J905229K199642K365731K785725
7109C1228683L056498L296223L654881M102343M686840N963648P479463Q646097
7101G2114676P421720K714252l712878r732756j3087314j2488837r862874p118262
7093B6247727m776570l322215k370034j763759j397896j095706q43088p57575
7085I920884n94065n95618n57797m41757l71483k90100k18491k46774j88607k26727
7075F189465k30186j86160k03550j80442j61204j11153q9740j01090q4126m1699
7065D800115n4753l3006N5623R3279J9006J59427J43640J23751K24190K06421
$$ plain form
7055 5737693 5967336 6108640 6326059 6546616 6858060 7273493 7677124 8132979 8659882 9262603
7045 9262603 9895189 10646610 11499691 12404633 13559774 15061213 16478195 17487870 17511921
7036 17511921 16218945 14005691 11288989 8908785 7076105 5738366 4892208 4311685
7028 4311685 3814584 3385847 3107326 2850690 2654683 2488893 2330609 2167604 2029118 1909933
7018 1909933 1807773 1724224 1695963 1625549 1574378 1510176 1444594 1416451 1336952 1290679 1259369
7007 1259369 1205916 1215967 1110029 1051103 1060141 1027139 995329 978071 1006250 991017 1013361
6996 1013361 966911 925340 916164 807527 792889 802933 753183 773194 732013 686637 757142
6985 757142 755418 746711 751034 760569 727970 724881 719891 639822 632554 636085 679977 624715 619975
$$ packed form
7055E737693K29643J41304K17419K20557L11444M15433M03631M55855N26903O02721
7045I262603O32586P51421Q53081R04942J155141J501439J416982J009675K4051
7036A7511921j292976k213254k716702k380204j832680j337739q46158n80523
7028D311685m97101m28737k78521k56636j96007j65790j58284j63005j38486j19185
7018A909933j02160q3549k8261p0414n1171o4202o5582k8143p9499m6273l1310
7007A259369n3453J0051j05938n8926R038l3002l1810j7258K8179j5233K2344
6996A013361m6450m1571r176j08637j4638J0044m9750K0011m1181m5376P0505
6985G57142j724q707M323R535l2599l089m990q0069p268L531M3892n5262m740
$$ plain form
6972 619975 622726 637407 639304 660328 640519 653702 644708 629009 618921 592341 548472 517518
6960 517518 577814 567490 591035 586442 547435 561132 528385 534818 526008 525880 500969 498925 507675
6947 507675 449689 483781 500335 458004 433198 434379 448810 419152 405985 458905 464820 399798
6935 399798 413439 431461 392839 407385 433968 435817 420228 466154 479130 465484 492970 439420
6923 439420 333843 304872 334656 342454 382117 428838 396390 319310 299442 291301 296736 363631
6911 363631 333992 282749 309008 331558 316796 275693 275772 298032 256655 333653 363311 384367
6899 384367 408652 367328 283231 218414 244283 281295 305701 336154 324860 286300 273892 309902
6887 309902 278771 254432 240604 259090 281276 289904 308837 263101 232376 267914 269692 271321
$$ packed form
6972F19975K751J4681J897K1024j9809J3183q994j5699j0088k6580m3869l0954
6960E17518O0296j0324K3545m593l9007J3697l2747O433q810j28k4911k044Q750
6947E07675n7986L4092J6554m2331k4806J181J4431k9658j3167N2920N915o5022
6935C99798J3641J8022l8622J4546K6583J849j5589M5926J2976j3646K7486n3550
6923D39420j05577k8971K9784P798L9663M6721l2448p7080j9868q141N435O6895
6911C63631k9639n1243K6259K2550j4762m1103P9K2260m1377P6998K9658K1056
6899C84367K4285m1324q4097o4817K5869L7012K4406L0453j1294l8560j2408L6010
6887C09902l1131k4339j3828J8486K2186Q628J8933m5736l0725L5538J778J629
$$ plain form
6875 271321 240523 281735 284697 286631 317572 277209 286216 312868 257166 247993 234309 241123 250019
6862 250019 262250 238152 245453 300701 274263 255360 272684 317650 292494 273891 266414 259259
6850 259259 219617 237998 218826 259403 257418 252654 231630 278671 256361 234008 265878 270805
6838 270805 283168 230084 185149 269462 286308 300360 288172 246495 270046 354580 337333 297537
6826 297537 314140 233423 247081 190137 184253 171476 199690 181987 209647 236835 246117 230330
6814 230330 214330 261678 272965 253653 239741 211286 167997 213258 268078 252324 190392 179220
6802 179220 123613 117490 192520 233912 171286 177020 178679 171653 213147 216346 206329 240339 199681
6789 199681 234213 251631 271865 271815 255286 235660 194552 236400 258907 215332 185850 180885
$$ packed form
6875B71321l0798M1212K962J934L0941m0363R007K6652n5702r173j3684O814Q896
6862B50019J2231k4098P301N5248k6438j8903J7324M4966k5156j8603p477p155
6850B59259l9642J8381j9172M0577j985m764k1024M7041k2310k2353L1870M927
6838B70805J2363n3084m4935Q4313J6846J4052j2188m1677K3551Q4534j7247l9796
6826B97537J6603q0717J3658n6944n884j2777K8214j7703K7660K7188R282j5787
6814B30330j6000M7348J1287j9312j3912k8455m3289M5261N4820j5754o1932j1172
6802A79220n5607o123P5030M1392o2626N734J659p026M1494L199j0017L4010m0658
6789A99681L4532J7418K0234n0j6529j9626m1108M1848K2507m3575k9482m965
$$ plain form
6777 180885 206808 254461 159604 165521 206958 166789 170498 211009 224908 200383 244145 229522
6765 229522 198926 215260 157467 158941 134169 119798 157472 136536 167675 158367 174054 210066
6753 210066 159229 183141 199209 208700 186595 159290 154347 170576 200042 213608 220029 237534
6741 237534 220506 198743 213258 196132 246631 239062 253174 214581 234012 274658 282564 310325
6729 310325 281624 328662 314741 263249 260353 256929 217169 237745 240237 229564 178588 215409
6717 215409 269266 313205 300872 277469 273791 304214 293688 359095 384786 358589 354620 372999
6705 372999 395425 372533 460707 515731 552376 550785 537837 554448 493567 477058 443510 355109
6693 355109 301693 290409 302318 274158 325714 245192 243476 214101 202534 219709 169829 184154
$$ packed form
6777A80885K5923M7653r4857N917M1437m0169L709M0511J3899k4525M3762j4623
6765B29522l0596J6334n7793J474k4772j4371L7674k0936L1139r308J5687L6012
6753B10066n0837K3912J6068R491k2105k7305m943J6229K9466J3566O421J7505
6741B37534j7028k1763J4515j7126N0499p569J4112l8593J9431M0646P906K7761
6729C10325k8701M7038j3921n1492k896l424l9760K0576K492j0673n0976L6821
6717B15409N3857M3939j2333k3403l678L0423j0526O5407K5691k6197l969J8379
6705C72999K2426k2892Q8174N5024L6645j591j2948J6611o0881j6509l3548q8401
6693C55109n3416j1284J1909k8160N1556q0522j716k9375j1567J7175m9880J4325
$$ plain form
6681 184154 121704 175472 211324 212064 204541 239016 249022 232040 184730 174226 132212 158321
6669 158321 153502 168318 131195 139780 165479 125353 144243 174286 208704 184573 211914 186553
6657 186553 226835 222624 201508 116892 140842 178201 120795 118548 123426 144136 139332 154732
6645 154732 169318 154973 174175 181168 190537 149187 169326 186833 211210 177948 174716 152817
6633 152817 216228 192051 69266 96559 159456 160617 141975 139551 145951 132744 154249 116783
6621 116783 113424 131548 129148 92255 80679 102418 149227 175699 157239 172096 180451 170184
6609 170184 128607 113036 84482 87867 42885 23084 84996 114378 136067 110911 116512 119753
6597 119753 173802 190386 150807 160313 125703 166727 137208 131493 104874 123579 119236 134241
$$ packed form
6681A84154o2450N3768L5852P40p523L4475J0006j6982m7310j0504m2014K6109
6669A58321m819J4816l7123Q585K5699m0126J8890L0043L4418k4131K7341k5361
6657A86553M0282m211k1116q4616K3950L7359n7406k247M878K0710m804J5400
6645A54732J4586j4345J9202O993R369m1350K0139J7507K4377l3262l232k1899
6633A52817O3411k4177j22785K7293O2897J161j8642k424O400j3207K1505l7466
6621A16783l359J8124k400l6893j1576K1739M6809K6472j8460J4857Q355j0267
6609A70184m1577j5571k8554L385m4982j9801O1912K9382K1689k5156N601L241
6597A19753N4049J6584l9579R506l4610M1024k9519n715k6619J8705m343J5005
$$ plain form
6585 134241 131262 140356 151034 204851 183379 146682 135079 119913 125213 94945 62520 82997
6573 82997 92347 107974 117226 125644 117657 107366 144650 185189 128538 131566 163845 144167 118831
6560 118831 87884 95778 125216 118112 108500 153084 202194 184862 197780 221137 168142 211729
6548 211729 199800 176655 196327 180133 195616 202600 225781 240909 225844 196833 199456 229897
6536 229897 236125 240671 227451 191185 194384 148346 106337 115649 172592 177539 149208 193284 190698
6523 190698 240191 264355 227059 232120 286434 266692 286897 307459 320036 299810 344358 266817
6511 266817 240622 199429 223380 206210 147493 184907 163714 127843 194884 240639 210356 205643
6499 205643 187720 183005 193092 208245 133674 123986 152301 161952 213867 195910 154899 150426
$$ packed form
6585A34241k979R094J0678N3817k1472l6697j1603j5166N300l0268l2425K0477
6573H2997R350J5627R252Q418p987j0291L7284M0539n6651L028L2279j9678k5336
6560A18831l0947P894K9438p104r612M4584M9110j7332J2918K3357n2995M3587
6548B11729j1929k3145J9672j6194J5483O984K3181J5128j5065k9011K623L0441
6536B29897O228M546j3220l6266L199m6038m2009R312N6943M947k8331M4076k586
6523A90698M9493K4164l7296N061N4314j9742K0205K0562J2577k0226M4548p7541
6511B66817k6195m1193K3951j7170n8717L7414k1193l5871O7041M5755l0283m713
6499B05643j7923m715J0087J5153p4571r688K8315R651N1915j7957m1011m473
$$ plain form
6487 150426 170280 149013 193834 194271 188533 219287 200940 185999 180842 209313 238068 255537
6475 255537 236753 241949 233185 190051 164160 182913 159110 191037 152814 177701 208018 226841
6463 226841 195914 173132 201221 184179 157272 186657 180442 189169 210874 252427 236359 179078
6451 179078 150622 158461 227217 232439 224751 194062 214461 233045 254753 238835 238371 277547 229801
6438 229801 282579 293617 293669 288839 281387 277981 218569 266210 269777 318922 313494 259230 253634
6425 253634 241839 253316 261370 293817 341276 304970 269290 285220 313823 340905 303316 301732
6413 301732 345695 366282 372070 368194 364147 332467 357594 291711 291443 338820 351719 385580 341882
6400 341882 353364 337748 399328 430388 416236 391224 421597 466664 496175 496917 499004 465357
$$ packed form
6487A50426J9854k1267M4821M37n738L0754j8347j4941n157K8471K8755J7469
6475B55537j8784N196q764m3134k5891J8753k3803L1927l8223K4887L0317J8823
6463B26841l0927k2782K8089j7042k6907K9385o215Q727K1705M1553j6068n7281
6451A79078k8456P839O8756N222p688l0689K0399J8584K1708j5918m64L9176m7746
6438B29801N2778J1038N2m830p452l406n9412M7641L567M9145n428n4264n596
6425B53634j1795J1477Q054L2447M7459l6306l5680J5930K8603K7082l7589j584
6413C01732M3963K0587N788l876m047l1680K5127o5883k68M7377J2899L3861m3698
6400C41882J1482j5616O1580L1060j4152k5012L0373M5067K9511P42K087l3647
$$ plain form
6388 465357 449223 461287 448119 484705 482206 475659 477159 502770 538323 495698 479266 494001
6376 494001 510836 481220 424403 425465 449720 463586 445285 450950 431118 464588 488956 453458
6364 453458 463020 439546 398226 401573 451218 489959 502649 510852 515423 580379 572876 560698 553530
6351 553530 557254 568256 535776 513179 522291 578207 611055 584256 643231 610382 637688 651498
6339 651498 582747 667840 655598 616127 628046 645848 605526 607950 626240 611406 670185 649146
6327 649146 663037 675272 608371 572485 555630 540626 554328 588163 585268 566699 574394 595577
6315 595577 613184 619096 632204 591971 584421 606334 611753 588090 569482 565532 572967 571108 610818
6302 610818 645286 648243 673349 699402 711286 738697 711384 728535 727551 691100 683884 648074
$$ packed form
6388D65357j6134J2064j3168L6586k499o547J500K5611L5553m2625j6432J4735
6376D94001J6835k9616n6817J062K4255J3866j8301N665j9832L3470K4368l5498
6364D53458R562k3474m1320L347M9645L8741J2690Q203M571O4956p503j2178p168
6351E53530L724J1002l2480k2597R112N5916L2848k6799N8975l2849K7306J3810
6339F51498o8751Q5093j2242l9471J1919J7802m0322K424J8290j4834N8779k1039
6327F49146J3891J2235o6901l5886j6855j5004J3702L3835k895j8569P695K1183
6315E95577J7607N912J3108m0233p550K1913N419k3663j8608l950P435j859L9710
6302F10818L4468K957K5106K6053J1884K7411k7313J7151r84l6451p216l5810
$$ plain form
6290 648074 661396 675551 724988 755796 751840 753257 744186 733763 737309 749475 745102 747283 753928
6277 753928 748635 766279 781137 787785 814296 817729 854270 879570 858111 865521 832870 902824
6265 902824 964521 956047 928496 953918 919462 906828 895728 904478 917748 928576 912024 906028
6253 906028 908243 929697 994085 977725 954255 971408 1028526 1027289 1008373 1059251 1044076 1062094
6241 1062094 1098029 1155891 1234502 1217979 1192333 1102531 1018007 1029539 1021403 992935 1031022 1031087
6229 1031087 1016787 987330 988951 972064 1001875 1012373 998061 978924 952274 949648 970187 1018487
6217 1018487 1024368 1041368 993491 937905 968813 973684 994910 999370 971002 1046592 1089783 1077638
6205 1077638 1050977 1107460 1099523 1073086 1121620 1109657 1124072 1151255 1135178 1138971 1125922 1180793
$$ packed form
6290F48074J3322J4155M9437L0808l956J417r071j0423L546J2166m373K181O645
6277G53928n293J7644J4858O648K6511L433L6541K5300k1459P410l2651O9954
6265I02824O1697q474k7551K5422l4456j2634j1100Q750J3270J0828j6552n996
6253I06028K215K1454O4388j6360k3470J7153N7118j237j8916N0878j5175J8018
6241A062094L5935N7862P8611j6523k5646q9802q4524J1532q136k8468L8087O5
6229A031087j4300k9457J621j6887K9811J0498j4312j9137k6650k626K0539M8300
6217A018487N881J7000m7877n5586L0908M871K1226M460k8368P5590M3191j2145
6205A077638k6661N6483p937k6437M8534j1963J4415K7183j6077L793j3049N4871
$$ plain form
6193 1180793 1186701 1212223 1249566 1241866 1221386 1216180 1238014 1239484 1262218 1275442 1260382 1263566
6181 1263566 1355256 1369240 1396881 1397318 1408866 1413710 1416792 1475658 1481090 1514255 1553562 1544069 1521830
6168 1521830 1498668 1548018 1562104 1549493 1585414 1562364 1591613 1615153 1651291 1707123 1669065
6157 1669065 1713748 1736315 1751678 1778068 1808939 1825041 1825206 1852953 1854838 1896888 1912873 1953597
6145 1953597 1998217 2011401 2037059 2068431 2127647 2165154 2190616 2189980 2184588 2232835 2222060 2283227
6133 2283227 2350026 2315628 2342619 2363687 2482078 2587505 2663594 2718448 2779463 2785160 2823568
6122 2823568 2894678 2964677 3014111 3061518 3131907 3259996 3351050 3378785 3472627 3520576 3629398
6111 3629398 3695629 3771314 3854929 3900856 3933051 4062174 4104947 4159067 4255515 4317301 4403401
$$ packed form
6193A180793N908K5522L7343p700k0480n206K1834J470K2734J3224j5060L184
6181A263566R1690J3984K7641M37J1548M844L082N8866N432L3165L9307r493k2239
6168A521830k3162M9350J4086j2611L5921k3050K9249K3540L6138N5832l8058
6157A669065M4683K2567J5363K6390L0871J6102J65K7747J885M2050J5985M0724
6145A953597M4620J3184K5658L1372N9216L7507K5462o36n392M8247j0775O1167
6133B283227O6799l4398K6991K1068J18391J05427P6089N4854O1015N697L8408
6122B823568P1110O9999M9434M7407P0389J28089R1054K7735R3842M7949J08822
6111C629398O6231P5685Q3615M5927L2195J29123M2773N4120R6448O1786Q6100
$$ plain form
6100 4403401 4460243 4593156 4676866 4742835 4790363 4881196 5033341 5194776 5364757 5505881
6090 5505881 5621416 5730447 5862839 6092341 6280408 6518994 6721058 6957658 7263905 7564716
6080 7564716 7952243 8399871 8895232 9447121 9990417 10648994 11431384 12263685 13239146 14269683
6070 14269683 15324353 16497750 17867228 19561456 21823512 24643765 27098704 27796731
6062 27796731 26264347 23548873 21182232 19739552 19055896 18956489 19218901 19861139 21248378
6053 21248378 23232721 25141590 25462993 23480483 20042141 16666970 14164859 12408329
6045 12408329 11283247 10534000 9898373 9499803 9216903 9030350 8965359 8907333 8930758 8953373
6035 8953373 9022616 9093862 9256709 9481209 9623133 9908483 10306705 10753509 11248863 11739521
$$ packed form
6100D403401N6842J32913Q3710O5969M7528R0833J52145J61435J69981J41124
6090E505881J15535J09031J32392K29502J88067K38586K02064K36600L06247L00811
6080G564716L87527M47628M95361N51889N43296O58577P82390Q32301R75461J030537
6070A4269683J054670J173397J369478J694228K262056K820253K454939O98027
6062B7796731j532384k715474k366641j442680o83656r9407K62412O42238J387239
6053B1248378J984343J908869L21403j982510l438342l375171k502111j756530
6045A2408329j125082p49247o35627l98570k82900j86553o4991n8026K3425K2615
6035H953373O9243P1246J62847K24500J41924K85350L98222M46804M95354M90658
$$ plain form
6025 11739521 12311975 13014686 13893617 14879769 16015073 17226885 18521226 19904541 21434807
6016 21434807 23373223 25940767 29291441 32729576 34878345 34078535 30857504 27241471
6008 27241471 24589867 23059845 22442819 22436415 22976649 24205511 26359130 28989727 30528845
5999 30528845 29251262 25230589 20254528 16042720 13087816 11022011 9529061 8478510
5991 8478510 7672736 7011974 6547917 6149001 5814270 5495059 5275213 5068513 4856439 4655367
5981 4655367 4513371 4447910 4391786 4286323 4204174 4061827 3977047 3897426 3812463 3750877 3672707
5970 3672707 3575496 3552420 3497835 3420550 3368015 3373951 3290995 3223194 3233313 3192089 3132671 3115276
5958 3115276 3135868 3067833 3021992 2981136 2944314 2910447 2998413 3049562 3029435 3001503 2990843
$$ packed form
6025A1739521N72454P02711Q78931R86152J135304J211812J294341J383315J530266
6016B1434807J938416K567544L350674L438135K148769p99810l221031l616033
6008B7241471k651604j530022o17026o404N40234J228862K153619K630597J539118
5999C0528845j277583m020673m976061m211808k954904k065805j492950j050551
5991H478510q05774o60762m64057l98916l34731l19211k19846k06700k12074k01072
5981D655367j41996o5461n6124j05463q2149j42347q4780p9621q4963o1586p8170
5970C672707r7211k3076n4585p7285n2535N936q2956o7801J0119m1224n9418j7395
5958C115276K0592o8035m5841m0856l6822l3867Q7966N1149k0127k7932j0660
$$ plain form
5947 2990843 3025633 3026107 3038055 3029642 3081619 3103082 3122352 3088612 3143270 3154325 3136213 3267215
5935 3267215 3261882 3256446 3272210 3312515 3373312 3414163 3496811 3526957 3525096 3505605 3488398 3474062
5923 3474062 3430548 3435203 3454308 3442270 3492833 3452638 3515489 3561200 3611837 3657373 3681376 3713402
5911 3713402 3747181 3813727 3839460 3858747 3923814 3978776 3984160 4082143 4197574 4265885 4305614
5900 4305614 4376341 4407563 4495276 4528487 4607741 4712573 4747410 4816402 4813283 4869035 4876823 4873762
5888 4873762 4833600 4816416 4875315 4926395 5004248 5115275 5185673 5224708 5293439 5442787 5585447
5877 5585447 5580247 5671133 5722626 5828091 5890876 5881033 5986274 6106347 6144491 6185770 6197926
5866 6197926 6182264 6154513 6099597 6039742 6023268 6025931 6028318 6052659 6154792 6151970 6097443 6119392
$$ packed form
5947B990843L4790M74J1948q413N1977K1463J9270l3740N4658J1055j8112J31002
5935C267215n333n436J5764M0305O0797M0851Q2648L0146j861j9491j7207j4336
5923C474062m3514M655J9105j2038N0563m0195O2851M5711N0637M5536K4003L2026
5911C713402L3779O6546K5733J9287O5067N4962N384R7983J15431O8311L9729
5900D305614P0727L1222Q7713L3211P9254J04832L4837O8992l119N5752P788l061
5888D873762m0162j7184N8899N1080P7853J11027P0398L9035O8731J49348J42660
5877E585447n200R0886N1493J05465O2785r843J05241J20073L8144M1279J2156
5866F197926j5662k7751n4916n9855j6474K663K387K4341J02133k822n4527K1949
$$ plain form
5854 6119392 6206255 6321074 6422653 6532922 6707428 6836514 6926664 7073844 7201115 7309943
5844 7309943 7313891 7231869 7198970 7112011 7057132 7105024 7131715 7204070 7304609 7427045 7471582
5833 7471582 7560676 7628374 7683730 7819034 8006746 8059940 8082889 8164334 8288478 8440179 8662056
5822 8662056 8913977 9083591 9292419 9425085 9602313 9748832 9886639 10097177 10276647 10444614
5812 10444614 10545881 10639964 10811271 10984444 11241981 11439701 11647606 11862031 12091152 12259503
5802 12259503 12410654 12571465 12651235 12686003 12820347 13111255 13418718 13743157 14111151 14525587
5792 14525587 14929385 15438618 16060623 16873201 17758482 18900282 20087526 20962059 21237925
5783 21237925 20637740 19436758 17816510 16314252 15187055 14382705 13946576 13672152 13575330
$$ packed form
5854F119392Q6863J14819J01579J10269J74506J29086R0150J47180J27271J08828
5844G309943L948q2022l2899q6959n4879M7892K6691P2355J00539J22436M4537
5833G471582Q9094O7698N5356J35304J87712N3194K2949Q1445J24144J51701K21877
5822H662056K51921J69614K08828J32666J77228J46519J37807K10538J79470J67967
5812A0444614J01267R4083J71307J73173K57537J97720K07905K14425K29121J68351
5802A2259503J51151J60811P9770L4768J34344K90908L07463L24439L67994M14436
5792A4525587M03798N09233O22005Q12578Q85281J141800J187244Q74533K75866
5783B1237925o00185j200982j620248j502258j127197q04350m36129k74424r6822
$$ plain form
5774 13575330 13652960 13964661 14315926 14666594 15149719 15690305 16274782 16855815 17538725 18414207
5764 18414207 19573912 21076529 22747407 23957489 24176312 22955440 20631253 18127127
5756 18127127 16146892 14835052 13907169 13311744 12915507 12743702 12747543 12809957 13054348 13381135
5746 13381135 13810743 14314498 14990553 15747054 16513476 17388885 18372050 19352581 20405115
5737 20405115 21757543 23630266 26254628 29398609 31779397 31629838 28524423 24080225
5729 24080225 20236487 17532606 15820173 14778580 14099616 13710600 13538057 13537734 13717058
5720 13717058 13971499 14365551 14918391 15558715 16253096 17086035 17969567 18958568 19974774
5711 19974774 21089748 22572760 24790885 27799151 31002553 32925453 31904424 27891714
$$ packed form
5774A3575330P7630L11701L51265L50668M83125N40586N84477N81033O82910Q75482
5764A8414207J159705J502617J670878J210082K18823j220872k324187k504126
5756A8127127j980235j311840r27883n95425l96237j71805L841O2414K44391L26787
5746A3381135M29608N03755O76055P56501P66422Q75409R83165R80531J052534
5737B0405115J352428J872723K624362L143981K380788j49559l105415m444198
5729B4080225l843738k703881j712433j041593o78964l89016j72543l23J79324
5720A3717058K54441L94052N52840O40324O94381Q32939Q83532R89001J016206
5711A9974774J114974J483012K218125L008266L203402J922900j021029m012710
$$ plain form
5703 27891714 23136370 19202079 16555273 14891759 13829753 13142680 12724838 12517198 12452258
5694 12452258 12549873 12747636 13052783 13472582 13920995 14495803 15149239 15745795 16483174 17557199
5684 17557199 19169140 21362798 23516165 24499745 23298618 20234453 17019363 14514028
5676 14514028 12888711 11961076 11364258 10983459 10691082 10585138 10663151 10827177 11135859
5667 11135859 11440413 11799426 12177414 12690466 13212707 13837356 14531441 15222222 16137481
5658 16137481 17446314 19386442 21809600 23986583 24449528 22318899 18558427 14981845
5650 14981845 12451329 10741030 9628570 8738921 8113102 7606101 7220210 6893904 6680067
5641 6680067 6457997 6280334 6098530 5932242 5893837 5851135 5739362 5713586 5744898 5739260 5784415
$$ packed form
5703B7891714m755344l934291k646806j663514j062006o87073m17842k07640o4940
5694A2452258R7615J97763L05147M19799M48413N74808O53436N96556P37379J074025
5684A7557199J611941K193658K153367R83580j201127l064165l215090k505335
5676A4514028j625317r27635n96818l80799k92377j05944P8013J64026L08682
5667A1135859L04554L59013L77988N13052N22241O24649O94085O90781R15259
5658A6137481J308833J940128K423158K176983M62945k130629l760472l576582
5650A4981845k530516j710299j112460q89649o25819n07001l85891l26306k13837
5641F680067k22070j77663j81804j66288l8405m2702j11773k5776L1312n638M5155
$$ plain form
5630 5784415 5786969 5822412 5825825 5827602 5812533 5698896 5670224 5631627 5530063 5469676 5445335 5417177
5618 5417177 5421191 5497405 5546809 5622497 5686111 5744896 5858404 5973934 6028730 6204053 6424567
5607 6424567 6578190 6651111 6746449 6800946 6728648 6545805 6308230 6133399 5972474 5807905
5597 5807905 5696568 5659015 5692180 5741807 5817879 5918384 5993945 6105348 6299602 6459087
5587 6459087 6635207 6783123 6970963 7291983 7646437 7954369 8157220 8164635 8017923 7674361
5577 7674361 7277134 6836833 6361364 5999974 5655299 5369893 5156977 5036638 4967945 4966247
5567 4966247 4997656 5004831 5075573 5167221 5243214 5402602 5558285 5733321 5998830 6260551 6469849
5556 6469849 6630829 6581037 6358311 5991042 5585129 5228225 4881618 4575484 4326060 4167349
$$ packed form
5630E784415K554L5443L413J777j5069j13637k8672l8597j01564o0387k4341k8158
5618E417177M014P6214M9404P5688O3614N8785J13508J15530N4796J75323K20514
5607F424567J53623P2921R5338N4497p2298j82843k37575j74831j60925j64569
5597E807905j11337l7553L3165M9627P6072J00505P5561J11403J94254J59485
5587F459087J76120J47916J87840L21020L54454L07932K02851P415j46712l43562
5577G674361l97227m40301m75469l61390l44675k85406k12916j20339o8693j698
5567D966247L1409P175P0742R1648P5993J59388J55683J75036K65509K61721K09298
5556F469849J60980m9792k22726l67269m05913l56904l46607l06134k49424j58711
$$ plain form
5546 4167349 4031847 3931322 3813302 3756218 3663112 3623105 3632945 3613129 3642279 3708863 3783323
5535 3783323 3901681 4004535 4142752 4291427 4323997 4252715 4121268 3910269 3690069 3442794
5525 3442794 3217350 3053107 2901662 2801543 2630114 2514011 2477950 2419031 2422793 2358289
5515 2358289 2348021 2364179 2339529 2309499 2323437 2384387 2392560 2402349 2413446 2439996 2420669 2370356
5503 2370356 2304359 2279223 2221804 2201502 2195226 2167850 2076099 2051715 2020840 1988249 1973936 1904944
5491 1904944 1873349 1870267 1836294 1828121 1810445 1813150 1801475 1810115 1866062 1877271 1853964 1864854
5479 1864854 1814860 1808846 1780347 1783907 1844048 1793478 1720870 1713143 1723589 1690846 1721599 1723527
5467 1723527 1684174 1663839 1716146 1693230 1656775 1721468 1760996 1735667 1724045 1744166 1767175
$$ packed form
5546D167349j35502j00525j18020n7084r3106m0007R840j9816K9150O6584P4460
5535C783323J18358J02854J38217J48675L2570p1282j31447k10999k20200k47275
5525C442794k25444j64243j51445j00119j71429j16103l6061n8919L762o4504
5515B358289j0268J6158k4650l0030J3938O0950Q173R789J1097K6550j9327n0313
5503B370356o5997k5136n7419k0302o276k7376r1751k4384l0875l2591j4313o8992
5491A904944l1595l082l3973q173j7676K705j1675Q640N5947J1209k3307J0890
5479A864854m9994o014k8499L560O0141n0570p2608p727J0446l2743L0753J928
5467A723527l9353k0335N2307k2916l6455O4693L9528k5329j1622K0121K3009
$$ plain form
5456 1767175 1810787 1883706 1851700 1879210 1875158 1902160 1979392 1988183 1955791 1912878 1927161 1941219
5444 1941219 1905267 1903501 1846909 1787319 1807592 1848630 1864934 1885045 1876034 1923205 1988162 2004981
5432 2004981 1984335 1982606 2045785 2118787 2116305 2153185 2183093 2183363 2167580 2133246 2156255 2113946
5420 2113946 2075149 2067561 2058478 2022266 2029422 2034966 1997033 2009526 1989920 1902799 1988545 2080788
5408 2080788 2120436 2135187 2140406 2208921 2257329 2356177 2384544 2380975 2445236 2474578 2498758 2478708
5396 2478708 2462037 2386432 2332512 2309568 2322159 2342556 2339207 2346854 2394630 2389670 2398215 2430039
5384 2430039 2414061 2431466 2491234 2553772 2613821 2629620 2618807 2688333 2754751 2803331 2918410
5373 2918410 2948344 3051585 3190343 3308281 3419058 3509569 3525273 3473583 3478638 3470480 3398720
$$ packed form
5456A767175M3612P2919l2006K7510m052K7002P7232Q791l2392m2913J4283J4058
5444A941219l5952j766n6592n9590K0273M1038J6304K0111r011M7171O4957J6819
5432B004981k0646j729O3179P3002k482L6880K9908K70j5783l4334K3009m2309
5420B113946l8797p588r083l6212P156N544l7933J2493j9606q7121Q5746R2243
5408B080788L9648J4751N219O8515M8408R8848K8367l569O4261K9342K4180k0050
5396B478708j6671p5605n3920k2944J2591K0397l349P647M7776m960Q545L1824
5384B430039j5978J7405N9768O2538O0049J5799j0813O9526O6418M8580J15079
5373B918410K9934J03241J38758J17938J10777R0511J5704n1690N055q158p1760
$$ plain form
5362 3398720 3356399 3349907 3327014 3328142 3409552 3492102 3505499 3589279 3714285 3892302 3995560
5351 3995560 4108826 4281514 4550912 4835162 5033460 5158547 5208381 5141256 4907411 4651609
5341 4651609 4456138 4317034 4272428 4213065 4137301 4101054 4110841 4139053 4150560 4151214 4187255 4210004
5329 4210004 4245329 4263362 4289767 4305689 4226310 4145643 4108305 4066891 4025056 4016442 3959932 3847877
5317 3847877 3773423 3717972 3604510 3525937 3454853 3390569 3358578 3323885 3313462 3355536 3319656
5306 3319656 3319427 3375286 3449538 3525950 3565601 3586053 3645859 3767266 3836755 3944526 3951861 3887529
5294 3887529 3843620 3802771 3803768 3696655 3686796 3663783 3595279 3624885 3721557 3807795 3912891 3966210
5282 3966210 4048479 4128541 4219931 4360788 4550042 4698526 4717956 4607518 4484033 4479527 4500725
$$ packed form
5362C398720m2321o492k2893J128Q1410Q2550J3397Q3780J25006J78017J03258
5351C995560J13266J72688K69398K84250J98298J25087M9834o7125k33845k55802
5341D651609j95471j39104m4606n9363p5764l6247R787K8212J1507O54L6041K2749
5329D210004L5325J8033K6405J5922p9379q0667l7338m1414m1835q614n6510j12055
5317C847877p4454n5451j13462p8573p1084o4284l1991l4693j0423M2074l5880
5306C319656k29N5859P4252P6412L9651K0452N9806J21407O9489J07771P335o4332
5294C887529m3909m0849R97j07113r859k3013o8504K9606R6672Q6238J05096N3319
5282C966210Q2269Q0062R1390J40857J89254J48484J9430j10438j23485m506K1198
$$ plain form
5271 4500725 4508426 4521803 4561874 4571554 4713418 4882516 5006470 5030603 4971644 4914520 4997045
5260 4997045 5005628 5049582 5037981 5076288 5154664 5195941 5229402 5247387 5210531 5105211 5026065
5249 5026065 5005225 5017632 5030994 4995801 4947901 4878616 4779774 4799575 4766363 4811860 4905954
5238 4905954 4958336 5063218 5182234 5267497 5415992 5531975 5609789 5578394 5586995 5655200 5675987
5227 5675987 5809296 5894645 6016851 6160502 6223630 6236523 6290727 6293170 6128855 5865917 5726838
5216 5726838 5597469 5589666 5597897 5602622 5665240 5795431 5909442 6052363 6244686 6416749 6502895
5205 6502895 6555237 6607056 6632764 6765008 6965538 7233147 7451581 7594894 7603112 7441133
5195 7441133 7215826 7054637 6949285 6887674 6730033 6675926 6645847 6669467 6713201 6852281
$$ packed form
5271D500725P701J3377M0071R680J41864J69098J23954K4133n8959n7124Q2525
5260D997045Q583M3954j1601L8307P8376M1277L3461J7985l6856j05320p9146
5249E026065k0840J2407J3362l5193m7900o9285r8842J9801l3212M5497R4094
5238D905954N2382J04882J19016Q5263J48495J15983P7814l1395Q601O8205K0787
5227E675987J33309Q5349J22206J43651O3128J2893N4204K443j64315k62938j39079
5216E726838j29369p803Q231M725O2618J30191J14011J42921J92323J72063Q6146
5205F502895N2342N1819K5708J32244K00530K67609K18434J43313Q218j61979
5195G441133k25307j61189j05352o1611j57641n4107l0079K3620M3734J39080
$$ plain form
5185 6852281 6965295 7115378 7220224 7337757 7499167 7624818 7762508 7935205 8104137 8280874
5175 8280874 8486750 8594245 8755175 8866862 8868345 8806728 8683532 8619242 8705552 8831597
5165 8831597 8984600 9129369 9266368 9520161 9763146 10053086 10376893 10640371 10951051 11323683
5155 11323683 11717048 12163312 12654850 13261012 13778100 14304567 14948255 15710200 16639405
5146 16639405 17700185 18595347 18847135 18534303 18301324 18401304 18762422 19329941 20046256
5137 20046256 21004548 22412035 24166928 26110849 27573985 27607137 26600472 25672892 25442141
5128 25442141 25914828 26816352 27648270 27963545 28024876 28398837 29280766 30417215 31151878
5119 31151878 31502388 31689208 31832159 32244225 33163726 33748683 33175548 31553048 30174176
$$ packed form
5185F852281J13014J50083J04846J17533J61410J25651J37690J72697J68932J76737
5175H280874K05876J07495J60930J11687J483o1617j23196o4290Q6310J26045
5165H831597J53003J44769J36999K53793K42985K89940L23807K63478L10680L72632
5155A1323683L93365M46264M91538O06162N17088N26467O43688P61945R29205
5146A6639405J060780Q95162K51788l12832k32979R9980L61118N67519P16315
5137B0046256R58292J407487J754893J943921J463136L3152j006665r27580k30751
5128B5442141M72687R01524Q31918L15275O1331L73961Q81929J136449P34663
5119C1151878L50510J86820J42951M12066R19501N84957n73135j622500j378872
$$ plain form
5110 30174176 29705922 30081754 31243334 32666056 33620023 33506179 32934588 32918299 33197102
5101 33197102 33288412 33205864 32890042 32341596 31916457 32173906 32840997 33355111 33455231 33353913
5091 33353913 33751250 34833233 36599376 38928825 40876014 41764719 42193323 42577913 42331198
5082 42331198 40897826 38137616 34435137 30962991 28596341 27412311 26996512 26646894
5074 26646894 25904491 25118389 24652635 24455263 24500440 24630209 24593345 24605300 25016730 25820791
5064 25820791 26893830 28085634 29244044 30201495 30558635 30089257 28896515 27462719 26006268
5055 26006268 24731521 23964525 23619260 23612750 23895902 24296177 24590322 24554562 24110735 23727102
5045 23727102 23704862 23959331 24051529 23754480 23390420 23382379 23530233 23384532 23037345 22904959
$$ packed form
5110C0174176m68254L75832J161580J422722R53967j13844n71591j6289K78803
5101C3197102R1310q2548l15822n48446m25139K57449O67091N14114J00120j01318
5091C3353913L97337J081983J766143K329449J947189Q88705M28604L84590k46715
5082D2331198j433372k760210l702479l472146k366650j184030m15799l49618
5074B6646894p42403p86102m65754j97372M5177J29769l6864J1955M11430Q04061
5064B5820791J073039J191804J158410R57451L57140m69378j192742j433796j456451
5055B6006268j274747p66996l45265o510K83152M00275K94145l5760m43827l83633
5045B3727102k2240K54469R2198k97049l64060q041J47854j45701l47187j32386
$$ plain form
5035 22904959 22836558 22638881 22563933 22726885 23214638 24078112 25403695 27233533 29397444
5026 29397444 31414450 32727971 33381126 33246991 32224040 30675810 29062550 27662397
5018 27662397 26999925 27390880 28636658 30170238 30850407 30162942 28659782 27097449 26107665
5009 26107665 25947352 25892157 25402253 24310830 22458207 20412739 19121203 18593388 18629098
5000 18629098 18801683 18949901 18861205 18341520 17653257 16707368 15454987 14230668 13395134
4991 13395134 13013053 13034016 12949286 12704309 12388193 12074459 11612333 11237877 11073184 10934696
4981 10934696 10887122 10713497 10294268 9729493 9314721 8921140 8481489 8085236 7902655 7924946
4971 7924946 8117450 8211709 7877570 7257849 6742319 6345666 6060649 5915687 5755775 5677699
$$ packed form
5035B2904959o8401j97677p4948J62952M87753Q63474J325583J829838K163911
5026B9397444K017006J313521O53155j34135j022951j548230j613260j400153
5018B7662397o62472L90955J245778J533580O80169o87465j503160j562333r89784
5009B6107665j60313n5195m89904j091423j852623k045468j291536n27815L5710
5000A8629098J72585J48218q8696n19685o88263r45889j252381j224319q35534
4991A3395134l82081K0963q4730k44977l16116l13734m62126l74456j64693j38488
4981A0934696m7574j73625m19229n64775m14772l93581m39651l96253j82581K2291
4971G924946J92504R4259l34139o19721n15530l96653k85017j44962j59912p8076
$$ plain form
4961 5677699 5612118 5616897 5667080 5719328 5731553 5769506 5884468 6001001 6058225 6031804 5900353
4950 5900353 5660726 5353627 5145369 5046418 4899717 4776216 4771654 4746693 4778159 4775642 4791523
4939 4791523 4812497 4817345 4765679 4705511 4720564 4699945 4652780 4599375 4661729 4700195 4704656 4755413
4927 4755413 4860378 4953097 5032692 5081334 5137286 5200990 5266585 5365625 5466257 5636079 5754274
4916 5754274 5939509 6147437 6388540 6651078 6942062 7259581 7624667 8044365 8498981 9077586
4906 9077586 9820993 10506173 11004944 11465851 11979252 12299934 11811897 10674808 9302364
4897 9302364 8086494 7292361 6810904 6403846 6132280 5924334 5773395 5744077 5712649 5741371
4887 5741371 5797699 5826219 5839576 5925359 6068790 6198841 6323118 6509928 6656911 6816419
$$ packed form
4961E677699o5581M779N0183N2248J2225L7953J14962J16533N7224k6421j31451
4950E900353k39627l07099k08258r8951j46701j23501m562k4961L1466k517J5881
4939D791523K0974M848n1666o0168J5053k0619m7165n3405O2354L8466M461N0757
4927D755413J04965R2719P9595M8642N5952O3704O5595R9040J00632J69822J18195
4916E754274J85235K07928K41103K62538K90984L17519L65086M19698M54616N78605
4906I077586P43407O85180M98771M60907N13401L20682m88037j137089j372444
4897I302364j215870p94133m81457m07058k71566k07946j50939k9318l1428K8722
4887E741371N6328K8520J3357Q5783J43431J30051J24277J86810J46983J59508
$$ plain form
4877 6816419 7105260 7422813 7788877 8258691 8673412 8801841 8846227 9079664 9401806 9827763
4867 9827763 10400609 11041300 11855429 12824492 13942203 15007065 15417277 14311778 12527128
4858 12527128 11205727 10437079 10087267 10088606 10212323 10342405 10354993 10422180 10626135 11161979
4848 11161979 12172223 13322821 13719210 12667152 11105101 9769068 8682276 7842779
4840 7842779 7271234 6934097 6648970 6489173 6411135 6356486 6227901 6023554 5866836 5746797
4830 5746797 5659619 5605306 5550919 5519729 5557999 5595039 5600731 5642107 5752341 5839194 5909360
4819 5909360 5995212 6136741 6226774 6351179 6566977 6780618 6954680 7211801 7502405 7922614
4809 7922614 8395780 8909376 9307340 9315770 9195561 9107144 8982224 8917419 8946385 9153886
$$ packed form
4877F816419K88841L17553L66064M69814M14721J28429M4386K33437L22142M25957
4867I827763N72846O40691Q14129R69063J117711J064862M10212j105499j784650
4858A2527128j321401p68648l49812J339J23717J30082J2588O7187K03955N35844
4848A1161979J010244J150598L96389j052058j562051j336033j086792q39497
4840G842779n71545l37137k85127j59797p8038n4649j28585k04347j56718j20039
4830E746797q7178n4313n4387l1190L8270L7040N692M1376J10234Q6853P0166
4819E909360Q5852J41529R0033J24405K15798K13641J74062K57121K90604M20209
4809G922614M73166N13596L97964Q430j20209q8417j24920o4805K8966K07501
$$ plain form
4799 9153886 9411411 9770871 10245745 10948280 11877070 12847126 13295174 13029050 12572606 12533675
4789 12533675 12826629 13053058 12855893 12286213 11741055 11484955 11560611 11809949 12332193 13091918
4779 13091918 13986329 14757234 15242346 15428470 15635946 16247557 17322665 18225703 17938756
4770 17938756 16517004 15150309 14400679 14149283 13957330 13645446 13348690 12962790 12453868
4761 12453868 12212957 12286288 12588163 12896877 12944944 12858583 12925206 13053710 12954005 12950475 13134680
4750 13134680 12953710 12127063 11096606 10320517 9859431 9609362 9463803 9492125 9552508 9661636
4740 9661636 9841288 10095197 10287410 10522982 10834629 11126225 11533022 12019032 12573395 13098229
4730 13098229 13699619 14455331 15312188 16186363 17084100 18075032 19164079 20258518 21752412
$$ packed form
4799I153886K57525L59460M74874P02535R28790R70056M48048k66124m56444l8931
4789A2533675K92954K26429j97165n69680n45158k56100P5656K49338N22244P59725
4779A3091918Q94411P70905M85112J86124K07476O11611J075108R03038k86947
4770A7938756j421752j366695p49630k51396j91953l11884k96756l85900n08922
4761A2453868k40911P3331L01875L08714M8067q6361O6623J28504r9705l530J84205
4750A3134680j80970q26647j030457p76089m61086k50069j45559K8322O0383J09128
4740I661636J79652K53909J92213K35572L11647K91596M06797M86010N54363N24834
4730A3098229O01390P55712Q56857Q74175Q97737R90932J089047J094439J493894
$$ plain form
4721 21752412 23893965 26785721 30021188 31905154 30620307 27107763 23783929 21569995
4713 21569995 20395960 20058031 20178271 20610259 21350668 22339597 23529272 25034072 26638679
4704 26638679 28374790 30555468 33317366 36821378 40954574 44567347 46214664 46137341
4696 46137341 44409677 39680903 33030192 27320943 23330592 20725525 19105513 18237401
4688 18237401 17841308 17814479 17905443 18216816 18740477 19370893 20107413 21358433 23389714
4679 23389714 26345938 29421680 30513677 27712182 22418605 17693831 14345380 12058420
4671 12058420 10549602 9409307 8541347 7907155 7446741 7036355 6638684 6417452 6200952
4662 6200952 5957984 5775715 5613817 5564702 5488035 5356042 5278718 5254796 5229385 5190513 5142044
$$ packed form
4721B1752412K141553K891756L235467J883966j284847l512544l323834k213934
4713B1569995j174035l37929J20240M31988P40409R88929J189675J504800J604607
4704B6638679J736111K180678K761898L504012M133196L612773J647317p7323
4696D6137341j727664m728774o650711n709249l990351k605067j620012q68112
4688A8237401l96093k6829R0964L11373N23661O30416P36520J251020K031281
4679B3389714K956224L075742J091997k801495n293577m724774l348451k286960
4671A2058420j508818j140295q67960o34192m60414m10386l97671k21232k16500
4662F200952k42968j82269j61898m9115p6667j31993p7324k3922k5411l8872m8469
$$ plain form
4651 5142044 5057221 5036559 4978668 5022042 5015534 5020674 4996626 4961199 4950299 4948394 4931955 4958330
4639 4958330 4961166 4985624 4989753 4949597 4892872 4883907 4871959 4882807 4885243 4974598 4999620 5028860
4627 5028860 5074777 5135264 5169036 5239166 5367855 5490939 5650927 5759633 5797167 5860878 5936902
4616 5936902 6058253 6119694 6085161 6135810 6203056 6252536 6294458 6458054 6527627 6586458 6643443
4605 6643443 6722995 6769563 6863618 6987027 7076192 7233145 7468365 7683424 7857626 7969332
4595 7969332 8078372 8228284 8400223 8629768 8864511 9068087 9245658 9391599 9606425 9783985
4585 9783985 10001156 10120481 10241185 10427418 10728126 11014218 11301589 11620490 11926277 12376602
4575 12376602 12786706 13245360 13776991 14460260 15216594 16008166 16916406 17984154 19099171
$$ packed form
4651E142044q4823k0662n7891M3374o508N140k4048l5427j0900j905j6439K6375
4639D958330K836K4458M129m0156n6725q965j1948J0848K436Q9355K5022K9240
4627E028860M5917O0487L3772P0130J28689J23084J59988J08706L7534O3711P6024
4616E936902J21351O1441l4533N0649O7246M9480M1922J63596O9573N8831N6985
4605F643443P9552M6568R4055J23409Q9165J56953K35220K15059J74202J11706
4595G969332J09040J49912J71939K29545K34743K03576J77571J45941K14826J77560
4585I783985K17171J19325J20704J86233L00708K86092K87371L18901L05787M50325
4575A2376602M10104M58654N31631O83269P56334P91572R08240J067748J115017
$$ plain form
4566 19099171 20207986 21539134 22956180 24464633 26197540 28430735 31389778 35117908
4558 35117908 38898691 41040883 40167862 36895449 33353842 30879062 29640126 29290073
4550 29290073 29633911 30769601 32862797 35790952 38757628 40128973 38520667 34818307
4542 34818307 31102042 28593445 27351583 27221094 28193469 30119973 32193213 32989967 31531775
4533 31531775 28467901 25431757 23231567 21917450 21190211 20989920 21297656 22311768 24002622
4524 24002622 25640429 25843133 23722327 20083604 16478102 13755411 11882928 10659053
4516 10659053 9772676 9069755 8521255 8022409 7626459 7298266 7106708 6894896 6722869
4507 6722869 6588993 6502561 6381668 6297586 6264633 6243436 6229555 6192041 6163244 6118488 6146809
$$ packed form
4566A9099171J108815J331148J417046J508453J732907K233195K959043L728130
4558C5117908L780783K142192q73021l272413l541607k474780j238936l50053
4550B9290073L43838J135690K093196K928155K966676J371345j608306l702360
4542C4818307l716265k508597j241862j30489R72375J926504K073240P96754j458192
4533C1531775l063874l036144k200190j314117p27239k00291L07736J014112J690854
4524B4002622J637807K02704k120806l638723l605502k722691j872483j223875
4516A0659053q86377p02921n48500m98846l95950l28193j91558k11812j72027
4507F722869j33876q6432j20893q4082l2953k1197j3881l7514k8797m4756K8321
$$ plain form
4496 6146809 6167770 6204976 6237491 6248142 6290816 6280180 6283881 6316056 6398367 6445729 6473558 6650609
4484 6650609 6802886 6903478 7089363 7331159 7520230 7768440 8093518 8406654 8799550 9187816
4474 9187816 9614938 10143177 10714247 11333909 12011791 12892409 14122794 15608804 16881004
4465 16881004 17171625 16275567 14953794 13922326 13415235 13344814 13703964 14606427 15920802
4456 15920802 16992984 16624880 14829254 13122888 12058316 11502808 11386459 11509468 11871674
4447 11871674 12397508 13274215 14340201 15085652 15169619 14634053 13939835 13252895 12732253
4438 12732253 12572167 12986340 13711253 14359684 14332809 13156699 11257385 9513445 8269439
4429 8269439 7447802 6809986 6277368 5947170 5593786 5290550 5094589 4927551 4914539 4925554
$$ packed form
4496F146809K0961L7206L2515J0651M2674j0636L701L2175Q2311M7362K7829J77051
4484F650609J52277J00592J85885K41796J89071K48210L25078L13136L92896L88266
4474I187816M27122N28239N71070O19662O77882Q80618J230385J486010J272200
4465A6881004K90621q96058j321773j031468n07091p0421L59150R02463J314375
4456A5920802J072182l68104j795626j706366j064572n55508j16349J23009L62206
4447A1871674N25834Q76707J065986P45451Q3967n35566o94218o86940n20642
4438A2732253j60086M14173P24913O48431k6875j176110j899314j743940j244006
4429H269439q21637o37816n32618l30198l53384l03236j95961j67038j3012J1015
$$ plain form
4419 4925554 4905564 4913368 4875203 4832748 4735126 4601947 4584708 4591942 4594292 4698507 4801925
4408 4801925 4897997 4989811 4990401 4946297 4849609 4724813 4538699 4457632 4437165 4428506 4478923 4534539
4396 4534539 4585594 4673827 4599522 4471206 4291501 4211006 4128317 3988038 3943171 3934908 3915331
4385 3915331 3887382 3909548 3898339 3830485 3741357 3674325 3595330 3591611 3624449 3673129 3706845 3746646
4373 3746646 3826184 3808311 3724567 3656515 3543319 3458166 3364503 3361571 3328727 3305679 3320561
4362 3320561 3329485 3329582 3274674 3262825 3261415 3280970 3312802 3277895 3228086 3208369 3207251 3171403 3186516
4349 3186516 3222114 3235456 3229198 3277891 3275518 3293082 3323845 3319860 3371931 3376239 3338747 3373922
4337 3373922 3403781 3467656 3499215 3521314 3543415 3575754 3568001 3569501 3564498 3578179 3653731 3730285
$$ packed form
4419D925554j9990P804l8165m2455r7622j33179j7239P234K350J04215J03418
4408D801925R6072R1814N90m4104r6688j24796j86114q1067k0467q659N0417N5616
4396D534539N1055Q8233p4305j28316j79705q0495q2689j40279m4867q263j9577
4385C915331k7949K2166j1209o7854q9128o7032p8995l719L2838M8680L3716L9801
4373C746646P9538j7873q3744o8052j13196q5153r3663k932l2844k3048J4882
4362C320561Q924R7n4908j1849j410J9555L1832l4907m9809j9717j118l5848J5113
4349C186516L5598J3342o258M8693k373J7564L0763l985N2071M308l7492L5175
4337C373922K9859O3875L1559K2099K2101L2339p753J500n003J3681P5552P6554
$$ plain form
4325 3730285 3844733 3887937 3874318 3896289 3938361 3941762 4000728 4049524 4101904 4170027 4197486
4314 4197486 4165477 4201009 4242200 4274550 4274351 4299782 4419827 4492354 4592252 4643284 4697587 4741762
4302 4741762 4779068 4840174 5010983 5119075 5137459 5138954 5181602 5185841 5163037 5175214 5170602 5185785
4290 5185785 5170774 5246594 5284216 5315472 5360500 5459853 5535564 5582959 5648932 5718995 5772078
4279 5772078 5868329 5976071 6151323 6288892 6331204 6398333 6468628 6553004 6637437 6675535 6680259
4268 6680259 6744130 6783037 6808088 6865560 6909209 6976506 6988354 7056911 7103066 7230965 7340535
4257 7340535 7340074 7414897 7501634 7621625 7719093 7775483 7820027 7809533 7871469 7880032 7919171 8036609
4245 8036609 8100290 8215771 8299654 8394015 8427162 8535506 8767543 8943472 9078814 9258093
$$ packed form
4325C730285J14448M3204j3619K1971M2072L401N8966M8796N2380O8123K7459
4314D197486l2009L5532M1191L2350j99K5431J20045P2527R9898N1032N4303M4175
4302D741762L7306O1106J70809J08092J8384J495M2648M239k2804J2177m612J5183
4290E185785j5011P5820L7622L1256M5028R9353P5711M7395O5973P0063N3083
4279E772078R6251J07742J75252J37569M2312O7129P0295Q4376Q4433L8098M724
4268F680259O3871L8907K5051N7472M3649O7297J1848O8557M6155J27899J09570
4257G340535m61P4823Q6737J19991R7468N6390M4544j0494O1936Q563L9139J17438
4245H036609O3681J15481Q3883R4361L3147J08344K32037J75929J35342J79279
$$ plain form
4235 9258093 9390911 9537734 9673185 9790270 9923207 9980136 10134285 10274121 10416730 10643977
4225 10643977 10770303 10965229 11206116 11464035 11714170 11872020 12051408 12193219 12389863
4216 12389863 12648092 12998042 13380402 13800862 14315379 14890522 15410303 15950915 16462834
4207 16462834 17005352 17565220 18103471 18600353 19050630 19540157 20070104 20543471 21019980
4198 21019980 21535904 22159338 22742946 23254027 23769194 24211763 24599949 25046559 25596624
4189 25596624 26133098 26728631 27446731 28181312 29036527 29943524 30753405 31581909 32491089
4180 32491089 33382924 34277130 35274615 36425361 37715642 39109896 40571640 42085957 43738745
4171 43738745 45647410 47869295 50295163 53070618 56227243 59913681 64219245 69156439
$$ packed form
4235I258093J32818J46823J35451J17085J32937N6929J54149J39836J42609K27247
4225A0643977J26326J94926K40887K57919K50135J57850J79388J41811J96644
4216A2389863K58229L49950L82360M20460N14517N75143N19781N40612N11919
4207A6462834N42518N59868N38251M96882M50277M89527N29947M73367M76509
4198B1019980N15924O23434N83608N11081N15167M42569L88186M46610N50065
4189B5596624N36474N95533P18100P34581Q55215R06997Q09881Q28504R09180
4180C2491089Q91835Q94206R97485J150746J290281J394254J461744J514317J652788
4171D3738745J908665K221885K425868K775455L156625L686438M305564M937194
$$ plain form
4163 69156439 74615199 80583528 87033741 94351110 102662106 112399669 123415764 135501765
4155 135501765 148772581 163240701 179014042 197727105 221754342 253353535 286695965
4148 286695965 305438272 297665915 266773515 225993184 188192499 155539689 126914912
4141 126914912 103712552 85949033 72512206 62068137 54232703 48264284 43628954
4134 43628954 39838575 36649091 33801137 31325044 29141275 27331721 25713185 24321361
4126 24321361 23064266 22017009 20917775 19885974 18844021 17897988 17091862 16427866 15726471
4117 15726471 15080362 14429517 13855238 13455670 13021882 12681635 12407226 12042074 11613421
4108 11613421 11154126 10817648 10432779 10093940 9720100 9320631 8992525 8649552 8420809
$$ packed form
4163F9156439N458760N968329O450213P317369Q310996R737563J1016095J2086001
4155A35501765J3270816J4468120J5773341J8713063K4027237L1599193L3342430
4148B86695965J8742307p772357l0892400m0780331l7800685l2652810k8624777
4141A26914912k3202360j7763519j3436827j0444069p835434n968419m635330
4134D3628954l790379l189484k847954k476093k183769j809554j618536j391824
4126B4321361j257095j047257j099234j031801j041953r46033q06126o63996p01395
4117A5726471o46109o50845n74279l99568m33788l40247k74409l65152m28653
4108A1613421m59295l36478l84869l38839l73840l99469l28106l42973k28743
$$ plain form
4099 8420809 8190104 8004372 7786530 7572373 7425613 7248406 7131704 6984162 6885687 6829071
4089 6829071 6743774 6683285 6685818 6625003 6547794 6475725 6414528 6447199 6428232 6377327 6306735 6322282
4077 6322282 6322175 6302218 6322350 6298530 6315911 6271919 6243402 6249146 6319333 6426690 6565441 6782915
4065 6782915 6937789 6983510 7038855 6936447 6862179 6937813 7037046 7203062 7403571 7576515
4055 7576515 7612482 7534827 7297560 7071054 6949490 6884700 6879129 6914371 6930045 7115649 7339434
4044 7339434 7566521 7633855 7496788 7372588 7366008 7306134 7013188 6596485 6221175 5928269
4034 5928269 5746789 5540789 5283982 5086136 4913979 4723685 4627209 4505405 4355549 4253974
4024 4253974 4143499 4006831 3897933 3711569 3604661 3500560 3472915 3471378 3340371 3229779
$$ packed form
4099H420809k30705j85732k17842k14157j46760j77207j16702j47542r8475n6616
4089F829071q5297o0489K533o0815p7209p2069o1197L2671j8967n0905p0592J5547
4077F322282j07j9957K0132k3820J7381m3992k8517N744P0187J07357J38751K17474
4065F782915J54874M5721N5345j02408p4268P5634R9233J66016K00509J72944
4055G576515L5967p7655k37267k26506j21564o4790n571L5242J5674J85604K23785
4044G339434K27087O7334j37067j24200o580n9874k92946m16703l75310k92906
4034E928269j81480k06000k56807j97846j72157j90294r6476j21804j49856j01575
4024D253974j10475j36668j08898j86364j06908j04101k7645j537j31007j10592
$$ plain form
4014 3229779 3143683 3103924 3047276 3010781 2931366 2876496 2876607 2853200 2844453 2845764 2850117 2823227
4002 2823227 2834655 2910161 2963104 3015391 3067256 2956279 2873691 2844729 2832389 2855058 2870094
3991 2870094 2833599 2722747 2565260 2443027 2340843 2291212 2328107 2327964 2292571 2251880 2231137
3980 2231137 2292259 2276097 2263639 2276401 2256151 2220976 2164379 2213786 2212013 2114726 2056833 1998865
3968 1998865 1964818 1906256 1832291 1815910 1821896 1785565 1624353 1614559 1586853 1529425 1570694 1628296
3956 1628296 1645472 1674389 1607888 1556873 1585707 1567474 1513173 1577514 1581875 1519382 1525142 1493605
3944 1493605 1481479 1489687 1514424 1482858 1420791 1465818 1516787 1462107 1418651 1437969 1455583 1471855
3932 1471855 1521078 1565351 1594022 1594694 1610029 1610833 1645484 1649237 1582329 1490360 1467805 1467061 1490305
$$ packed form
4014C229779q6096l9759n6648l6495p9415n4870J11k3407q747J311M353k6890
4002B823227J1428P5506N2943N2287N1865j10977q2588k8962j2340K2669J5036
3991B870094l6495j10852j57487j22233j02184m9631L6895j43l5393m0691k0743
3980B231137O1122j6162j2458J2762k0250l5175n6597M9407j773r7287n7893n7968
3968A998865l4047n8562p3965j6381N986l6331j61212r794k7706n7428M1269N7602
3956A628296J7176K8917o6501n1015K8834j8233n4301O4341M361o2493N760l1537
3944A493605j2126Q208K4737l1566o2067M5027N0969n4680m3456J9318J7614J6272
3932A471855M9223M4273K8671O72J5335Q04L4651L753o6908r1969k2555p44K3244
$$ plain form
3919 1490305 1447357 1424586 1497739 1421262 1454090 1439716 1382788 1332257 1311116 1320944 1351361 1311693
3907 1311693 1340730 1300584 1329367 1359510 1311848 1283299 1277798 1312646 1299366 1332422 1297099 1355623
3895 1355623 1360190 1360592 1351752 1320193 1359747 1425577 1460550 1441433 1450206 1535312 1565786 1585690
3883 1585690 1651234 1669562 1716942 1765479 1873447 1926775 1906646 1903687 1889183 1904912 1901532 1877400
3871 1877400 1866907 1849779 1863924 1979617 2093477 2174490 2261283 2352334 2463100 2479866 2563441
3860 2563441 2690875 2814400 2962298 2985831 2862922 2608660 2348178 2139286 1992430 1856446
3850 1856446 1707472 1571652 1489985 1429658 1433495 1458033 1448668 1447089 1391034 1288927 1196059
3839 1196059 1124461 1087256 1111414 1145111 1092145 1121681 1117235 1080172 1091281 1093079 1048286 1031029
$$ packed form
3919A490305m2948k2771P3153p6477L2828j4374n6928n0531k1141R828L0417l9668
3907A311693K9037m0146K8783L0143m7662k8549n501L4848j3280L3056l5323N8524
3895A355623M567M02q840l1559L9554O5830L4973j9117Q773Q5106L0474J9904
3883A585690O5544J8328M7380M8537J07968N3328k0129k959j4504J5729l380k4132
3871A877400j0493j7128J4145J15693J13860Q1013Q6793R1051J10766J6766Q3575
3860B563441J27434J23525J47898K3533j22909k54262k60482k08892j46856j35984
3850A856446j48974j35820q1667o0327L837K4538r365j579n6055j02107r2868
3839A196059p1598l7205K4158L3697n2966K9536m446l7063J1109J798m4793j7257
$$ plain form
3827 1031029 1061066 1022167 987363 960526 947484 928252 1002855 1004426 949360 925053 901327 902882
3815 902882 885135 894930 883627 915862 935905 885115 898363 972446 936554 846420 821039 859358
3803 859358 835095 918942 966605 974474 954712 1020472 1032781 971135 946830 994696 1028212 1024360
3791 1024360 1037248 1047225 996832 1008888 1041389 1051454 1124004 1117083 1145163 1194079 1189193 1187541
3779 1187541 1151156 1173600 1213333 1165775 1180518 1224752 1220590 1212505 1197387 1205917 1274354 1227708
3767 1227708 1285857 1287450 1301333 1285891 1270334 1248031 1261449 1281839 1283614 1241861 1335325 1298210
3755 1298210 1249329 1268473 1285941 1330696 1262174 1247222 1223026 1208307 1142809 1140902 1152972 1158744
3743 1158744 1169965 1164912 1108628 1112892 1137789 1135656 1120458 1076398 1094961 1155704 1110538 1070450
$$ packed form
3827A031029L0037l8899l4804k6837j3042j9232P4603J571n5066k4307k3726J555
3815I02882j7747R795j1303L2235K0043n0790J3248P4083l5892r0134k5381L8319
3803H59358k4263Q3847M7663P869j9762O5760J2309o1646k4305M7866L3516l852
3791A024360J2888R977n0393J2056L2501J0065P2550o921K8080M8916m886j652
3779A187541l6385K2444L9733m7558J4743M4234m162q085j5118Q530O8437m6646
3767A227708N8149J593J3883j5442j5557k2303J3418K0390J775m1753R3464l7115
3755A298210m8881J9144J7468M4755o8522j4952k4196j4719o5498j907J2070N772
3743A158744J1221n053n6284M264K4897k133j5198m4060J8563O0743m5166m0088
$$ plain form
3731 1070450 1079215 1082151 1120593 1137197 1132883 1146746 1137319 1129739 1119047 1154355 1195768 1173552
3719 1173552 1174092 1193783 1161692 1110050 1085727 1052729 1110168 1128781 1110460 1071519 1072627 1096341
3707 1096341 1109490 1144883 1146655 1147148 1116281 1073583 1086066 1080754 1075841 1132132 1117159 1154069
3695 1154069 1164116 1146497 1140420 1148115 1075170 1056155 1098640 1088549 1103314 1168904 1168855 1198074
3683 1198074 1171882 1083960 1115217 1148968 1158168 1149465 1166920 1164902 1201953 1214920 1249615 1269769
3671 1269769 1284193 1260621 1275796 1227630 1241900 1238583 1212522 1203065 1184151 1186063 1169434 1167203
3659 1167203 1176573 1196352 1251485 1307438 1343194 1320532 1287956 1263876 1250724 1240379 1233195 1222954
3647 1222954 1217550 1231969 1250537 1257420 1193089 1228038 1199947 1211089 1189583 1138180 1164216 1145276
$$ packed form
3731A070450Q765K936L8442J6604m314J3863r427p580j0692L5308M1413k2216
3719A173552N40J9691l2091n1642k4323l2998N7439J8613j8321l8941J108K3714
3707A096341J3149L5393J772M93l0867m2698J2483n312m913N6291j4973L6910
3695A154069J0047j7619o077P695p2945j9015M2485j0091J4765O5590m9K9219
3683A198074k6192q7922L1257L3751R200q703J7455k018L7051J2967L4695K0154
3671A269769J4424k3572J5175m8166J4270l317k6061r457j8914J912j6629k231
3659A167203R370J9779N5133N5953L5756k2662l2576k4080j3152j0345p184j0241
3647A222954n404J4419J8568O883o4331L4949k8091J1142k1506n1403K6036j8940
$$ plain form
3635 1145276 1114905 1214159 1228341 1212936 1250554 1249089 1185537 1214456 1231731 1239373 1214902 1283666
3623 1283666 1339692 1274778 1285721 1318836 1302353 1320835 1320305 1299016 1321115 1268451 1306587 1270741
3611 1270741 1224127 1225303 1292036 1328770 1321305 1323216 1335041 1388838 1371591 1351688 1353511 1370171
3599 1370171 1389841 1350744 1335294 1406736 1453914 1435484 1403400 1405870 1433652 1484691 1477950 1459900
3587 1459900 1448347 1398974 1363538 1401117 1391808 1390210 1397747 1394202 1387335 1362520 1377345 1406116
3575 1406116 1425133 1412187 1394033 1363530 1351677 1317948 1363626 1319780 1315645 1327154 1269226 1295542
3563 1295542 1298407 1256281 1294755 1339741 1372823 1367002 1323975 1354162 1409045 1384916 1339468 1355064
3551 1355064 1386433 1414470 1441164 1392188 1352797 1320811 1325205 1335181 1390803 1399168 1406472 1441006
$$ packed form
3635A145276l0371R9254J4182j5405L7618j465o3552K8919J7275P642k4471O8764
3623A283666N6026o4914J0943L3115j6483J8482n30k1289K2099n2664L8136l5846
3611A270741m6614J176O6733L6734p465J911J1825N3797j7247j9903J823J6660
3599A370171J9670l9097j5450P1442M7178j8430l2084K470K7782N1039o741j8050
3587A459900j1553m9373l5436L7579r309j598P537l545o867k4815J4825K8771
3575A406116J9017j2946j8154l0503j1853l3729M5678m3846m135J1509n7928K6316
3563A295542K865m2126L8474M4986L3082n821m3027L0187N4883k4129m5448J5596
3551A355064L1369K8037K6694m8976l9391l1986M394R976N5622Q365P304L4534
$$ plain form
3539 1441006 1406731 1376192 1325916 1346636 1401346 1432074 1388185 1412879 1402957 1386165 1388478 1457653
3527 1457653 1483092 1418287 1380611 1407831 1426973 1421830 1416304 1459671 1453845 1424932 1469198 1484959
3515 1484959 1502099 1475002 1503131 1537136 1527216 1519414 1498939 1533691 1549225 1550340 1590473 1600941
3503 1600941 1638680 1596482 1602511 1644746 1623292 1639194 1670894 1643889 1675559 1718456 1819647
3492 1819647 1832684 1807515 1829024 1853039 1882944 1838153 1766475 1704833 1725770 1717147 1689580 1668569
3480 1668569 1695135 1664683 1681314 1683430 1733726 1703426 1656904 1676584 1643237 1623526 1646402 1676696
3468 1676696 1706482 1693141 1711151 1743874 1712841 1695617 1684749 1756906 1811953 1847011 1818003
3457 1818003 1815748 1813378 1805873 1846082 1835936 1767895 1787272 1860067 1868001 1899153 1868500 1911886
$$ packed form
3539A441006l4275l0539n0276K0720N4710L0728m3889K4694r922j6792K313O9175
3527A457653K5439o4805l7676K7220J9142n143n526M3367n826k8913M4266J5761
3515A484959J7140k7097K8129L4005r920p802k0475L4752J5534J115M0133J0468
3503A600941L7739m2198O029M2235k1454J5902L1700k7005L1670M2897J01191
3492A819647J3037k5169K1509K4015K9905m4791p1678o1642K0937q623k7567k1011
3480A668569K6566l0452J6631K116N0296l0300m6522J9680l3347j9711K2876L0294
3468A676696K9786j3341J8010L2723l1033j7224j0868P2157N5047L5058k9008
3457A818003k255k370p505M0209j0146o8041J9377P2795P934L1152l0653M3386
$$ plain form
3445 1911886 1902470 1862107 1845657 1823968 1876728 1905385 1882028 1864120 1895346 1954587 1920786 1914499
3433 1914499 1963899 1980304 1919626 1902035 1991124 2080737 2111472 2097156 2150821 2177183 2224202
3422 2224202 2250352 2282575 2335557 2375364 2436055 2490919 2539789 2635508 2655268 2603259 2532587
3411 2532587 2496610 2425007 2394365 2410310 2390887 2355960 2347921 2399833 2430901 2398646 2419525 2471572
3399 2471572 2513249 2544514 2567515 2605805 2730614 2827965 2860533 2872960 2984756 3075131 3085472
3388 3085472 3191298 3263184 3359957 3498697 3620041 3813192 3937567 3904868 3719174 3548012
3378 3548012 3468606 3366031 3302629 3312857 3328924 3335711 3333185 3318415 3367606 3399088 3407957 3429422
3366 3429422 3480123 3494035 3508978 3537387 3540684 3559247 3592688 3600441 3580346 3603212 3579723 3531493
$$ packed form
3445A911886r416m0363j6450k1689N2760K8657k3357j7908L1226N9241l3801o287
3433A914499M9400J6405o0678j7591Q9089Q9613L0735j4316N3665K6362M7019
3422B224202K6150L2223N2982L9807O0691N4864M8870R5719J9760n2009p0672
3411B532587l5977p1603l0642J5945j9423l4927q039N1912L1068l2255K0879N2047
3399B471572M1677L1265K3001L8290J24809R7351L2568J2427J11796R0375J0341
3388C085472J05826P1886R6773J38740J21344J93151J24375l2699j85694j71162
3378C548012p9406j02575o3402J0228J6067O787k526j4770M9191L1482Q869K1465
3366C429422N0701J3912J4943K8409L297J8563L3441P753k0095K2866k3489m8230
$$ plain form
3354 3531493 3562817 3625018 3714409 3845546 3861597 3839418 3769432 3727613 3685683 3652000 3657117
3343 3657117 3637727 3597763 3594571 3616386 3641365 3626175 3680770 3766261 3749807 3770627 3838400 3966412
3331 3966412 4066710 4119251 4162538 4237875 4290264 4371826 4432375 4462237 4482225 4553073 4590415
3320 4590415 4675524 4740843 4832434 4876908 4895576 4914615 4919709 4974420 5103286 5071254 5081342
3309 5081342 5104457 5055793 5065456 5096636 5188679 5230509 5271203 5347512 5419436 5516500 5633857
3298 5633857 5715085 5845523 6010797 6222224 6398152 6458605 6505452 6512733 6589522 6703279 6822433
3287 6822433 6850152 6843986 6841686 6831222 6853003 6906145 7019570 7067905 7126957 7158551 7226373 7286332
3275 7286332 7348299 7423313 7508948 7666190 7789064 7928522 8068004 8186885 8309323 8479607
$$ packed form
3354C531493L1324O2201Q9391J31137J6051k2179o9986m1819m1930l3683N117
3343C657117j9390l9964l192K1815K4979j5190N4595Q5491j6454K0820O7773J28012
3331C966412J00298N2541M3287P5337N2389Q1562O0549K9862J9988P0848L7342
3320D590415Q5109O5319R1591M4474J8668J9039N094N4711J28866l2032J0088
3309E081342K3115m8664R663L1180R2043M1830M0694P6309P1924R7064J17357
3298E633857Q1228J30438J65274K11427J75928O0453M6847P281P6789J13757J19154
3287F822433K7719o166k300j0464K1781N3142J13425M8335N9052L1594O7822N9959
3275G286332O1967P5014Q5635J57242J22874J39458J39482J18881J22438J70284
$$ plain form
3265 8479607 8711704 8987752 9228727 9446502 9678479 9839257 9904535 10063401 10286112 10461829
3255 10461829 10715531 10971183 11244711 11538749 11889459 12278212 12667232 13148333 13562227
3246 13562227 13990902 14459370 14929189 15414646 15892569 16289507 16590693 16880673 16952691 16941177
3236 16941177 16680913 16160240 15411995 14570191 13740130 12910184 12128741 11430859 10776796
3227 10776796 10203820 9741677 9385635 9045990 8730736 8449123 8276901 8137093 8011137
3218 8011137 7868791 7770656 7640469 7554330 7423751 7311266 7226757 7118502 7044837 7030999
3208 7030999 6992499 6950220 6960834 6952424 6984151 6931971 6724419 6469733 6253684 6112979 6095414
3197 6095414 5927857 5696687 5472861 5288637 5177131 5152894 5085242 5058044 4986643 4852605
$$ packed form
3265H479607K32097K76048K40975K17775K31977J60778O5278J58866K22711J75717
3255A0461829K53702K55652K73528K94038L50710L88753L89020M81101M13894
3246A3562227M28675M68468M69819M85457M77923L96938L01186K89980P2018j1514
3236A6941177k60264n20673p48245q41804q30061q29946p81443o97882o54063
3227A0776796n72976m62143l56042l39645l15254k81613j72222j39808j25956
3218H011137j42346r8135j30187q6139j30579j12485q4509j08255p3665j3838
3208G030999l8500m2279J0614q410L1727n2180k07552k54686k16049j40705j7565
3197F095414j67557k31170k23826j84224j11506k4237o7652k7198p1401j34038
$$ plain form
3187 4852605 4859980 4851692 4878515 4923785 4951646 5001136 5079264 5214507 5217693 5301428 5355282 5431812
3175 5431812 5586856 5697691 5896612 6116560 6039716 5711230 5292310 4948223 4759460 4612768
3165 4612768 4498030 4320414 4102532 3944925 3838457 3729641 3698608 3695437 3683521 3614666
3155 3614666 3585269 3562712 3505837 3452021 3482608 3548536 3592733 3553105 3548794 3579986 3600648 3610529
3143 3610529 3666563 3774460 3871597 3969629 3917872 3754765 3524435 3340112 3193083 3139420
3133 3139420 3084907 3011690 2884025 2822014 2845312 2811794 2769751 2758622 2733361 2663046 2622191
3122 2622191 2602808 2582153 2526418 2466817 2427724 2429717 2369418 2368311 2362584 2360240 2403416 2399654
3110 2399654 2372668 2290829 2330730 2373650 2306700 2241576 2239836 2224014 2207487 2214381 2239350 2210932
$$ packed form
3187D852605P375q288K6823M5270K7861M9490P8128J35243L186Q3735N3854P6530
3175E431812J55044J10835J98921K19948p6844l28486m18920l44087j88763j46692
3165D612768j14738j77616k17882j57607j06468j08816l1033l171j1916o8855
3155C614666k9397k2557n6875n3816L0587O5928M4197l9628m311L1192K0662R881
3143C610529N6034J07897R7137R8032n1757j63107k30330j84323j47029n3663
3133C139420n4513p3217j27665o2011K3298l3518m2043j1129k5261p0315m0855
3122B622191j9383k0655n5735n9601l9093J993o0299j107n727k344M3176l762
3110B399654k6986q1839L9901M2920o6950o5124j740j5822j6527O894K4969k8418
$$ plain form
3098 2210932 2178927 2129605 2096536 2083232 2056635 1994377 2018274 2005561 1925685 1931709 1902933 1904472
3086 1904472 1953451 1952802 1937424 1915174 1944887 1943324 1951470 1890803 1856611 1812869 1768592 1774420
3074 1774420 1834414 1853321 1815536 1784633 1803072 1789836 1809537 1787133 1741101 1754336 1782459
3063 1782459 1804605 1790070 1767540 1735652 1754570 1752288 1780932 1737372 1715413 1688408 1672871 1680052
3051 1680052 1637757 1599014 1673907 1722196 1720944 1683316 1671776 1672637 1647265 1641022 1635809 1651622
3039 1651622 1628035 1654569 1621248 1599990 1610451 1613893 1692972 1639776 1624724 1620615 1654616 1645500
3027 1645500 1633031 1655740 1647591 1593586 1575718 1578630 1618713 1626054 1687277 1690689 1667243 1671088
3015 1671088 1698287 1682882 1664970 1719911 1730158 1714619 1716200 1694315 1736090 1794319 1800121 1795475
$$ packed form
3098B210932l2005m9322l3069j3304k6597o2258K3897j2713p9876O024k8776J539
3086A904472M8979o49j5378k2250K9713j563Q146o0667l4192m3742m4277N828
3074A774420N9994J8907l7785l0903J8439j3236J9701k2404m6032J3235K8123
3063A782459K2146j4535k2530l1888J8918k282K8644m3560k1959k7005j5537P181
3051A680052m2295l8743P4893M8289j252l7628j1540Q61k5372o243n213J5813
3039A651622k3587K6534l3321k1258J0461L442P9079n3196j5052m109L4001r116
3027A645500j2469K2709q149n4005j7868K912M0083P341O1223L412k3446L845
3015A671088K7199j5405j7912N4941J0247j5539J581k1885M1775N8229N802m646
$$ plain form
3003 1795475 1832000 1884303 1890019 1880106 1914010 1920715 1875134 1945387 1916986 1912121 1919521 1920385 1997177
2990 1997177 1965740 1948362 2003521 2025776 2052549 2093510 2050260 2033930 2055994 2050527 2070252 2138356
2978 2138356 2085335 2101431 2208530 2203874 2227312 2206661 2273473 2354168 2353359 2368708 2406495 2408635
2966 2408635 2452501 2489961 2533158 2580235 2589784 2587858 2544526 2565719 2521193 2538073 2568311 2538726
2954 2538726 2579199 2583967 2602256 2695194 2712580 2708500 2707883 2752731 2811600 2856526 2884387 2916908
2942 2916908 2893103 2893849 2998386 3096773 3147694 3238436 3300325 3296838 3365271 3404770 3489475 3566713
2930 3566713 3617601 3720582 3779402 3822515 3854553 3889878 3934355 4005801 4033370 4029108 4068937
2919 4068937 4107435 4143046 4147258 4215111 4245359 4322816 4391786 4460144 4508007 4583478 4572258 4676979
$$ packed form
3003A795475L6525N2303N716r913L3904O705m5581P0253k8401m865P400Q64P6792
2990A997177l1437j7378N5159K2255K6773M0961m3250j6330K2064n467J9725O8104
2978B138356n3021J6096J07099m656K3438k0651O6812Q0695q09J5349L7787K140
2966B408635M3866L7460M3197M7077R549j926m3332K1193m4526J6880L0238k9585
2954B538726M0473M768J8289R2938J7386m080o17M4848N8869M4926K7861L2521
2942B916908k3805P46J04537R8387N0921R0742O1889l487O8433L9499Q4705P7238
2930C566713N0888J02981N8820M3113L2038L5325M4477P1446K7569m262L9829
2919D068937L8498L5611M212O7853L0248P7457O8970O8358M7863P5471j1220J04721
$$ plain form
2907 4676979 4806851 4918425 5022744 5158471 5332040 5463929 5512313 5626453 5786640 5930982
2897 5930982 6001785 6073411 6069419 6041329 5990948 5835296 5603410 5475685 5327023 5233463 5164439
2886 5164439 5181586 5150230 5136538 5137176 5088705 5109071 5151583 5199093 5256651 5323104 5367043 5443247
2874 5443247 5446230 5443705 5388252 5409181 5425486 5447648 5381345 5330433 5236132 5151170 5040075 4974916
2862 4974916 4853512 4732072 4617598 4545622 4479995 4370071 4359986 4283805 4174316 4049637
2852 4049637 3983148 3877306 3783257 3699461 3596564 3509913 3414518 3353435 3237086 3182741 3104740
2841 3104740 3000219 2856657 2743634 2665059 2629307 2596279 2512852 2368726 2338828 2314681 2212661
2830 2212661 2153377 2116852 2020624 1980350 2005300 1975539 1886372 1879508 1866273 1853425 1815269 1741991
$$ packed form
2907D676979J29872J11574J04319J35727J73569J31889M8384J14140J60187J44342
2897E930982P0803P1626l992k8090n0381j55652k31886j27725j48662r3560o9024
2886E164439J7147l1356j3692O38m8471K0366M2512M7510N7558O6453M3939P6204
2874E443247K983k525n5453K0929J6305K2162o6303n0912r4301q4962j11095o5159
2862D974916j21404j21440j14474p1976o5627j09924j0085p6181j09489j24679
2852D049637o6489j05842r4049q3796j02897q6651r5395o1083j16349n4345p8001
2841C104740j04521j43562j13023p8575l5752l3028q3427j44126k9898k4147j02020
2830B212661n9284l6525r6228m0274K4950k9761q9167o864j3235j2848l8156p3278
$$ plain form
2818 1741991 1707951 1731639 1684131 1638010 1624856 1550367 1480413 1437430 1457958 1454702 1378135 1368231
2806 1368231 1349880 1310770 1265761 1213016 1277218 1216086 1154715 1187381 1232151 1269989 1230899
2795 1230899 1214985 1211747 1126739 1071441 1002780 1003010 1043512 1024666 1078985 1058298 1025047 978265
2783 978265 947553 974938 1001331 936508 931025 939065 906527 820653 791346 779212 736983 763330
2771 763330 760546 730387 733380 720596 733780 710048 669004 669296 643810 601075 627087 685694
2759 685694 650740 562755 563668 611477 570571 589117 587905 542308 539456 592330 594611 613928 557538
2746 557538 545682 577850 596354 543775 481261 470294 529642 518668 489494 487319 475428 454099
2734 454099 437147 448130 464004 452021 410087 403127 437189 449389 441593 450898 420120 400691
$$ packed form
2818A741991l4040K3688m7508m6121j3154p4489o9954m2983K0528l256p6567r904
2806A368231j8351l9110m5009n2745O4202o1132o1371L2666M4770L7838l9090
2795A230899j5914l238q5008n5298o8661K30M0502j8846N4319k0687l3251m6782
2783I78265l0712K7385K6393o4823n483Q040l2538q5874k9307j2134m2229K6347
2771G63330k784l0159K993j2784J3184k3732m1044K92k5486m2735K6012N8607
2759F85694l4954q7985R13M7809m0906J8546j212m5597k852N2874K281J9317n6390
2746E57538j1856L2168J8504n2579o2514j0967N9348j0974k9174k175j1891k1329
2734D54099j6952J0983J5874j1983m1934o960L4062J2200p796R305l0778j9429
$$ plain form
2722 400691 388959 368155 430641 395730 371112 384581 399190 426224 356380 332960 346500 298875
2710 298875 299576 291881 309751 309861 274521 254364 260025 239967 307245 314115 293136 300836 300470 267392
2696 267392 276062 302446 280729 274323 238060 291154 328248 297126 250300 255025 279047 282934
2684 282934 253789 243514 216289 227121 272621 247188 196708 197635 173481 208471 288051 279652
2672 279652 260319 213939 201460 207382 234201 203403 195019 181678 144107 193596 269746 246712
2660 246712 218742 188894 197108 258194 242785 174345 199807 193265 153876 197541 198855 201028
2648 201028 183179 205468 169888 158903 159364 167892 190839 230792 223951 206415 198450 183961 159836
2635 159836 196133 224829 258968 186663 195997 251671 225227 137864 122450 191905 183912 195042
$$ packed form
2722D00691j1732k0804O2486l4911k4618J3469J4609K7034o9844k3420J3540m7625
2710B98875P01p695J7870J10l5340k0157N661k0058O7278O870k0979P700l66l3078
2696B67392Q670K6384k1717o406l6263N3094L7094l1122m6826M725K4022L887
2684B82934k9145j0275k7225J0832M5500k5433n0480R27k4154L4990P9580q399
2672B79652j9333m6380j2479N922K6819l0798q384j3341l7571M9489P6150k3034
2660B46712k7970k9848Q214O1086j5409o8440K5462o542l9389M3665J314K173
2648B01028j7849K2289l5580j0985M61Q528K2947L9953o841j7536p965j4489k4125
2635A59836L6297K8696L4139p2305R334N5674k6444q7363j5414O9455p993J1130
$$ plain form
2623 195042 129140 103832 145970 184739 168958 144228 144045 143329 179740 135749 148915 171360
2611 171360 149621 189817 192904 199018 188883 153206 148484 114334 127986 103763 101600 139283
2599 139283 156581 132207 151919 163441 145577 181934 224192 202409 192532 137299 151722 139417
2587 139417 148698 209729 190865 155268 132529 130548 151990 102157 133750 186345 142205 150979
2575 150979 171841 187225 176704 99642 61805 131051 137249 159798 179769 165302 161856 165258
2563 165258 142790 168384 119840 114257 100717 36459 12951 11003 67537 112617 79715 113416
2551 113416 132059 118493 128436 116226 104651 131608 121816 64323 25916 103539 142231 143444
2539 143444 121410 127014 114884 164329 157045 161769 149649 140838 142414 147137 136863 46674 29012
$$ packed form
2623A95042o5902k5308M2138L8769j5781k4730j83p16L6411m3991J3166K2445
2611A71360k1739M0196L087O114j0135l5677m722l4150J3652k4223k163L7683
2599A39283J7298k4374J9712J1522j7864L6357M2258k1783r877n5233J4423j2305
2587A39417R281O1031j8864l5597k2739j981K1442m9833L1593N2595m4140Q774
2575A50979K0862J5384j0521p7062l7837O9246O198K2549J9971j4467l446L402
2563A65258k2468K5594m8544n583j3540o4258k3508j948N6534M5080l2902L3701
2551A13416J8643j3566R943j2210j1575K6957r792n7493l8407P7623L8692J213
2539A43444k2034N604j2130M9445p284M724j2120q811J576M723j0274r0189j7662
$$ plain form
2526 29012 37848 49306 104061 103794 140766 97878 69574 141169 123170 166419 129946 68732
2514 68732 48278 72931 73459 67867 68768 64727 54516 95547 114830 103843 81866 62695 74803
2501 74803 77664 27401 51776 49403 40604 41550 38405 65993 70405 67652 52470 54550 104721 76837
2487 76837 31840 74196 101255 54672 32860 49665 76744 51151 47221 42532 17282 16243
2475 16243 17219 35979 38194 44073 95533 85796 80152 97814 72126 98309 74649 106933 53090
2462 53090 58647 40991 40844 52493 32116 -7076 -290 -13222 37895 27109 -5406 60537 84702
2449 84702 102935 91603 87485 96276 30365 10983 80537 50528 100147 117906 84603 110298
2437 110298 96992 51125 30906 48572 84301 102246 142113 104572 54419 92959 122216 107346
$$ packed form
2526B9012Q836J1458N4755k67L6972m2888k8304P1595j7999M3249l6473o1214
2514F8732k0454K4653N28n592R01m041j0211M1031J9283j0987k1977j9171J2108
2501G4803K861n0263K4375k373q799R46l145K7588M412k753j5182K080N0171k7884
2487G6837m4997M2356K7059m6583k1812J6805K7079k5593l930m689k5250j039
2475A6243R76J8760K215N879N1460r737n644J7662k5688K6183k3660L2284n3843
2462E3090N557j7656j47J1649k0377l9192O786j2932N1117j0786l2515O5943K4165
2449H4702J8233j1332m118Q791o5911j9382O9554l0009M9619J7759l3303K5695
2437A10298j3306m5867k0219J7666L5729J7945L9867l7541n0153L8540K9257j4870
$$ plain form
2425 107346 109974 50006 11615 48921 112968 63124 88952 89276 86112 79596 84362 113249 102949
2412 102949 56107 62016 69048 66534 86559 62250 67517 73802 43327 25983 46931 60203 58477
2399 58477 80739 89881 70175 45520 20230 -3548 6753 57924 83413 80303 56699 24654
2387 24654 33697 81725 90015 42028 90946 83504 39808 88454 39766 57868 88800 64218
2375 64218 83807 126695 102336 114320 142811 127979 114051 139553 97832 114459 107234 117808
2363 117808 68999 94512 128018 116608 74228 72295 109429 77309 67559 63558 43637 34054
2351 34054 83470 123670 146396 72962 63245 1266 -1865 21495 30944 50035 50002 56879 8409
2338 8409 -2288 55799 39374 72591 96158 91954 103803 92455 103523 67853 54660 85576
$$ packed form
2425A07346K628n9968l8391L7306O4047m9844K5828L24l164o516M766K8887j0300
2412A02949m6842N909P032k514K0025k4309N267O285l0475j7344K0948J3272j726
2399E8477K2262R142j9706k4655k5290k3778J0301N1171K5489l110k3604l2045
2387B4654R043M8028Q290m7987M8918p442m3696M8646m8688J8102L0932k4582
2375F4218J9589M2888k4359J1984K8491j4832j3928K5502m1721J6627p225J0574
2363A17808m8809K5513L3506j1410m2380j933L7134l2120r750m001j9921r583
2351C4054M9416M0200K2726p3434r717o1979l131K3360R449J9091l3O877m8470
2338H409j0697N8087j6425L3217K3567m204J1849j1348J1068l5670j3193L0916
$$ plain form
2326 85576 108865 62764 79349 113486 104171 65111 65745 56636 -18969 22202 41676 95353 99724
2313 99724 95808 108446 105951 130784 80840 72418 69726 77325 19987 25393 83306 126568 116512
2300 116512 129373 74147 38466 69359 75626 76795 116729 106219 60450 87508 64307 84218
2288 84218 90283 90090 79014 177899 156587 112833 96143 63489 49379 116322 106917 78527 42657
2275 42657 71413 93072 114020 115210 101657 112270 95292 103851 114844 149769 148797 130399 89889
2262 89889 138550 201094 214041 184096 157578 128925 155348 166262 144014 164335 124452 165984
2250 165984 180805 180082 180319 189675 186370 182151 220393 186798 206212 180859 180202 142249 131541
2237 131541 168602 214925 170353 197394 217571 179723 173998 240261 276362 222182 170489 220070
$$ packed form
2326H5576K3289m6101J6585L4137r315l9060O34r109p5605M1171J9474N3677M371
2313I9724l916J2638k495K4833m9944q422k692P599n7338N406N7913M3262j0056
2300A16512J2861n5226l5681L0893O267J169L9934j0510m5769K7058k3201J9911
2288H4218O065j93j1076R8885k1312m3754j6690l2654j4110O6943r405k8390l5870
2275D2657K8756K1659K0948J190j3553J0613j6978Q559J0993L4925r72j8398m0510
2262H9889M8661O2544J2947k9945k6518k8653K6423J0914k2248K0321l9883M1532
2250A65984J4821p23K37R356l305m219L8242l3595J9414k5353o57l7953j0708
2237A31541L7061M6323m4572K7041K0177l7848n725O6263L6101n4180n1693M9581
$$ plain form
2225 220070 217947 177009 172083 211944 216215 291933 253886 249542 282289 299817 264362 257168 302238
2212 302238 297411 297702 343218 320623 302135 277189 269569 299241 293184 301453 273221 308588 325125
2199 325125 300785 313568 329628 338879 316525 371980 363342 320465 364844 366154 371432 366714 385720
2186 385720 401765 391823 408478 470751 444035 446678 420888 477151 478396 528910 466479 451285
2174 451285 463087 470276 467358 475216 517199 563194 560973 566995 543514 560186 626745 663774 654705
2161 654705 629090 687498 732910 807498 796277 799951 802591 789283 809983 900988 982436 952819
2149 952819 993470 1015145 1085386 1086477 1120656 1166084 1162720 1166158 1209247 1264771 1292639 1319058
2137 1319058 1344118 1393259 1484997 1512249 1551802 1578604 1644418 1628186 1640598 1684138 1756890
$$ packed form
2225B20070k123m0938m926L9861M271P5718l8047m344L2747J7528l5455p194M5070
2212C02238m827K91M5516k2595j8488k4946p620K9672o057Q269k8232L5367J6537
2199C25125k4340J2783J6060R251k2354N5455q638m2877M4379J310N278m718J9006
2186C85720J6045r942J6655O2273k6716K643k5790N6263J245N0514o2431j5194
2174D51285J1802P189k918P858M1983M5995k221O022k3481J6672O6559L7029r069
2161F54705k5615N8408M5412P4588j1221L674K640j3308K0700R1005Q1448k9617
2149I52819M0651K1675P0241J091L4179M5428l364L438M3089N5524K7868K6419
2137A319058K5060M9141R1738K7252L9553K6802O5814j6232J2412M3540P2752
$$ plain form
2126 1756890 1884732 1946846 2011287 2142139 2274142 2294307 2424324 2597237 2756391 2942227
2116 2942227 3177194 3414557 3710909 4035837 4322286 4597097 4896335 5273660 5712415 6226308
2106 6226308 6801925 7490742 8317962 9251776 10370028 11626105 12880505 14901519 17840693
2097 17840693 20402139 19999762 15494670 11286322 8533379 6473409 5231026 4291789
2089 4291789 3639204 3219359 2865446 2590452 2380821 2226455 2133992 2077598 1964629 1787102
2079 1787102 1586044 1421227 1322128 1252471 1137755 1016489 1031059 970693 881213 869935 813446
2068 813446 729322 722576 687426 690079 600462 544358 525673 475906 408484 425125 422551 435324
2056 435324 447407 454926 420712 341710 331472 298011 296327 316499 337094 299936 283968 264834
$$ packed form
2126A756890J27842O2114O4441J30852J32003K0165J30017J72913J59154J85836
2116B942227K34967K37363K96352L24928K86449K74811K99238L77325M38755N13893
2106F226308N75617O88817Q27220R33814J118252J256077J254400K021014K939174
2097A7840693K561446m02377m505092m208348k752943k059970j242383r39237
2089D291789o52585m19845l53913k74994k09631j54366r2463n6394j12969j77527
2079A787102k01058j64817r9099o9657j14716j21266J4570o0366q9480j1278n6489
2068H13446q4124o746l5150K653q9617n6104j8685m9767o7422J6641k574J2773
2056D35324J2083P519l4214p9002j0238l3461j684K0172K0595l7158j5968j9134
$$ plain form
2044 264834 217586 223094 266587 224326 224308 228517 201596 218246 234461 222013 180020 174876 168676
2031 168676 178610 161089 189186 254844 234489 199001 180405 154270 189495 206521 179993 164077
2019 164077 133213 119884 179582 148238 140821 155485 166530 141051 138716 130554 121613 129364 153881
2006 153881 156568 143008 119867 60066 67652 65058 64643 108023 106681 162783 133872 63234 47217
1993 47217 50001 85807 83523 69575 74126 99406 68922 28503 52297 68143 65789 77211 84069
1980 84069 60815 50193 21498 47336 62260 59760 77609 104195 65888 26492 38937 46084
1968 46084 42675 63284 71672 44129 67353 91817 131482 109704 101158 66749 54814 31097
1956 31097 56578 64412 118435 89635 92751 146784 148228 119070 89396 87636 58165 -11422 16426
$$ packed form
2044B64834m7248N508M3493m2261j8M209k6921J6650J6215j2448m1993n144o200
2031A68676R934j7521K8097O5658k0355l5488j8596k6135L5225J7026k6528j5916
2019A64077l0864j3329N9698l1344p417J4664J1045k5479k335q162q941P751K4517
2006A53881K687j3560k3141n9801P586k594m15M3380j342N6102k8911p0638j6017
1993D7217K784L5806k284j3948M551K5280l0484m0419K3794J5846k354J1422O858
1980H4069k3254j0622k8695K5838J4924k500J7849K6586l8307l9396J2445P147
1968D6084l409K0609Q388k7543K3224K4464L9665k1778q546l4409j1935k3717
1956C1097K5481P834N4023k8800L116N4033J444k9158k9674j760k9471o9587K7848
$$ plain form
1943 16426 10408 -2995 70353 75345 16340 25304 33572 37325 12150 66728 121542 63720 83130
1930 83130 87811 57681 31446 61192 59027 34703 80528 113387 59301 -25937 -4068 76495
1918 76495 57017 48454 42602 55298 61366 90131 60561 51912 59383 58219 17248 -4978 -7347
1905 -7347 26246 41789 62149 66972 12352 8632 72 -17234 -14090 37161 38661 40469 31765
1892 31765 24998 47674 19174 19677 2489 10455 23965 -36970 -49016 -37775 -20643 -23191 33560
1879 33560 73555 12072 38422 53321 21262 3676 22787 42447 11951 -38106 13561 9985
1867 9985 31484 18250 20105 5485 10266 22233 -21372 12366 18989 28124 23861 29909 33746
1854 33746 -1149 -23905 -34725 2862 42680 48820 55649 27634 67356 30182 40399 65953
$$ packed form
1943A6426o018j3403P3348M992n9005Q964Q268L753k5175N4578N4814n7822J9410
1930H3130M681l0130k6235K9746k165k4324M5825L2859n4086q5238K1869Q0563
1918G6495j9478q563n852J2696O068K8765k9570q649P471j164m0971k2226k369
1905g347L3593J5543K0360M823n4620l720q560j7306L144N1251J500J808q704
1892C1765o767K2676k8500N03j7188P966J3510o0935j2046J1241J7132k548N6751
1879C3560L9995o1483K6350J4899l2059j7586J9111J9660l0496n0057N1667l576
1867I985K1499j3234J855j4620M781J1967m3605L3738O623R135m263O048L837
1854C3746l4895k2756j0820L7587L9818O140O829k8015L9722l7174J0217K5554
$$ plain form
1842 65953 40950 64023 61262 13149 4099 -11917 -22729 -19948 22162 51600 99696 122717
1830 122717 121062 122688 132558 112975 112870 69849 21901 32275 495 42398 28858 12537 28510
1817 28510 -5946 -47205 -34121 -20089 4882 12086 -10792 1545 -15643 2678 34278 39936
1805 39936 54345 17676 -35831 19442 68789 21023 -16909 14540 24475 20006 -26579 -81623
1793 -81623 -29446 18443 53836 27093 60920 38881 24819 42356 15411 19432 6422 47889
1781 47889 63206 32224 -55460 -31573 -25070 -43463 -10369 19570 -8317 -39598 -1031 -28443
1769 -28443 -31621 -37512 -35611 10647 28976 49643 35872 10481 50231 41762 -5327 30830 35472
1756 35472 41843 21571 8027 77940 99993 48129 45164 -50 5800 15713 -15254 -33605 -20131
$$ packed form
1842F5953k5003K3073k761m8113r050j6016j0812K781M2110K9438M8096K3021
1830A22717j655J626R870j9583j05m3021m7948J0374l1780M1903j3540j6321J5973
1817B8510l4456m1259J3084J4032K4971P204k2878J2337j7188J8321L1600N658
1805C9936J4409l6669n3507N5273M9347m7766l7932L1449R935m469m6585n5044
1793h1623N2177M7889L5393k6743L3827k2039j4062J7537k6945M021j3010M1467
1781D7889J5317l0982q7684K3887O503j8393L3094K9939k7887l1281L8567k7412
1769b8443l178n891J901M6258J8329K0667j3771k5391L9750q469m7089L6157M642
1756C5472O371k0272j3544O9913K2053n1864k965m5214N850R913l0967j8351J3474
$$ plain form
1743 -20131 18443 13911 19419 11328 -37148 -29072 18553 45426 54617 52173 78509 51950 24798
1730 24798 -17939 -2348 -5398 -5869 30489 59120 41816 56948 71227 67759 19584 48783 23412
1717 23412 -10616 8365 31007 25743 12734 55442 26513 4204 -1932 23306 -8863 -26838
1705 -26838 -6377 -11446 11212 8131 -20847 -41278 56666 3318 16061 49429 67204 58105
1693 58105 -3925 17043 -4058 14470 -12921 9059 -12894 21907 36010 22805 -13817 -13694
1681 -13694 5468 -29002 -29988 -25141 25641 14983 -25356 6295 -17011 -5333 -30835 -36112 -5885
1668 -5885 39704 -11497 -20209 20909 15637 35805 1704 22221 57724 36296 31417 49287 27582
1655 27582 -11981 -21066 19715 24043 -4088 5856 -10718 -33217 -2930 -25852 -39951 -39592 -57324
$$ packed form
1743b0131L8574m532N508q091m8476Q076M7625K6873R191k444K6336k6559k7152
1730B4798m2737J5591l050m71L6358K8631j7304J5132J4279l468m8175K9199k5371
1717B3412l4028J8981K2642n264j3009M2708k8929k2309o136K5238l2169j7975
1705b6838K0461n069K2658l081k8978k0431R7944n3348J2743L3368J7775r099
1693E8105o2030K0968k1101J8528k7391K1980k1953L4801J4103j3205l6622J23
1681a3694J9162l4470r86M847N0782j0658m0339L1651k3306J1678k5502n277L0227
1668e885M5589n1201q712M1118n272K0168l4101K0517L5503k1428m879J7870k1705
1655B7582l9563r085M0781M328k8131R944j6574k2499L0287k2922j4099L59j7732
$$ plain form
1642 -57324 -54881 15760 719 4726 10123 5379 -16029 -13547 4068 -36972 18961 70007 37479
1629 37479 -4598 -43543 -37549 19869 -36573 -48789 8478 -34982 -82012 -71650 -10909 22754
1617 22754 33958 33515 7654 9751 -20261 -28410 -60830 -41585 12403 25241 -9144 -84537 -73262
1604 -73262 -29549 -21688 -9740 -26316 -34996 -28886 -29452 19881 17906 64489 90052 55423 34427
1591 34427 -4376 -38653 -23400 -32804 7259 35792 18260 -35858 17918 26487 -35215 -21630
1579 -21630 -26941 3409 11015 18076 -9109 -10993 -20485 -5576 -47220 -59497 -10528 12463 -3366
1566 -3366 -20782 -25737 -1522 27795 -42533 -23703 -58608 -13945 34824 -7086 -12914 -22323 7382
1553 7382 -6174 -7176 -13141 26176 52871 24755 6368 10101 -11734 -41626 -88003 -49734 -5421
$$ packed form
1642e7324K443P0641j5041M007N397m744k1408K482J7615m1040N5933N1046l2528
1629C7479m2077l8945N994N7418n6442j2216N7267m3460m7030J0362O0741L3663
1617B2754J1204m43k5861K097l0012q149l2420J9245N3988J2838l4385p5393J1275
1604g3262M3713P861J1948j6576q680O110n66M9333j975M6583K5563l4629k0996
1591C4427l8803l4277J5253r404M0063K8533j7532n4118N3776Q569o1702J3585
1579b1630n311L0350P606P061k7185j884r492J4909m1644j2277M8969K2991j5829
1566c366j7416m955K4215K9317p0328J8830l4905M4663M8769m1910n828r409K9705
1553G382j3556j002n965L9317K6695k8116j8387L733k1835k9892m6377L8269M4313
$$ plain form
1540 -5421 -46503 -24934 -6635 -60793 -30880 56902 80248 -1952 -935 -1500 -24687 -25856 -21136
1527 -21136 -5455 -10444 -34275 -51028 -49185 -17068 26602 15475 22454 -8902 -14249 43112 18834
1514 18834 -20972 2379 -27574 -31053 15791 -7894 -4658 -6914 -2116 -10829 -5927 6272 -2532
1501 -2532 -2512 20849 6964 -2122 14206 -12195 -30753 -31699 18106 4677 38084 64042 18955
1488 18955 54211 24642 10810 32887 -13256 -45039 -18577 34092 32859 -1172 6056 -44917
1476 -44917 -27862 -8220 -26020 -27038 -52143 -7475 28753 45951 29774 20834 -41755 -40243
1464 -40243 -32308 -16641 -36472 13198 1648 -34350 -29859 -26939 -30076 -11086 48624 -11820 -21058
1451 -21058 -4317 -69942 -50491 -17538 31010 37114 -557 11690 -3164 -55050 -43663 -26627
$$ packed form
1540e421m1082K1569J8299n4158K9913Q7782K3346q2200J017n65k3187j169M720
1527b1136J5681m989k3831j6753J843L2117M3670j1127O979l1356n347N7361k4278
1514A8834l9806K3351k9953l479M6844k3685L236k256M798q713M902J2199q804
1501b532K0K3361j3885r086J6328k6401j8558r46M9805j3429L3407K5958m5087
1488A8955L5256k9569j3832K2077m6143l1783K6462N2669j233l4031P228n0973
1476d4917J7055J9642j7800j018k5105M4668L6228J7198j6177q940o2589J512
1464d0243P935J5667j9831M9670j1550l5998M491K920l137J8990N9710o0444r238
1451b1058J6741o5625J9451L2953M8548O104l7671J2247j4854n1886J1387J7036
$$ plain form
1439 -26627 -22220 5172 362 26490 11133 -52568 -17232 -16307 -32411 -57064 15386 -35920 -64684
1426 -64684 -38690 -41015 -65078 -19514 -20156 -45215 -60101 -10030 5728 -57810 16384 -45614
1414 -45614 11953 27162 22551 -26506 -12218 -1370 -14199 -14207 13619 -17909 -17067 -35359 -5276
1401 -5276 -18446 6072 -1791 -50904 -36846 -12588 -3976 -14010 -18715 -7401 -27123 -6893 -27594
1388 -27594 -38290 44293 49778 21547 -7842 1372 -29571 -20984 30648 43535 50948 52622 21484
1375 21484 -10909 -32003 13017 80019 28745 -26349 -19332 -4643 3487 -24752 6672 -35949
1363 -35949 -45502 -13312 -5254 2090 20268 -11161 -64601 -55709 -14289 -801 -13903 -27447 -31186
1350 -31186 -41753 -7789 -25725 7875 37698 33237 53462 40617 20222 8089 13871 -9147
$$ packed form
1439b6627M407K7392m810K6128j5357o3701L5336R25j6104k4653P2450n1306k8764
1426f4684K5994k325k4063M5564o42k5059j4886N0071J5758o3538P4194o1998
1414d5614N7567J5209m611m9057J4288J0848j2829qK7826l1528Q42j8292L0083
1401e276j3170K4518p863m9113J4058K4258Q612j0034m705J1314j9722K0230k0701
1388b7594j0696Q2583N485k8231k9389R214l0943Q587N1632J2887P413J674l1138
1375B1484l2393k1094M5020O7002n1274n5094P017J4689Q130k8239L1424m2621
1363c5949r553L2190Q058P344J8178l1429n3440Q892M1420J3488j3102j3544l739
1350c1186j0567L3964j7936L3600K9823m461K0225j2845k0395j2133N782k3018
$$ plain form
1338 -9147 -24397 -23576 -37275 11137 12967 68472 78476 25897 27312 19905 5437 -23745 13660
1325 13660 43307 32243 10531 -6209 -32725 -31300 -15439 -15047 17840 -91 15297 15547 30338
1312 30338 -395 -26570 674 -19140 -40112 -49574 6647 6080 -6135 12176 -28430 -96388
1300 -96388 -65263 -38672 -26327 -23487 -35877 -35569 -17265 -21438 -17527 -50450 -98805 -87405 -2611
1287 -2611 -9048 -1286 -38312 -67352 -53278 -57518 -75274 -76663 -55446 -20514 -24106 -8862 17222
1274 17222 -29691 8802 39793 12388 6905 -38699 -28900 -22136 -16828 3936 15753 9246 -5820
1261 -5820 50734 38374 22283 44428 29855 7913 12229 13860 4637 -38585 -35879 -28009 -16078
1248 -16078 -42781 -37752 -6127 9572 36736 43731 62005 57563 14291 37837 33623 8540 -1124
$$ packed form
1338i147j5250Q21j3699M8412J830N5505J0004n2579J415p407j4468k9182L7405
1325A3660K9647j1064k1712j6740k6516J425J5861L92L2887j7931J5388K50J4791
1312C0338l0733k6175K7244j9814k0972r462N6221n67j2215J8311m0606o7958
1300i6388L1125K6591J2345K840j2390L08J8304m173L911l2923m8355J1400Q4794
1287b611o437P762l7026k9040J4074m240j7756j389K1217L4932l592J5244K6084
1274A7222m6913L8493L0991k7405n483m5604R799O764N308K0764J1817o507j5066
1261e820N6554j2360j6091K2145j4573k1942M316J631r223m3222K706P870J1931
1248a6078k6703N029L1625J5699K7164O995J8274m442m3272K3546m214k5083r664
$$ plain form
1235 -1124 -56876 -71776 -53051 -88201 -84071 -32400 -32063 -16889 6971 54415 56535 24125 15781
1222 15781 -12750 -18364 -31209 -3040 26215 9467 42431 -5602 -11902 -13797 -26780 5156
1210 5156 39724 17608 31795 -25615 -43313 -4695 -19562 -38909 6382 27968 77566 111933
1198 111933 35838 66153 49473 -7444 -8290 29904 18213 23769 -2114 -36389 -54258 -23867
1186 -23867 -15034 -24780 -80645 -40131 -31581 -34713 -29304 -14629 -15855 1734 -9145 3302 -31146
1173 -31146 -14269 28555 28677 13792 -20557 -34786 -4589 28589 43465 37508 36806 -6372 -44664
1160 -44664 -36821 -8640 33277 -11597 -4122 13198 59196 40284 -2661 -19270 3330 3678 -10223
1147 -10223 28088 39532 -6221 -886 -3410 -20347 33834 -17224 -79856 -50354 -41462 -86648
$$ packed form
1235a124n5752j4900J8725l5150M130N1671L37J5174K3860M7444K120l2410q344
1222A5781k8531n614j2845K8169K9255j6748L2964m8033o300j895j2983L1936
1210E156L4568k2116J4187n7410j7698L8618j4867j9347M5291K1586M9598L4367
1198A11933p6095L0315j6680n6917q46L8194j1691N556k5883l4275j7869L0391
1186b3867Q833r746n5865M0514Q550l132N409J4675j226J7589j0879J2447l4448
1173c1146J6877M2824J22j4885l4349j4229L0197L3178J4876n957p02m3178l8292
1160d4664P843K8181M1917m4874P475J7320M5998j8912m2945j6609K2600L48j3901
1147a0223L8311J1444m5753N335k524j6937N4181n1058o2632K9502Q892m5186
$$ plain form
1135 -86648 -35832 32239 -13084 -28937 11791 45378 58504 26368 14797 32176 20200 -6066
1123 -6066 3603 33627 -21766 -32918 12819 26038 -17891 -19044 -24889 24806 21793 53864 78846
1110 78846 42282 48428 15791 12764 7762 -2882 -38245 -5974 17032 -24772 -7842 -7265 26540
1097 26540 20357 -12247 -43589 -469 -7689 -26532 -7648 21379 -2596 27294 28243 -2832 19525
1084 19525 7121 -19461 -4516 24565 -1541 -5034 -13986 -2071 -15345 -17920 -32699 -34349 -33752
1071 -33752 -67373 -79514 -46946 -37635 -13706 53428 14244 39221 14293 63968 36026 25409
1059 25409 17942 15201 -6573 23952 6202 -7988 -19012 -34681 23072 -29759 -49865 -62886
1047 -62886 -75982 -74195 -47198 -31464 9532 5224 1749 -25882 4609 -21533 21701 6504
$$ packed form
1135h6648N0816O8071m5323j5853M0728L3587J3126l2136j1571J7379j1976k6266
1123f066R669L0024n5393j1152M5737J3219m3929j153n845M9695l013L2071K4982
1110G8846l6564O146l2637l027n002j0644l5363L2271K3006m1804J6930N77L3805
1097B6540o183l2604l1342M3120p220j8843J8884K9027k3975K9890R49l1075K2357
1084A9525j2404k6582J4945K9081k6106l493q952J1915j3274k575j4779j650N97
1071c3752l3621j2141L2568R311K3929O7134l9184K4977k4928M9675k7942j0617
1059B5409p467k741k1774L0525j7750j4190j1024j5669N7753n2831k0106j3021
1047f2886j3096J787K6997J5734M0996m308l475k7631L0491k6142M3234j5197
$$ plain form
1035 6504 -38799 -49325 -54267 -42933 -18795 -35843 -80127 -73623 -62720 -39280 -17404 9006
1023 9006 -5759 -1619 12832 24475 42161 -20504 -45939 -20428 -3651 28200 39927 27071
1011 27071 61625 54856 33202 501 7413 48469 26571 -8771 12516 -38182 -21727 73553
999 73553 73018 14055 -9692 -8862 -308 -43244 -28808 -68417 -36628 20465 6078 -8291 12905
986 12905 -43873 -32756 -9779 4831 -5680 -59854 -1620 10485 54482 41489 -17256 -49300
974 -49300 -43115 -32954 -59405 -18061 -22199 -30681 20467 21171 21438 -465 -23087 -18619 16185 4818
960 4818 -1235 -23945 38634 55568 24059 18156 -5271 -27742 -68868 -78900 -19661 18307 29244
947 29244 43429 18744 19287 64455 30253 18447 56234 21088 20703 17528 15083 773 -12671
$$ packed form
1035F504m5303j0526m942J1334K4138j7048m4284O504J0903K3440K1876K6410
1023I006j4765M140J4451J1643J7686o2665k5435K5511J6777L1851J1727j2856
1011B7071L4554o769k1654l2701O912M1056k1898l5342K1287n0698J6455R5280
999G3553n35n8963k3747Q30Q554m2936J4436l9609L1789N7093j4387j4369K1196
986A2905n6778J1117K2977J4610j0511n4174N8234J2105M3997j2993n8745l2044
974d9300O185J0161k6451M1344m138q482N1148P04K67k1903k2622M468L4804j1367
960D818o053k2710O2579J6934l1509n903k3427k2471m1126j0032N9239L7968J0937
947B9244J4185k4685N43M5168l4202j1806L7787l5146l85l175k445j4310j3444
$$ plain form
934 -12671 476 22248 49603 19017 16205 5673 -25983 -6263 23725 15278 -17953 -7064
922 -7064 -36626 20154 48285 1595 14853 21068 25572 21894 -9020 7166 40281 8598 -668
909 -668 -9476 12610 -40995 -65391 -73933 -87318 -35093 -15470 -27106 -2478 5572 33107 44786
896 44786 9108 38080 32763 25299 30245 16603 -21176 3972 -52091 -101693 -37955 -40718 -59844
883 -59844 -66036 -10939 707 -23721 1096 5493 -5973 15424 -30046 13758 39160 -28927
871 -28927 -66779 -14758 -86475 -43782 10634 15467 9870 50358 7603 -17736 -19003 -55573 -43576
858 -43576 -59686 -14089 -11825 -36101 -47769 -47994 -56290 -13473 -32297 -37751 -6604 -1580 40574
845 40574 86328 103715 103213 50407 21254 22001 -7410 -6492 38385 31171 -5582 -30580 -12438
$$ packed form
934a2671J3147K1772K7355l0586k812j0532l1656J9720K9988q447l3231J0889
922g064k9562N6780K8131m6690J3258O215M504l678l0914J6186L3115l1683r266
909f68q808K2086n3605k4396q542j3385N2225J9623j1636K4628Q050K7535J1679
896D4786l5678K8972n317p464M946j3642l7779K5148n6063m9602O3738k763j9126
883e9844o192N5097J1646k4428K4817M397j1466K1397m5470M3804K5402o8087
871b8927l7852N2021p1717M2693N4416M833n597M0488m2755k5339j267l6570J1997
858d3576j6110M5597K264k4276j1668k25q296M2817j8824n454L1147N024M2154
845D0574M5754J7387n02n2806k9153P47k9411R18M4877p214l6753k4998J8142
$$ plain form
832 -12438 11622 15168 10733 -46477 -40993 -15789 -5434 -25919 2730 59226 35526 11966 -9625
819 -9625 1439 -23443 -14670 -51076 -98433 -25287 -31541 -42821 -17498 -16115 22151 -1896 -51586
806 -51586 48148 65643 20918 24539 13244 23622 12571 4854 17516 19459 -38128 -35623 -30625
793 -30625 8961 -61768 -41614 -42662 -9876 -1832 34971 12259 -23671 14766 -14563 27924
781 27924 36040 37658 -2414 21774 5880 26344 47268 16151 -8727 -39991 -16514 10407
$$ packed form
832a2438K4060L546m435n7210N484K5204J0355k0485K8649N6496k3700k3560k1591
819i625J1064k4882Q773l6406m7357P3146o254j1280K5323J383L8266k4047m9690
806e1586R9734J7495m4725L621j1295J0378j1051p717J2662J943n7587K505M998
793c0625L9586p0729K0154j048L2786Q044L6803k2712l5930L8437k9329M2487
781B7924Q116J618m0072K4188j5894K0464K0924l1117k4878l1264K3477K6921
$$ [...]
##END NTUPLES=NMR SPECTRUM
##END=
