##TITLE=1H_TG-2340-XVb
 CDCl3
 8 sc, 
 2.10.2023
##JCAMPDX= 6.0         $$ Bruker NMR JCAMP-DX V2.0
##DATA TYPE= NMR SPECTRUM
##DATA CLASS= NTUPLES
##ORIGIN= UXNMR, Bruker Analytische Messtechnik GmbH
##OWNER= root
$$ XWIN-NMR		Version 3.5
$$ Mon Oct  2 14:09:31 2023 Russian Standard Time (UT+4h)  she@DPX200
##.OBSERVE FREQUENCY= 200.13135
##.OBSERVE NUCLEUS= ^1H
##.ACQUISITION MODE= SIMULTANEOUS
##.ACQUISITION SCHEME= undefined
##.AVERAGES= 8
##.DIGITISER RES= 18
##SPECTROMETER/DATA SYSTEM= spect
##.PULSE SEQUENCE= zg30
##.SOLVENT NAME= CDCl3
##.SHIFT REFERENCE= (INTERNAL, CDCl3, 0, 15.737)
##AUDIT TRAIL= $$ (NUMBER, WHEN, WHO, WHERE, WHAT)
$$ ##TITLE= Audit trail, XWIN-NMR		Version 3.5
$$ ##JCAMPDX= 5.01
$$ ##ORIGIN= Bruker BioSpin GmbH
$$ ##OWNER= she
$$ F:/spectra/data/she/nmr/H-F/1/pdata/1/auditp.txt
$$ ##AUDIT TRAIL=  $$ (NUMBER, WHEN, WHO, WHERE, WHAT)
(   1,<2023-10-02 14:08:29.21 +0400>,<she>,<DPX200>,
      <created by zg, POWCHK disabled, PULCHK disabled
       configuration hash MD5:
       00 E9 B6 7A A2 85 ED C7 34 08 36 98 17 FE 4E 26
       data hash MD5: 16K
       59 87 2A 5A 2B 9F DC CB 32 07 4A E4 75 08 5D 99>)
(   2,<2023-10-02 14:08:31.82 +0400>,<she>,<DPX200>,
      <Start of raw data processing
       efp BC_mod = 2 LB = 0.24 FT_mod = 6 PKNL = 1 PHC0 = -21710.78 PHC1 = 11.65271 SI = 16K 
       data hash MD5: 16K
       10 59 B9 3F 31 9C 93 48 4C 06 E7 65 07 5C D8 BE>)
(   3,<2023-10-02 14:08:47.78 +0400>,<she>,<DPX200>,
      <pk PHC0 = 2.311424 PHC1 = -1.8 
       data hash MD5: 16K
       30 74 2D DE A1 4A E0 BC EB 84 FD BF AB 99 45 98>)
(   4,<2023-10-02 14:08:50.76 +0400>,<she>,<DPX200>,
      <abs ABSG = 5 
       data hash MD5: 16K
       9C C5 B9 20 A2 D0 C0 F5 AD F2 E5 64 DA E4 EE 9F>)
$$ ##END=
$$ 
$$ hash MD5
$$ B1 A3 BE C7 C9 9D 2B F9 8C 3C 64 73 4E 4D 30 CA
##$RELAX= 
##$RELAX= 
##$RELAX= 
##$RELAX= 
##$RELAX= 
##$RELAX= 
$$ Bruker specific parameters
$$ --------------------------
##$DU= <F:/spectra>
##$EXPNO= 1
##$NAME= <H-F>
##$PROCNO= 1
##$TYPE= <nmr>
##$USER= <she>
##$AMP= (0..31)
100 100 100 100 100 100 100 100 100 100 100 100 100 100 100 100 100 100 
100 100 100 100 100 100 100 100 100 100 100 100 100 100 
##$AQSEQ= 0
##$AQ_mod= 1
##$AUNM= <au_zg>
##$AUTOPOS= <>
##$BF1= 200.13
##$BF2= 200.13
##$BF3= 200.13
##$BF4= 200.13
##$BF5= 200.13
##$BF6= 200.13
##$BF7= 200.13
##$BF8= 200.13
##$BYTORDA= 1
##$CFDGTYP= 0
##$CFRGTYP= 5
##$CHEMSTR= <none>
##$CNST= (0..31)
1 1 145 1 1 1 1 1 1 1 1 1 1 1 1 1 1 1 1 1 1 1 1 1 1 1 1 1 1 1 1 1 
##$CPDPRG= <>
##$CPDPRG1= <>
##$CPDPRG2= <>
##$CPDPRG3= <>
##$CPDPRG4= <mlev>
##$CPDPRG5= <mlev>
##$CPDPRG6= <mlev>
##$CPDPRG7= <mlev>
##$CPDPRG8= <mlev>
##$CPDPRGB= <>
##$CPDPRGT= <>
##$D= (0..31)
0 1.2 0 0 0 0 0 0 0 0.06 0 0.03 0 0 0 0 0.0002 0 0 0 0 0 0 0 0 0 0 0 0 
0 0 0 
##$DATE= 1696241308
##$DBL= (0..7)
120 120 120 120 120 120 120 120 
##$DBP= (0..7)
150 150 150 150 150 150 150 150 
##$DBP07= 0
##$DBPNAM0= <>
##$DBPNAM1= <>
##$DBPNAM2= <>
##$DBPNAM3= <>
##$DBPNAM4= <>
$$ [...]
##$SUBNAM3= <"">
##$SUBNAM4= <"">
##$SUBNAM5= <"">
##$SUBNAM6= <"">
##$SUBNAM7= <"">
##$SUBNAM8= <"">
##$SUBNAM9= <"">
##$SW= 18.05172834244
##$SWIBOX= (0..15)
0 0 2 0 0 0 0 0 0 0 0 0 0 0 0 0 
##$SW_h= 3612.71676300578
##$TD= 16384
##$TD0= 1
##$TE= 0
##$TE2= 300
##$TE3= 300
##$TEG= 300
##$TL= (0..7)
0 120 120 120 120 120 120 120 
##$TP= (0..7)
150 150 150 150 150 150 150 150 
##$TP07= 0
##$TPNAME0= <>
##$TPNAME1= <>
##$TPNAME2= <>
##$TPNAME3= <>
##$TPNAME4= <>
##$TPNAME5= <>
##$TPNAME6= <>
##$TPNAME7= <>
##$TPOAL= (0..7)
0.5 0.5 0.5 0.5 0.5 0.5 0.5 0.5 
##$TPOFFS= (0..7)
0 0 0 0 0 0 0 0 
##$TUNHIN= 0
##$TUNHOUT= 0
##$TUNXOUT= 0
##$USERA1= <user>
##$USERA2= <user>
##$USERA3= <user>
##$USERA4= <user>
##$USERA5= <user>
##$V9= 5
##$VALIST= <valist>
##$VCLIST= <CCCCCCCCCCCCCCC>
##$VD= 0
##$VDLIST= <DDDDDDDDDDDDDDD>
##$VPLIST= <PPPPPPPPPPPPPPP>
##$VTLIST= <TTTTTTTTTTTTTTT>
##$WBST= 1024
##$WBSW= 4
##$XGAIN= (0..3)
0 0 0 0 
##$XL= 0
##$YL= 0
##$YMAX_a= 156629
##$YMIN_a= -211148
##$ZGOPTNS= <>
##$ZL1= 120
##$ZL2= 120
##$ZL3= 120
##$ZL4= 120
##$ABSF1= 15.73917
##$ABSF2= -2.312679
##$ABSG= 5
##$ABSL= 3
##$ALPHA= 0
##$AQORDER= 0
##$ASSFAC= 0
##$ASSFACI= 0
##$ASSFACX= 0
##$ASSWID= 0
##$AUNMP= <proc_1d>
##$AZFE= 0.1
##$AZFW= 0.1
##$BCFW= 0
##$BC_mod= 2
##$BYTORDP= 0
##$COROFFS= 0
##$CY= -3
##$DATMOD= 1
##$DC= 0
##$DFILT= <>
##$DTYPP= 0
##$F1P= 0
##$F2P= 0
##$FCOR= 1
##$FTSIZE= 16384
##$FT_mod= 6
##$GAMMA= 0
##$GB= 0
##$INTBC= 1
##$INTSCL= 3.70164e-10
##$ISEN= 128
##$LB= 0.24
##$LEV0= 0
##$LPBIN= 0
##$MAXI= 10000
##$MC2= 0
##$MEAN= 0
##$ME_mod= 0
##$MI= 1.114404
##$NCOEF= 0
##$NC_proc= -7
##$NLEV= 6
##$NOISF1= 3.799351
##$NOISF2= 2.8
##$NSP= 0
##$NTH_PI= 0
##$NZP= 0
##$OFFSET= 15.73697
##$PC= 1
##$PHC0= -21708.47
##$PHC1= 9.85271
##$PH_mod= 1
##$PKNL= yes
##$PPARMOD= 0
##$PSCAL= 0
##$PSIGN= 0
##$REVERSE= no
##$SF= 200.13000691708
##$SI= 16384
##$SIGF1= 3
##$SIGF2= 2
##$SINO= 5.538805
##$SIOLD= 16384
##$SREGLST= <1H.CDCl3>
##$SSB= 0
##$STSI= 16384
##$STSR= 0
##$SW_p= 3612.71676300578
##$SYMM= 0
##$S_DEV= 0
##$TDeff= 16384
##$TDoff= 0
##$TI= <>
##$TILT= no
##$TM1= 0
##$TM2= 0
##$TOPLEV= 0
##$USERP1= <user>
##$USERP2= <user>
##$USERP3= <user>
##$USERP4= <user>
##$USERP5= <user>
##$WDW= 1
##$XDIM= 16384
##$YMAX_p= 379842725
##$YMIN_p= -610477
$$ End of Bruker specific parameters
$$ ---------------------------------
##NTUPLES= NMR SPECTRUM
##VAR_NAME=  FREQUENCY,     SPECTRUM/REAL,   SPECTRUM/IMAG
##SYMBOL=    X,             R,               I
##VAR_TYPE=  INDEPENDENT,   DEPENDENT,       DEPENDENT
##VAR_FORM=  AFFN,          ASDF,            ASDF
##VAR_DIM=   16384,         16384,           16384
##UNITS=     HZ,            ARBITRARY UNITS, ARBITRARY UNITS
##FACTOR=    0.220516191357247, 1,           1
##FIRST=     3149.43990451008, 0,            0
##LAST=      -463.276858495696, 0,           0
##MIN=       -463.276858495696, -610477,     0
##MAX=       3149.43990451008, 379842725,    0
$$ Real data points
##PAGE= N=1
##DATA TABLE= (X++(R..R)), XYDATA
$$ [...]
7026F562339l94985k44093l72938j58805l8267N7896J2061l0871l2583K8803R8273
7015E486830J75479L32608J0280L72075M17474L46076L76377N16907M66071M37275
7005H937452R14486R35715J466643J715054J894145J827277K373025K955007L355980
6996B6374784L626745K929622J099472j380530l800362m706451m741099l826781
6988A5575400k946810k002956j387503j369417p10307o75592o70576m69058k70958
6979E072223l46686l79856n3062l28125n31959j28084J8967r4137K084j63697
6969C067668k01473m6809q5527m4649j79445k49597Q5753n0301k13808j37077
6959A944735k65629P6453j88793r0217j70778q4049o4002q0327L1872m7288J27157
$$ plain form
7026 6562339 6167354 5923261 5550323 5391518 5353251 5411147 5423208 5392337 5359754 5388557 5486830
7015 5486830 5662309 5994917 6005197 6377272 6794746 7140822 7517199 8034106 8500177 8937452
7005 8937452 9851938 10787653 12254296 13969350 15863495 17690772 20063797 23018804 26374784
6996 26374784 30001529 32931151 34030623 32650093 28849731 24143280 19402181 15575400
6988 15575400 12628590 10625634 9238131 7868714 7158407 6482815 5812239 5343181 5072223
6979 5072223 4725537 4345681 4292619 3964494 3432535 3304451 3323418 3229281 3231365 3067668
6969 3067668 2866195 2819386 2733859 2689210 2509765 2260168 2345921 2295620 2081812 1944735
6959 1944735 1679106 1755559 1566766 1476549 1305771 1221722 1157720 1077393 1109265 1061977 1189134
6948A189134j55808j40722J23555l5206K1738j19446M9098R4383j64580K598R945
6937H74689k2114K10637p0504j92005p5699N7716J13506j05480k6950m7914N2483
6926G68365j7624j46799J31858r5490q2548q835K57907N9173l7974j19865l42967
6915C65201k26501P1629K87215P9311R0558J46869p3520k00391k8024L2169r2105
6904D52411j85078K71041J54032O0201j9185Q1961j27789j67456j12169j28195
6894B79774J82735m358M2339J79413j44177N641m8909J19362o3316J18478j31059
6883E35923l1751J45773j13843m1984J29284j19446j49108J76815j4890j20113
6873C96660O0443M0118j9452j51991K33288k06775m1330J55691O9037k1387j94011
$$ plain form
6948 1189134 1033326 892604 1016159 980953 1002691 883245 932343 1026726 862146 864744 874689
6937 874689 852575 1063212 992708 800703 725004 782720 896226 790746 763796 715882 768365
6926 768365 750741 603942 735800 640310 557762 548927 806834 866007 828033 708168 365201
6915 365201 138700 210329 497544 576855 667413 814282 740762 540371 512347 544516 452411
6904 452411 267333 538374 692406 752607 733422 815383 687594 520138 407969 279774
6894 279774 462509 458151 500490 679903 535726 541367 492458 611820 548504 666982 535923
6883 535923 504172 649945 536102 494118 623402 503956 354848 531663 516773 396660
6873 396660 457103 497221 477769 325778 559066 352291 310961 466652 535689 514302 320291
6862C20291J01353j01192J64956l7830l7059j25984K44458r4556l3227J14807
6852E16017k5164l6965J04117l4721j22627k9997L3316n5012m5973J60651P7744
6841E41386k70126o818K14078m5076l3867o2306j1736P6384j78225l3927L0438
6830B20205m0720O9230J37625O3176Q337o1614r4038J20898R8690J11509j57432
6819D75866n9378J60383r4465K547k50505m9827l9386J28508O2292q7334R1778
6808C40479j70367j16801J48736p6212j7030p367J2933m8065J2480J89475j6783
6797B51478l31R8285J62092j4579q2465j9351j07573K4357K31235j7907l9667
6786D85574j23946j20174P8613R6485o7511J36284j57147l67327J6089L07155
$$ plain form
6862 320291 421644 320452 485408 447578 410519 284535 528993 434437 401210 516017
6852 516017 490853 453888 558005 523284 400657 370660 403976 348964 302991 463642 541386
6841 541386 271260 264442 478520 433444 399577 337271 325535 401919 223694 189767 220205
6830 220205 179485 248715 386340 449516 457853 396239 302201 423099 521789 633298 475866
6819 475866 416488 576871 482406 484953 234448 184621 145235 273743 336035 248701 340479
6808 340479 170112 53311 202047 125835 108805 101438 114371 66306 78786 268261 251478
6797 251478 251147 349432 511524 496945 414480 395129 287556 311913 543148 525241 485574
6786 485574 361628 241454 320067 416552 349041 485325 328178 -39149 -23060 284095
6776B84095J11066K4005M9233n5177K4081n7017J01547J537L0238O2518J29240
6765G05366Q4617j51903l3002Q2596j36651k39380q5609K00238J24483k33867
6755C16888O7277J8212j14399m2751j38268p123J11305l6415j0049J22993L906
6744B91576J11343j87799m635J80508j29354r0094k5868K38843j01417j26660
6734A56443j34685J45260r195n1459J26231M9018N830J9425n2685J42219P6449
6723D72851k22908k28196R9193J6243Q206k7315K8249J70692J36773j48046j72712
6712A33030J70515o7416n1190L4604K6061J58921N0594j03482J39149j06088n6621
6701C28077K3330R2004J33570l9527k57185n704J08880n8889L7050j43452k7191
$$ plain form
6776 284095 395161 419166 468399 413222 437303 380286 481833 483370 513608 576126 705366
6765 705366 789983 638080 605078 687674 551023 311643 226034 426272 550755 316888
6755 316888 384165 402377 287978 245227 106959 99836 211141 174726 164677 287670 291576
6744 291576 402919 215120 210485 390993 261639 171545 145677 384520 283103 156443
6734 156443 21758 167018 157823 106364 232595 281613 287443 306868 254183 396402 472851
6723 472851 249943 21747 120940 137183 145389 118074 146323 317015 453788 305742 133030
6712 133030 303545 236129 184939 219543 245604 404525 455119 351637 490786 384698 328077
6701 328077 351407 443411 576981 537454 280269 274565 383445 324556 361606 218154 190963
6690A90963O8608L4040j4884j0746j9817K27327P984M8983K01642j41842j19602
6679D72656j02685M2995n8710j60193L3402P3781J7362k864M4169P5269J4058
6668D49240l5725m561J01779p0182R0805K54287j69593O7566m3395k6680Q2995
6657F96536j41416j72960j00380N2415O0384p644J9776p1927p2766n4737Q5656
6646B92937J83877o0287k10108L4240J70991J9750O8472j35751O5719k69862n2381
6635A07597O6265P6988l5584p0473O4567J02581Q7697j53202j93542J30182k1363
6624A61713O5484J47481N1164J65405j73124j59280N1446J90233j66658j32013
6614B01851j5552n6701m3010m3609P1392K57247j12443n4433L0992J37828k71625
$$ plain form
6690 190963 259571 293611 278727 267981 248164 475491 483475 532458 734100 592258 472656
6679 472656 369971 412966 354256 194063 227465 301246 318608 315744 359913 435182 449240
6668 449240 413515 408954 510733 440551 531356 785643 616050 683616 640221 613541 696536
6657 696536 555120 382160 281780 334195 394579 386935 406711 334784 262018 207281 292937
6646 292937 476814 416527 206419 240659 411650 431400 499872 364121 429840 159978 107597
6635 107597 173862 250850 215266 144793 209360 311941 399638 246436 52894 183076 161713
6624 161713 227197 374678 425842 591247 418123 258843 310289 500522 333864 201851
6614 201851 186299 129598 86588 42979 114371 371618 259175 204742 235734 373562 101937
6603A01937j90151J76841O4537R5425Q8434J28577j32703M9578l1165k2506J33162
6592D61966j35550J0504J69966n8261N8354j66858J33072n1696K27365j24072
6582E24790k06834J29797J2182L9020l9949p4944j07205L22310J69028k06158
6572E62037n1830p0879M049j0912K7917k54541J3505J03196r2394P5292p3589
6561B31851k9283J5598L3875l4285L2669J1628J1238Q7471r9086P0920N1763O3121
6549D47480J96513L0205j81876k46534L7344J11136Q3252j17699r3831K3220l4792
6538B54418q4640J75135L5655j37904o0114L5809j18190L94545k4001k86317L2781
6527B17177J29833K09449J09760P11j69464k75189j1692J98257J5235O134L8735
$$ plain form
6603 101937 -88214 88627 153164 248589 337023 465600 332897 382475 351310 328804 461966
6592 461966 326416 336920 506886 448625 506979 340121 473193 421497 648862 524790
6582 524790 317956 447753 459935 498955 459006 384062 276857 599167 768195 562037
6572 562037 510207 439328 443377 432465 460382 205841 219346 322542 230148 305440 231851
6561 231851 202568 218166 252041 217756 250425 262053 273291 360762 261676 332596 384359 447480
6549 447480 643993 674198 492322 245788 283132 394268 477520 359821 265990 289210 254418
6538 254418 169778 344913 380568 242664 182550 218359 100169 494714 470713 184396 217177
6527 217177 347010 556459 666219 666930 497466 222277 210585 408842 424077 430211 468946
6516D68946m4596j74925r3307J42491j9818J8439M909O5074l7344j49171O9543
6505B50241L0474k3037o4335M0164k775r6816N1905L1070R7979K14356j05456
6494D23770J2249q553J09304K54253k61606k8419k9196n4034K51522o9324r4882
6483E05084O0148N2740M9470p6112j54515j8157j6260m3285r3362J16430L07792
6472F89973J20820l8203l39673N0324J05464j35545q1068J15333m6307P1963J26444
6461F39525O8299Q7333J61808o0758j77573n0042k1008k81055M3852J74672k01281
6450C83772J38053O8877j70599K3894Q1282L9036r6879p7056m1028J07250j13216
6439C43386K4982N4313p7802J22183p4437J13321J45267P7016q5061J34181j33002
$$ plain form
6516 468946 424350 249425 156118 298609 278791 297230 302139 367213 329869 180698 250241
6505 250241 280715 257678 193343 233507 230732 133916 185821 216891 314870 529226 423770
6494 423770 436019 427466 536770 791023 529417 500998 471802 417768 669290 599966 505084
6483 505084 565232 617972 667442 591330 436815 418658 402398 359113 265751 382181 689973
6472 689973 810793 772590 432917 483241 588705 453160 372092 487425 441118 513081 639525
6461 639525 707824 795157 956965 896207 718634 668592 647584 366529 410381 585053 383772
6450 383772 521825 590702 420103 443997 525279 564315 467436 390380 349352 456602 343386
6439 343386 368368 422681 344879 467062 392625 505946 651213 728229 643168 777349 644347
6428F44347m0142N3552R4784r7725q8652q4442K48549K9612k63402J2428R4604
6417F03513J2905Q6783l02156l9568J53230Q9052l7641J53937K21397l5673l90037
6406E15742M1680m1983j16852o6363n9155R4122J27635J15129l42054R7211j5474
6395C49638j2968m608J53023k6976j8279j12016M5757Q5423J59269R0658n0717
6384F58204p8442k4082P8126J27360p5985k69684j55249Q0536J65400n8783l9794
6373D07607k6425K6381J22314m3570L1930k25794J45508L5199k00959L4403l2599
6362B73995j71472K08761M30691j56223o455R9160j7659k9514k6604r1842P2686
6351E85524J11927m2295p6985J49512k96400J46466j41663j2245J50867o787p5164
$$ plain form
6428 644347 604205 657757 752541 654816 566164 481722 730271 759883 496481 508909 603513
6417 603513 616418 703201 401045 361477 514707 603759 566118 720055 941452 905779 515742
6406 515742 557422 515439 398587 332224 273069 367191 494826 609955 267901 365112 349638
6395 349638 336670 332062 485085 458109 439830 327814 373571 458994 618263 708921 658204
6384 658204 579762 555680 633806 761166 685181 415497 260248 340784 506184 447401 407607
6373 407607 381182 407563 529877 486307 518237 292443 437951 473150 272191 306594 273995
6362 273995 102523 311284 741975 585752 579297 678457 660798 631284 604680 512838 585524
6351 585524 697451 655156 578171 727683 431283 577749 436086 423841 574708 567921 492757
6340D92757Q4597L4355r0812j2948l292l8188K1218J41401j12923k24163j88064
6329A03938N6299K22381J8796O8232j3888n2052O9866Q9479p311r7988J22188
6318E79940j81562J99980J60246o7614j59612J26688q0733j07062j79271j6756
6308B74244R519N9379K64190L1922r9489N5205N2234j66376J2759J31576j53441
6297D71722M1526K14561n3239o2180K5777m9566M4631o9581P2722J00051j13991
6286F22433J9341N1675P5208l0480Q4623k7381k33946o7100K75891K49627j60320
6275H59571m1366j28714k38816J22660J72210j17183J8532n7187j54499L2484
6265D67692K54317o205J90958J40641R8820k51803j54044P2441L2605N1023q0897
$$ plain form
6340 492757 577354 611709 520897 507949 504657 466469 487687 629088 516165 292002 103938
6329 103938 160237 382618 401414 469646 455758 403706 473572 563051 555740 457752 579940
6318 579940 398378 598358 758604 690990 531378 658066 577333 470271 291000 274244
6308 274244 283763 343142 607332 639254 539765 594970 647204 480828 493587 625163 471722
6297 471722 513248 727809 674570 612390 638167 588601 633232 563651 636373 736424 622433
6286 622433 641774 693449 768657 738177 822800 795419 561473 494373 770264 1019891 859571
6275 859571 818205 689491 450675 573335 745545 628362 646894 589707 435208 467692
6265 467692 722009 715804 906762 1047403 1146223 894420 740376 812817 845422 896445 815548
6254H15548K1208K18053m2127j34131J71731o1282K66357K1336k29090O979o1993
6243I92589j06910j7055Q4340q0473M5544K0055J989r9364r081r422r6287J81680
6231I07605j34671L72244j99603o7148J67906K60236r6425k41126j55761M871
6221H18128P2068P3934J8296r515P5321J82930n4761q0863R213M0879Q9939k95797
6209I39772J88750M4571j00341R8761L2582K1807j98288r8913J44936J36510j9076
6198A191071k1701n3372L04401j8096q3366j31890N6056J72892m1803k8312k32463
6187A113417J36842m5546J70459P656j31645M0970n5199R0570J80568j08180n787
6176A394125P3489k2935q0716K10748J45784k23452o4836J55193r523K4599J35313
$$ plain form
6254 815548 836756 1054809 1012682 878551 1050282 989000 1255357 1276693 1047603 1054582 992589
6243 992589 885679 868624 952964 872491 918035 938090 940079 840715 831634 822212 725925 907605
6231 907605 772934 1145178 945575 878427 1046333 1306569 1210144 969018 813257 818128
6221 818128 890196 964130 982426 972911 1048232 1231162 1176401 1095538 1104751 1145630 1235569 939772
6209 939772 1128522 1173093 1072752 1171513 1204095 1225902 1027614 928701 1073637 1210147 1191071
6198 1191071 1169370 1115998 1420399 1402303 1318937 1187047 1243103 1415995 1374192 1345880 1113417
6187 1113417 1250259 1204713 1375172 1382828 1251183 1292153 1236954 1327524 1508092 1399912 1394125
6176 1394125 1467614 1444679 1363963 1574711 1720495 1497043 1432207 1587400 1577877 1602476 1737789
6165A737789q3205m09135L7671J32833n7742K25693K86034P8540J36720k95705
6155A789493j01057R4795P4342J45641M7521j39952m6122K76409k8550j91721
6145A920799P3598k064R9125J03878K5352j77908k90958K57347P3944J24652q227
6134B199538q1826R9130K3483m8756J85566J9503j12781J08532j62412M2492R3272
6123B365741l2735J07860M2456k4063M0257K8618k80354K5120J23699k11710K04489
6112B389378J08920l8803m1186m4486P2450j09996K69594q1088Q8569j68675N7183
6101B501860J72890j18361J05516N6233L0622N5936N1533o4046J56407J86435
6091C135025K1957J69489n7894O4693K70078R721J48598J14556K52274M11309
$$ plain form
6165 1737789 1654584 1245449 1283120 1415953 1358211 1583904 1869938 1948478 2085198 1789493
6155 1789493 1688436 1783231 1857573 2003214 2050735 1910783 1864661 2141070 2112520 1920799
6145 1920799 1994397 1992333 2091458 2195336 2220688 2042780 1751822 2009169 2083113 2207765 2199538
6134 2199538 2117712 2216842 2240325 2191569 2377135 2396638 2283857 2392389 2229977 2272469 2365741
6123 2365741 2333006 2440866 2483322 2459259 2499516 2528134 2247780 2272900 2396599 2184889 2389378
6112 2389378 2498298 2459495 2418309 2373823 2446273 2336277 2605871 2524783 2613352 2444677 2501860
6101 2501860 2674750 2556389 2661905 2718138 2748760 2804696 2856229 2792183 2948590 3135025
6091 3135025 3156982 3326471 3268577 3333270 3603348 3613069 3761667 3876223 4128497 4539806
6081D539806N14540K41325J87972P44989O53156O29420R50347J035332J190126
6072A0687013J308245J092504k91160j220845j416673j273736m90210J29185L57116
6063H881439O30527P54899J042448J222776P66875k99726j378132j842514j338163
6054H440429j085622p25766l82493l54802O437k43031n6051n0998q2360j76091
6044E289652k4580j39774K8648J13927o9917K65456J59832O2243K08750R7544
6034E991781m2300K50614M12935K58148J18207M74834L38228O95359R57469R60459
6024A0415734J211131J169466J557701K031531J562983L48000j021262j766972
6016A5508312j304346r28324k11128M44892P72987J039224J316434J481348J660997
$$ plain form
6081 4539806 5054346 5295671 5483643 6228632 6881788 7511208 8461555 9496887 10687013
6072 10687013 11995258 13087762 12796602 11575757 10159084 8885348 8395138 8524323 8881439
6063 8881439 9511966 10266865 11309313 12532089 13298964 12999238 11621106 9778592 8440429
6054 8440429 7354807 6629041 6246548 5891746 5898183 5655152 5599101 5548103 5465743 5289652
6044 5289652 5265072 5125298 5153946 5267873 5197956 5463412 5623244 5685487 5894237 5991781
6034 5991781 5949481 6200095 6613030 6871178 6989385 7464219 7802447 8497806 9455275 10415734
6024 10415734 11626865 12796331 14354032 16385563 17948546 18296546 17275284 15508312
6016 15508312 14203966 13275642 13064514 13509406 14282393 15321617 16638051 18119399 19780396
6007A9780396P95153j187136k237339k084190j417553j137591q26982q42025j54472
5998A0688261k57341p09109m02665k67920l74015k38065k24989m25036n2695n3034
5988G683392K2417M1023k04082r8151q045K22108j5053O8818J29410j918O392
5977G846311L08295N6689K40143K86156J38216Q7466K66755R9199m7107K73557
5967I555680J49707k0479j89541J1760r4643m8523k51781K99337J34724J30586
5957I676827J07817J58153Q5059L81910K3095Q3031K30726L33359L26694J82877
5947A1589548J79206J01466L07949K42621K74447K74838K54773j64904Q3704j3868
5937A3129780J59622L17438O47659L87327L26095M42461M11263M80802L86747
$$ plain form
6007 19780396 20575549 19388413 17151074 15066884 13649331 12511740 11684758 10842733 10688261
5998 10688261 10430920 9721811 9319146 9051226 8677211 8439146 8214157 7789121 7736426 7683392
5988 7683392 7705809 7746832 7542750 7444599 7436554 7658662 7643609 7712427 7841837 7839919 7846311
5977 7846311 8154606 8211295 8451438 8737594 8875810 8963276 9230031 9329230 9282123 9555680
5967 9555680 9705387 9684908 9495367 9507127 9412484 9363961 9112180 9411517 9546241 9676827
5957 9676827 9784644 9942797 10027856 10409766 10432861 10515892 10746618 11079977 11406671 11589548
5947 11589548 11768754 11870220 12178169 12420790 12695237 12970075 13224848 13059944 13143648 13129780
5937 13129780 13289402 13606840 14254499 14641826 14967921 15410382 15821645 16302447 16689194
5928A6689194J02226M04524L59254K27815M47497K97554K88525M56358P88713
5919B0061660N57117J82871M93523M81502J38281J69778J28726l59244l56608
5910B1497606l49889n03912l27300m12686k29761k76375r4667K08531M58834K96083
5900B0266464J63698L62865N95123R43882Q05755P23350J001390P68999Q82181
5891B6513707R48963J161192Q12906J109043J037854Q20122N16937M50280M61005
5882C3832009M70958L52780L1346M71646L61364J19308L32293N75275P95748J018059
5872C8360786J436389J784403J737533J338282J199476J278255J022362Q85202
5864D9042688Q38840L47355L6282o58565j195780q78568r29648j078797j310089
$$ plain form
5928 16689194 16791420 17195944 17555198 17783013 18230510 18528064 18816589 19272947 20061660
5919 20061660 20618777 20801648 21295171 21776673 21914954 22084732 22213458 21854214 21497606
5910 21497606 21147717 20643805 20316505 19903819 19674058 19397683 19303016 19511547 19970381 20266464
5900 20266464 20430162 20793027 21388150 22332032 23137787 23861137 24862527 25631526 26513707
5891 26513707 27462670 28623862 29436768 30545811 31583665 32403787 32920724 33371004 33832009
5882 33832009 34302967 34655747 34687093 35158739 35520103 35639411 35971704 36546979 37342727 38360786
5872 38360786 39797175 41581578 43319111 44657393 45856869 47135124 48157486 49042688
5864 49042688 49881528 50228883 50265165 49606600 48410820 47532252 46602604 45523807 44213718
5855D4213718p93270o57804l73532k54075N5759M11698N69755M77585R19414R40248
5845D5509496J347181J612975J357184J786251J707428J756193J840391J918203
5837E8835302K102928J853484J581094J544215J432079J969168K173508K434131
5829G3925909K966005L093661L449013L915569M524837M415551M076922L806574
5821A04174041L491898K820259K192604J681428O53321n76853j401641j080425
5813A11954632m26063P16302J458947K065533K378233K292027J578123J026241
5805A23043975O71292J49823J11898O70862J665790K419782L035589L076605K860211
5796A37705827J115541j353963m907228p585858q654211q484713p432635n002233
$$ plain form
5855 44213718 43420448 42762644 42389112 42135037 42190796 42602494 43172249 43649834 44569248 45509496
5845 45509496 46856677 48469652 49826836 51613087 53320515 55076708 56917099 58835302
5837 58835302 60938230 62791714 64372808 65917023 67349102 69318270 71491778 73925909
5829 73925909 76891914 79985575 83434588 87350157 91874994 96290545 100367467 104174041
5821 104174041 107665939 110486198 112678802 114360230 115013551 114436698 113035057 111954632
5813 111954632 111528569 112244871 113703818 115769351 118147584 120439611 122017734 123043975
5805 123043975 123715267 123865090 123976988 124647850 126313640 128733422 131769011 134845616 137705827
5796 137705827 138821368 137467405 132560177 124974319 116320108 107835395 100402760 95400527
5788I5400527k530003j527272k208264m042359n522122n873065n538674m733103
5780F3425665m255659l832186l448430l330569k852223k603055j994693j649897
5772C9458953j385741j416443j620045j571665j283497j245887r13755j088676
5764B8933244o63138o51114n20636j14690n8118k10753J39072J42602K63589M72528
5754B7732586N77717K98540q1693j87160j56747J14130K13132M72092N31094Q00251
5744C0313942K95440o80727j862187k182761j923587j183294p06248l44111o3249
5735B1663218k72678k29689k1335j3700J60219Q9591K28243k55097p76171n84159
5725A9988442l65885j5064L3836M67187Q56758J232182J554610J480124L93784
$$ plain form
5788 95400527 92870524 91343252 89134988 85092629 79570507 73697442 68158768 63425665
5780 63425665 59170006 55337820 51889390 48558821 45706598 43103543 41108850 39458953
5772 39458953 38073212 36656769 35036724 33465059 32181562 30935675 30021920 28933244
5764 28933244 28270106 27618992 27098356 26983666 26925548 26714795 26853867 26996469 27260058 27732586
5754 27732586 28310303 28608843 28527150 28339990 28183243 28297373 28510505 28982597 29513691 30313942
5744 30313942 30609382 29928655 28066468 25883707 23960120 22776826 22070578 21726467 21663218
5735 21663218 21390540 21160851 21139516 21125816 21286035 21375626 21603869 21348772 20572601 19988442
5725 19988442 19622557 19607493 19641329 20108516 20965274 22197456 23752066 25232190 25625974
5716B5625974r50588j852198k228205j919477j400316r58545n91382m42530k67459
5707A5015274k55986k57562j24912k8426N1705q6762m1110J75694M77497L43303
5697A5268715M45287P53440N12554R44312J074738M13652r62792j474978j303280
5688A5671648r54042q31054m73058k27444k89588l9958L3560K47614K39865J91755
5678A3569298K68364n802J69186J71764K26278N87804Q48229O56158Q69333Q13925
5668A8174537J022154J308813P12688P8658j334396j534208j681905j147358o86450
5659A4912533m83728m02175k88423p563P7976J76241J84297K60576P1913L31125
5649A4832772O35656L68607O20123L38218L90354J15608r7102l68365n25830l47023
$$ plain form
5716 25625974 24675386 22823188 20594983 18675506 17275190 16316645 15725263 15282733 15015274
5707 15015274 14759288 14501726 14376814 14348388 14400093 14313331 14272221 14447915 14925412 15268715
5697 15268715 15714002 16467442 16979996 17924308 18999046 19412698 18449906 16974928 15671648
5688 15671648 14717606 13886552 13413494 13186050 12896462 12856504 12890064 13137678 13377543 13569298
5678 13569298 13837662 13831860 14001046 14172810 14399088 14986892 15835121 16491279 17360612 18174537
5668 18174537 19196691 20505504 21218192 21296850 19962454 18428246 16746341 15598983 14912533
5659 14912533 14428805 14026630 13738207 13730644 13808620 13984861 14169158 14429734 14501647 14832772
5649 14832772 15468428 15837035 16457158 16795376 17185730 17301338 17204236 16835871 16310041 15963018
5639A5963018l37282l22704o4766J71305q4287J43403L66864L56254L40605O66024
5629A7198434J022358P83173J054904J186287J099144J341667J464992J059477
5621B6210436R24687Q16919j29772m40961o73879m90326l68561n27173k29389
5612B5091981J99685O27323R81485Q06545J249615J179767J663251J423139J269270
5603C4492061J473922J208909J130467N04563k26124p63050j248563j274018j445684
5594C3852483j269411j270210j165002r27030o13814k45595j34860K74795J89012
5585B8690368M935l32451n09898o82374p61903o40683m54321k49567n84105m46841
5575B4033160m75287o20604q61922r06011o22432o40214n56000m22881j72156
$$ plain form
5639 15963018 15625736 15303032 15238266 15409571 15325284 15468687 15835551 16191805 16532410 17198434
5629 17198434 18220792 19003965 20058869 21245156 22344300 23685967 25150959 26210436
5621 26210436 27135123 27952042 27822270 27381309 26707430 26217104 25848543 25321370 25091981
5612 25091981 25291666 25918989 26900474 27707019 28956634 30136401 31799652 33222791 34492061
5603 34492061 35965983 37174892 38305359 38809922 38583798 37820748 36572185 35298167 33852483
5594 33852483 32583072 31312862 30147860 29220830 28607016 28361421 28226561 28501356 28690368
5585 28690368 28695303 28362852 27852954 27170580 26408677 25767994 25313673 25064106 24480001 24033160
5575 24033160 23557873 22937269 22075347 21169336 20546904 19906690 19350690 18927809 18755653
5566A8755653k88553r3979m66960J735k19126l56436k00859m77667k36709n10140
5556A5906959j67800j69704k59495k20189j66791k94194l80423n1866k94471p5881
5546A3826145n6868o8254m133j0491j52361m759j74615k95672k23812j83648j62019
5535A2489513j71404k3979J44759k62296k02736k06421J08767r5474k34695j02694
5525A1443340l50567k87802l9895R9936p5782l9567Q5806j74987o0766j2217k67857
5514A0319642j52310j50214K7011Q7070q9984j15824p2006k78246j1465k20230
5504I343444j76647j06779j81011L2703j86020k21038l511j10925k04947j24809
5494H060460M28036K56487M2783k84492j79592J09426O0444j78760R2710k16577
$$ plain form
5566 18755653 18467100 18373121 17906161 17907896 17688770 17332334 17131475 16653808 16417099 15906959
5556 15906959 15739159 15569455 15309960 15089771 14922980 14628786 14248363 14196497 13902026 13826145
5546 13826145 13769277 13701023 13696890 13686399 13534038 13529279 13354664 13058992 12835180 12651532 12489513
5535 12489513 12318109 12294130 12438889 12176593 11973857 11767436 11876203 11780729 11546034 11443340
5525 11443340 11092773 10804971 10765076 10865012 10789230 10749663 10835469 10660482 10599716 10587499 10319642
5514 10319642 10167332 10017118 10044129 10131199 10041215 9925391 9853385 9575139 9563674 9343444
5504 9343444 9166797 9060018 8879007 8911710 8725690 8504652 8501141 8390216 8185269 8060460
5494 8060460 8488496 8744983 8787766 8503274 8323682 8433108 8493552 8314792 8407502 8190925
5484H190925r7058q0075j76039k0069j72619j95319J15414O5611m03795N6562
5474G283538q261m9917P3436L482N1615p0346J10814L0360j12719j25287J10634
5463G297349N4296o4446M3384K12181k39856j13969j09110J02894J49732j74067
5453G158388J335j33163J42283J18280J12841q0546O6907p301r909J30497L8987
5442G538599J52173M9192J62586J55578Q787K24300J1344k5047M8221K49860o3995
5431H511598m6007K14857L4426K2382K04442P052m1194J63873K47801J34006o9286
5420I383950k3919l9039J19549J50360Q3160J59334M3145k09554r3919L35268
5410I908335J93772L45413L9871K55647R106k00396K9690L06753N90816M31033
$$ plain form
5484 8190925 8093867 8013792 7837753 7817684 7645065 7449746 7565160 7630771 7226976 7283538
5474 7283538 7275277 7225360 7298796 7302278 7353893 7283547 7394361 7424721 7312002 7186715 7297349
5463 7297349 7351645 7287199 7330583 7542764 7302908 7188939 7079829 7182723 7332455 7158388
5453 7158388 7159723 7026560 7168843 7287123 7399964 7319418 7386325 7379024 7369115 7499612 7538599
5442 7538599 7690772 7739964 7902550 8058128 8066915 8291215 8302559 8277512 8325733 8575593 8511598
5431 8511598 8465591 8680448 8714874 8737256 8941698 8948750 8907556 9071429 9319230 9453236 9383950
5420 9383950 9360031 9320992 9440541 9590901 9674061 9833395 9876540 9666986 9573067 9908335
5410 9908335 10102107 10447520 10487391 10743038 10752144 10551748 10581438 10888191 11479007 11910040
5400A1910040K68563J24270j82396R7572q1179L8352K06023K58744J99549K31866
5390A3071404L05681L54219N46451M86066N00486Q70691Q27143N09566P09489
5381A8181196M38776Q8059j307k80579k62529J34262j54037l0983l8421o9186
5371A8005251l3399J0949j07901j95595j90912K82720L2356K15310Q3363J93897
5361A8296039J48431j01066K4498l5367p45759p27604p04971q38686n76109m78957
5351A4260449k03824j11190k65855k9729k10063l01858k87089l78105l67407o89771
5341A1415558k17345j13558j98106k45857J25242Q1905q3855j30364O0543j51873
5331A0542290l50226Q2757J59895j9190p8590j94023k96008k746l3482p963l752
$$ plain form
5400 11910040 12178603 12302873 12120477 12218049 12136870 12175222 12381245 12639989 12839538 13071404
5390 13071404 13377085 13731304 14277755 14763821 15264307 16134998 16962141 17471707 18181196
5381 18181196 18619972 18708031 18706724 18426145 18163616 18297878 18143841 18112858 18074437 18005251
5371 18005251 17971852 17982801 17874900 17679305 17488393 17771113 17803469 18018779 18102142 18296039
5361 18296039 18444470 18343404 18367902 18332535 17586776 16859172 16154201 15315515 14739406 14260449
5351 14260449 14056625 13945435 13679580 13649851 13439788 13137930 12850841 12472736 12105329 11415558
5341 11415558 11198213 11084655 10886549 10640692 10765934 10847839 10763984 10633620 10694163 10542290
5331 10542290 10192064 10274821 10434716 10415526 10336936 10142913 9846905 9844159 9810677 9802714 9798962
5320I798962j97183M458l4607j79468J41005j4m26J87770K90531p3067J86490
5309A0124451j27383m8410J00164r1044r0491J9405m3697K31933J51010J05961
5299A0331899J18307J99110J28417j29584J49687K69514K63824K12750M2747j50980
5289A1435691K04109L9203L4170J81449M85846M3762J72100N4672J39753r8187
5279A2692568J4590k2002j49783j31482l10571J4812n1447J18782J45033J54000
5269A2474500M84854J03938L11537K00821Q5598P0645J28357J19748N7966P59
5259A4038723o5435n4980r4017k17349n86189k50594k84932m13872l30513k42814
5249A1498028j0442r7046j08471J75486nK9969j1460k23327N8463J50076K83182
$$ plain form
5320 9798962 9601779 9606237 9571630 9392162 9533167 9533153 9532727 9720497 10011028 9937961 10124451
5309 10124451 9997068 9948658 10048822 9957778 9867287 9886692 9842995 10074928 10225938 10331899
5299 10331899 10450206 10649316 10777733 10648149 10797836 11067350 11331174 11543924 11586671 11435691
5289 11435691 11639800 11679003 11713173 11894622 12380468 12424230 12596330 12651002 12790755 12692568
5279 12692568 12707158 12685156 12535373 12403891 12093320 12108132 12056685 12175467 12320500 12474500
5269 12474500 12959354 13063292 13374829 13575650 13661248 13731893 13860250 13979998 14037964 14038723
5259 14038723 13973288 13918308 13824291 13606942 13020753 12770159 12485227 12071355 11740842 11498028
5249 11498028 11487586 11390540 11282069 11457555 11457550 11487519 11476059 11252732 11311195 11461271 11744453
5238A1744453K20720o317J24835J45690n9698j69538j94494m86208p16022j62728
5228A0440693j62213k22332m72863j58291m5014k48045j06222J64698Q6200j58136
5218I118475j6890Q6028N3786K17417J93384J08647j05899p6406M4983J51612
5208I775137K47452m58373k84018q7906m35316l50810j6864J07263K9910m3454
5198H483021j43624j37811j1760P062K6348K8918J0547O3187j35586K33827J76394
5187H600523q0945p1142k61875J26868N4433j354j80105K3139k7460o9868l6352
5176H075862K83640r2261k1375n0013N2240J62960J66819o809J45028m3399L08103
5165H980795K18574J92063R0304J16305L91922L51742L39864Q01448N03804J05394
$$ plain form
5238 11744453 11965173 11958856 12083691 12229381 12169683 12000145 11805651 11319443 10603421 10440693
5228 10440693 10278480 10056148 9583285 9424994 9379980 9131935 9025713 9190411 9276611 9118475
5218 9118475 9101585 9187613 9241399 9458816 9652200 9760847 9654948 9578542 9623525 9775137
5208 9775137 10022589 9564216 9280198 9192292 8756976 8406166 8389302 8496565 8526475 8483021
5198 8483021 8339397 8201586 8189826 8196888 8223236 8252154 8262701 8325888 8190302 8424129 8600523
5187 8600523 8519578 8448436 8186561 8313429 8367862 8366508 8186403 8209542 8182082 8112214 8075862
5176 8075862 8359502 8267241 8245866 8195853 8248093 8411053 8577872 8571063 8716091 8672692 8980795
5165 8980795 9199369 9391432 9481736 9598041 9989963 10341705 10681569 11483017 11986821 12092215
5155A2092215K6430p1161L4593j46707J90905K91939P50591P31003Q31408J010008
5145A5741224J156023Q34623J01106l73633l12521J96710M69225Q09792J094938
5136A9717487P47531M96113P12766J294534J494402J591822J539560J736282J529971
5127C0860468J778221K254421K138852J781281K216573K809449L203961L151005
5119E0194231J782585J26948k520187m466133m735145l652013k292955j631735
5111C2805596j102325o49476p24451k18976L75565O17939P07778N55014N19139
5102C2885803Q64241R54111J791493K443038J817092O01833n21064j241918j756862
5093C7837767j854994j734282j058086q44248l49084M24582N54578M29882R32970
$$ plain form
5155 12092215 12118645 12047484 12082077 11935370 12126275 12418214 13168805 13899808 14731216 15741224
5145 15741224 16897247 17731870 17832976 17459343 17146822 17343532 17812757 18622549 19717487
5136 19717487 20465018 20961131 21673897 22968431 24462833 26054655 27594215 29330497 30860468
5127 30860468 32638689 34893110 37031962 38813243 41029816 43839265 47043226 50194231
5119 50194231 51976816 52103764 49583577 45117444 40382299 36730286 34437331 32805596
5111 32805596 31703271 31053795 30329344 30110368 30485933 31103872 31811650 32366664 32885803
5102 32885803 33750044 34704155 36495648 38938686 40755778 41357611 40836547 39594629 37837767
5093 37837767 35982773 34248491 33190405 32346157 31997073 32421655 32976233 33406115 34339085
5084C4339085J074048J374632J301865L81308o12716j183780j989216k182909
5076C2502317j929790j120277p99000m89516k92997K56334N38172P90227J095611
5067C0551081J194989J749358K184267K317091K367188K688951K823636L234853
5059D9111414K682652J023693r30823k539487l394086l443415l206100l075636
5051C6228212k451350k008861j168361j080093q78548o01893k58594j04442K57308
5042B7933378N16914J048688J201802Q54061P14376M94418P24658M67263k41351
5033C3714207r93521j437272j522291j295762j047593j243879j391230j367049
5025B3415610j399581q37345n66110n37915n81944o81957q52134j063781p87843
$$ plain form
5084 34339085 35413133 36787765 38089630 38470938 37858222 36674442 34685226 32502317
5076 32502317 30572527 29452250 28653250 28163734 27870737 28127071 28665243 29455470 30551081
5067 30551081 31746070 33495428 35679695 37996786 40363974 43052925 45876561 49111414
5059 49111414 51794066 52817759 51886936 49347449 45953363 42509948 39303848 36228212
5051 36228212 33776862 31768001 30599640 29519547 28640999 28039106 27780512 27676070 27933378
5042 27933378 28450292 29498980 30700782 31554843 32269219 32763637 33488295 33955558 33714207
5033 33714207 32720686 31283414 29761123 28465361 27417768 26173889 24782659 23415610
5025 23415610 22016029 21178684 20612574 20074659 19492715 18810758 17958624 16894843 16107000
5016A6107000n71868k92825k5089K78552K21357Q3393J29300k41121m92704n29140
5006A4666855n07527n38328l20501m69851l04499j58443j36602l01321j07509
4997A1822274j44235l8074J00678N86910J70559k04936Q6120r5058L67627J46148
4987A2798013l13616k16998n20961m09061j91477m52563m76057n13302q29644
4978H874334l94147j27877k50996n13534j2019r5812j58078j41121j01866k99973
4968F778911N3229l7018P2895J4339k30911r2043K02762J8748k82328J31651J19174
4957F749409L0515J30747K57672L4641k35328k2199k12425l67377j57708l1054
4947F176893K10776Q6123j36687J19329J76412N4789J911q0832j64904P601k5721
$$ plain form
5016 16107000 15535132 15242307 15217218 15495770 15717127 15800520 15929820 15688699 15195995 14666855
5006 14666855 14159328 13621000 13300499 12830648 12526149 12367706 12231104 11929783 11822274
4997 11822274 11678039 11639965 11740643 12327553 12498112 12293176 12379296 12284238 12651865 12798013
4987 12798013 12484397 12267399 11746438 11337377 11145900 10693337 10217280 9703978 8874334
4978 8874334 8480187 8352310 8101314 7587780 7575761 7479949 7321871 7180750 7078884 6778911
4968 6778911 6832140 6795122 6868017 6882356 6651445 6559402 6762164 6780912 6498584 6630235 6749409
4957 6749409 6779924 6910671 7168343 7202984 6967656 6945457 6733032 6365655 6207947 6176893
4947 6176893 6387669 6473792 6337105 6456434 6632846 6687635 6689546 6608714 6443810 6451411 6425690
4936F425690j01583N4715j5440R2996r9156k7314N2941r2949K3337K04339O9288
4925F586864M9210J78444N6667j3349J71334k21810o9655j08573m0551K01860
4915F790441L28511L66372M42850K14247K34930j24633K90311K87102j27525n75807
4905H126799o60069m04116l47910k20018k85176k88296j28467l25601k3218m4869
4895E399059l37854p0450m6845k246m9336N7204j21190J1513j23537j15659j03168
4884D497491M4554K85411K4002O2006o5098m4635j1583p6101J84295K00745L24095
4873E425182P9239M30660N60857K12888M81564N02878j38930p72319p81633o77574
4863E322812k78002j2579N3011J8306j35828K0264M23159K49960M12152O31234
$$ plain form
4936 6425690 6324107 6378822 6363382 6456378 6357222 6329908 6382849 6289900 6313237 6517576 6586864
4925 6586864 6636074 6814518 6871185 6857836 7029170 6807360 6737705 6629132 6588581 6790441
4915 6790441 7118952 7485324 7928174 8142421 8377351 8252718 8543029 8830131 8702606 8126799
4905 8126799 7466730 7062614 6714704 6494686 6209510 5921214 5792747 5467146 5443928 5399059
4895 5399059 5061205 4990755 4943910 4941664 4892328 4949532 4828342 4839855 4716318 4600659 4497491
4884 4497491 4542045 4827456 4851458 4913464 4848366 4803731 4792148 4716047 4900342 5101087 5425182
4873 5425182 5504421 5935081 6495938 6708826 7190390 7693268 7554338 6782019 6000386 5322812
4863 5322812 5044810 5032231 5085242 5103548 4967720 4987984 5411143 5661103 6073255 6704489
4853F704489M18852j94286n68684n76087l64386n10408l23642l65229j25071J02354
4843D197902o0913J5214J87763L04k33118l98689j60877M4533n3366N8282L1035
4832C628070j45368j57580J09830J32686J47922r169J78265Q4977j06801P2441
4822C935273j54844K68196K27474O2335L29028P3892K28439L73735M32292M20099
4812F195919o8863K10192L60990L11659L77991j11813j81801l49866J01240J11904
4802F957552j36992J31220k83157m29721K44785K26592N31K30592M38839K55467
4792G635708O03017K54658K67833L40532L97085O48204M32609l22039m96227l64095
4782I397285j83329Q9047M0555r1560j58521J04523j76770m18969K20279K64732
$$ plain form
4853 6704489 7123341 6929055 6360371 5784284 5419898 4909490 4585848 4220619 4095548 4197902
4843 4197902 4136989 4152203 4339966 4340270 4107152 3708463 3547586 3592119 3538753 3597035 3628070
4832 3628070 3482702 3325122 3434952 3567638 3715560 3706391 3884656 3969633 3862832 3935273
4822 3935273 3780429 4048625 4276099 4338434 4667462 4741354 4969793 5343528 5775820 6195919
4812 6195919 6127056 6337248 6698238 7009897 7387888 7276075 7094274 6744408 6845648 6957552
4802 6957552 6820560 6951780 6668623 6238902 6483687 6710279 6710810 6941402 7380241 7635708
4792 7635708 8238725 8493383 8761216 9101748 9498833 10147037 10579646 10257607 9761380 9397285
4782 9397285 9213956 9303003 9343558 9251998 9093477 9198000 9021230 8602261 8822540 9087272
4772I087272j2065l7264K23999M8300L11668J93737Q8392M49707m4466k52494
4762A0056786j14172J24618n4353J97706N05696M76052M80209M12609L27526M28279
4752A2840956N01986N67183J002466J017971J068834J815496K406498L094622
4744B4316012L523047M341991M933634N230951O577702Q457888R711634P681046
4736G4773905L668214j957368p510234j1039003j1142368r419937o480845m234069
4728B6658295l035264j828815j436077r13676n85092m27024k556N19071O11358
4719A9560220P82941J087577J716154K166559K311450J359749L46525j99457j425615
4710B7706103k934787l178501k539287j672748r83834q84110o40367J52497J46902
$$ plain form
4772 9087272 9075207 9037943 9261942 9310242 9621910 9815647 9904039 10353746 10309280 10056786
4762 10056786 9942614 10067232 10012879 10210585 10716281 11192333 11672542 12085151 12412677 12840956
4752 12840956 13342942 13910125 14912591 15930562 16999396 18814892 21221390 24316012
4744 24316012 27839059 32181050 37114684 42345635 48923337 57381225 67092859 74773905
4736 74773905 78442119 76484751 68974517 57935514 46793146 37373209 30892364 26658295
4728 26658295 23623031 21794216 20358139 19444463 18859371 18432347 18429791 18948862 19560220
4719 19560220 20343161 21430738 23146892 25313451 27624901 28984650 29331175 29131718 27706103
4710 27706103 24771316 21592815 19053528 17380780 16396946 15512836 14872469 15024966 15171868
4701A5171868J88578L76032P82511R87453J154982J221276J486694J926624K052055
4692B5348073K15497j333073j599716q96926K27063J233738K092328K987884L765196
4683C2040064M453912N191554O485523Q617090P617152L165001k8680l416568
4675F4125048p644770j0256058r684411p166095n146464l320692k414367j632967
4667A6859224j379079j320765r49340n44843n78814n35549l52219k95903l02790
4658A0599922l30923j57729P7729n6634l1027k11628r3352j2601j01183k06270
4648I476304j46057n5073j92330m64498m00164j2564j52831J26399M2138j50853
4638H070471q8101K111N3995Q9299J94281J32563J91404L39017R9062P5433K13050
$$ plain form
4701 15171868 15360446 15736478 16518989 17506442 18661424 19882700 21369394 23296018 25348073
4692 25348073 25563570 24230497 22630781 21733855 21960918 23194656 25286984 28274868 32040064
4683 32040064 36493976 41685530 48171053 56788143 64405295 67570296 67541616 64125048
4675 64125048 56480278 46224220 36539809 29373714 24227250 20906558 18492191 16859224
4667 16859224 15480145 14159380 13210040 12665197 12086383 11550834 11198615 10902712 10599922
4658 10599922 10268999 10111270 10188999 10132365 10101338 9889710 9796358 9783757 9682574 9476304
4648 9476304 9330247 9275174 9082844 8618346 8218182 8205618 8052787 8179186 8221324 8070471
4638 8070471 7982370 7984481 8038476 8127775 8322056 8454619 8646023 8985040 9084102 9159535 9372585
4627I372585K22838n0337J24827K54614M27421K12556J00427K49103Q20Q9405
4617A1004259k19036j73430L6332l3724j31179k8745J55295M27228m7153M1261
4607A1031108J42940j63526j94036j55445j35957J30028M9757Q4033j56569l0848
4597A0601485o9897l34002l11955m07829j08520n1678Q2689Q9812o3317m6164
4587I380624k35108j42691o5234J02919K44933K37646M35164M07980N15520P44797
4577A1626550P07710Q29437J108801J360899J866463J650749J591046P05220j069693
4568B0377182j838430j264855n75629L374M70614J114086J388786J907091J944016
4559B3526235J978823R13473m57858j428740j172194l44290J55036N78461P92193
$$ plain form
4627 9372585 9595423 9545086 9669913 9924527 10351948 10564504 10664931 10914034 10914854 11004259
4617 11004259 10785223 10611793 10648125 10614401 10483222 10454477 10609772 11037000 10989847 11031108
4607 11031108 11174048 11010522 10816486 10661041 10525084 10655112 10704869 10788902 10632333 10601485
4597 10601485 10531588 10197586 9885631 9477802 9369282 9317604 9400293 9490105 9426788 9380624
4587 9380624 9145516 9002825 8937591 9040510 9285443 9523089 9958253 10366233 10881753 11626550
4577 11626550 12334260 13163697 14272498 15633397 17499860 19150609 20741655 21446875 20377182
4568 20377182 18538752 17273897 16698268 16701642 17172256 18286342 19675128 21582219 23526235
4559 23526235 25505058 26418531 25960673 24531933 23359739 23015449 23170485 23748946 24541139
4550B4541139J397574P55168k06616j413030k262054k025922j114475o43786l56946
4541A8671052M83516N73511J063843J280495J056698J89223r89102j539217j447966
4532A9342053j050890r24865r07208q67776m98850p93989q42727o12599n62302
4523A2280847r19355n43427o45208m21180n98547l33247j73512m32970j65177
4514H048224k5885j90320j82138l68019j43524j44717o2093j48296k19950L7588
4504F600870k25603P2809L63845J03473k07959k31674o9188O0399L7497J4447
4494F518916O1668j98450J93144J59141M6175J63346M3690J39962K29762K26792
4484G584146L20303N29943N85797M80590L87453O02789k8638m44361n61829l20082
$$ plain form
4550 24541139 25938713 26693881 26487265 25074235 22812181 20786259 19671784 19027998 18671052
4541 18671052 19154568 19728079 20791922 22072417 23129115 23318338 22329236 20790019 19342053
4532 19342053 18291163 17366298 16459090 15591314 15092464 14298475 13455748 12843149 12280847
4523 12280847 11361492 10818065 10172857 9751677 9153130 8819883 8646371 8213401 8048224
4514 8048224 8022339 7832019 7649881 7281862 7138338 6993621 6931528 6783232 6563282 6600870
4504 6600870 6375267 6448076 6811921 6915394 6707435 6475761 6406573 6466972 6504469 6518916
4494 6518916 6580584 6382134 6575278 6734419 6780594 6943940 6987630 7127592 7357354 7584146
4484 7584146 7904449 8434392 9020189 9500779 9888232 10491021 10462383 10018022 9456193 9136111
4474I136111n2818M9314L31589O51396P30238M04660l35609q96590o29011l79153
4464I010127l53021J38228R8261K30387K06171K51847N47619J476l63160k85074
4454I482861k55649l10248m0708J10205J42398K26934K25032L77146n85954q39438
4444H532579l13694j50802l66425k08185j89367K8709J96453J55219N70783L22509
4434H577779K07189R1614k00270j49887m99010m67112k13386O7267j26250j46230
4424G141704P7744J5341o5435J738L5353j37436k25199L3115k7312O10P5935j37227
4412F788931M5877P6904k67696j37732L603J30542J5883M5100L53487N2886N3520
4401G161305r7747j17375k7589j05189K19462M36754K86560K73490J1992J03147
$$ plain form
4474 9136111 9083293 9132607 9464196 10115592 10845830 11250490 10914881 10018291 9389280 9010127
4464 9010127 8657106 8795334 8893595 9123982 9330153 9582000 10129619 10131095 9767935 9482861
4454 9482861 9227212 8916964 8876256 8986461 9128859 9355793 9580825 9957971 9372017 8532579
4444 8532579 8218885 8068083 7701658 7493473 7304106 7332815 7529268 7684487 8255270 8577779
4434 8577779 8784968 8876582 8676312 8526425 8027415 7560303 7346917 7414184 7287934 7141704
4424 7141704 7219448 7234789 7169354 7171092 7206445 7069009 6843810 6876925 6849613 6850223 6926158 6788931
4412 6788931 6834808 6911712 6644016 6506284 6509887 6640429 6656312 6701412 7054899 7107785 7161305
4401 7161305 7063558 6946183 6918594 6813405 7032867 7469621 7756181 8029671 8041663 8144810
4391H144810L24349L38634M85041K02489K99736P95302P61341K07620J06306M11562
4381A2077190j39832k68002m9218N9929n9515K30693J10148J34490J20870k6709
4371A2190044j1809j8741j25778j55146K26457J6455Q1950K55638J42280K97468
4361A2898818l40923l22843m29093l97231k32143n06501n78022o29550m53093
4352I009419n28428l03150q9770k06714m34438k39263j07654j84379N283l0761
4342F890145m1220o7978j70835J03537P1923k16038j37624p6604k02692J71384
4332F323998k4719J18212K18529J13812K00921J00006q1180R4693J43987K9381
4322G237640M06916L52251J46038L42380L83727M30084L71361J32329L10570r146
$$ plain form
4391 8144810 8469159 8807793 9292834 9495323 9795059 10590361 11351702 11559322 11665628 12077190
4381 12077190 11937358 11669356 11620138 11680067 11620552 11851245 11961393 12095883 12216753 12190044
4371 12190044 12178235 12159494 12033716 11878570 12105027 12121482 12203432 12459070 12601350 12898818
4361 12898818 12557895 12235052 11805959 11408728 11176585 10670084 10092062 9462512 9009419
4352 9009419 8480991 8177841 8088071 7881357 7446919 7207656 7100002 6915623 6920906 6890145
4342 6890145 6848925 6780947 6610112 6713649 6785572 6569534 6431910 6355306 6152614 6323998
4332 6323998 6299279 6417491 6636020 6749832 6950753 7050759 6969579 7064272 7208259 7237640
4322 7237640 7644556 7996807 8142845 8485225 8868952 9299036 9670397 9802726 10113296 10104150
4312A0104150j50493L5863P8059J30552M5068J14873j8580k2153r3350j00420
4302A0123569K37615j62880J6677K66492J61091M0631l0225J61661k9455p0348
4292A0714828j00883n6334K23093j15134k71565j51030j53431j06670k22187L9952
4282I800639Q1866J7703K18126K92142J90383L93706J29801J99285K06868J9399
4272A1549918K09322o6443P7514J02767l05004j14326k2933J00388J91171Q809
4262A1731183o408K06706K66860K74063M67563M56328M48267M72017O43032M12944
4252A5372555k93068k57993r7125j91057j77877J09742L40983J93303O05805O39680
4242A6244948P96127Q47897P56443M51445K78114J98173K81908L11540K92405
$$ plain form
4312 10104150 9953657 9989520 10067579 10198131 10243199 10358072 10339492 10317339 10223989 10123569
4302 10123569 10361184 10198304 10214981 10481473 10642564 10683195 10652970 10814631 10785176 10714828
4292 10714828 10613945 10557611 10780704 10665570 10394005 10242975 10089544 9982874 9760687 9800639
4282 9800639 9882505 9900208 10118334 10410476 10600859 10994565 11124366 11323651 11530519 11549918
4272 11549918 11759240 11692797 11770311 11873078 11568074 11453748 11430815 11531203 11722374 11731183
4262 11731183 11724775 11931481 12198341 12472404 12939967 13396295 13844562 14316579 14959611 15372555
4252 15372555 15079487 14821494 14724369 14533312 14355435 14465177 14806160 14999463 15605268 16244948
4242 16244948 17041075 17888972 18645415 19096860 19374974 19573147 19855055 20166595 20459000
4233B0459000J55863j79747p3244q3081n13063l36344k37160k60736L76352L14999
4223A9622839Q8758O61706P25160Q86090J129257J232752J499592J572476J011677
4214B8430307P13886L35476j12021o17215p86404p97620p32279k46935j20590
4205B6066605K45638L76186M25104M57796P45173O25355N26167M06367L63220
4196C0237611L34606M90519N07389O18496O16956M12356N2177o2061L0192M58219
4186C3696460K01069K39208O43062Q63605R89179J208786J409268J612503J572801
4177D2435941J994121K191333K340696K163915J245472N02975K95372N69747P01500
4168E4441072J227646J143983J570712J538660J971904K740640L013480L270923
$$ plain form
4233 20459000 20614863 20435116 20361872 20278791 19765728 19429384 19192224 18931488 19307840 19622839
4223 19622839 19711597 20373303 21098463 21984553 23113810 24346562 25846154 27418630 28430307
4214 28430307 29144193 29479669 29367648 28750433 27964029 27166409 26434130 26187195 26066605
4205 26066605 26312243 26688429 27113533 27571329 28316502 28941857 29468024 29874391 30237611
4196 30237611 30572217 31062736 31570125 32188621 32805577 33217933 33270110 33208049 33238241 33696460
4186 33696460 33897529 34136737 34779799 35643404 36632583 37841369 39250637 40863140 42435941
4177 42435941 44430062 46621395 48962091 51126006 52371478 52874453 53169825 53739572 54441072
4168 54441072 55668718 56812701 58383413 59922073 61893977 64634617 67648097 70919020
4160G0919020L953412M700058N988780P756127R882193J2616787J6285369K0607937
4152A52709683K5532558L1027642L7961767M1977632L7104204K7610312J8479808
4145C72403606P439119r303329l0217362m4338296m1298921k8449679j5866114
4138B10369024o703272j062566M43077m137634j2955848k0927027k3249173k0081233
4130A21695348j5142992j1172727q266079o427913n883316m893794l895678l351205
4122F2661644k790064k097008j850661j365513j105535q47996j61975m83418n08966
4113E1450508k2107M56704R28454N19624l86837o83426j295490j938040k049861
4104D6979529k104205j976148k133604j869518j289796k88284j07333K19321P93656
$$ plain form
4160 70919020 74872432 79572490 85561270 93317397 103199590 115816377 132101746 152709683
4152 152709683 178242241 209269883 247231650 289209282 326313486 353923798 372403606
4145 372403606 379842725 370539396 340322034 295983738 254684817 226235138 210369024
4138 210369024 203665752 202603186 203046263 198908629 185952781 165025754 141776581 121695348
4130 121695348 106552356 95379629 87113550 80685637 74802321 69908527 66012849 62661644
4122 62661644 59871580 57774572 55923911 54558398 53452863 52604867 52442892 51959474 51450508
4113 51450508 51428401 51885105 52813559 53333183 52946346 52262920 50967430 49029390 46979529
4104 46979529 44875324 42899176 40765572 38896054 37606258 37317974 37210641 37429962 38223618
4095C8223618M52985N86310Q90141J693995J858471J457567P85384l73302r26506
4086D4648663j212249j218006j086821j200787j351283p08923p85299p75129p68116
4077C5542050l39001l28718j76643L56645P37676Q49652Q67818Q15440N82920
4068C8907839M22373Q82883J148355R10261J777172K522387L423367M757387N921763
4059F0673787O875389P889388Q503002R203304J1119836J3729394J3867197O628665
4051A38489962o261669j5965597j9005713j6235865j2682537r084379o978625
4044E2275577n475300m615651l801571l264755k178207j583241j524348j584109
4036B8248395j216868j084275j288747j100677r14897p05107n05008l35249l93699
$$ plain form
4095 38223618 38676603 39262913 40153054 41847049 43705520 45163087 45948471 45575169 44648663
4086 44648663 43436414 42218408 41131587 39930800 38579517 37870594 37085295 36310166 35542050
4077 35542050 35203049 34874331 34697688 35054333 35792009 36641661 37509479 38324919 38907839
4068 38907839 39330212 40213095 41361450 42271711 44048883 46571270 49994637 54752024 60673787
4059 60673787 67549176 75438564 83941566 93144870 104264706 117994100 131861297 138489962
4051 138489962 132228293 116262696 97256983 81021118 68338581 59254202 52275577
4044 52275577 46800277 42184626 38383055 35118300 32940093 31356852 29832504 28248395
4036 28248395 27031527 25947252 24658505 23557828 22642931 21937824 21432816 21097567 20703868
4027B0703868n47942n00583o75084p35313p87454p10598n18967n68383o96046
4018A4963498n76059m51259k11713j71649j74965j12829k24861n16435r42318
4009A1581410n66749n95066l14349l42984l79842k6084k37128l37519o3063k28601
3999H490025j05369j63682k3167K1990j79102j91064k7447j38787j88526m64476
3989G030395J81386j67530o4674O0490l65767J62208K29330P1505P8877n8042
3979G158178L35027K63488K80406J90921L98001L29131L31555L06317N37304N73422
3969A0703750R33506L42932k73891o58874j009490r60294p74700k04220l57051
3960G741668j39658k86294p8765k7455J04738q237l09897o8641l03526l34313
$$ plain form
4027 20703868 20155926 19655343 18980259 18244946 17457492 16746894 16227927 15659544 14963498
4018 14963498 14387439 13936180 13724467 13552818 13377853 13265024 13040163 12523728 11581410
4009 11581410 11014661 10419595 10105246 9762262 9382420 9356336 9119208 8781689 8718626 8490025
3999 8490025 8384656 8220974 8197807 8219797 8040695 7849631 7822184 7683397 7494871 7030395
3989 7030395 7211781 7044251 6979577 7040067 6674300 6836508 7065838 7137343 7216220 7158178
3979 7158178 7493205 7756693 8037099 8228020 8626021 8955152 9286707 9593024 10130328 10703750
3969 10703750 11637256 11980188 11706297 11047423 10037933 9077639 8302939 8098719 7741668
3960 7741668 7602010 7315716 7236951 7209496 7314234 7305997 6996100 6927459 6623933 6289620
3950F289620j47832k22187j72423J4207R2743m9555q7625m50739r9332l054q8844
3939E074979N9836r1925M0517q7296K58238K11115n5421J13828j3819k8781r8528
3928E382743J13230L1697K06582N3906M8202K05763J20583J52516J54993j29107
3918F341108k89534q3421R0224j12441M1927l4757n1244K39604K26909r6597K33406
3907F505184L58516l63634Q9814J72061K00530J14308J46261K24730l5783K70342
3897G682329O6143J4455K39028L38138N66525N28798M44074K08492K18796L77193
3887A0683971L71476K17344L1197J55628J33286K19537Q2883L92821N3509K12463
3877A2554115M61828M89868M83252L80025O07685O55624P49632P36208J031647
$$ plain form
3950 6289620 6141788 5919601 5747178 5761385 5854128 5804573 5716948 5266209 5166877 5163823 5074979
3939 5074979 5134815 5042890 5083407 4996111 5254349 5465464 5410043 5523871 5510052 5481271 5382743
3928 5382743 5495973 5527670 5734252 5788158 5836360 6042123 6162706 6315222 6470215 6341108
3918 6341108 6051574 5968153 6058377 5945936 5987863 5953106 5901862 6141466 6368375 6271778 6505184
3907 6505184 6863700 6500066 6589880 6761941 6962471 7076779 7223040 7447770 7411987 7682329
3897 7682329 7748472 7762927 8001955 8340093 8906618 9435416 9879490 10087982 10306778 10683971
3887 10683971 11055447 11272791 11303988 11459616 11592902 11812439 11895322 12288143 12341652 12554115
3877 12554115 13015943 13505811 13989063 14369088 14976773 15632397 16382029 17118237 18149884
3868A8149884J160187J105748J091494J206708J315947J429410J407279J304761
3860B8171418J829717J943125J748531K350966K815835L888339M713694O248757
3852E3710382Q323429R799400J2043515J3579141J4030788J4844479J9355114
3845A45686248K7474311L1622172J7501642j1220492l1882009l7968560l2300198
3838A08913114k2093175j4393560r583034o424546m675243l294142j971577o91013
3830D5786824m7230M85855q06978k823562l848815m173990l591208k894977k139924
3821B5945995j763499r00421n96218l29246j58817N057J16415K17915K62660O44045
3811B3443886R08394J394233J937480J310878k58321k207937l156240l000710
$$ plain form
3868 18149884 19310071 20415819 21507313 22714021 24029968 25459378 26866657 28171418
3860 28171418 30001135 31944260 33692791 36043757 38859592 42747931 47461625 53710382
3852 53710382 62033811 71833211 83876726 97455867 111486655 126331134 145686248
3845 145686248 173160559 204782731 222284373 211063881 179181872 141213312 108913114
3838 108913114 86819939 72426379 62843345 56418799 51743556 48449414 46477837 45786824
3830 45786824 45739594 46225449 45418471 42594909 38746094 34572104 30980896 28085919 25945995
3821 25945995 24182496 23282075 22685857 22356611 22197794 22202851 22319266 22537181 22799841 23443886
3811 23443886 24352280 25746513 27683993 28994871 28736550 26528613 23372373 20371663
3803B0371663k166567j637398j467497q04845n82757P6974p0R4578M15518N27241
3793A4826840P14204P98044J097812J383002J734366K080144J203613p61957k098606
3784B0977462k767735k440790j755242j284880q37463n45445l58855Q65J10863
3775A1098780J63420K81353M99538L56277P46220Q43681J313142J293075J266669
3766A7862155M62377q42664j677666k161785j974818j627916j012972r54437o27720
3757G444554n80275l77690m23048l51113k73712k54647k82637k53144m29088m6466
3747D172734n7284j04102p8478j16786k22420r4783j4755r8405O004r9869j16703
3736C175153P136l54213k03675Q1806j83197j53722j13171J66070P7896p1617
$$ plain form
3803 20371663 18205096 16567698 15100201 14295356 13712599 13789573 13789503 13884081 14299599 14826840
3793 14826840 15541044 16339088 17436900 18819902 20554268 22634412 23838025 23076068 20977462
3784 20977462 18209727 15768937 14013695 12728815 11891352 11345907 10987052 10987917 11098780
3775 11098780 11262200 11543553 12043091 12399368 13145588 13989269 15302411 16595486 17862155
3766 17862155 18324532 17481868 15804202 13642417 11667599 10039683 9026711 8072274 7444554
3757 7444554 6864279 6486589 6063541 5712428 5438716 5184069 4901432 4648288 4219200 4172734
3747 4172734 4115450 4011348 3932870 3816084 3593664 3498881 3484126 3385721 3391725 3291856 3175153
3736 3175153 3182289 2828076 2624401 2706207 2523010 2369288 2256117 2422187 2500083 2428466
3726B428466p7149j57622k08553j45456o2614R9103N6308n489l06817R6263M066
3715A720506P5686j85762j41752N8406q0775M0276J80958K6588j26467j78579
3705A389085L960K01696j5942k19062P4155m1770j04825M2743J09851N0052j75578
3694A314365L5974j67182n9143J42854R1416q1478r6125j75100n0453k5192k4778
3683I05158J10821M3891K1520m6373k4296j08519R8159M1690k76036k03445Q2183
3672F44753K42413j6734J8954J13873k01884J08659J53463j7737m295n1416Q2783
3661A072832j10002q4253J06696j43945L9425p2758K3977J09455j04537M6627
3651H83517j64911l5047J00783J16375L6067o9007J99258k8246L7884k5380k46492
$$ plain form
3726 2428466 2351317 2193695 1985142 1839686 1777072 1876175 1932483 1926994 1620177 1716440 1720506
3715 1720506 1796192 1610430 1468678 1527084 1446309 1486585 1667543 1694131 1567664 1389085
3705 1389085 1393045 1594741 1578799 1359737 1433892 1392122 1287297 1330040 1439891 1489943 1314365
3694 1314365 1350339 1183157 1124014 1266868 1358284 1276806 1180681 1005581 955128 929936 905158
3683 905158 1015979 1059870 1081390 1035017 1010721 902202 1000361 1042051 766015 562570 644753
3672 644753 887166 870432 889386 1003259 801375 910034 1063497 1045760 1041465 990049 1072832
3661 1072832 962830 878577 985273 841328 880753 807995 831972 941427 836890 883517
3651 883517 718606 683559 784342 900717 936784 867777 1067035 1038789 1076673 1051293 804801
3640H04801K34718J51890m4301Q9067r5307j31188j16799K7540k4072k08584J7619
3629G05384l4742J0278K2605J46584K06170m3704J20631J82813j11058l9915P0203
3618A235249Q1819o1390M2773k56720j79456R1976L814j43233J48596J8456j16297
3607H65587J64019K021q1053O7766J10691j10726m4748M2903p5313q6185j20555
3596G34407O6158K9536P402k7398m349R8129n9752o3216p3658M5477n5990J3195
3584G09941j32683n2384J78047j22691L7093j7194q3544q5819R5639K26192l47080
3573D05517j7151R3764R7231K66332j64535p3052l2522O9739j8108k1832r7198
3562E08185J55665j75540J59397J32992j00940L1j0746K24844K37123J07592J26459
$$ plain form
3640 804801 1039519 1191409 1147108 1236175 1140868 1009680 892881 920421 896349 687765 705384
3629 705384 670642 680920 703525 850109 1056279 1012575 1133206 1316019 1204961 1165046 1235249
3618 1235249 1317068 1255678 1298451 1041731 862275 954251 958065 814832 963428 981884 865587
3607 865587 1029606 1031627 950574 1018340 1129031 1018305 973557 1016460 941147 854962 734407
3596 734407 800565 830101 837503 810105 805756 903885 844133 780917 707259 752736 696746 709941
3584 709941 577258 524874 702921 580230 617323 600129 516585 430766 526405 752597 405517
3573 405517 388366 482130 579361 845693 681158 608106 575584 645323 627215 605383 508185
3562 508185 663850 488310 647707 780699 679759 679790 669044 893888 1131011 1238603 1365062
3551A365062J16323O2114K41933j1887l13546j34607q0146j43534j27093q5931
3541H88688l0530N7690j1512k9242o8347p7200J79O8391J0280k55277R6811K31357
3529H81288j1235j9266Q247r0506o1489J90421j57012j12549M8192j40799n44
3518E34748q0298J65872o2647j4228j80632N5220J65197n4002l9987L05655K6834
3507H21732M8733j53027j35095J37159k5471J5509o5963M4472J87555N7747l1713
3496I01638k90708R465r321j92789O7034Q5908L0222L03944L7318k89568o7438
3485E85705l3622k286j05862j7661n4283J72126K45404J9617k94195L0193n3609
3474D91527k1557j0000k2952j899j0049J87763j23481k9201J01285r3101J36679
$$ plain form
3551 1365062 1481385 1543499 1785432 1773545 1459999 1325392 1245246 1101712 974619 888688
3541 888688 858158 915848 904336 875094 806747 729547 729726 798117 808397 553120 649931 881288
3529 881288 870053 850787 859034 768528 707039 897460 740448 627899 676091 535292 534748
3518 534748 454450 620322 557675 543447 362815 418035 583232 529230 489243 794898 821732
3507 821732 870465 717438 582343 719502 694031 709540 643577 688049 875604 933351 901638
3496 901638 610930 620395 611074 418285 485319 571227 601449 905393 942711 653143 585705
3485 585705 552083 549797 443935 426274 371991 544117 789521 809138 514943 545136 491527
3474 491527 469970 459970 437018 435119 425070 612833 489352 460151 561436 468335 605014
3463F05014J04561k5506J04413j35625P7772m837J17815j97294r2723O8483k940
3452F19133O9607K06978q9631j17683K3796J50236L3961O7493k1955k4245r4712
3441H22978j08646k5286N2617r3431Q5067J75602r1025L011j38864Q6311J8867
3430G87201j11201K32758M8834j08426K84626p6564k91852J9163J17616J66648
3420A068803K4044L6002J22234j20624m6152L1751R3743J11157j09003o0300L09219
3409A460874J1329p1206P3237Q8682K6157N6485j0343K39630K6804J27541J50127
3398B179317L57051M65445P42152P82946R39292Q39193L37512p72555j446259
3389D424094r39245m48155m10908j21693l02676j40354m7633n0861m0414j01383
$$ plain form
3463 605014 709575 684069 788482 652857 730629 725792 843607 646313 553590 622073 619133
3452 619133 688740 895718 806087 688404 712200 862436 896397 963890 941935 917690 822978
3441 822978 714332 689046 741663 648232 733299 908901 817876 820887 682023 768334 787201
3430 787201 676000 908758 957592 849166 1133792 1057228 765376 784539 902155 1068803
3420 1068803 1092847 1128849 1251083 1130459 1084307 1116058 1209801 1320958 1211955 1151655 1460874
3409 1460874 1472203 1400997 1474234 1562916 1589073 1645558 1635215 1874845 1901649 2029190 2179317
3398 2179317 2536368 3001813 3743965 4526911 5466203 6305396 6642908 5870353 4424094
3389 4424094 3484849 3036694 2625786 2504093 2201417 2061063 2013430 1962569 1922155 1820772
3379A820772q827m9166r4629k0446k19793k7554j8665P4387K51583J40849j90312
3368A658199k07490j20933j82483N401J37945K25057J56522l1628P93J72610j22490
3357A691503p1165l6552K4180p607J51613J49329J63509j95145J22476L4727k58855
3346A768013P5287O0954k901K22542m8539n4276P7853J16103L8102o0676J25937
3335B318399J33881K21194K1520j08391Q5673K22374J4983J56406J16186Q4819
3325C267044J08655r9203J88540J04137J10816L7654l38876J44479K3590p9041
3315C467795Q7022J23625L05986k00996R7077J46601J13220J73561L21703O5921
3305D701515J79568L60551M6078J42244O4256K79019J75702M4450J03303k4260
$$ plain form
3379 1820772 1811945 1762779 1668150 1647704 1427911 1400357 1381692 1456079 1707662 1848511 1658199
3368 1658199 1450709 1329776 1147293 1152694 1290639 1515696 1672218 1640590 1641383 1813993 1691503
3357 1691503 1620338 1583786 1607966 1600359 1751972 1901301 2064810 1869665 1992141 2026868 1768013
3346 1768013 1843300 1904254 1901353 2123895 2075356 2021080 2098933 2215036 2253138 2192462 2318399
3335 2318399 2452280 2673474 2694994 2586603 2672276 2894650 2909633 3066039 3182225 3267044
3325 3267044 3375699 3276496 3465036 3569173 3679989 3717643 3378767 3523246 3546836 3467795
3315 3467795 3554817 3678442 3984428 3783432 3880509 4027110 4140330 4313891 4635594 4701515
3305 4701515 4881083 5241634 5287712 5429956 5494212 5773231 5948933 5993383 6096686 6072426
3295F072426J50069L36890L11085L9447J71821J51476k8722j70492K26881K83786
3285G544667L8819n660K32499K2272J94914K94630K98166O2451O0766N06425N19589
3274I769538M12826K60190L05440L18153M41836K35396L64297K68998K59621M15257
3264A3051552L87125N89152Q94446Q01818J135788R44172J169197J620638J180871
3255B1774759J289437J319681J160165R84379N49780K59789j56567q99118r76787
3246B5305518r76601j124756j173301j248862q68798q46979q67754o52494o74738
3237A6871235q09991p19607p25882p68429o29766m50302n48854o11019n49047
3228A1058338p30710l69039l95648n19136l37532k45211l59831m20882m87072
$$ plain form
3295 6072426 6222495 6559385 6870470 6909917 7081738 7233214 7204492 7034000 7260881 7544667
3285 7544667 7583486 7577826 7810325 7832597 8027511 8322141 8620307 8682758 8743524 9249949 9769538
3274 9769538 10182364 10442554 10747994 11066147 11507983 11743379 12107676 12376674 12636295 13051552
3264 13051552 13438677 14027829 14922275 15724093 16859881 17804053 18973250 20593888 21774759
3255 21774759 23064196 24383877 25544042 26528421 27078201 27337990 27181423 26282305 25305518
3246 25305518 24328917 23204161 22030860 20781998 19913200 19066221 18198467 17545973 16871235
3237 16871235 16061244 15341637 14615755 13847326 13217560 12767258 12218404 11607385 11058338
3228 11058338 10327628 9958589 9562941 9043805 8706273 8461062 8101231 7680349 7193277
3219G193277k29325k93967l0004j65336n8773Q6832k28756j97189l42705j05204
3209E628850j15056k34016O9276k71539m07635m16340k73735R5615j43497p5674
3199C856249k0897j73723j77104j51543M8589j89255J07584j0533k51137M6114
3189C084344o5651K29245K23696J91018l175K56643K97735K07349l07782n9868
3179D053554l31897j24974J77610o9041n10523m03876j35190k14723l08689j38819
3169A993432J11822J04874j92097j23571j1068J809j44475k80534J06931n2316
3159A514807K14511J00809O580J2317N3902L0882P8023L14295J46612n9993k15363
3148B197382o8181k63662o1179Q9836k50190j71840j1065R073l913j83624j36979
$$ plain form
3219 7193277 6963952 6669985 6639981 6474645 6415872 6502704 6273948 6076759 5734054 5628850
3209 5628850 5513794 5279778 5349054 5077515 4669880 4253540 3979805 4075420 3931923 3856249
3199 3856249 3835352 3661629 3484525 3332982 3381571 3192316 3299900 3289367 3038230 3084344
3189 3084344 3018693 3247938 3471634 3662652 3659477 3916120 4213855 4421204 4113422 4053554
3179 4053554 3721657 3596683 3774293 3705252 3194729 2790853 2655663 2440940 2132251 1993432
3169 1993432 2105254 2210128 2018031 1894460 1883392 1885201 1740726 1460192 1567123 1514807
3159 1514807 1729318 1830127 1836707 1849024 1902926 1933808 2011831 2326126 2472738 2412745 2197382
3148 2197382 2129201 1865539 1804360 1894196 1644006 1472166 1461101 1470174 1466261 1282637 1145658
3137A145658l5107j64105p0285q6531J78885M0236l38222j0322L0379J50j2636
3126F78100p6280J57619l1468p7756O2620Q5022J09769M2314q9678j37737M2698
3115G65223J61367j44941j52325J28033P3259Q5518k68939O4538j99146j34167
3105C78420N9024J20579r1845k6991M9798O3100R1838j34742Q1792j37208o7508
3094C86257J19493O1001k21135K30768j80759j66231K34228J06050n7734k13989
3084B97949j1642J60824k4217L13249l8162k24632N4478j5068R7912k6015j30153
3073D54523L0768R2236o2050n8717m6748K6485j56744K28232J72810j62794p9746
3062D38255Q7627r0402k5061K45667k87748N5014L7747J21266J60110N7329j87928
$$ plain form
3137 1145658 1110551 946446 876161 789630 968515 1008751 670529 660207 690586 690736 678100
3126 678100 601820 759439 727971 650215 712835 797857 907626 949940 860262 722525 765223
3115 765223 926590 781649 629324 757357 830616 916134 647195 711733 512587 378420
3105 378420 437444 558023 466178 439187 488985 552085 643923 509181 590973 453765 386257
3094 386257 505750 566751 345616 576384 395625 229394 463622 569672 511938 297949
3084 297949 286307 447131 422914 736163 698001 473369 527847 512779 610691 584676 454523
3073 454523 485291 577527 515477 456760 410012 436497 279753 507985 680795 518001 438255
3062 438255 525882 435480 410419 656086 368338 423352 461099 582365 742475 799804 611876
3051F11876p291J39040j62806q6571J18900o5852j88641J11935J58028m2126J40677
3040G27169n3570K78601j94355j82341r4605j784L6357J94929j09276k41658K11653
3029E71120R7836q7481q1641j98219K7253K79095q7690J37148j44540j98339K28289
3018E42831K49350N3778J08754j00269k58051J8903K24438r4026J9539J7418J92455
3007I75120L8807p8767j03852q1090j51617O5219J87433M9767J83268j5625n6051
2996A012612J21720p5619q343n5592r9640K15566K18864K6578o7976r6185N1941
2985A243926M8133l0149K6873l5430J51674Q4267l7480O8894q8753K23605J5496
2974A671056l3750k69098j33667K97971R7059J37211J3004J07194J20490o3005
$$ plain form
3051 611876 604585 743625 580819 494248 613148 547296 358655 470590 628618 586492 727169
3040 727169 673599 952200 757845 575504 480899 479115 515472 710401 601125 359467 571120
3029 571120 668956 581475 499834 301615 328868 607963 520273 657421 512881 314542 542831
3018 542831 792181 845959 954713 854444 596393 615296 839734 745708 765247 782665 975120
3007 975120 1013927 935160 831308 750218 598601 663820 851253 901020 1084288 1068663 1012612
2996 1012612 1134332 1058713 1050370 994778 895138 1110704 1329568 1356146 1288170 1191985 1243926
2985 1243926 1292059 1261910 1288783 1253353 1405027 1489294 1451814 1520708 1431955 1655560 1671056
2974 1671056 1637306 1368208 1234541 1532512 1629571 1766782 1779786 1886980 2007470 1944465
2964A944465J00613K60782l8996n0543J92171j18900K00973j35177r421K59377
2954B605344j06927R1831J64436J45334J50050P8073j5978M66665M01254M2518
2944D022600J83383N1828J80441L63006K36822L39538L34417L29728N03653M69404
2934G014820N06629L53538O94907M70316J89517K07984j20611k29626M5493n3640
2924I079327j7868P6332Q71M2245M3826L00361L1788k07104o0197m1645L41976
2913I589912Q5680Q0948L67386L05352L55505N04842Q57144R97184J401155K107740
2903A6652848K078513K069580Q39053j119112k182587k619661k122116j317450
2895A2279068j189352j021719o91104n66796l38276m02126k86476k48659j52473
$$ plain form
2964 1944465 2045078 2305860 2266864 2216321 2408492 2289592 2490565 2355388 2345967 2605344
2954 2605344 2498417 2590248 2754684 2900018 3050068 3128141 3112163 3578828 3980082 4022600
2944 4022600 4205983 4257811 4438252 4801258 5038080 5377618 5712035 6041763 6545416 7014820
2934 7014820 7521449 7874987 8569894 9040210 9229727 9437711 9317100 9087474 9132967 9079327
2924 9079327 9061459 9137791 9138662 9180907 9224733 9525094 9556882 9349778 9289581 9247936 9589912
2913 9589912 9675592 9756540 10123926 10429278 10784783 11289625 12146769 13143953 14545108 16652848
2903 16652848 18731361 20800941 21639994 20520882 18338295 15718634 13596518 12279068
2895 12279068 11089716 10067997 9376893 8810097 8471821 8069695 7783219 7534560 7382087
2886G382087m08587k83707j98147J38398J26520j7251J7513K7868K57467J61919
2876G204080J45329L68028K95292L23512J62319J15794j91851l55078m63264o31452
2866F972709p27227n18633m11152n17456n77297m51803k45125j70774k57499j35977
2856B959766R977K7654k73883J9380j52606j86268j56068N4199k73405k50165
2846A778581J45447k0911p6765o4188k73595k91587R4673Q3652k82679K8648K21461
2835A342737k35495P623O243m38943N0381J86067m5429n0848j28501m3474J7180
2824F67541L9826k17944k7284M3664J74659k14410o1779J01837o1223Q1234L0250
2813E56371j53226O9478J23177j99195p2675K44741j069n2205o250L53r9328n2465
$$ plain form
2886 7382087 6973500 6689793 6491646 6630044 6756564 6739313 6756826 6784694 7042161 7204080
2876 7204080 7349409 7717437 8012729 8336241 8498560 8614354 8422503 8067425 7604161 6972709
2866 6972709 6245482 5726849 5315697 4798241 4220944 3769141 3524016 3353242 3095743 2959766
2856 2959766 2969743 2997397 2723514 2742894 2590288 2404020 2247952 2302151 2028746 1778581
2846 1778581 1924028 1903117 1826352 1762164 1488569 1196982 1291655 1375307 1092628 1121276 1342737
2835 1342737 1107242 1114865 1121108 682165 732546 918613 873184 822336 693835 650361 667541
2824 667541 707367 489423 462139 505803 680462 466052 404273 506110 444887 526121 556371
2813 556371 403145 472623 595800 396605 323930 568671 567602 515397 509147 509500 410172 357707
2801C57707m8811m0239k9733p7978M1908o70J73957n8475N5502J27445j19441
2790C81172Q062o2696J25966k26218p7804j07259M0436Q3164L5832j55144N7145
2779A02656J17235j0591J21017j31776J6142l4235k4676k247j32708P428J33629
2768A61874R5965l95562J40932K20079r0242K0285r3022N998j41271J6824O4208
2757F068P5790q500j53900J08012J78479L5169j11482j56062K6895N8630J79016
2746B38115j4945n7906J5228O1191j72432q451k4442m2292j7105L1757K14790
2735B23508j89579J15833R4743J00488m8785j85681j24777K3951J06331K5313
2725A41345l564L8638R050j09711J14210L5351j54415k37556J04134J92845J27580
$$ plain form
2801 357707 308896 268657 238924 160946 202854 202184 376141 317666 373168 500613 381172
2790 381172 389234 326538 452504 226286 148482 41223 81659 164823 200655 45511 102656
2779 102656 219891 209300 330317 198541 214683 180448 155772 153525 20817 28245 161874
2768 161874 257839 -137723 3209 223288 133046 153331 60309 66307 -74964 -58140 6068
2757 6068 81858 73358 -80542 27470 205949 241118 129636 -26426 469 59099 238115
2746 238115 223170 165264 180492 241683 69251 60800 36358 -5934 -23039 8718 223508
2735 223508 33929 149762 244505 344993 296208 110527 -14250 9701 116032 141345
2725 141345 137781 176419 185469 75758 189968 225319 70904 -166652 -62518 130327 257907
2714B57907j25488j52407j66659K79552L1396K6970o683j40168O7691P2421J8053
2703A62585j98893m0328K22633q4944m1396r2723m0078M6218j16839K7631J60626
2692D492P8717l2734M7391l9643j30867N3218J42416J78720j79734k51267R1427
2681c7864m0213j498K4701r6837n7048K36036r8156q692r2943l4277K81070J66187
2669B40466n0940j72381j47258L510J18941m298L6673q1495j63513J13151P6628
2658c0516M7905J53239j16482j78693J0977j83398M32571K4983k6805J68598j60181
2647A42198j87691p5246M7867N7327J03053j6145k13701K0704J60703o5287j49966
2636a76184k7893J75121J65860K31297l8057J3501j34555j44560p948j42778K48302
$$ plain form
2714 257907 132419 -19988 -186647 92905 124301 151271 144588 4420 72111 144532 162585
2703 162585 -36308 -76636 145997 61053 19657 -73066 -113144 -66926 -183765 -156134 4492
2692 4492 83209 50475 97866 58223 -72644 -19426 122990 301710 121976 -129291 -37864
2681 -37864 -78077 -79575 -54874 -151711 -208759 27277 -70879 -79571 -172514 -206791 74279 240466
2669 240466 189526 17145 -130113 -126603 -7662 -11960 24713 -56782 -220295 -107144 -30516
2658 -30516 17389 170628 54146 -124547 -113570 -296968 135603 160586 133781 302379 142198
2647 142198 -45493 -120739 -72872 -15545 87508 71363 -142338 -121634 39069 -26218 -176184
2636 -176184 -204077 -28956 136904 368201 330144 343645 209090 64530 56582 -86196 162106
2625A62106M9881P6230j81257j16562M4268P1633J62292m5893n0116J09485J24487
2614D06554l10652J64922n7242j73539j26316J91582L7472l6489J01598j12786
2604H5104o8374J49747O212k24395L3009M1411k52784J3497J10107J40884M7062
2593H1480k37781J65206J44915q2109L1906j28313R8965J18087j09707q5159K93226
2582B90716P5191k15583j63719l6657P1908j5936n9600k5383J67498O8372p2727
2571H4080j34957j5393j71407r4845K5905N6387J03585O5999J54121j33146O1779
2560B108J24602j10510J51586N8062K5378j41096m8621K9771N1414n5759j3630
2549G3305J32002p8302r5141k5356k6412l4531j30544J86692N3673k02427Q6388
$$ plain form
2625 162106 211987 288217 106960 -9602 34666 106299 268591 222698 172582 282067 406554
2614 406554 95902 260824 203582 30043 -96273 95309 132781 96292 197890 85104
2604 85104 16730 166477 172689 -51706 -18697 22714 -230070 -216573 -106466 34418 81480
2593 81480 -156301 8905 153820 71711 103617 -24696 74269 192356 82649 -2510 290716
2582 290716 365907 150324 -13395 -50052 21856 5920 -53680 -79063 88435 156807 84080
2571 84080 -50877 -66270 -237677 -332522 -306617 -250230 -146645 -80646 73475 -59671 2108
2560 2108 126710 16200 167786 225848 251226 110130 61509 91280 142694 86935 73305
2549 73305 205307 127005 31864 6508 -19904 -54435 -184979 1713 55386 -147041 -60653
2538f0653j17007L9556N19M5649j76027O0578K10139j12443j55720K00854K9340
2527c5215L0036m9341r0201J50978o3799K8046L9726J23196r3702o7183p9895
2516a07354P5867J92733J2683K9066k26659j50763J1353p1363M13521p3454j40267
2505c4637J7592K6485j30491L2962K28838q8867k20890L6041L1767j1954M4901
2494f8253n0947J71471M9503j09913K5490r3278k8498N1844O2263j09609K18241
2483A18314j28459j26775o2388P3226J6965j63810K16546M2877J65278k26848
2473g5074r6856L4475l9459J0018J5538M9458J79230k072j03440k9259j15235
2462a72676Q8830o9600L7421J30990L0575K7131J14602p650k37261n5345N0692
$$ plain form
2538 -60653 -177660 -138104 -137585 -91936 -267963 -207385 2754 -109689 -265409 -64555 -35215
2527 -35215 -5179 -54520 -144721 6257 -57542 -29496 10230 133426 39724 -27459 -107354
2516 -107354 -31487 161246 173929 202995 -23664 -174427 -163074 -234437 179084 105630 -34637
2505 -34637 -17045 9440 -121051 -88089 140749 51882 -169008 -132967 -101200 -113154 -68253
2494 -68253 -119200 52271 101774 -8139 17351 -75927 -104425 -52581 9682 -99927 118314
2483 118314 -10145 -136920 -199308 -126082 -109117 -272927 -56381 -13504 151774 -75074
2473 -75074 -171930 -137455 -176914 -166896 -151358 -101900 77330 75258 -28182 -57441 -172676
2462 -172676 -83846 -153446 -116025 14965 45540 72671 187273 179623 -57638 -112983 -62291
2451f2291j09430K2970J49462j5460j9836M3502r6190k60611K15546J32327j1525
2440a1536j50434Q6312M3451o1622J18583k3562J8890o8142l4178J86540k48587
2429a44285L5358L83420n3826o6607P8738j18936m9723j14227j7871M7716n1156
2418g1399p1311O4902j0383m4816J12650P9218n9758j24636J27945J27646p6411
2407E3647q7233J39332N8189k09433Q5349r375q5816J02369P7077m9868j34798
2396f0560q6282K32330L7701j92844L8303R9374j32797o0565J54134L625L07262
2385C39681j73036j90972J6942P2405L8655K6177k07218R1494M6705K02530l022
2374B60341n0124M0010L2146J50011l4124j38031n1788r9190M9370M6390q6285
$$ plain form
2451 -62291 -171721 -148751 711 -14749 -34585 8917 -87273 -347884 -132338 -11 -11536
2440 -11536 -161970 -75658 -32207 -93829 24754 1192 20082 -48060 -82238 104302 -144285
2429 -144285 -108927 274493 220667 154060 232798 113862 64139 -50088 -67959 -20243 -71399
2418 -71399 -142710 -77808 -88191 -133007 -20357 58861 -897 -125533 2412 130058 53647
2407 53647 -33586 105746 163935 -45498 39851 30476 -55340 47029 124106 74238 -60560
2396 -60560 -146842 85488 123189 -69655 -31352 68022 -64775 -125340 28794 32419 339681
2385 339681 166645 -24327 -7385 65020 103675 129852 -77366 14128 60833 263363 260341
2374 260341 210217 250227 282373 432384 398260 260229 208441 109251 158621 205011 118726
2363A18726o2846j03176J48399j89923J82928N6027j89869J76398p2863K4275
2353H8076O4641N8911L5040j85306M4586n2809N5509k10J7279j4925p1564j91371
2341a52143J28111K32729J43401r3771k26999L4587K0114j72256L2053q4129J17057
2330b1246L3322O0851J48309j10565j87436m9411K44083K2081q7170j25338N8147
2319a4373J16837M1406k49931K9385M3390j99834K7910J91151Q5l9038m2290J39791
2307D4489K72766k2394p5327j07403L346l9090J02519j4057R8295J01180k02960
2296A61364o0436p0389M1787p8010l7311J09605l7459M6528R9184P7893P4671
2285C27427j31416m7849N5331J09212l5027k20322j3946J19304M4813O7042R1822
$$ plain form
2363 118726 55880 -47296 101103 -88820 94108 150135 -39734 136664 63801 88076
2353 88076 152717 211628 246668 61362 105948 53139 108648 108438 125717 110792 39228 -152143
2341 -152143 -24032 208697 352098 258327 31328 65915 86029 -86227 -54174 -138303 -21246
2330 -21246 12076 72927 221236 110671 -76765 -126176 117907 139988 52818 -72520 -14373
2319 -14373 102464 143870 -106061 -76676 -33286 -233120 -205210 -14059 -13974 -53012 -95302 44489
2307 44489 317255 294861 219534 112131 115477 76387 178906 164849 263144 364324 161364
2296 161364 100928 30539 72326 -5684 -42995 66610 29151 75679 174863 252756 327427
2285 327427 196011 148162 203493 312705 277678 57356 43410 162714 207527 274569 366391
2274C66391j79006K4182M0558q0113o3156j26941L0828N204R0624J02562n9208
2263A51925k9921Q2003p2427N5430m5119R5767R8782k45841m7073J02822j82611
2252c6263r6613K89663J26963L6512J49934k12931J5576j6116k9463p5099k6321
2241A25842L6789J28552J12165m2423o5354J32839J70522j57862k3991O6052k05678
2230B77453k3650J5429j43178l7182M1260J45118J0518J99077J88612j351k20334
2219D51772O6131j49398l1677J19939j56904J40962J61263j571L3475q2105j27378
2208D24509J83644J43957j88455k29425J63172p3448k10296J68373j26964R2133
2198C47200J12359n3402J19783o5088k12316M1680K83406K3610K3836J36630k2211
$$ plain form
2274 366391 187385 211567 252125 172012 108856 -18085 12743 17947 108571 211133 151925
2263 151925 122004 204007 131580 187010 141891 237658 336440 90599 43526 146348 -36263
2252 -36263 -132876 156787 283750 320262 470196 257265 272841 256725 227262 152163 125842
2241 125842 162631 291183 403348 360925 295571 428410 598932 441070 417079 483131 277453
2230 277453 253803 269232 126054 88872 130132 275250 285768 484845 673457 672106 451772
2219 451772 517903 368505 336828 456767 299863 440825 602088 600517 633992 551887 424509
2208 424509 608153 752110 563655 334230 497402 423954 213658 382031 255067 347200
2198 347200 459559 406157 525940 460852 248536 290216 573622 597232 621068 757698 735487
2187G35487K556Q968q868j10051R1980R7905R0430j44822Q9942K8248K0955J10164
2175A012894o8016n3495M9590O7990J04071j65653j47205K92343P4274N5751N8348
2164A280892p437l9018J54224q4773p8252J35290R8806J34542k91916J29565J40802
2153A572725O7563M1079O8970q6878J26219K13352M0043L76582j9216k11825n7216
2142B131398J60612J83553J42130p4094J07696P2758j28958J28220R6997J83115
2132C003427K09641J3173K03435J68197J53448K44461L83640R0964N12616N95071
2122E578073J90267O01802M11391M72571L76066P16546N90765n3075L44540O24580
2112I853526J048164J272201K277330K624431L297363M505081O295745Q831467
$$ plain form
2187 735487 738043 747011 738143 628092 720072 817977 908407 763585 853527 881775 902730 1012894
2175 1012894 944878 891383 940973 1008963 1113034 947381 800176 1092519 1166793 1222544 1280892
2164 1280892 1273455 1234437 1388661 1303888 1225636 1360926 1459732 1594274 1302358 1431923 1572725
2153 1572725 1640288 1681367 1750337 1663459 1789678 2003030 2043073 2419655 2400439 2188614 2131398
2142 2131398 2292010 2475563 2617693 2543599 2651295 2724053 2595095 2723315 2820312 3003427
2132 3003427 3213068 3226241 3429676 3597873 3751321 3995782 4379422 4470386 4983002 5578073
2122 5578073 5768340 6370142 6781533 7254104 7630170 8346716 8937481 8884406 9228946 9853526
2112 9853526 10901690 12173891 14451221 17075652 20373015 24878096 31173841 40005308
2104D0005308J2200796J2734778J4966439j747710k0172645j7195167j1216728
2097B9575071o797402m722713k981323k306140j604214j143702p02390p44546
2089H572641j60040j60349k26060p10677p54725q49909l79951k57291l07839m19927
2079D345873k44569j42168n6543j33053j71456k45317n9234k41762k85838l31762
2069B434171J42916j67031j06827j04886k31467q3099j34645j65317j04485n338
2059A473992j68887j05599J3180j22580l7002r5247J77483l6598l9614K8197q345
2048A078980j4028p4977m8389j39007J18120L1229p397k2366J3314p2368J91443
2037A054554l60573j01444j03038q8074L095P4720k334L08359r8016q7267j33582
$$ plain form
2104 40005308 52206104 64940882 79907321 78159611 57986966 40791799 29575071
2097 29575071 22777669 18054956 15073633 12767493 11163279 10019577 9317187 8572641
2089 8572641 8412601 8252252 8026192 7315515 6560790 5710881 5330930 5073639 4765800 4345873
2079 4345873 4101304 3959136 3902593 3769540 3598084 3352767 3293533 3051771 2765933 2434171
2069 2434171 2577087 2410056 2303229 2198343 1966876 1883777 1749132 1583815 1479330 1473992
2059 1473992 1305105 1199506 1212686 1090106 1053104 957857 1135340 1098742 1059128 1087325 1078980
2048 1078980 1064952 989975 941586 802579 920699 951928 944531 922165 935479 863111 1054554
2037 1054554 693981 592537 489499 401425 404520 479240 476906 785265 687249 599982 466400
2026D66400j26053J58723o8296p1455p9076J23676j19708j32109J30138J59698
2016D41938K4669J6797k05942J25449K02154j89656j54855j51882J92899p7857
2006B23714o7738j6289q8467j14671J14907N7650P8574j13044p201J37675r2996
1995A12114j1350J70063L7932k25486P6125n8163K9642k1782Q686j05449K804
1984A5136R0826O198j31768n9430P0015J21003j75331j21605L9883J50147Q5169
1973I0243p5157M449J58602m1661j00083J8671L348N4995j23957r787J4365K88200
1961B82228J844j92677k4496K20496k9396j64572Q5913J21179n5575j6512j24785
1950A03647o0967k52936J08136j1812m7021K00577L7618j54533R4973j15487r3946
$$ plain form
2026 466400 340347 499070 430774 359319 280243 403919 284211 152102 282240 441938
2016 441938 466607 483404 277462 402911 605065 415409 260554 108672 301571 223714
2006 223714 155976 139687 51220 -63451 51456 109106 187680 74636 67435 205110 112114
1995 112114 100764 270827 308759 83273 159398 101235 130877 109095 117781 12332 15136
1984 15136 105962 112160 -19608 -79038 -9023 111980 -63351 -184956 -145073 5074 90243
1973 90243 15086 19535 178137 136476 36393 55064 58412 113407 -10550 -20337 -5972 282228
1961 282228 284072 91395 66899 287395 257999 93427 179340 300519 244944 228432 103647
1950 103647 42680 -210256 -102120 -113932 -160953 39624 77242 -77291 17682 -97805 -191751
1939a91751K41989l7334Q2811Q7785j02786q0400J79331M6781j13128p6517M8761
1928H5542j73742M1952M2049J64347o6862k97138m3624J64121L0103k2751P1918
1917d085j37690n6456o6670J95287J98961j59341K2832J94448R8839k09100j5258
1906F1767q1843N9268J5701K6156Q7052j09200j76936Q0374O3495q2891K09536
1895A52479O2390j10276J1983j12174N1606l8637m1688J05343k8343q2509j59244
1884a89070q7974J34656j7938K40766j70643J734J59422j95072j70576j24003
1874d18698J74431J67476r619p1637K53841j26240L4773K15898j13771j23795
1864a7341K0058J34538j35001P032n2771j57589L26204L9180N0028o6700j03573
$$ plain form
1939 -191751 50238 12904 95715 183500 80714 314 179645 226426 113298 36781 85542
1928 85542 -88200 -46248 -4199 160148 93286 -203852 -247476 -83355 -53252 -76003 -4085
1917 -4085 -141775 -198231 -264901 -69614 129347 -29994 -7162 187286 286125 77025 61767
1906 61767 -20076 39192 54893 81049 168101 58901 -118035 -37661 25834 -57057 152479
1895 152479 214869 104593 116576 4402 56008 17371 -24317 81026 52683 -29826 -189070
1884 -189070 -277044 -142388 -160326 80440 -90203 -88469 70953 -124119 -294695 -418698
1874 -418698 -244267 -76791 -86410 -158047 95794 -30446 4327 220225 106454 -17341
1864 -17341 2717 137255 2254 9286 -43485 -201074 125130 164310 214338 147638 44065
1853D4065o3737n063L3139O196J52161K2111j10364r8433n288J22985l1892J4679
1841H0559r691N1486R2146q089j09186J15626n7791K34413P0661k288l904p9078
1829C74864M9584p3733j78270l64832L1079N3754Q2627J6303Q2898L8193J1469
1818A23936O3632M2802j70214L2532j10238J61462Q7910j47989Q2033L3149k64405
1807f5390P7440J13383L1305J664j748j33994M6215J02511l9188j72256r3944
1796a34002J34582p1488o5422L02339k47836k30567M10264R4604k07783k6601
1786d1910j0448m2393j56578P145K08976k09579m4797J07746J77563K0759N146
1775B1630j38591J83563n188k04492O217J20937O0963o4523j87681j20469J64904
$$ plain form
1853 44065 -19672 -24735 8404 14600 166761 188872 78508 -19925 -25213 97772 65880 80559
1841 80559 70868 122354 214500 206411 97225 212851 155060 389473 460134 457846 453942 374864
1829 374864 424448 350715 172445 -192387 -161308 -107554 -24927 -8624 74274 112467 123936
1818 123936 187568 230370 60156 92688 -17550 143912 231822 83833 165866 199015 -65390
1807 -65390 12050 125433 156738 158402 156654 22660 68875 171386 132198 -40058 -134002
1796 -134002 580 -70908 -136330 166009 -81827 -312394 97870 192474 -15309 -41910
1786 -41910 -52358 -94751 -251329 -244184 -35208 -244787 -289584 -181838 -4275 16484 21630
1775 21630 -116961 66602 61414 -143078 -136861 -15924 45039 -19484 -207165 -327634 -162730
1764a62730O9484j11635J91304r6694r90o2245n2608N0905J53875j96269j1118
1753b28721L29524J54523p1228j29757p6077N316o7078j74710J10660J68057O3736
1742H4245k21996l604J04749J50006J98091k59321j51548j26797N9210K43056
1732G6091K75403l0854k65365j10478o4797J69653n2600J33462O9055q7644k2126
1721H9800J00489l57081K5293J84054k83890K15270J10890R4523J02719j93561
1711H8506j07971N193l6804o5056j19645J38219Q5093j19633j46189J07177K47443
1700G6333J66939o2664q1812p8376n8553J13004K16485n1820j05692j84834Q4799
1689C3809J80198J2351J25j79797p8159m5456J29919K6664R4602N0291j63124
$$ plain form
1764 -162730 -93246 -204881 -13577 -110271 -111261 -173506 -226114 -175209 -21334 -217603 -228721
1753 -228721 100803 255326 184098 54341 -21736 -16420 -83498 -258208 -147548 20509 84245
1742 84245 -137751 -141355 -36606 113400 311491 52170 -99378 -226175 -166965 76091
1732 76091 351494 320640 55275 -55203 -120000 49653 -2947 130515 199570 111926 89800
1721 89800 190289 -166792 -141499 42555 -241335 -26065 84825 179348 282067 88506
1711 88506 -19465 -14272 -51076 -116132 -235777 -97558 -12465 -132098 -278287 -171110 76333
1700 76333 243272 180608 98796 20420 -38133 74871 291356 239536 133844 -50990 33809
1689 33809 214007 226358 226483 46686 -31473 -76929 52990 79654 174256 224547 61423
1678F1423m6958j49589l7948J52124o1663k04748O1905K07043q9252k4749j21384
1667b53796L4992N0166r6610O2091J71625j41484J05471M5052J37355j82268J4351
1656e3055J38698J04253r7034K7125l8390k6427O0976q6317r4632M0096m3221
1645f7928L8893p8153J18621o4871j13791k3013N3671R5970l1524K32632j98424
1634c7917m9527l3643R45K1578J12479j04843O3672J45068k85303k4243l449P877
1622a87306J24380M8622J41907q5542J90151p1361k09340R1742k0359J22464N4417
1611A99775j1508j74352k53014J0639P7757j56799J51339Q8715o1858J6432J06214
1600f660Q8680k0680J00583k13828k4013M7636j3810j17407o776j2951J00243
$$ plain form
1678 61423 14465 -135124 -173072 -20948 -82611 -287359 -225454 -18411 -107663 -132412 -253796
1667 -253796 -218804 -168638 -265248 -203157 -31532 -173016 -67545 -22493 114862 -67406 -53055
1656 -53055 85643 189896 92862 119987 81597 55170 116146 29829 -64803 -24707 -67928
1645 -67928 -29035 -107188 11433 -53438 -167229 -190242 -136571 -40601 -72125 160507 -37917
1634 -37917 -87444 -121087 -120142 -98564 13915 -90928 -27256 117812 -167491 -191734 -195183 -187306
1622 -187306 -62926 -14304 127603 42061 232212 160851 -48489 43253 22894 145358 199775
1611 199775 188267 13915 -239099 -228460 -150703 -307502 -156163 -67448 -129306 -112874 -6660
1600 -6660 82020 61340 161923 -51905 -75918 -28282 -42092 -159499 -166275 -179226 -78983
1589g8983R8440K29346o8362j29851k1897k5549q85N8921q9872k27094K95961
1578D0175J362M4874l137j8323Q0157j65713K01710J1001j06747q9698J5760m9720
1566c8299j9524J77052N0101j07326N5353o0201j8144j61552Q5342K4063J04028
1555I0893O002j49053R4654J02018J26066j59956k5390n4375j01005K9577q5183
1544a25752Q512j0413K61756l6379N3122j124K1119j17147j32980R3607R7629
1533A11950J21977k62175q72J4531O1833J6764p0715J05064o8724P285K58920
1522B95838j13918j38580m7225Q4965j00404L4719Q442k06697K0963R2619J8333
1511e0945J76669p5015N1645O2385o6724J5958K2568k30082J548k264O2461m1600
$$ plain form
1589 -78983 19457 248803 180441 50590 28693 3144 2259 61180 -28692 -255786 40175
1578 40175 41537 86411 83274 64951 145108 -20605 181105 192106 85359 -4339 11421 -38299
1566 -38299 -57823 119229 169330 62004 117357 57156 39012 -122540 -37198 -13135 90893
1555 90893 96895 -52158 42496 144514 270580 110624 85234 30859 -70146 -40569 -125752
1544 -125752 -117240 -127653 134103 97724 150846 149722 170841 53694 -79286 14321 111950
1533 111950 233927 -28248 -29120 -14589 47244 64008 -6707 98357 29633 36918 295838
1522 295838 181920 43340 -3885 81080 -19324 15395 23837 -182860 -161897 -69278 -50945
1511 -50945 125724 50709 102354 164739 98015 113973 136541 -93541 -91993 -94257 -31796 -73396
1499g3396j46848J33689Q2068l7912J7122K6584R524q3388p9491M4245P25J53923
1487D6845M228r6575j17007o2682J00337k56j30542O1709J57255Q982K4972O3685
1475F0951j01223L7335K60422l544j20037r5708k11061j09712J72941k441n0514
1464a62591m9196J52696Q2014p0396J54075Q477n3384j56966j62687K63789Q2498
1453H8329j12192N4570Q6625R1253P5193o8048r0664J5623j66026q5521J73725
1442F2867M0793K9707j36056j09702J9249n2673J29228j1546Q2786j28980j72819
1431b47146K06512J4993J23186j42124j69370q2076j12926N2877j221J99073J05611
1420e2611J11123O8426p4778j6173m1432J51062J47917L04k39901N9647n9593
$$ plain form
1499 -73396 -220244 -86555 -4487 -42399 -25277 1307 10831 -72557 -152048 -107803 -107078 46845
1487 46845 51073 -45502 -162509 -225191 -124854 -125110 -255652 -193943 -36688 -27706 -2734 60951
1475 60951 -40272 -2937 257485 253941 133904 38196 -172865 -282577 -109636 -112077 -162591
1464 -162591 -211787 -59091 22923 -47473 106602 115079 61695 -95271 -257958 5831 88329
1453 88329 -23863 30707 117332 208585 283778 215730 125066 140689 -25337 -110858 62867
1442 62867 103660 133367 -2689 -112391 -93142 -145815 -16587 -28133 54653 -74327 -247146
1431 -247146 -40634 -25641 97545 -44579 -213949 -296025 -408951 -356074 -357295 -158222 -52611
1420 -52611 58512 126938 52160 35987 -5445 145617 293534 293838 53937 113584 53991
1409E3991j46020O7754J13091j096k41802L6553L00154k9874q112J22330k58740
1398H229r3436p806O3755k02436K05338R6557j5135j39123J55449l8400K7178
1387F0170k5633k1175R5815P2751J1916p2133j77911k989K7840N109q1140r4265
1375b01645J72219O597k0737r3137o1816K5519J97396j06025j0649j12262J42560
1364f1980j34600j53694N4494J03922p712Q9983J05766k5179l1022R1379k1459
1353I898n6469r1657k7777K49010L9617j32714p6374q7264j19688N5717J91165
1342d6536q0633m8417K66051J06888j25161Q3889N1900k49306j9427k21783R4304
1331a88231Q1991N6597m5913K5685n790j40830L7780K89337L0496j35083J00548
$$ plain form
1409 53991 -92029 -24275 88816 87720 -154082 -117529 182625 152751 144639 266969 8229
1398 8229 -85207 -93013 -29258 -231694 -26356 70201 55066 -84057 71392 32992 60170
1387 60170 34537 13362 109177 181928 193844 121711 -56200 -59189 -31349 -26240 -107380 -201645
1375 -201645 -29426 -22829 -43566 -136703 -198519 -173000 24396 -81629 -92278 -204540 -61980
1364 -61980 -196580 -350274 -295780 -191858 -199570 -109587 -3821 -29000 -60022 31357 9898
1353 9898 -46571 -138228 -166005 83005 122622 -10092 -86466 -173730 -293418 -237701 -46536
1342 -46536 -127169 -175586 90465 197353 72192 156081 207981 -41325 -60752 -282535 -188231
1331 -188231 -106240 -49643 -95556 -69871 -75661 -216491 -178711 110626 141122 6039 106587
1320A06587k4491k2031j35892j29461M4736J78096J58070r3028j17563J02887
1310F7910q5110m4555K8237K11609j9318j99076n1689P7202J6953M6522j2481
1299C6204Q990J29969r5245q6762J77730l937j58214j64921q8762K49891J39321
1288A44264k76965j34371j0093P6702J57869j30959P2362J80156q2137q822L9801
1277B7807j27688R8852p7953k7102M1944n4472L18212Q4120k48225j714r6577
1266f2796M9168l3663j0054j28246Q9658J17898m3491J13645j83252P3054m6109
1255f4188k6964q0061j5016J18017J3511j75086J77554J39425k04993J61381K47992
1244B91572p4991j38966K3686l2759k0960p6222o4571R4098k8137J79806R6634
$$ plain form
1320 106587 82096 60065 -75827 -205288 -160552 17544 175614 82586 -34977 67910
1310 67910 -17200 -61755 -33518 178091 158773 -40303 -91992 -14790 2163 48685 36204
1299 36204 45194 175163 79918 -6844 170886 166949 8735 -156186 -244948 4943 144264
1288 144264 -132701 -267072 -277165 -200463 -42594 -173553 -101191 78965 -3172 -11994 27807
1277 27807 -99881 -1029 -78982 -106084 -64140 -118612 199600 283720 35495 33781 -62796
1266 -62796 -13628 -47291 -57345 -185591 -95933 21965 -21526 92119 -91133 -18079 -64188
1255 -64188 -91152 -171213 -186229 -68212 -54701 -229787 -52233 87192 -117801 43580 291572
1244 291572 216581 77615 101301 68542 47582 -28640 -93211 887 -27250 152556 249190
1233B49190l3910J1642L9910j52639j39095J43854N7330j28056j8731q2276J92421
1222A39640r7686q3588o3145j94955K19849K8037k3199J76761J1364k1025n8219
1211C3834p8889J27060l8180J03196R9127j4160k80439Q0287m1849p8443j75847
1200b64303R2492K83620R7977j38428j04914j56196L35124J28565o5953M3790
1190B51774j93408q4517O7260Q3157o6931M9161k6273l8211p202m3677q9112J06076
1178H097J22444j13871r4572N7867m5409p4888j0583J56303N2141q2816n7558
1167h2845K511j25071o709k2406J24525L5020J27387L611M1403o8464k55539J43416
1155h3161J97589q930Q268k2439n7699o3380j32596M9078J86581r2630j76129
$$ plain form
1233 249190 215280 226922 266832 114193 -24902 118952 176282 48226 29495 -52781 139640
1222 139640 41954 -41634 -104779 -299734 -79885 -51848 -75047 101714 113078 92053 33834
1211 33834 -45055 82005 43825 147021 246148 231988 -48451 31836 -10013 -88456 -264303
1200 -264303 -171811 111809 209786 71358 -33556 -189752 145372 273937 207984 251774
1190 251774 58366 -26151 41109 124266 57335 106496 80223 42012 34810 -8867 -97979 8097
1178 8097 130541 16670 -77902 -20035 -65444 -140332 -150915 5388 57529 -25287 -82845
1167 -82845 -80334 -205405 -212114 -234520 -109995 -74975 52412 56023 97426 28962 -226577 -83161
1155 -83161 114428 105498 113766 91327 33628 -29752 -162348 -113270 73311 -19319 -195448
1144a95448J86389k5206l9626K66780P4689j22002j97865n1785K34419R1550j83121
1133C8774j13370n9479k2257J38134R5886J05527j22799j68354J18835K58501
1123B69398j83923r4266j08886k7386J77012p6514j13404K7071K75999K4634l1385
1112A38350R8832O9073j54058k6322k09950m458N3603l9865M3375j33518R116
1101a55822J75472J9634M2675j70467m3312k0502J97286J51795k85892j18269
$$ plain form
1144 -195448 -9059 -34265 -73891 192889 267578 145576 -52289 -104074 130345 221895 38774
1133 38774 -74596 -134075 -156332 -18198 77688 183215 60416 -107938 10897 269398
1123 269398 85475 -8791 -117677 -145063 31949 -44565 -157969 -130898 145101 169735 138350
1112 138350 237182 306255 152197 125875 -84075 -88533 -34930 -74795 -31420 -164938 -155822
1101 -155822 19650 39284 81959 -88508 -131820 -152322 44964 196759 -89133 -207402
$$ [...]
##END NTUPLES=NMR SPECTRUM
##END=
