##TITLE=1H_TG-2340-XVa
 CDCl3
 8 sc, 
 2.10.2023
##JCAMPDX= 6.0         $$ Bruker NMR JCAMP-DX V2.0
##DATA TYPE= NMR SPECTRUM
##DATA CLASS= NTUPLES
##ORIGIN= UXNMR, Bruker Analytische Messtechnik GmbH
##OWNER= root
$$ XWIN-NMR		Version 3.5
$$ Mon Oct  2 14:03:54 2023 Russian Standard Time (UT+4h)  she@DPX200
##.OBSERVE FREQUENCY= 200.13135
##.OBSERVE NUCLEUS= ^1H
##.ACQUISITION MODE= SIMULTANEOUS
##.ACQUISITION SCHEME= undefined
##.AVERAGES= 8
##.DIGITISER RES= 18
##SPECTROMETER/DATA SYSTEM= spect
##.PULSE SEQUENCE= zg30
##.SOLVENT NAME= CDCl3
##.SHIFT REFERENCE= (INTERNAL, CDCl3, 0, 15.7392)
##AUDIT TRAIL= $$ (NUMBER, WHEN, WHO, WHERE, WHAT)
$$ ##TITLE= Audit trail, XWIN-NMR		Version 3.5
$$ ##JCAMPDX= 5.01
$$ ##ORIGIN= Bruker BioSpin GmbH
$$ ##OWNER= she
$$ F:/spectra/data/she/nmr/H-F/1/pdata/1/auditp.txt
$$ ##AUDIT TRAIL=  $$ (NUMBER, WHEN, WHO, WHERE, WHAT)
(   1,<2023-10-02 14:02:43.51 +0400>,<she>,<DPX200>,
      <created by zg, POWCHK disabled, PULCHK disabled
       configuration hash MD5:
       00 E9 B6 7A A2 85 ED C7 34 08 36 98 17 FE 4E 26
       data hash MD5: 16K
       0D 27 63 38 A3 93 B3 6D D3 81 C1 F3 04 D4 44 99>)
(   2,<2023-10-02 14:02:46.56 +0400>,<she>,<DPX200>,
      <Start of raw data processing
       efp BC_mod = 2 LB = 0.24 FT_mod = 6 PKNL = 1 PHC0 = -21708.1 PHC1 = 9.652711 SI = 16K 
       data hash MD5: 16K
       1F CE B9 9A 57 4A 42 42 1B 3E AA E5 70 E5 84 1B>)
(   3,<2023-10-02 14:03:02.09 +0400>,<she>,<DPX200>,
      <pk PHC0 = -2.683897 PHC1 = 2 
       data hash MD5: 16K
       EC BD 93 40 55 0E 08 4D EA 40 39 C0 34 8B 80 D9>)
(   4,<2023-10-02 14:03:05.50 +0400>,<she>,<DPX200>,
      <abs ABSG = 5 
       data hash MD5: 16K
       85 97 F2 5C BA 46 24 90 0B 89 03 D2 7D C0 1B B9>)
$$ ##END=
$$ 
$$ hash MD5
$$ A3 BF F9 0D 67 2D 91 57 47 5E 6D 90 1B 0A 22 F6
##$RELAX= 
##$RELAX= 
##$RELAX= 
##$RELAX= 
##$RELAX= 
##$RELAX= 
$$ Bruker specific parameters
$$ --------------------------
##$DU= <F:/spectra>
##$EXPNO= 1
##$NAME= <H-F>
##$PROCNO= 1
##$TYPE= <nmr>
##$USER= <she>
##$AMP= (0..31)
100 100 100 100 100 100 100 100 100 100 100 100 100 100 100 100 100 100 
100 100 100 100 100 100 100 100 100 100 100 100 100 100 
##$AQSEQ= 0
##$AQ_mod= 1
##$AUNM= <au_zg>
##$AUTOPOS= <>
##$BF1= 200.13
##$BF2= 200.13
##$BF3= 200.13
##$BF4= 200.13
##$BF5= 200.13
##$BF6= 200.13
##$BF7= 200.13
##$BF8= 200.13
##$BYTORDA= 1
##$CFDGTYP= 0
##$CFRGTYP= 5
##$CHEMSTR= <none>
##$CNST= (0..31)
1 1 145 1 1 1 1 1 1 1 1 1 1 1 1 1 1 1 1 1 1 1 1 1 1 1 1 1 1 1 1 1 
##$CPDPRG= <>
##$CPDPRG1= <>
##$CPDPRG2= <>
##$CPDPRG3= <>
##$CPDPRG4= <mlev>
##$CPDPRG5= <mlev>
##$CPDPRG6= <mlev>
##$CPDPRG7= <mlev>
##$CPDPRG8= <mlev>
##$CPDPRGB= <>
##$CPDPRGT= <>
##$D= (0..31)
0 1.2 0 0 0 0 0 0 0 0.06 0 0.03 0 0 0 0 0.0002 0 0 0 0 0 0 0 0 0 0 0 0 
0 0 0 
##$DATE= 1696240962
##$DBL= (0..7)
120 120 120 120 120 120 120 120 
##$DBP= (0..7)
150 150 150 150 150 150 150 150 
##$DBP07= 0
##$DBPNAM0= <>
##$DBPNAM1= <>
##$DBPNAM2= <>
##$DBPNAM3= <>
##$DBPNAM4= <>
$$ [...]
##$SUBNAM3= <"">
##$SUBNAM4= <"">
##$SUBNAM5= <"">
##$SUBNAM6= <"">
##$SUBNAM7= <"">
##$SUBNAM8= <"">
##$SUBNAM9= <"">
##$SW= 18.05172834244
##$SWIBOX= (0..15)
0 0 2 0 0 0 0 0 0 0 0 0 0 0 0 0 
##$SW_h= 3612.71676300578
##$TD= 16384
##$TD0= 1
##$TE= 0
##$TE2= 300
##$TE3= 300
##$TEG= 300
##$TL= (0..7)
0 120 120 120 120 120 120 120 
##$TP= (0..7)
150 150 150 150 150 150 150 150 
##$TP07= 0
##$TPNAME0= <>
##$TPNAME1= <>
##$TPNAME2= <>
##$TPNAME3= <>
##$TPNAME4= <>
##$TPNAME5= <>
##$TPNAME6= <>
##$TPNAME7= <>
##$TPOAL= (0..7)
0.5 0.5 0.5 0.5 0.5 0.5 0.5 0.5 
##$TPOFFS= (0..7)
0 0 0 0 0 0 0 0 
##$TUNHIN= 0
##$TUNHOUT= 0
##$TUNXOUT= 0
##$USERA1= <user>
##$USERA2= <user>
##$USERA3= <user>
##$USERA4= <user>
##$USERA5= <user>
##$V9= 5
##$VALIST= <valist>
##$VCLIST= <CCCCCCCCCCCCCCC>
##$VD= 0
##$VDLIST= <DDDDDDDDDDDDDDD>
##$VPLIST= <PPPPPPPPPPPPPPP>
##$VTLIST= <TTTTTTTTTTTTTTT>
##$WBST= 1024
##$WBSW= 4
##$XGAIN= (0..3)
0 0 0 0 
##$XL= 0
##$YL= 0
##$YMAX_a= 323074
##$YMIN_a= -490669
##$ZGOPTNS= <>
##$ZL1= 120
##$ZL2= 120
##$ZL3= 120
##$ZL4= 120
##$ABSF1= 15.71732
##$ABSF2= -2.334529
##$ABSG= 5
##$ABSL= 3
##$ALPHA= 0
##$AQORDER= 0
##$ASSFAC= 0
##$ASSFACI= 0
##$ASSFACX= 0
##$ASSWID= 0
##$AUNMP= <proc_1d>
##$AZFE= 0.1
##$AZFW= 0.1
##$BCFW= 0
##$BC_mod= 2
##$BYTORDP= 0
##$COROFFS= 0
##$CY= -3
##$DATMOD= 1
##$DC= 0
##$DFILT= <>
##$DTYPP= 0
##$F1P= 0
##$F2P= 0
##$FCOR= 1
##$FTSIZE= 16384
##$FT_mod= 6
##$GAMMA= 0
##$GB= 0
##$INTBC= 1
##$INTSCL= 3.70164e-10
##$ISEN= 128
##$LB= 0.24
##$LEV0= 0
##$LPBIN= 0
##$MAXI= 10000
##$MC2= 0
##$MEAN= 0
##$ME_mod= 0
##$MI= 1.114404
##$NCOEF= 0
##$NC_proc= -5
##$NLEV= 6
##$NOISF1= 3.799351
##$NOISF2= 2.8
##$NSP= 0
##$NTH_PI= 0
##$NZP= 0
##$OFFSET= 15.73918
##$PC= 1
##$PHC0= -21710.78
##$PHC1= 11.65271
##$PH_mod= 1
##$PKNL= yes
##$PPARMOD= 0
##$PSCAL= 0
##$PSIGN= 0
##$REVERSE= no
##$SF= 200.130006477394
##$SI= 16384
##$SIGF1= 3
##$SIGF2= 2
##$SINO= 5.538805
##$SIOLD= 16384
##$SREGLST= <1H.CDCl3>
##$SSB= 0
##$STSI= 16384
##$STSR= 0
##$SW_p= 3612.71676300578
##$SYMM= 0
##$S_DEV= 0
##$TDeff= 16384
##$TDoff= 0
##$TI= <>
##$TILT= no
##$TM1= 0
##$TM2= 0
##$TOPLEV= 0
##$USERP1= <user>
##$USERP2= <user>
##$USERP3= <user>
##$USERP4= <user>
##$USERP5= <user>
##$WDW= 1
##$XDIM= 16384
##$YMAX_p= 270320568
##$YMIN_p= -190563
$$ End of Bruker specific parameters
$$ ---------------------------------
##NTUPLES= NMR SPECTRUM
##VAR_NAME=  FREQUENCY,     SPECTRUM/REAL,   SPECTRUM/IMAG
##SYMBOL=    X,             R,               I
##VAR_TYPE=  INDEPENDENT,   DEPENDENT,       DEPENDENT
##VAR_FORM=  AFFN,          ASDF,            ASDF
##VAR_DIM=   16384,         16384,           16384
##UNITS=     HZ,            ARBITRARY UNITS, ARBITRARY UNITS
##FACTOR=    0.220516191357247, 1,           1
##FIRST=     3149.88211753954, 0,            0
##LAST=      -462.834645466245, 0,           0
##MIN=       -462.834645466245, -190563,     0
##MAX=       3149.88211753954, 270320568,    0
$$ Real data points
##PAGE= N=1
##DATA TABLE= (X++(R..R)), XYDATA
$$ [...]
9341 1389242 1404255 1415859 1461406 1466154 1450885 1442351 1470399 1508378 1574678 1584676 1593008 1588067
9329 1588067 1592852 1589959 1631193 1659694 1680609 1710908 1720541 1755535 1813030 1806439 1848233 1914752
9317 1914752 1988232 2047326 2075542 2062708 2132591 2243797 2303595 2371322 2415065 2441232 2457936
9306 2457936 2490159 2498737 2525186 2532461 2580915 2612218 2576359 2555845 2509515 2511485 2529632 2525443
9294 2525443 2535863 2491858 2543975 2494150 2505946 2572900 2569311 2613021 2638152 2729402 2749007 2819599
9282 2819599 2880782 2961217 3036196 3089226 3212894 3318086 3402084 3541297 3628901 3773906 3942774
9271 3942774 3974263 3928740 3859881 3912048 4032020 4078887 4035774 3928332 3751469 3552882 3405246
9260 3405246 3339192 3275651 3250309 3222200 3187431 3201470 3135641 3090587 3068031 3068101 3112436 3141366
9248 3141366 3205830 3252224 3284844 3307180 3383548 3474629 3527428 3625684 3756755 3839861 3924009
9237 3924009 4003583 4086328 4120149 4171407 4362653 4506546 4543687 4468517 4377639 4269696 4129504
9226 4129504 4014605 3731778 3416186 3243134 3151757 3072794 3004911 2983680 2972597 2967289 2912247
9215 2912247 2878837 2906266 2876233 2890490 2827532 2818241 2803697 2776797 2811598 2834064 2873391 2880599
9203 2880599 2875696 2857890 2852585 2839435 2798612 2845806 2842491 2849729 2830081 2771202 2814088 2733504
9191 2733504 2753944 2719588 2668717 2645294 2639399 2639459 2626141 2674177 2671115 2747159 2816596 2790093
9179 2790093 2775009 2811493 2846857 2865292 2876525 2880982 2853294 2866942 2910533 2983314 2941758 2994601
9167 2994601 3018107 3043750 3095842 3128674 3085992 3091966 3182308 3203600 3246958 3236162 3265648 3264983
9155 3264983 3299163 3326903 3381385 3445220 3439585 3485832 3515593 3512116 3630871 3651738 3731382 3809258
9143 3809258 3887522 3916384 3955152 3969732 3962850 4007855 4039615 4139663 4190798 4210198 4240436
9132 4240436 4264597 4339566 4365617 4447134 4528051 4640714 4748162 4771131 4881814 4949658 5034417
9121 5034417 5125363 5204309 5308843 5349586 5473782 5620357 5692211 5782768 5979715 6107383
9111 6107383 6183192 6262430 6331694 6482060 6648972 6814946 6992055 7149715 7304551 7501557
9101 7501557 7711989 7878972 8126635 8405333 8701038 8992613 9231845 9449978 9773758 10079494
9091 10079494 10395899 10804329 11037771 11258444 11483430 11840415 12226822 12593444 12896133
9082 12896133 13139990 13379150 13653207 13924337 14324175 14813286 15494708 16292097 17193159
9073 17193159 18233514 19292831 20491395 21931486 23730471 25698994 27554292 29289848
9065 29289848 31394908 34094605 36931650 38518509 38532455 38263829 38891113 40794040 43139522
9056 43139522 44167456 42779354 39560222 35611988 32354362 30166396 28904208 28249778
9048 28249778 27946121 27729625 27223043 26314041 25370771 24716759 24456026 24450096 24680408 25118880
9038 25118880 25819326 26805720 28099754 29664190 31582276 33939120 36513985 38958658
9030 38958658 41212722 43644250 46008199 47715249 49131540 51599538 55375640 58943536
9022 58943536 60298517 60324549 60573828 60728750 60056892 57665960 53602996 49663267 46508102
9013 46508102 43750273 41558944 40306384 40113169 40763048 41208163 40227920 37647847 34257634
9004 34257634 30980027 28529617 27002338 26195962 25786994 25488660 25183523 24779657 24319892
8995 24319892 23922867 23557198 23347333 23471636 23899329 24620359 25345099 25898924 26285673
8986 26285673 26683806 27501236 28689588 29965521 31186698 32500001 33693558 34454823 34929120
8977 34929120 35835887 37613592 39314631 39607839 38770146 37841988 36723414 35246739 32948287
8968 32948287 29341003 25612027 22815286 20965413 19853977 19173379 18765268 18495232 18224332
8959 18224332 18065269 18067111 18067013 17842076 17268986 16639522 16038236 15388464 14738370 13768132
8949 13768132 12514482 11347188 10383276 9742640 9263651 8860950 8560960 8323596 8117294
8940 8117294 7961581 7791310 7611732 7436852 7288309 7049898 6903757 6768183 6643643 6576671
8930 6576671 6511319 6435134 6390251 6308999 6304230 6293829 6170505 6101990 6082705 6062348 6060987 6073137
8918 6073137 6102957 6102099 6134079 6121639 6123009 6154891 6177945 6220522 6257574 6323444 6380653 6461109
8906 6461109 6557859 6617864 6650738 6743221 6814589 6933173 7005453 7089014 7186872 7283637 7411891
8895 7411891 7570466 7700551 7847464 7913898 8039079 8175740 8378938 8534344 8713514 8909444
8885 8909444 9039291 9199025 9374915 9503817 9738703 9961586 10134182 10359719 10549406 10807625
8875 10807625 11090265 11372630 11669221 11984453 12321641 12742752 13136729 13523899 13866112
8866 13866112 14306446 14734062 15222118 15687914 16140210 16646982 17347890 18149925 19117858
8857 19117858 20249134 21584468 23055988 24379231 25574759 26801230 28504967 30750518
8849 30750518 32771763 33808920 34492294 35449999 36092004 35401422 33379464 31315427 30075621
8840 30075621 29653643 29817382 30397033 31399493 32393219 32899644 33235161 33614306 34136171
8831 34136171 35014657 36197210 37478853 38585794 39528609 40730850 42318823 43805928
8823 43805928 44358332 44014289 44019329 45025142 47158845 49889984 53036075 56638266 59969784
8814 59969784 61978970 63437425 64020821 62765728 59645207 55692794 52503178 50554924
8806 50554924 50038766 50340935 49749689 47970746 46095024 44746454 44164557 44099373 44558932
8797 44558932 45477396 46939453 48583831 50008918 51030805 51521306 51060889 49468459 47083580
8788 47083580 44916966 43786335 43682929 44463221 45541056 45829709 44907301 43804566 43659714
8779 43659714 44368262 45532603 46501603 47137688 46588535 44930720 42619553 39607235 36848823
8770 36848823 34787308 33079492 31585485 30518669 29908814 29839198 30054916 30211907 29944946
8761 29944946 29344106 28841351 28759733 29098516 29534046 29669474 29225056 28022859 26209433
8752 26209433 24102406 21963131 20246838 19006693 18108968 17465863 17020162 16785170 16668370
8743 16668370 16575502 16409899 16218403 16054767 15867323 15730673 15776935 15883589 16014259 15932203
8733 15932203 15654203 15167619 14548645 13953052 13414127 13007567 12741587 12522381 12309198
8724 12309198 12211204 12101662 12048975 12038956 11974768 11999529 12059733 12119680 12242673 12432304 12667133
8713 12667133 13039985 13528863 14034173 14613226 15248950 16150431 17188014 18537833 20178594
8704 20178594 22023887 24206697 27079658 30415674 33215331 34082066 32954968 31891246
8696 31891246 31956899 32647116 32030491 30468176 29325611 28966709 29169584 29150622 28122291
8687 28122291 26971192 26479440 26423094 26217286 25349806 24187821 23229058 22851916 22848558 22796477
8677 22796477 22530444 22026312 21573290 21397935 21632767 22445733 23327713 23700195 23749904 24119836
8667 24119836 24993555 26509672 28539003 30903542 32788463 33736587 33761299 32442722 29955571
8658 29955571 27591144 26204024 25778559 26207627 27137343 28012144 28484992 27969677 26371379
8649 26371379 24163812 22069425 20550282 19522598 18822908 18178260 17605149 17006362 16363263
8640 16363263 15632911 14914948 14377528 14071277 14016180 14193091 14459855 14511611 14335648 14213672
8630 14213672 14374467 14769692 14994411 14562087 13901154 13523149 13509736 13546957 13232070 12620126
8620 12620126 12198472 12025159 11876340 11566727 11063775 10645774 10278341 9923972 9537359
8611 9537359 8892230 8162490 7440640 6777343 6265092 5835075 5552191 5270953 4953072 4650139
8601 4650139 4400663 4133583 4012990 3876269 3733675 3600603 3455708 3363263 3308672 3231054
8591 3231054 3132885 3083331 3013540 2961384 2892297 2931628 2955063 2868661 2845551 2797633 2731310
8580 2731310 2719611 2669636 2505894 2392270 2272617 2169651 2166245 1988443 1871232 1737624
8570 1737624 1638108 1612448 1593600 1551618 1502235 1428627 1402619 1354253 1335308 1356632 1311619
8559 1311619 1258159 1290844 1279285 1227506 1253034 1236231 1259134 1234498 1163554 1191393 1209172
8548 1209172 1144736 1102182 1095505 1045383 979179 988182 994369 960013 965368 942681 847725 865325
8536 865325 813465 759985 741517 693305 680867 669550 679123 662649 657290 623297 540544 529630
8524 529630 555228 535047 527541 517737 488090 496822 479008 532602 505831 466913 449097 421457
8512 421457 417447 396931 457829 394826 428735 405019 372937 378544 347868 395471 344725 336732
8500 336732 365158 368967 319695 370276 361676 390704 388175 337979 361981 366025 349369 372426
8488 372426 398180 384774 381629 412553 403815 388340 370003 399962 397571 391272 366218 397567
8476 397567 420614 426776 371611 301622 306317 331172 353782 378892 380737 386723 372741 339949
8464 339949 344243 385630 403090 410691 463281 445736 415067 383373 429729 433461 427316 408683
8452 408683 397133 408527 455500 513602 530951 501646 505429 521535 482578 470955 462725 436293
8440 436293 395667 375219 395718 459861 510904 489197 419511 395140 434373 368096 320778 377913
8428 377913 404515 340115 342678 374299 396743 419420 386611 393214 373639 341883 337520 348245
8416 348245 332261 315874 303518 284417 307838 327997 334655 295291 290991 242495 249654 222371
8404 222371 250840 233013 253245 243333 272150 239529 192784 176109 205173 186485 146859 181445
8392 181445 170542 175997 195204 185281 182753 161203 137146 129167 197594 196921 131417 141948 137613
8379 137613 117162 91690 104370 65640 51128 69045 9578 -25392 8799 66008 87728 47554
8367 47554 70411 86411 52829 67866 132113 103710 63022 88459 95586 86531 79640 67078
8355 67078 69519 69877 65879 70939 97437 85130 83214 39834 54913 29926 62016 46946 29983
8342 29983 37333 90681 95260 74407 84017 125365 129661 123882 156906 154453 81747 112852 115943
8329 115943 107218 120522 107787 126463 128676 89658 112223 124853 107284 109666 107688 81228
8317 81228 109213 54084 59917 84212 60887 85697 69379 68319 97520 86116 88453 88161 62518
8304 62518 93706 99937 83204 83844 134773 149768 181950 133469 163658 125457 133833 128402 140756
8291 140756 171313 151790 139779 133100 123573 109769 115318 98327 85365 59557 58281 80508
8279 80508 58573 41032 53976 128118 84041 92685 117903 140631 90358 57239 61282 67007
8267 67007 54932 -7763 35124 17514 46896 20123 16246 47327 55168 67088 25559 -28986
8255 -28986 -8848 -10726 -29958 -24105 -51919 -17227 34342 -19 28886 -6134 -1719 12277
8243 12277 -17722 -31392 -86276 -65518 -30182 -28083 -49783 -58865 -73673 -115916 -120470 -76524
8231 -76524 -41317 -50645 -35224 -37622 -9462 -45041 -56384 -44584 -59989 -59663 4029 21342 -36067
8218 -36067 -39970 -47656 -36960 -35554 -29618 -49709 -56455 -93081 -56936 6360 -41486 -56293 -101413
8205 -101413 -128496 -95859 -64631 -15852 -43723 -92545 -45241 -68874 -74838 -34379 -53418 -72628
8193 -72628 -15628 307038 74634 -57548 -35345 -56389 -5304 -54379 -83413 -97667 -89771
8182 -89771 -81190 -92755 -95902 -78166 -122177 -89923 -64603 -59683 -59536 -43589 -71797 -71622 -87545
8169 -87545 -95317 -123967 -111922 -69943 -61114 -93839 -87055 -34830 -6703 -40542 -56916 -54288 -41625
8156 -41625 -40981 -85802 -61030 -60285 -77279 -92627 -103663 -89420 -72264 -111263 -94482 -81435 -64533
8143 -64533 -12432 -56031 -87027 -94613 -70297 -73530 -48872 -82017 -130043 -143211 -109906 -117942
8131 -117942 -119625 -95192 -98487 -113509 -138746 -174563 -175454 -151979 -137233 -127831 -114829 -85092 -93972
8118 -93972 -95744 -82515 -87796 -91519 -59784 -76521 -126604 -117931 -124900 -190563 -169179 -157042 -139133
8105 -139133 -109995 -80939 -50808 -59456 -107198 -138684 -132770 -120473 -69520 -120049 -119402 -137050
8093 -137050 -142641 -143965 -126144 -136782 -94181 -145266 -159502 -115771 -103661 -112918 -118393 -108719 -101247
8080 -101247 -48544 -58731 -65870 -88008 -54905 -139440 -135968 -101521 -111269 -124751 -114979 -104057
8068 -104057 -104409 -68806 -71447 -127199 -139607 -127411 -83265 -104181 -161216 -135466 -153394 -171929
8056 -171929 -149656 -159587 -138463 -126906 -88171 -68586 -102255 -71969 -38975 -62067 -100464 -123853
8044 -123853 -131182 -93296 -89766 -35295 -99611 -140137 -155800 -124978 -94814 -111066 -94971 -75860
8032 -75860 -89453 -70455 -64553 -87145 -105676 -94742 -78830 -89680 -77265 -77974 -84128 -128726 -127196
8019 -127196 -91215 -74595 -146587 -121383 -76045 -74177 -68465 -57948 -125508 -130423 -74560 -81872
8007 -81872 -93221 -102135 -75170 -75588 -109460 -70454 -49421 -45729 -67848 -94603 -48215 -55034 -111330
7994 -111330 -121072 -101095 -74759 -60125 -94981 -116379 -114734 -139899 -137961 -112381 -72444 -76960
7982 -76960 -60113 -20337 -85365 -92566 24188 -44218 -80124 -73323 -119435 -84173 -54700 -45043
7970 -45043 -19780 -25146 -39671 -27777 -26608 -68735 -58375 -70643 -81794 8618 25173 -35965
7958 -35965 -47129 -56934 -17381 -4393 25451 44015 -23664 -16023 -22885 -51606 -20847 -96099
7946 -96099 -144349 -131443 -76994 -75238 -63276 -49184 -47901 -40264 -51281 -11619 -67458 14421
7934 14421 11412 -53614 -63385 -40929 -29021 -92737 -106526 -48258 -74786 -56786 -53520 -31712
7922 -31712 -49210 -68691 -37505 -30933 -91496 -97737 -75259 -82945 -83108 -80632 -66009 -94506 -102385
7909 -102385 -75434 -72448 -85801 -43775 -59148 -111342 -72653 -71164 -98588 -93355 -81202 -99915
7897 -99915 -66644 -44408 -89833 -114251 -97720 -84019 -53567 -93605 -84397 -107901 -141853 -91252
7885 -91252 -83905 -29465 -42928 -25973 -80261 -151839 -103056 -83464 -100981 -49231 -48908 -93377
7873 -93377 -112427 -29907 -13608 628 -8358 -58875 -51245 -65492 -100752 -99271 -90827 -67162 -57179
7860 -57179 -39619 -44390 -37419 -38190 -14117 -8533 -40170 -16987 -27616 -55462 -81265 -63564 -73324
7847 -73324 -45826 -94846 -53255 -14728 -9964 -51866 -58539 -53663 -85853 -84563 -60687 -64422 -71419
7834 -71419 -92302 -78301 -54531 -16885 -11472 -62107 -58796 -30561 7272 -20402 -64997 -99400
7822 -99400 -68746 -51256 -77949 -83661 -60780 -8420 -14668 -65400 -37918 -4834 -26315 -36131
7810 -36131 -70268 -82523 -53442 -52429 -9769 -31681 -5768 -39947 -10081 -11454 -72454 -83398
7798 -83398 -75459 -40621 -18438 -44088 -10976 -26972 -56011 -30477 -33374 -14631 -7549 -22684
7786 -22684 -74060 -86720 -50691 -38963 -67911 -62701 -19480 -35978 -61686 -67462 -114286 -56814
7774 -56814 25045 18919 11376 19043 34667 5578 5238 13342 -34351 -38517 -25401 -4485 -14470
7761 -14470 -39102 -45585 -4664 -32796 -32204 -1985 -24044 -34430 -27949 -31641 -38802 -23991 -2555
7748 -2555 -41468 -59240 -36965 -58525 -36206 25859 20141 454 -17766 19844 -10799 -6757
7736 -6757 43059 15164 -15060 16992 13549 9533 34896 56856 112380 88159 86228 70206 125144
7723 125144 135749 155065 222283 273977 321182 416503 472484 443707 292659 135283 36077
7712 36077 6642 16869 46922 32752 -26194 -6132 60882 5424 -21693 6955 -58102 -16203
7700 -16203 22644 9504 3351 -3827 -37345 -95475 -36807 -25903 -4877 649 -37656 -4028
7688 -4028 -9956 -19737 -11376 -4026 -58068 -19593 9041 -13871 4917 28102 53606 63434 -1074
7675 -1074 -25089 13001 52324 6518 -15121 21740 22272 27969 6635 35589 80942 69250 35965
7662 35965 4038 -38409 -30666 36995 11559 12460 4866 41587 85153 50846 39480 5937 20945
7649 20945 55245 36256 39629 19814 21328 6128 9167 -8329 -709 3017 32737 20579 -4642
7636 -4642 -7245 -12139 1905 21215 40605 9660 71000 86524 53431 -1113 -56346 -42875
7624 -42875 -20747 5349 53766 89194 105662 60864 49900 53809 21017 27512 62628 83729
7612 83729 78115 35882 4294 31697 61525 81122 22903 44464 18516 10794 44387 54193
7600 54193 54743 33907 89384 83964 63453 30880 38261 43892 7415 18271 22563 29178 43063
7587 43063 56990 27706 36105 36158 42031 62670 41572 35132 18716 19163 -10174 1867 13518
7574 13518 68217 50340 15172 53828 38748 15670 76491 58264 48600 21718 32680 75850
7562 75850 105004 56492 23186 53395 46494 40854 65499 91901 60378 21978 42074 12058
7550 12058 28584 63755 84586 85439 44241 52632 61834 84800 113311 145984 102161 85233 134268
7537 134268 128093 95161 126594 159473 161354 170299 148426 151172 151245 154515 159947 170807 191113
7524 191113 196249 196058 199639 206177 187283 171556 140728 203573 248156 231463 255858 290515 284951
7511 284951 308450 295346 275690 284262 337602 329785 352039 403254 339802 368127 471604 477819
7499 477819 446856 430604 425360 416619 378061 319037 272587 257393 221291 221012 273955 261753
7487 261753 237743 248312 262748 277793 262944 220147 231196 216658 181912 208325 218222 173638
7475 173638 171831 168202 116832 94785 91412 135547 168055 173829 176432 192346 189145 169218 159281
7462 159281 147537 147773 220803 205410 206425 228983 230146 194146 196698 220694 193675 206368 230665
7449 230665 243299 240043 267335 259153 271534 286525 313528 310429 246595 333048 365816 327810
7437 327810 345777 308350 316776 281891 317381 315729 307908 291611 234666 204459 169037 189953
7425 189953 222305 199100 191966 158997 156084 193897 180163 192025 189382 186097 176642 179228 228986
7412 228986 217727 197205 152766 124996 173784 172095 177442 201076 194903 285206 248533 207722
7400 207722 181686 181571 196295 208022 202067 227020 252063 215033 237057 190271 206706 205648
7388 205648 214637 176971 225334 242798 225882 210833 230556 274933 267613 199904 211154 201752
7376 201752 159481 192355 187714 200844 233398 263941 257828 223723 181641 190217 189208 194153 211682
7363 211682 193051 210053 223946 230762 260237 246211 228573 182150 227186 285698 274669 271491
7351 271491 237443 279333 293875 258025 246205 259115 278600 231434 209153 260210 289102 239076
7339 239076 231213 231079 239793 242887 232750 227232 227533 263861 279359 310179 326572 321733 296909
7326 296909 286716 296936 262456 255332 274011 315084 302952 254451 286870 325426 341554 328113
7314 328113 336808 370464 315875 313000 344252 333460 326578 309700 350180 322807 333512 364982
7302 364982 368196 385576 402918 385930 372907 369785 383027 306452 265736 303175 368323 382697
7290 382697 372739 371182 373222 406692 448124 438258 409752 415087 399932 384008 393463 435710 426866
7277 426866 419540 434749 423707 437059 443620 442371 477529 488277 508284 478182 480823 458002
7265 458002 455451 483334 505948 513477 497320 485017 460874 456494 459613 545040 562817 584945
7253 584945 562434 518210 514301 525063 496812 497691 556952 591893 592788 583749 618962 598964 567963
7240 567963 580943 583728 589616 626434 626791 634268 629113 663935 691436 720218 744673 749229 695278
7227 695278 761112 759157 756987 751826 795050 778672 794430 857557 849787 889265 859570 831997
7215 831997 862529 923919 922431 952952 988383 976352 987209 977501 1026272 1037898 1069853 1058415
7203 1058415 1072528 1086906 1073336 1065208 1117161 1174007 1180619 1200913 1205854 1332788 1384579 1320341
7191 1320341 1253164 1286144 1390782 1408542 1473529 1496408 1519728 1535791 1535898 1572252 1571428 1616810
7179 1616810 1646061 1686062 1743991 1709709 1718162 1814433 1847012 1862306 1897303 1908545 1929616 1993122
7167 1993122 2062840 2099296 2132586 2197079 2187531 2239093 2261076 2355290 2425942 2463139 2517379 2619912
7155 2619912 2692098 2756920 2785852 2890154 2926142 3009207 3106980 3196688 3287605 3401741 3499294
7144 3499294 3627163 3717608 3851474 4030381 4096698 4226683 4308499 4381567 4462817 4652646
7134 4652646 4814069 4918223 5058117 5182164 5242205 5390436 5585673 5770820 5963383 6139627
7124 6139627 6273009 6496081 6774146 7043826 7331193 7715006 8189066 8599463 9074485 9678172
7114 9678172 10435185 11308295 12352941 13621867 15149173 16901954 19009283 21486167 24491672
7105 24491672 28135022 32377574 37235924 42768038 48694043 53760394 55779117 53502302
7097 53502302 47172626 38498661 30126309 23556971 18985162 15958698 13897066 12428478
7089 12428478 11465606 10723517 10123443 9619092 9216546 8805232 8440113 8115836 7828251
7080 7828251 7641051 7536140 7390562 7171404 6963967 6795127 6688062 6541137 6450771 6366435
7070 6366435 6312638 6283611 6249805 6240049 6298334 6332589 6481776 6652419 6705991 6853749 7083566
7059 7083566 7364376 7670935 8075029 8531605 9072370 9657890 10404429 11283662 12324313
7050 12324313 13496177 14892638 16429310 18171613 20016589 21926473 24098161 26567250
7042 26567250 29085532 31204077 32650633 33065174 31919210 29218604 25148138 20573515
7034 20573515 16549594 13550876 11459934 10071731 9076079 8298222 7662965 7053766 6610815
7025 6610815 6280683 5998346 5780777 5570930 5386540 5219249 5100717 4950972 4697675 4406216
7015 4406216 4081558 3770456 3596608 3455280 3289584 3211638 3143393 3017517 2882076 2785780
7005 2785780 2721417 2658353 2609427 2584010 2513063 2518261 2468198 2445188 2410697 2414183 2388463 2390417
6993 2390417 2408893 2381368 2456718 2392246 2377474 2498080 2553957 2640292 2769032 2912852 3096655
6982 3096655 3314328 3599225 3971351 4261495 4707365 5089509 5534813 6001924 6527938 7209017
6972 7209017 8018304 8720513 9296430 9644746 9528408 8922942 7828107 6466407 5206777
6963 5206777 4228751 3525494 3047247 2709073 2509902 2328300 2174975 2045502 1868580 1751618
6953 1751618 1622117 1527605 1416476 1333559 1295719 1241153 1187260 1099240 1034803 984977 993904
6942 993904 979832 961037 914605 902379 890017 905040 835783 786553 740384 732450 737692 669982
6930 669982 662131 705295 657208 620436 626698 642854 674640 656877 637126 621099 540598 531117
6918 531117 511245 447668 456841 423292 412519 471512 509180 512606 519970 493015 420735 422286
6906 422286 440607 444994 446439 438238 414734 376187 394767 391584 385189 387432 398619 403076 380183
6893 380183 337118 324644 328684 386273 404617 418955 394461 390846 425722 408014 386137 393259
6881 393259 417500 414498 388460 382019 325930 306972 353739 372038 341982 317368 313652 299448
6869 299448 306061 300316 351452 344968 326154 323493 312523 284940 311215 295293 336250 315111
6857 315111 312477 295622 285138 287887 274495 239259 243378 275968 308022 338327 349091 314198
6845 314198 317257 330068 339159 348590 309478 302409 286073 317667 313342 294116 312131 295910 271702
6832 271702 286252 307573 301520 322744 302866 293858 314940 336724 337959 302178 320600 259751
6820 259751 256471 260195 258684 281280 280840 289913 289289 305671 364886 326268 255609 250794 357652
6807 357652 359483 271808 257524 258282 261752 215272 208444 225405 214798 243387 226979 240381 268691
6794 268691 248395 203717 210002 264353 322488 332187 280284 291643 263947 276879 313601 272886
6782 272886 208834 244287 221095 217668 306339 305532 267858 239829 253301 301689 265122 215459
6770 215459 244845 281968 311232 299395 298243 323641 276906 223946 273444 302703 368244 380043
6758 380043 372494 351807 341227 340157 324899 272709 267525 255441 248323 192665 222812 204934
6746 204934 178339 180920 181895 167106 169328 210459 159201 137150 203641 243820 169369 128435
6734 128435 161963 203007 206806 230151 210943 233230 222765 219679 199737 164561 226685 245284
6722 245284 240762 220914 224768 227138 244894 307065 296113 308031 250845 231807 233186 254819
6710 254819 292708 302033 315538 314875 299865 313116 315575 289646 316461 379551 434789 423935
6698 423935 382944 360357 399619 398891 353687 311542 298921 309930 263408 248480 239390 277008
6686 277008 261653 263411 272035 242706 224210 204305 214909 208983 224639 238207 277520 273564
6674 273564 236486 216380 230657 209830 180944 189461 205184 234113 226396 192011 233129 283265
6662 283265 265416 265448 250154 276509 263523 256223 240430 249034 295598 259808 206812 216971 186058
6649 186058 212069 241697 298277 336813 356596 280666 258664 284424 257531 297823 286736 311769
6637 311769 348507 324484 305207 299387 342362 286290 231217 233178 210696 234406 246311 240915
6625 240915 222016 196036 208729 172583 156743 189166 193947 224548 205272 153476 149333 219445
6613 219445 182521 173979 188661 163781 154088 182138 169658 135948 194162 234097 192814 192992
6601 192992 133985 124159 89325 102454 112819 124070 168872 185539 170309 202567 191175 172115
6589 172115 198882 176530 193498 189364 158426 160502 153270 200049 184053 203222 206716 186070
6577 186070 237222 215243 217618 187597 224072 177357 155546 221328 256493 238297 187509 174749
6565 174749 190077 166483 199534 205714 228448 258799 276707 200852 208795 270857 216042 169115
6553 169115 178117 209838 175212 194451 214993 173046 175602 233011 220485 233969 207593 169518
6541 169518 141841 205322 227264 213697 195098 221017 270918 308305 196273 129295 190974
6530 190974 204167 170935 174895 179458 167474 202550 186539 241649 256259 252379 281668 275043
6518 275043 249830 244049 290744 299043 286820 314584 223573 198473 245855 221444 209466 237421
6506 237421 237054 265313 227480 241334 222826 236620 272073 277323 261545 267515 274996 225813 279044
6493 279044 247938 266291 226891 191347 203940 216610 241010 176461 200427 242174 189948 194119
6481 194119 227731 256497 242339 283887 289730 269405 252964 217469 205767 226651 260212 168605
6469 168605 196318 233920 249330 249028 261582 247235 240347 214125 208263 205575 205840 219832 234587
6456 234587 228492 241538 260931 242155 242759 240957 227279 201297 242847 249565 277753 266413 233021
6443 233021 265885 231690 250247 307830 279248 263949 265711 276672 289082 327990 300971 325352
6431 325352 296344 306852 299895 274254 255172 275459 307139 281551 310612 304641 303214 310992
6419 310992 332898 310963 331410 346198 334926 352713 330476 326829 315815 313493 343628 343698 373834
6406 373834 353284 328900 352940 375074 337789 321220 294960 326061 350714 375094 345605 388665
6394 388665 422963 425731 432420 422114 450627 443372 425721 417826 381111 393960 390254 370009 431736
6381 431736 488632 453008 401539 409152 395567 429141 410069 386439 409100 432230 458479 374006
6369 374006 375294 393351 397984 445721 424804 394656 342914 372030 380230 429427 411173 413973
6357 413973 407802 433650 474829 426308 389054 481457 491425 506889 482498 463350 447068 443519
6345 443519 474649 500701 517171 525928 522103 527809 536158 583433 542387 540288 593897 627255 580772
6332 580772 535204 544770 492382 556091 549936 560708 602290 579690 518480 475866 519125 541479
6320 541479 492188 519147 553149 579522 536044 501491 472164 513505 548933 526294 536705 562713
6308 562713 556886 537205 534222 519560 571205 640140 636563 648394 636593 608538 623550 708788
6296 708788 688147 684281 662320 620515 643374 626345 612949 618105 635173 639444 639268 645220 578770
6283 578770 574420 581478 571407 600930 613084 586962 603619 630960 643744 711104 693958 678335
6271 678335 658175 594175 645485 665391 723891 778345 744338 732089 745840 789392 749179 729690
6259 729690 742507 705793 701172 755002 763533 747737 696776 755877 759726 783802 806520 842419
6247 842419 882030 879795 908305 883189 904629 897879 896080 909449 946352 999229 985520 1010018
6235 1010018 981136 928718 859441 843624 855539 854172 869312 840285 858346 902124 872977 875719
6223 875719 894076 845382 817708 832362 862360 854186 824193 826524 828505 788384 792426 843953
6211 843953 871691 854650 877010 882560 926667 878368 909705 893003 876136 914936 963278 953231
6199 953231 944949 922148 941017 938359 889985 891221 840976 887614 950258 987353 1004806 1003754
6187 1003754 1016681 1079127 1061447 1060602 1084189 1092423 1101672 1077780 1089630 1123797 1087988 1063141
6175 1063141 1077893 1129609 1096376 1098938 1113028 1166499 1205898 1213676 1162604 1163585 1156610 1204773
6163 1204773 1229509 1169423 1235386 1235906 1254574 1272871 1267322 1296561 1284708 1349360 1351412 1318038
6151 1318038 1391715 1391413 1418694 1449235 1488737 1500001 1524906 1507720 1514857 1562243 1560147 1619736
6139 1619736 1630379 1637909 1652545 1654570 1677304 1712733 1728674 1785554 1851111 1893432 1882558 1851800
6127 1851800 1890945 1966279 2033331 2061408 2088386 2128130 2196835 2165467 2179524 2246368 2293018
6116 2293018 2305320 2319601 2358978 2385205 2369755 2456892 2505119 2564460 2624169 2655688 2701461
6105 2701461 2733761 2857272 2946079 2968865 2987523 3073585 3134263 3205716 3245554 3303623 3405291
6094 3405291 3426571 3518900 3620194 3673314 3748433 3808780 3888296 3968205 4039605 4119992 4243718
6083 4243718 4336261 4506274 4700489 4871126 5073582 5277184 5579091 5907965 6335779 6876329
6073 6876329 7453471 8074692 8798768 9711272 10733791 11922166 13159379 14638004 16381048
6064 16381048 17728365 17975023 16940477 15276679 13844358 13069963 12931245 13178030 13712286
6055 13712286 14440668 15426245 16565982 17534405 17455280 15996455 13677240 11451917 9916372
6046 9916372 8884066 8184285 7716565 7445818 7292660 7126401 7070756 7064650 7094173 7114631
6036 7114631 7131590 7230737 7256285 7227289 7211452 7203389 7217744 7368779 7491133 7620830 7742011
6025 7742011 8017597 8429464 8872167 9470713 10188107 10987685 11995980 13224787 14583882
6016 14583882 16025696 17762650 19760282 21762767 22844300 22148767 20042674 17722275
6008 17722275 16182784 15523891 15523362 16002366 16764144 17825960 19247831 20834258 21599461
5999 21599461 20537306 17764501 14584612 11937895 10153171 8939990 8066416 7438972
5991 7438972 6904802 6532176 6259571 6032847 5836782 5710915 5627411 5559662 5476534 5477761
5981 5477761 5463213 5461388 5419625 5389699 5349682 5340494 5302983 5115949 4960141 4851768 4745738
5970 4745738 4697108 4685051 4635875 4617726 4605449 4631261 4593308 4513277 4497708 4597718 4600307
5959 4600307 4584232 4617502 4651006 4662348 4669547 4675693 4635109 4584780 4545761 4525555 4546050 4591542
5947 4591542 4584647 4621009 4716510 4799653 4849507 4933588 4976810 5032028 5060463 5141933 5178371 5293630
5935 5293630 5400035 5464600 5514994 5557991 5506849 5446943 5445354 5430335 5405113 5387045 5371010
5924 5371010 5334074 5369722 5443016 5436323 5517187 5547053 5543539 5651739 5748192 5832348 5871253 5972736
5912 5972736 6078582 6152873 6264472 6294734 6309831 6368598 6376788 6371680 6412412 6475328 6506775
5901 6506775 6511498 6517587 6622741 6721290 6748213 6897894 7076532 7139016 7324092 7509440 7654917
5890 7654917 7910492 8102927 8298616 8577697 8908655 9253502 9600411 10001257 10447832 10997672
5880 10997672 11599651 12152464 12541543 12740279 12748694 12593249 12385118 12171676 11940758 11746280
5870 11746280 11593576 11533270 11459467 11392448 11392019 11451373 11587190 11845044 12036427 12229885 12530202
5859 12530202 12913191 13278426 13711245 14280806 14905614 15476286 15928473 16271376 16399256
5850 16399256 16386890 16283571 16119720 15853664 15633895 15460230 15232123 15004525 14854102 14806706
5840 14806706 14760160 14732573 14732135 14769789 14883554 14946568 14996213 15072866 15143840 15159030 15241175
5829 15241175 15409861 15607886 15847693 16058826 16303048 16578120 16898920 17317258 17779029
5820 17779029 18274818 18887703 19490404 20035664 20527317 21029031 21573565 22066116 22578751
5811 22578751 22993631 23439613 24035657 24710155 25509524 26385457 27260770 28064240 28750139
5802 28750139 29384727 30101337 31005273 32068216 33241568 34468494 35668353 36846354 38064605
5793 38064605 39330845 40609580 41682645 42501255 43091993 43107903 42321122 40807036 38551772
5784 38551772 35840269 33198821 31105863 29687069 28847851 28510377 28595045 28988856 29631825
5775 29631825 30487991 31472022 32543973 33584387 34595732 35577262 36851898 38529233 40390998
5766 40390998 41839885 42498167 42587915 41818192 39495708 35543461 31098776 27301032 24418797
5757 24418797 22263194 20587840 19319383 18313932 17512886 16888063 16322911 15905800 15615083
5748 15615083 15336870 15139629 15035051 15106478 15343810 15639125 16080504 16621666 17199490 17883877
5738 17883877 18658500 19404450 20353791 21659348 23128318 24250916 24700746 24021335 21859719
5729 21859719 19188064 16988679 15484379 14553117 13878165 13442391 13212522 13077994 12975735
5720 12975735 12934031 12927115 13042346 13238765 13508772 13879072 14364142 15038285 15786629 16625381
5710 16625381 17565676 18804556 20296732 21770339 22754121 22958657 21774249 19295814 16465183
5701 16465183 14268755 12805612 11893365 11304665 10857046 10624407 10493462 10453369 10494271
5692 10494271 10705383 10942536 11291316 11762951 12246364 12793652 13376545 14054736 14958698
5683 14958698 16031557 16987002 17596106 17582351 16571258 14715685 12827072 11424863 10543211
5674 10543211 10042403 9656755 9351529 9270697 9235744 9359279 9488960 9632104 9835809 10126560
5664 10126560 10492728 10956580 11558879 12230013 12910336 13678171 14590755 15802025 17169117
5655 17169117 18260339 18835605 18539194 17109395 14895554 12824563 11326996 10339316 9616422
5646 9616422 9185401 8827383 8521133 8319806 8164761 8056515 8012466 7898715 7831789 7755578
5636 7755578 7788606 7800488 7843745 7966443 8112242 8168603 8282165 8279756 8215984 8071111 7868693
5625 7868693 7813210 7716728 7534717 7480650 7450076 7400452 7430428 7537381 7598554 7707558 7775630
5614 7775630 7954825 8151871 8394416 8645583 8855700 9082892 9216634 9273214 9219933 9079871
5604 9079871 8878842 8551524 8209950 7992303 7784297 7647507 7669179 7705743 7804679 8005135
5594 8005135 8196174 8465512 8761093 9118301 9410105 9819281 10279636 10721693 11136749 11595510
5584 11595510 11966176 12199203 12189480 11993360 11649127 11210374 10644342 10084427 9599308 9212332
5574 9212332 8933108 8755219 8676613 8663607 8698538 8728199 8837170 9015736 9188999 9453690
5564 9453690 9689547 10044017 10367540 10687673 10981174 11242025 11333287 11177206 10787812 10298249
5554 10298249 9722994 9065897 8459690 8005258 7664917 7457620 7271905 7209282 7205942 7164564
5544 7164564 7187173 7238136 7187781 7233549 7207001 7243616 7254153 7310854 7375649 7392581 7407608
5533 7407608 7343741 7229707 6938056 6583993 6225172 5915993 5610793 5459302 5253060 5109313
5523 5109313 5014520 4914936 4782302 4696115 4629141 4523926 4443240 4417078 4344602 4370791 4378758
5512 4378758 4384906 4380667 4362273 4393537 4362833 4314461 4218888 4101302 4071930 4045333 3995936 3961882
5500 3961882 3921525 3894029 3848172 3860331 3880786 3783160 3785434 3739948 3666119 3585104 3507896 3431281
5488 3431281 3437519 3375812 3340461 3311253 3259858 3273760 3314482 3308637 3302052 3255484 3280143 3200171
5476 3200171 3232720 3247591 3195943 3173910 3118525 3070788 3004115 2988335 3031683 2977227 2906542
5465 2906542 2919537 2880507 2894073 2886167 2860857 2872628 2915106 2962515 2982831 2987465 3045950 3043021
5453 3043021 3078103 3073042 3008875 3000896 2980452 2931354 2934640 2923669 2864508 2881219 2854602 2855902
5441 2855902 2834747 2852775 2875448 2896485 2879825 2849518 2940431 2988719 3012671 3047135 3105235
5430 3105235 3165093 3133127 3124345 3153899 3143946 3098993 3056310 3045639 2996897 2972880 2964635 2985471
5418 2985471 2995814 3043915 3039197 3105388 3113902 3132460 3144743 3214620 3249654 3287703 3358632 3409444
5406 3409444 3419990 3487467 3533646 3558248 3533451 3534398 3556803 3614719 3674689 3670510 3683153 3706791
5394 3706791 3747300 3750651 3750110 3742599 3708136 3761800 3800972 3837738 3854813 3851695 3950714 4055733
5382 4055733 4077288 4117089 4191435 4234066 4297848 4400973 4458949 4521290 4632496 4755465 4858070
5371 4858070 4950215 5139837 5307923 5383175 5462449 5467637 5428753 5459982 5483324 5539095 5582532
5360 5582532 5672371 5829390 5986181 6151773 6339423 6530130 6767534 7059911 7298212 7526374
5350 7526374 7738902 7850882 8014595 8074224 8005942 7888756 7733170 7673080 7635836 7642780 7729728
5339 7729728 7794752 7860031 7914630 8039858 8064456 8084694 8113477 8071051 8011662 7936697 7834842
5328 7834842 7656581 7446294 7248978 7079039 6908626 6754235 6662749 6533129 6394947 6276942
5318 6276942 6139043 6033461 5958316 5937437 5891910 5760870 5638420 5485945 5346192 5269165
5308 5269165 5186737 5096286 5084856 5059470 5068669 5047648 5021976 4992402 4979153 4988326 4995978 5059160
5296 5059160 4991540 4895575 4902031 4866136 4852099 4819807 4819196 4826744 4886012 4943599 4993273 5160280
5284 5160280 5274060 5317521 5340874 5413662 5470815 5524924 5552146 5553044 5469519 5295775 5197408
5273 5197408 5184653 5135851 5157506 5232476 5301586 5366967 5435689 5484731 5508883 5507044 5552001 5579504
5261 5579504 5570089 5607443 5585511 5606632 5663051 5691228 5741780 5754874 5715438 5644217 5522066
5250 5522066 5327133 5143059 4948872 4737297 4628220 4611957 4602729 4637897 4660161 4724338 4866713
5239 4866713 4916931 5027825 5173711 5276958 5361614 5473080 5484202 5488506 5503731 5547306 5598914
5228 5598914 5505276 5441557 5393637 5311983 5159996 5019515 4869562 4829979 4814187 4835503 4835879
5217 4835879 4865301 4982019 5065027 5119461 5174387 5219960 5331700 5421969 5566023 5675548 5838841
5206 5838841 6030356 6141503 6186399 6130956 5978295 5785699 5648399 5465435 5376565 5267220
5196 5267220 5163707 5130791 5147264 5158429 5203521 5273769 5346200 5432936 5531633 5607015 5718257
5185 5718257 5797894 5904664 5991535 6147669 6262294 6306015 6273786 6214933 6196899 6142657 6055700
5174 6055700 5979438 5942433 5866204 5877758 5937370 5971552 6065623 6145732 6250347 6373013 6475390
5163 6475390 6613762 6757810 7010798 7227253 7367770 7543145 7667425 7853725 8048618 8191025
5153 8191025 8374745 8635675 8969171 9313306 9728718 10194882 10772174 11403372 11958027 12299102
5143 12299102 12346011 12144780 12128321 12365987 12750665 13314637 13994271 14818427 15850019 16878627
5133 16878627 17821949 18338688 18167281 17574690 17226960 17403117 17931213 18518099 18992039
5124 18992039 19299471 19594097 20062756 20729180 21458814 22003581 22250692 22461336 22779192
5115 22779192 23142901 23607576 23807314 23414032 22703247 22381173 22620217 23429408 24466866
5106 24466866 25448512 26106850 26232307 26386767 26802336 27535357 28252955 28794208 29245209
5097 29245209 29583478 30168728 31016491 31922626 32706468 33624463 34858404 36476765 38200347
5088 38200347 39571556 40225322 39889980 37988181 34840149 31267460 28164402 26078319
5080 26078319 24831228 24265186 24260592 24682782 25295493 26046568 26604174 26820876 26976396 27349156
5070 27349156 27934249 28632171 29308538 29882082 30519048 31193327 31677931 31600579 30775936 29627681
5060 29627681 28422815 27325378 26506061 26070658 25873620 25984464 26519333 27339351 28366973
5051 28366973 29217246 29961446 30707137 31345653 31465095 31006237 30283794 29997150 29942405 29664137
5041 29664137 29306695 29302273 29580185 29683172 29575928 29415148 29351652 29614137 30321246 31347073
5031 31347073 32845602 34996023 37648360 40291402 42258012 43432223 44414556 45166280
5023 45166280 44586604 42337900 39415657 36837260 35402037 35381863 36269199 37452315 38699411
5014 38699411 38829020 37117232 34893095 33537968 33333289 33685772 33474552 32297834 30056484
5005 30056484 27932857 26771931 26416538 26298635 26348519 26537713 26654479 26193105 24754604
4996 24754604 22721494 20634341 18812908 17680477 17182123 16940437 16934665 16964236 16629888
4987 16629888 16015030 15410020 14956117 14871415 14912548 14835361 14436940 13734343 13102734 12716492
4977 12716492 12443056 12087045 11629018 11232299 11000367 10840443 10578132 9889324 9082896
4968 9082896 8516134 8098597 7841932 7629834 7559758 7532479 7495594 7515601 7579692 7615560 7711345
4957 7711345 7922142 8100279 8200659 8259437 8312594 8277022 8066096 7653956 7155194 6779353
4947 6779353 6465847 6289380 6107151 5968592 5857650 5814947 5751153 5699103 5740065 5736762 5727118
4936 5727118 5690471 5663485 5651923 5649600 5662109 5615711 5623051 5588809 5646823 5750874 5781081 5766807
4924 5766807 5751116 5784573 5765873 5773605 5879050 5916613 5922896 5980021 6110995 6296856 6495290
4913 6495290 6785251 7132679 7511542 7893744 8417716 9038724 9872758 10898897 12013754
4904 12013754 12874480 13437576 14093639 14419260 13873577 12399539 10530894 8984934 8007858
4895 8007858 7321984 6857566 6615679 6390188 6173456 6027588 5970029 5948267 5901788 5912489
4885 5912489 5900021 5904094 5993003 6074793 6095769 6199714 6335881 6474564 6672370 6914134 7222414
4874 7222414 7643118 8084130 8473167 8687689 8893732 9186917 9735152 10536992 11579660
4865 11579660 12773497 14015216 15511710 16948290 17117791 15236675 12879364 11234697
4857 11234697 10366212 10070331 10129398 10211549 10367070 10612213 11053957 11675116 12521187 13748543
4847 13748543 15168406 15455205 13833651 11564930 9698995 8403503 7555741 7052636 6748248
4838 6748248 6557834 6448547 6403942 6181220 5795109 5542361 5292886 5143873 5123210 5066846
4828 5066846 4959869 4931036 4968007 5030472 5038865 5034081 5028459 5062041 5131980 5191701 5337436 5445361
4816 5445361 5587628 5736882 5915948 6204972 6595266 7033416 7494018 8019845 8683145 9138523
4806 9138523 9141516 8872290 8716279 8580301 8588205 8845802 9213835 9680365 10315329 11109644
4796 11109644 12030128 12902239 13288632 12902734 12401405 12286977 12467983 12549658 12127954 11462747
4786 11462747 10932807 10800441 10990866 11538502 12243864 13119543 14166851 15155922 15793842
4777 15793842 16105721 16509210 17308489 18184127 18629760 18019108 16417566 15008199 14269933
4768 14269933 13948006 13653681 13209515 12844240 12305142 11782307 11670442 11909163 12143639
4759 12143639 12491442 12680796 12640228 12643332 12576909 12426888 12318164 12185374 11657398 10550223
4749 10550223 9354956 8502853 7987640 7716759 7525381 7460377 7444615 7400001 7429684 7534249
4739 7534249 7644952 7875871 8093709 8345141 8603194 8985736 9395435 9948429 10627508 11428286
4729 11428286 12250081 13040762 13702451 14240845 14717763 15164261 15990742 17278617 18700391
4720 18700391 19877549 20133586 18803594 16398856 14336463 13032920 12393633 12224759 12299259
4711 12299259 12616071 13195317 14042513 15112187 16390090 17736091 19301471 21260108 23543434
4702 23543434 25938765 28204234 30020528 30428142 29384424 27427857 24083845 20056938
4694 20056938 16810069 14599863 13220007 12428909 12032210 11970037 12154889 12455541 12970095
4685 12970095 13749517 14558344 15439664 16632022 18171209 19744145 20820734 20749000 18724035
4676 18724035 15624410 13086364 11499054 10559590 9980565 9470441 8802628 8179679 7552386
4667 7552386 6897832 6312593 5855561 5577114 5324351 5124192 4961594 4814312 4734173 4626449
4657 4626449 4562706 4477709 4435199 4366833 4279150 4264525 4271853 4263468 4339952 4329648 4326911 4398827
4645 4398827 4418411 4421500 4483341 4544077 4603075 4612881 4647029 4687424 4617645 4462368 4324114
4634 4324114 4211296 4164099 4159285 4220883 4285542 4267159 4265772 4364265 4503161 4603502 4643444
4623 4643444 4770141 4933644 5050885 5132160 5145277 5223357 5271264 5251892 5227578 5165132 5117154
4612 5117154 5079649 5098824 5145346 5231927 5228307 5160254 5184616 5181020 5203462 5314909 5369763 5505478
4600 5505478 5647882 5791793 5938062 6018519 6149015 6227149 6370435 6534836 6690552 6875214
4590 6875214 7101602 7241198 7332836 7353366 7335203 7240343 7194205 7139250 7158102 7269442 7413483
4579 7413483 7643909 7868792 8036878 8250779 8424489 8664224 8975200 9335909 9653260 10075942
4569 10075942 10715116 11447097 12211638 12940693 13747082 14848441 16129065 17504860 19149333
4560 19149333 21175115 23336564 25126462 25761424 24804606 22833252 20959872 19881802
4552 19881802 19564680 19798085 20456418 21486117 22931596 24572345 25792338 26057319 24825647
4543 24825647 22627406 20679004 19571041 19289513 19595303 20392134 21462388 22290096 22305291
4534 22305291 21134669 19272379 17606784 16617743 16230582 16289476 16622396 17226052 18130710
4525 18130710 19057558 19555420 19141037 17501201 15090783 12804106 11145432 10035949 9274226
4516 9274226 8751534 8319817 7979919 7714203 7535841 7383518 7235728 7162804 7052248 6897011
4506 6897011 6775035 6732513 6647682 6569552 6468727 6437292 6338278 6259477 6223474 6146262 6060681
4495 6060681 6034245 6034298 6027636 5968985 5967829 6016633 6044746 6106332 6160039 6264934 6410690 6544660
4483 6544660 6714036 6906483 7169441 7459426 7799901 8239361 8758924 9295061 9951129 10620347
4473 10620347 11387179 12339928 13389057 14661326 16166875 17660149 18384832 17833881 16359659
4464 16359659 15064652 14520253 14570565 14941322 15747257 17015754 18230102 18478687 17108109
4455 17108109 14888147 13234756 12433113 12232233 12390487 12690823 13298912 14214651 15274850
4446 15274850 16221018 16542643 16072014 15202707 14371392 13774970 13534780 13667242 14268699
4437 14268699 15007991 15469812 14835603 13203893 11255794 9876589 9082045 8637986 8289197
4428 8289197 7919422 7525215 7106799 6704802 6361692 6065670 5798740 5634533 5515524 5441303
4418 5441303 5386164 5295116 5245839 5141423 4981251 4882675 4813216 4762248 4755204 4792831 4811222
4407 4811222 4906139 5008533 5032629 4852626 4700617 4563593 4486078 4422301 4464577 4525099 4543771
4396 4543771 4602039 4670858 4786529 4813055 4646879 4488214 4277438 4123528 4039716 3972720
4386 3972720 3870506 3827996 3845934 3825110 3797191 3727240 3653401 3601206 3586972 3588430 3587588 3628811
4374 3628811 3676899 3715271 3677412 3712624 3765803 3733638 3597165 3503375 3517057 3508668 3501592 3550827
4362 3550827 3597351 3572487 3582633 3593487 3585157 3593637 3657508 3638600 3630246 3651004 3651118 3677160
4350 3677160 3744500 3729734 3771691 3788492 3734832 3738065 3705434 3669013 3620460 3629731 3604596 3620824
4338 3620824 3627108 3658853 3699324 3670444 3682244 3713954 3751332 3775373 3803466 3854555 3817692 3796804
4326 3796804 3813818 3803590 3710641 3652678 3691358 3694794 3742768 3815233 3824493 3837402 3841825 3857042
4314 3857042 3881506 3939967 3980441 3984019 4008499 4030760 4082747 4058566 4045603 4075762 4081825 4127544
4302 4127544 4133778 4124120 4260279 4392589 4446397 4530559 4534390 4489001 4479242 4448408 4488351 4439870
4290 4439870 4442257 4471922 4476037 4538419 4624030 4641631 4653004 4629506 4656799 4695536 4712116 4809571
4278 4809571 4861896 4967986 5070990 5146043 5159414 5189287 5264431 5285522 5317144 5359703 5405072
4267 5405072 5459932 5515401 5568665 5652159 5685033 5697586 5723357 5745244 5769570 5732710 5712212
4256 5712212 5754212 5706596 5691267 5817906 5853043 5873843 5926345 6041644 6157820 6271343 6361450
4245 6361450 6518736 6610788 6708673 6865422 6956120 7093606 7252882 7425466 7609507 7771407
4235 7771407 7895950 8027867 8183329 8286121 8364578 8440398 8515150 8640233 8776061 8946288
4225 8946288 9095905 9288421 9507880 9716346 9875635 10082441 10277592 10468817 10666065 10873143
4215 10873143 11030549 11173568 11318044 11469439 11717733 11965155 12192552 12483041 12773925
4206 12773925 13002945 13251492 13531691 13779758 14024504 14301256 14682842 15064649 15413668
4197 15413668 15871232 16301791 16672692 17010332 17360366 17702754 18009667 18404802 18780161
4188 18780161 19141374 19610072 20230194 20838624 21414932 22054155 22683029 23326771 23992759
4179 23992759 24655893 25295160 25969281 26639352 27353212 28025875 28732662 29534027 30315104
4170 30315104 31174239 32118494 33158610 34203886 35364405 36592938 37970968 39506998
4162 39506998 41346305 43407980 45736650 48378572 51420867 54894593 58919004 63653375
4154 63653375 69428695 76428161 84657726 94269878 105679983 119320999 135955672 155092175
4146 155092175 176725514 201642128 230510945 257045884 270320568 266723434 250945518
4139 250945518 232804239 213611604 190361829 163815537 139127809 120587416 108031247
4132 108031247 99596100 93889905 90038066 86781628 82352870 76067902 68658092 61415896
4124 61415896 55143042 49902150 45508951 41823173 38737352 36078249 33941638 32087133
4116 32087133 30439309 28888815 27503275 26329932 25201288 24184305 23306953 22442124
4108 22442124 21770125 21221613 20541167 19685828 18879119 18154242 17474948 16841333 16240773
4099 16240773 15712581 15228743 14733253 14333291 13960340 13701262 13454160 13169225 12928174
4090 12928174 12727403 12478411 12328840 12195076 11971367 11855224 11761715 11649846 11503281 11258590
4080 11258590 10990116 10630649 10246944 9919483 9629592 9429716 9188829 9018558 8952596 8896499
4070 8896499 8796771 8666220 8568983 8473524 8321877 8203281 8128855 8040823 7988746 7878074 7884029
4059 7884029 7876722 7823543 7690640 7607078 7535443 7516607 7628163 7824128 8043128 8327064 8739195
4048 8739195 9187502 9646332 10152871 10746988 11458613 12175827 12576440 12563855 11796916 10364634
4038 10364634 8891161 7775078 6974539 6392930 5980969 5682539 5451956 5317107 5229161
4029 5229161 5138789 5032908 4867838 4741442 4590805 4472450 4335714 4159643 3983656 3879724
4019 3879724 3733658 3613300 3487679 3379589 3302644 3199247 3086253 3067836 3013002 3056028
4009 3056028 3076921 2991713 2935644 3013005 3033193 3075173 3119642 3176263 3281650 3244927 3148643
3998 3148643 2915121 2711592 2663543 2583416 2554354 2610980 2576806 2626715 2630597 2603775 2526711
3987 2526711 2470739 2394812 2344159 2295303 2254619 2235024 2237076 2242469 2214150 2198622 2259901 2282885
3975 2282885 2273177 2243501 2157523 2124585 2057152 1993812 1965410 2017279 2104920 2081254 2102233 2042269
3963 2042269 2012385 1980331 1971372 1994972 1975294 1887096 1886969 1900992 1872099 1914751 1944625 1993519
3951 1993519 2004699 2087207 2174430 2232960 2282382 2273064 2291879 2251395 2260392 2287267 2285570 2270304
3939 2270304 2256820 2224554 2208500 2087809 1975659 1900077 1885019 1904850 1880384 1872557 1874025
3928 1874025 1906947 1934215 1959642 1972294 1915862 1858280 1758383 1685387 1689262 1665191 1638021 1652485
3916 1652485 1710868 1691308 1664177 1627868 1639931 1653695 1658755 1604202 1568106 1539354 1511789 1524086
3904 1524086 1489186 1456661 1490422 1483494 1466032 1463746 1444819 1471214 1418790 1395267 1477920 1502511
3892 1502511 1514775 1600865 1593813 1645251 1704256 1685134 1746412 1822550 1894077 1915464 1980753 2024205
3880 2024205 2051936 2044508 2086722 2158518 2244030 2238749 2285100 2308302 2347956 2329255 2302339 2352951
3868 2352951 2354133 2427052 2457889 2558502 2631783 2709857 2780443 2850143 2961355 3087260 3173564
3857 3173564 3308203 3373250 3387780 3518019 3622873 3724001 3723037 3713045 3664300 3571229 3506473
3846 3506473 3477152 3455180 3461026 3494388 3564981 3701250 3849361 4016970 4281502 4532477 4822216
3835 4822216 5090940 5360992 5655444 6045762 6630020 7397268 8144934 8443318 8642367 8782210
3825 8782210 8210292 6892606 5556009 4638989 4145891 3777978 3502597 3298403 3197803
3816 3197803 3081450 3019306 2984232 2913965 2810280 2617122 2403637 2234137 2179534 2056458
3806 2056458 1966302 1922249 1892739 1918037 1928154 1971603 1969459 1913184 1929669 1960922 1996923 2036902
3794 2036902 2087045 2079678 2107411 2048257 1907100 1810908 1753318 1723441 1689384 1711381 1715072 1710761
3782 1710761 1760481 1747046 1704564 1695554 1718353 1736034 1784385 1891094 1942971 1946336 1996044 2009945
3770 2009945 1991460 1950618 1874098 1819261 1774393 1726113 1652013 1657235 1671638 1702452 1730843 1764096
3758 1764096 1815601 1911329 1988763 2033636 2069677 2087294 2105343 2057708 1993906 1912242 1779161
3747 1779161 1648837 1576982 1547165 1511903 1526489 1511836 1469876 1467669 1405259 1362701 1363993 1370223
3735 1370223 1355389 1345754 1315278 1369872 1318556 1329392 1350442 1336538 1352247 1272695 1287400 1295343
3723 1295343 1326865 1338465 1314026 1345635 1376159 1421183 1421113 1383475 1364085 1368656 1416268 1413717
3711 1413717 1373520 1358085 1362402 1367110 1320503 1311949 1318660 1328178 1328737 1249139 1280317 1291372 1327526
3698 1327526 1322378 1354108 1402111 1361728 1408954 1409252 1378180 1398576 1407864 1410625 1344471 1348647 1353163
3685 1353163 1354610 1380226 1351922 1334382 1368522 1346154 1387709 1411047 1406424 1393970 1406466 1429378
3673 1429378 1421570 1432924 1451613 1411792 1402731 1429326 1370764 1365672 1430840 1402813 1399808 1444043
3661 1444043 1426426 1421266 1373527 1418361 1440049 1391981 1405772 1433551 1435864 1460565 1492324 1513359
3649 1513359 1447189 1375857 1399893 1444186 1473973 1514612 1527585 1460715 1460244 1471034 1450698 1451510
3637 1451510 1372589 1314065 1305693 1375169 1401349 1364073 1372578 1388544 1376200 1368039 1395701 1412115
3625 1412115 1408945 1408022 1420521 1421105 1404829 1405673 1452409 1460724 1433097 1478164 1518181 1463847 1408629
3612 1408629 1472871 1470179 1423008 1441323 1445560 1464247 1467042 1513712 1526808 1502341 1532904 1505521
3600 1505521 1507418 1486327 1494222 1534551 1565669 1543347 1551335 1543572 1499662 1469030 1544610 1579586
3588 1579586 1572980 1582908 1577374 1558831 1555000 1571741 1556946 1537806 1569253 1578038 1578995 1542621 1505614
3575 1505614 1471791 1461085 1444880 1472412 1480911 1470754 1482944 1449636 1442876 1453490 1491387 1482171
3563 1482171 1476129 1506180 1497375 1484409 1509869 1500958 1506595 1510174 1518433 1499783 1530267 1572789 1540031
3550 1540031 1550994 1606690 1578440 1550755 1528338 1536194 1562337 1539446 1552646 1576332 1534987 1564128
3538 1564128 1592525 1573570 1620522 1629319 1593891 1588303 1597621 1625620 1653188 1640251 1609408 1648465
3526 1648465 1654348 1644443 1597076 1598931 1623248 1711728 1689569 1692259 1714701 1697522 1719961 1710637
3514 1710637 1718832 1754864 1797272 1798543 1769642 1784399 1739982 1697999 1732498 1755268 1787886 1788358
3502 1788358 1764044 1773693 1820656 1864841 1866808 1890884 1865161 1860897 1873093 1911783 1940257 1969694
3490 1969694 1983463 1924644 1926996 1927985 1950074 1918234 1857543 1837533 1899370 1896827 1879107 1829264
3478 1829264 1848810 1910554 1887105 1870889 1880465 1887260 1848209 1849267 1816450 1863722 1915867 1905123
3466 1905123 1878552 1879619 1889678 1858781 1853871 1897272 1974476 1934769 1962537 1978220 2020313 2004056
3454 2004056 1973064 2012533 1974831 1967861 2015633 2025320 1976349 1960500 2028500 2080566 2135833 2044300
3442 2044300 2052717 2069565 2096239 2105685 2100241 2083279 2095255 2113049 2105851 2161009 2161695 2159517 2162412
3429 2162412 2167167 2183237 2211194 2218921 2281736 2264534 2343777 2368837 2380116 2390954 2431590 2501136
3417 2501136 2554545 2601893 2682677 2725665 2687049 2631073 2581738 2501984 2504184 2494175 2471693 2497053
3405 2497053 2447362 2489488 2522371 2525957 2518328 2580208 2612410 2638683 2655868 2653577 2680820 2765419
3393 2765419 2867902 2895163 2926242 2976833 3064602 3138064 3214803 3297498 3348320 3476298 3589706
3382 3589706 3634839 3684934 3607112 3492398 3400728 3331671 3290887 3317382 3320604 3310850 3321114 3377025
3370 3377025 3375150 3409885 3473466 3515413 3546965 3593008 3641488 3648389 3688099 3691664 3686596 3714586
3358 3714586 3784821 3762891 3739024 3727671 3728623 3772600 3820607 3924620 4034098 4048247 4033395
3347 4033395 3948395 3891243 3890308 3918847 3901455 3905965 4009365 4061450 4070186 4073486 4082098 4132157
3335 4132157 4222287 4277452 4365110 4440329 4519986 4626698 4751519 4874320 4925904 4960544 4953069
3324 4953069 4977758 4991077 5072306 5161756 5212618 5266388 5318352 5396965 5508937 5584027 5708391
3313 5708391 5835590 5977626 6049435 6040814 6072261 6017871 5963464 5955374 5985159 6042494 6087732
3302 6087732 6191371 6283191 6409141 6570039 6713129 6840293 6997580 7224538 7282714 7238561
3292 7238561 7205871 7231921 7255033 7340531 7478503 7524321 7551633 7655462 7684389 7725240 7879211
3281 7879211 7925628 7973189 8073767 8107992 8235730 8336334 8443111 8575222 8694903 8823179
3271 8823179 8992628 9206769 9383256 9572410 9770293 9995980 10292524 10638005 11024403 11298619
3261 11298619 11450094 11552081 11665304 11794497 11982845 12225718 12499232 12856225 13222095
3252 13222095 13644925 14110859 14663185 15227475 15846899 16497519 17178053 17871268 18626968
3243 18626968 19356547 20076461 20662212 21043897 21200194 20994652 20475956 19651641 18551102
3234 18551102 17469186 16484467 15520907 14662218 13923418 13311508 12738316 12197426 11704256
3225 11704256 11232189 10899661 10570371 10289424 10123016 9939711 9832006 9738397 9621233 9475264
3215 9475264 9321696 9147788 8960448 8723056 8558387 8465804 8414730 8309230 8281208 8281380 8290626
3204 8290626 8251245 8181690 8030671 7873995 7733213 7711870 7671908 7534794 7300710 6907574
3194 6907574 6565555 6299185 6118155 6023853 5926683 5852562 5757581 5693880 5664615 5618806 5637604
3183 5637604 5670142 5716012 5774448 5852544 5903704 5930992 6059762 6208008 6346879 6439712 6707522
3172 6707522 6838959 6693929 6465763 6235698 6054772 6001681 6029818 5864665 5560815 5231963
3162 5231963 4990483 4816541 4619081 4538685 4496241 4411428 4351145 4297736 4253797 4210673 4219864
3151 4219864 4221763 4232266 4212526 4202944 4162411 4193735 4212625 4311063 4340797 4451706 4520015 4557013
3139 4557013 4515902 4354834 4192902 4107264 4014456 3957093 3798329 3706578 3609803 3510781 3458898
3128 3458898 3399929 3318975 3290745 3221747 3151895 3164938 3133864 2997794 3014858 3003363 2944721
3117 2944721 2930072 2880632 2860774 2817174 2788227 2713227 2724017 2761529 2772647 2722814 2694991
3106 2694991 2675271 2640712 2575820 2616673 2635554 2621492 2601086 2556991 2593816 2555945 2497148
3095 2497148 2555175 2554307 2514022 2440483 2419443 2379841 2333464 2335917 2331206 2363059 2358800 2335184
3083 2335184 2330283 2279221 2262413 2209830 2204755 2235178 2254342 2215637 2160900 2178583 2196746 2173280
3071 2173280 2185243 2159476 2170159 2137894 2068504 2039906 2063147 2088337 2083411 2109202 2141964 2159247
3059 2159247 2132604 2110002 2068112 2048588 2040249 2050933 2070380 2075160 2052028 2015522 2012584 1980065
3047 1980065 1973561 1973791 1971739 1931341 1959327 1946173 1947548 1942266 1935369 1970056 1967150 1925175 1943007
3034 1943007 1963958 1926349 1909446 1908958 1888286 1899521 1925718 1890364 1935931 1965793 1928461 1917326
3022 1917326 1909016 1914131 1912658 1982686 1992163 1965075 1950472 1945833 1936375 1929000 1949868 1973291 2025265
3009 2025265 1985125 2039028 2026185 2046835 2113047 2118970 2143721 2146122 2178015 2216241 2237432 2235483
2997 2235483 2297039 2306960 2365852 2322616 2307023 2326863 2337388 2372530 2373586 2408043 2407323 2407850 2389651
2984 2389651 2413165 2418687 2475228 2489026 2499647 2529270 2530001 2558127 2611551 2671769 2721611 2743919
2972 2743919 2826594 2862032 2876369 2935545 2942639 2978475 3033929 3069014 3175813 3250438 3199247
2961 3199247 3181828 3217562 3136004 3090101 3155031 3199027 3191473 3226512 3202062 3207957 3271547 3291424
2949 3291424 3324224 3402230 3387162 3464110 3587460 3622032 3689454 3736761 3776658 3843639 3903974
2938 3903974 3945965 4046129 4174076 4185948 4225183 4332565 4448994 4554932 4646139 4709732
2928 4709732 4808929 4870052 4955444 5022249 5099657 5149424 5170368 5196117 5286728 5307718 5262742
2917 5262742 5308332 5366494 5435317 5523945 5605570 5646529 5754635 5915732 5996198 6119613 6294068
2906 6294068 6408362 6578778 6798467 7069553 7328517 7557564 7776401 7962816 8094470 8195483
2896 8195483 8183241 8100960 7924253 7722903 7431533 7172748 6993969 6866478 6788145 6723754
2886 6723754 6737930 6733574 6743397 6799530 6835438 6926404 7012021 7041555 7062676 7159413 7232264 7320599
2874 7320599 7329431 7358097 7395861 7417314 7419428 7311724 7218482 7045896 6907329 6735380 6523888
2863 6523888 6369536 6182469 5978356 5805869 5697026 5603676 5519485 5471938 5425193 5308836
2853 5308836 5246842 5192576 5143986 5074447 4965715 4886071 4756095 4586823 4458174 4297771
2843 4297771 4149751 3988879 3880461 3725999 3638621 3548615 3453983 3330357 3213900 3135196
2833 3135196 3043594 2968292 2903881 2850746 2803712 2746526 2692073 2683964 2598801 2580924 2550795 2485182
2821 2485182 2405248 2411705 2368400 2295139 2236434 2186654 2144207 2086296 2062205 1989889 1955057 1956489
2809 1956489 1926315 1862005 1816702 1777743 1750778 1744763 1708813 1642941 1593636 1576825 1564041 1579568
2797 1579568 1553786 1488290 1462643 1460535 1424412 1393400 1358808 1356515 1338671 1342781 1282902 1249403
2785 1249403 1213708 1190593 1181322 1176260 1181052 1177771 1130635 1059364 1003542 1022720 1061067 1025012
2773 1025012 1009430 1000812 950198 918610 881673 899899 911129 883973 844927 852753 922651 829387
2761 829387 794798 839899 808921 741137 744939 766995 728903 692860 683788 664476 669255 671407
2749 671407 663801 664070 656476 641624 637506 645006 606978 599662 557599 548161 531265 514419 484967
2736 484967 462229 499933 506155 487757 490810 434677 446315 474841 462072 507886 498000 482059
2724 482059 438898 466229 444929 413113 423639 405901 406024 331542 311388 304562 314572 313596 300386
2711 300386 327795 297795 272625 297255 294665 318543 328888 316468 345184 320333 281312 230565
2699 230565 220205 201408 240873 255125 276303 284585 251958 214784 235122 258867 260573 250566
2687 250566 249573 209159 230805 191884 233786 212759 202232 232975 207341 227812 182892 184956
2675 184956 189182 170977 151403 153571 138440 92852 85706 167603 205459 182251 203205 166318
2663 166318 157017 184565 160883 135555 161779 175532 153711 171825 169818 167202 175024 169000 116322
2650 116322 136236 151739 172227 172653 156362 142506 136913 121654 165746 192190 150528 120508
2638 120508 105935 178309 231432 133995 159707 159444 217897 159587 113532 107314 106963 185132 218912
2625 218912 169505 134304 130749 131702 128770 118515 118604 106783 136276 142694 159162 152702 164606
2612 164606 119697 113095 128202 152847 168181 184202 118255 129584 112535 67852 89405 97486
2600 97486 76137 93281 76836 53703 61004 48380 93782 77495 81714 102190 140698 135130
2588 135130 126508 144005 141808 113968 107743 94714 92377 135239 137630 116118 128715 114248 119556
2575 119556 165191 145370 127744 145945 96858 57415 80635 32604 68314 33754 40691 74166
2563 74166 38062 38974 13348 30788 75982 63122 90722 132074 91224 82832 74202 16734 38145
2550 38145 68152 79300 96489 55860 14929 46613 32623 49390 38776 31651 49061 72278
2538 72278 54115 -21768 40686 7314 -43812 -386 34348 25179 -9458 3159 33756 68147
2526 68147 35881 15419 19176 17947 32026 46312 28164 -22645 -8360 12966 45364 30413
2514 30413 58844 25708 -49513 -38580 -24695 -49767 -33694 -19720 -21108 10276 58949 30427
2502 30427 17801 20569 27306 24677 48067 82147 31713 29687 23106 5551 -3740 32016 -2993
2489 -2993 -7204 -42499 -55865 -56733 -28244 -16358 -34946 -37579 13071 -7718 18552 54550 21262
2476 21262 17469 -22235 -40707 -27015 -15359 -34874 -48012 -89315 -12590 13087 -11294 -13962
2464 -13962 -42102 -50676 -96760 -42174 -37906 -42014 -48507 -63256 13796 25901 -21507 -43354 2183
2451 2183 2588 17430 -15805 -23232 -1363 -2827 40748 13998 -76769 -71722 -36885 -3427 -6194
2438 -6194 -8248 -6903 14656 12647 -8159 -8142 10809 -33058 -28937 -57828 -15222 34328 11872
2425 11872 -35291 9497 -30473 -53230 -12682 -7210 -47073 -34647 -47320 -98478 -76864 -56452
2413 -56452 -2875 13409 27453 21296 15631 -10727 -17421 36093 24639 -21524 9892 -3070
2401 -3070 11650 -8019 -27912 -68283 -27081 -16477 -44680 -63065 -21959 -218 -41694 -49542
2389 -49542 -31540 -49929 -39259 -43336 -31470 47774 17155 2851 16776 4099 7753 -13598
2377 -13598 20298 48837 -29731 -20087 -4365 -20225 9677 579 10814 28085 90208 119096
2365 119096 129003 129473 122488 127450 91095 62572 21217 -2596 7860 42626 45450 26576 11883
2352 11883 -854 -9468 -32902 -16805 18735 32503 31096 5743 -16707 36069 7489 -2189
2340 -2189 1101 46079 29921 148 -9557 16919 36333 -22572 -590 28167 -697 -53216
2328 -53216 -93377 -62379 -48515 -16829 -12849 20875 51411 36925 15320 -24798 -42877 33411
2316 33411 86032 52010 -41532 -33060 10395 4901 48103 21735 23194 39487 29208 -11134
2304 -11134 714 13389 2171 19888 32549 19650 61850 96315 24964 -8027 420 -8976
2292 -8976 9918 5797 35536 20114 -10949 -47059 22637 63795 71740 23861 42901 78813
2280 78813 73661 38943 -9226 -27895 -3554 42884 23703 24547 32880 15616 52394 44054 77713
2267 77713 86045 89104 122460 91482 48926 30576 42824 10937 11231 32000 87881 83637 73343
2254 73343 88435 94323 102337 80549 74112 99536 130006 106904 83215 61037 4151 10288 71810
2241 71810 86223 135468 116460 90620 52182 69643 125095 103465 105449 99992 111319 141090
2229 141090 136262 140047 128659 144229 150579 107354 169806 183081 158231 140248 142050 156533
2217 156533 164307 102837 124656 226733 198231 141501 104272 138965 154763 164674 191129 165833
2205 165833 176516 192716 192062 270402 246586 230637 233712 206695 193382 211419 291998 282156
2193 282156 268619 265939 234273 283296 258888 230753 232769 270738 284159 270981 311047 353074
2181 353074 350179 338998 379883 374509 399504 377223 362556 376362 434601 429486 432530 462341
2169 462341 456414 443654 473395 444014 455595 483432 517613 520239 544290 504863 521056 582225
2157 582225 582268 636292 691974 706809 710614 676474 699747 784521 827265 826060 829658 828035 874700
2144 874700 913939 939358 959124 971696 1040051 1093557 1118617 1172388 1222738 1250098 1305166 1361565
2132 1361565 1356895 1369696 1390583 1466060 1488512 1542733 1613833 1705220 1765579 1787834 1876503 1995106
2120 1995106 2117287 2268466 2398952 2550301 2776354 3009207 3263870 3546578 3687024 3878742
2110 3878742 4205392 4721866 5274526 5949624 6760361 7763698 9056220 10880801 13107264
2101 13107264 15796841 18558702 22389746 24445445 20160341 14688540 10744399 8107536
2093 8107536 6522078 5431810 4544261 3943386 3529073 3215309 3027368 2886032 2701164
2084 2701164 2612290 2501641 2235375 1972397 1812675 1663585 1454806 1376423 1252628 1163075
2074 1163075 1109120 1055608 994798 947119 907862 862256 859474 842475 798321 784374 754726 761659
2062 761659 735783 667114 573374 566276 559273 516170 506365 472266 451392 409924 405663 408808 386506
2049 386506 332644 358741 343226 262822 291594 241616 228380 226693 234111 216887 217036 159518
2037 159518 181808 239935 229276 217676 226765 222725 220873 190887 189473 155866 120263 141016
2025 141016 153142 108954 115901 135024 108975 109783 115276 120173 187390 145251 79417 152941 113166
2012 113166 64360 46083 60680 80411 66789 72100 58734 83004 124402 147880 126451 116210
2000 116210 105583 96222 55864 16830 1024 38926 15911 1994 2209 27888 36717 52125
1988 52125 16321 32281 -14187 45736 47166 12978 -23585 -1394 -1808 6234 -5871 8808 51641
1975 51641 22375 59289 28462 -328 -22645 26235 38488 40962 -11720 44771 62203 57308
1963 57308 18056 -14338 -45826 -36488 -31906 -36486 -47202 -52541 -35316 -57995 -39077 -62251 -55570
1950 -55570 -11135 -4715 -24868 -20702 17297 3824 -5769 -7415 -18383 5315 35501 28417 43400
1937 43400 9078 -32403 -17847 -11431 -64940 -44893 -58412 -35620 -35926 -50891 -31655 -14112
1925 -14112 7143 11129 15750 13565 -53303 -64161 -13251 16340 3888 4388 -17485 -8493 -62708
1912 -62708 -65102 -63908 -69401 -91103 -26371 45264 14129 -16954 29447 3031 -10542 -5782 -20394
1899 -20394 -26241 -42791 -96450 -81059 -16145 -38614 -1563 -13138 12457 -25161 23095 19193
1887 19193 41588 78412 61097 10306 -46153 -42144 2123 20556 18585 29632 36156 -37486
1875 -37486 17074 51751 37987 2697 9541 -286 -13699 -36792 -40399 -36431 26484 15620 -27086
1862 -27086 -13483 27515 35320 -7577 -53230 -39258 14112 -7485 -6405 15537 -2054 -31989
1850 -31989 -3993 -36258 -40074 -50180 -54034 -17957 27296 -11335 -37645 -5288 -7976 -45292
1838 -45292 22198 46365 -6934 46971 91831 61666 43756 74938 43623 39955 65894 64678
1826 64678 26635 -61950 -54400 -17367 26808 -24580 -29920 -35280 -25618 -59943 -61585 -37066 -59201
1813 -59201 11065 14767 -39035 -93668 -73233 -70670 -57923 -46036 -43556 -35871 -13111 15776 6184
1800 6184 -10102 -12865 -29327 -36313 -5770 -32685 -21988 -29213 -46501 -92331 -86047 -49049 -3091
1787 -3091 -12668 -9312 -26127 -35095 -65885 -38618 -41200 -55000 -9788 -52424 -31538 -36404 -45957
1774 -45957 -42182 -14730 -807 -34625 -34497 -20012 -34022 -37824 -27510 -4694 -36829 -44470 25096
1761 25096 47483 23233 20266 -10203 -8576 -29990 -43384 -31242 -13762 -10914 -45060 -70224
1749 -70224 -57618 -80546 -43788 -59133 -55067 -30594 -31779 -33442 4266 -11904 -26613 -54892
1737 -54892 -5318 -2684 -3781 -12467 -7945 -13900 -33250 20061 -1644 -15855 -9854 -23912 -64994
1724 -64994 -53917 -52774 -59493 -86765 -71073 -41618 -18351 -26107 -43310 -56491 -44221 -35051 -29112
1711 -29112 701 -26118 -14045 -27179 -45531 -53993 -86649 -81820 -89906 -37924 -49020 -58073 -6096
1698 -6096 -2489 22891 13937 -13221 -2255 -23544 -41665 -63686 -20069 -28253 -46307 -36170 -41053
1685 -41053 -69384 -62943 -36019 -64971 -63155 -7387 -67043 -45633 17864 20763 55706 44569
1673 44569 -4101 18633 14531 34016 -9987 -39428 -28558 -17091 -62200 -36706 -79636 -109212
1661 -109212 -48743 -14277 -41393 -70822 -53556 -69162 -73288 -62096 -48487 -19577 9755 -21800
1649 -21800 -2632 -17272 -13381 -39128 -32649 -29876 -64542 -32894 -39935 -91181 -46557 -11392 -18235
1636 -18235 -33396 -43815 8639 -12482 -12938 8871 -66300 -12570 -15817 32835 95936 31089
1624 31089 -21868 -49264 -70239 508 19778 -28472 -81892 -27812 44007 15079 -88025 -57080
1612 -57080 7223 -45751 -17306 -16544 -17986 -42242 -58579 -27188 23561 33724 -15727 -46946
1600 -46946 -64638 -91063 -78937 -7735 -45088 -46535 -19562 -22295 -41520 -79062 -41980 -21708
1588 -21708 -50117 -22773 -9578 22547 24484 -2404 -52740 -80838 -57837 -61493 -41248 -43010
1576 -43010 -8487 36484 -39386 -26849 -38988 -45662 2947 -25501 -89717 -65682 -23357 -41289
1564 -41289 -14965 -17983 -25262 -56637 -42875 -45252 -42032 -50774 -53712 -30519 -25428 -10198 -2115
1551 -2115 13069 -28185 -71278 -19560 -47437 -52130 -38476 34293 5336 1301 20515 16422 -33082
1538 -33082 -33030 -43209 -58957 -38815 -7550 13818 -30800 -17811 -14006 -2327 -556 -20021 6959
1525 6959 10186 5508 16876 -20289 -33770 -30329 -20941 -48715 -74459 -64346 -69435 -50097 -3652
1512 -3652 -4774 16549 -27701 -7557 -32091 5 20373 -20533 -48621 -4272 -12695 -84294
1500 -84294 -87988 -48810 -46761 -58792 -74316 -57739 19994 211 -34495 30722 46080 17574
1488 17574 27018 24389 29169 20264 63691 29168 3871 -2829 -10772 -27221 -4419 -19350 -29400
1475 -29400 -746 -6604 4576 -2349 -36864 -29946 -63695 -42182 -47087 -30156 -36682 -44172 -77816
1462 -77816 -29965 55153 49605 -25924 -77330 -59526 -52128 -44569 -78676 -61327 -25828 16518
1450 16518 17048 13989 -12460 -7203 -20628 21505 3097 -3477 -54448 -53226 -73541 -87831 -78658
1437 -78658 -56458 -47120 -62188 -70384 -72429 -46424 -42438 -1631 -9163 -4865 -4873 -4299 -40420 -3905
1423 -3905 -20962 -30723 -45445 -79728 -83163 -45058 1077 15093 5542 -20940 -15894 -19975 -11897
1410 -11897 -45382 -40543 -40557 -52557 -7479 -61599 -68029 29879 28519 9378 32653 185 -1491
1397 -1491 1416 -62212 -44888 -41985 -53745 10515 -8775 -21013 -25037 -41588 -29255 -56842 -65084
1384 -65084 -31133 -9476 -9766 -23335 -14383 -27357 -60339 -43464 -73324 -9441 9930 -56609
1372 -56609 -66234 -80487 -79286 -51477 -36186 -39981 -50127 -24501 -12714 -43928 -58473 -38669
1360 -38669 -15066 -42400 -31809 -43130 -65162 -39040 7603 30893 44698 43740 -14911 -3934
1348 -3934 -18733 -78098 -59114 -61972 -39146 -20245 -60830 -58873 -40376 -51807 6534 17541
1336 17541 -54603 -99778 -52438 -15617 -6610 -14852 -57084 -13030 -63364 -87637 -103184 -61353
1324 -61353 -36709 -13379 -49496 -37828 -32596 -97780 -62397 -15126 7553 -8249 -57142 -43187
1312 -43187 -33017 -41204 -10977 -9915 -1920 -8186 -22612 -41824 -55900 -23822 -50143 -29571 -39857
1299 -39857 -78930 -96505 -49031 15982 -26859 23551 13482 25643 34243 5824 33196 32520
1287 32520 -2964 52380 842 -16279 -29165 -22847 12828 9770 -41015 -8278 -53903 -76278
1275 -76278 739 3291 3831 -5955 -23876 -7470 -28679 -39597 13000 -39312 -44869 -24838 -50126
1262 -50126 -92184 -20719 -10486 -29768 -46185 -44195 -33288 -25508 -6172 -42070 -55689 -56932
1250 -56932 -20342 -24650 -22729 -21128 -19963 2507 19906 36609 24742 -30688 -21328 1010 41009
1237 41009 10115 -8153 -29188 -32881 -11088 -22152 -26501 -28974 -15132 -9651 6877 -6719 -34857
1224 -34857 -26953 1139 27596 31960 -2245 10135 64954 43256 31698 86040 48856 24553
1212 24553 31070 14913 -28579 -30327 16755 35100 27752 66884 16916 -20980 -24693 -25723 -27114
1199 -27114 14633 10921 -67568 -50106 -60324 -54916 -17818 7210 66671 62533 43597 2798
1187 2798 -23544 -20884 -3687 -55335 -29571 -19414 24325 18143 41903 38820 -28931 -64677 -58049
1174 -58049 748 -23815 -6208 20189 -3143 9955 15724 -9723 -927 -45132 -71869 -40814
1162 -40814 -24399 -31828 -27106 -32690 25207 16797 -46359 -54297 -59057 -72106 -94847 -87765 -39116
1149 -39116 -36445 -31405 -28518 -14277 -6249 -14580 1305 -2178 -5749 11314 -16991 26598 10068
1136 10068 3583 -14938 -64160 -72934 -25252 -38927 -46945 -5563 1356 -7520 -41323 -23728 -47621
1123 -47621 -50002 -47969 -51763 -5460 15313 43577 27429 65690 61203 -20029 -11406 -21287 -17050
1110 -17050 -1597 -3501 -43187 -53218 -9350 -16514 -1123 -16052 18641 5936 8001 10864 31627
1097 31627 25529 28948 55539 9753 -59760 -39462 22885 9230 27565 -26121 19265 43417
1085 43417 -11242 1677 51987 34379 10225 24200 23477 26124 27857 53733 63232 23833 12916
1072 12916 152 17956 -11564 -26016 -6945 25630 37090 5147 3475 -15950 -41475 -21567
1060 -21567 -40638 -19796 16172 20674 -8453 5012 -42837 -2255 34737 35394 6866 36911
1048 36911 49920 30611 63077 59357 -638 -1071 -1224 16153 -1895 7506 -20771 4483 51528
1035 51528 11743 10221 -19901 -33173 -11912 -33131 -30666 -33244 -90474 -80875 -131078 -26289
1023 -26289 368 12273 -19900 -30938 -715 -18499 1307 85966 43811 15833 -18681 -7716
1011 -7716 -45636 -32362 -30163 -11425 33240 9315 6687 51899 54259 62321 27113 -4495 -22064
998 -22064 -37087 36096 40225 -1724 22560 15954 30981 7147 -1320 -29988 -73876 -16789 26993
985 26993 -11794 -60763 -57963 -47768 -4854 12537 -22088 -61127 -64466 -64783 -31878 -30073 -41463
972 -41463 -63296 -5783 15336 -12347 -60394 -15231 -46702 -12199 -13863 -16321 -18400 -14813 32814
959 32814 40849 -15631 -25637 -2950 -1170 -1116 -8549 14154 -21027 -33004 -8092 -312 16340
946 16340 -3092 -3129 45196 39453 10181 13005 54334 74015 106490 55756 -16556 1064 -11909
933 -11909 -22306 -31838 -61290 -56244 -11856 4566 -18196 -30962 921 7908 -11351 -3349 7488
920 7488 48350 44177 38674 50410 43857 -20608 3360 29295 28801 82794 67735 92902 72943
907 72943 61076 16062 27202 -116 -59069 -65142 -53725 -5814 -902 -15373 13684 41355
895 41355 19330 -28075 -15197 23351 15114 34993 -11182 -31713 -16041 30297 50388 101130
883 101130 47336 32351 8734 -20985 -14043 -1943 -16491 13426 -960 -16892 30827 30998
871 30998 38301 -8972 -30460 -4392 28770 -27101 -45858 -71491 -40119 -9134 -7858 -46757
859 -46757 1689 39518 -1541 -17776 -33200 4564 -15765 -17694 20804 11454 -18996 -26711 23334
846 23334 53519 17491 -9805 -13237 15873 62170 50454 -5565 824 375 24059 14777 -15164
833 -15164 -36630 606 10099 -35130 -33771 -16781 -24 -17593 -6031 19744 21573 -18882 5211
820 5211 37556 28954 23885 -11226 1832 12207 1987 69640 86713 48948 40212 41698 40287
807 40287 25570 -51514 -52897 -4521 -30775 14024 35757 5026 -18454 -20723 24697 15164 9452
794 9452 6472 32798 50383 12616 10399 23038 16457 10344 4217 -6043 -25715 -47604 -40181
781 -40181 -5784 30672 31676 16082 -32551 -64361 -43672 31599 34177 27018 18753 18618 22490
768 22490 -1699 -5894 33427 10678 3490 -48565 -22508 5833 36554 8820 -12945 13738
756 13738 -22450 -25402 -27718 -29418 -25292 30710 19893 4661 25393 42201 -14302 44087 74261
743 74261 46242 1002 -1863 -10276 -6088 -14691 -3405 4165 -3404 5410 -3485 8413 55189 29852
729 29852 -18363 -35970 6592 18109 9926 56440 97884 77708 31782 3319 11507 28838
717 28838 -25841 -4792 48041 41836 -40868 -18530 -15871 -9421 -23201 -13062 -3888 -13328 23423
704 23423 -5560 -17081 -53212 -46942 -34527 -51601 -49988 -24268 8244 18330 37188 64915
692 64915 43262 67089 9168 -17195 -4140 -9377 -25108 -444 26883 6778 16364 -19726
680 -19726 14046 40489 1632 58062 86015 57762 11975 -26418 -15337 -29432 -27287 -37599
668 -37599 1137 55002 72528 -27497 -34661 -856 20016 18041 -27332 -21949 -11846 -31532
656 -31532 -5100 -54203 -63189 -25957 -2697 -40217 -24370 19562 581 -37615 -16361 38168
644 38168 44279 7903 121 49529 5709 -29271 -7999 33267 13942 21260 -12590 29288 2571
631 2571 -8050 -23712 -26584 -53644 -40465 -13383 4169 50718 49628 56462 61321 56058 -9461
618 -9461 13517 -28905 -38361 8854 27904 47110 15304 3256 60521 25856 31871 18180 48098
605 48098 -20091 -30256 7774 -25905 -38569 -3776 30132 25697 53664 -20619 -28521 21165
593 21165 21652 -5776 37394 46818 68913 18788 -46188 2596 13557 -7853 -14257 -9064 30576
580 30576 -19680 -9747 24400 -41982 -3166 17608 41481 45603 14151 21967 70578 81288 10535
567 10535 -7182 1561 19024 -3218 31795 28035 18776 50158 9215 1372 36485 27018 31703
554 31703 32651 11609 10857 21919 -16991 -35636 -44442 -13141 3787 32711 23087 45504 83326
541 83326 88321 63522 72444 92262 35073 61758 51093 18759 35567 -10827 28549 64427
529 64427 21215 -8643 6827 1011 -2245 24232 39813 40981 71110 22533 4932 53974 64042
516 64042 61250 -5323 2530 -22074 -4544 839 5671 -22909 -38363 -37213 -17877 -25910 5664
503 5664 7933 51522 33312 38942 -1430 -36639 -22981 -6865 -9504 14077 34590 21668 37938
490 37938 36653 49738 81577 27607 -39681 2246 7689 55803 77530 56289 44747 65625
478 65625 61945 37232 63076 63573 40869 101657 70579 32343 70579 59211 62162 74659 80096
465 80096 -13417 -34617 67177 57580 91367 77622 24173 84921 56819 33429 49692 49065
453 49065 3411 17236 -5883 29734 66075 37839 110186 70551 29692 44544 18577 -68326
441 -68326 -45072 45911 108593 70616 9013 20300 -20669 -20655 58698 41515 55603 27481 60035
428 60035 -21670 -68031 -32588 -22007 3474 3689 3089 -18521 -21940 -1694 34531 18894 59284
415 59284 45421 24098 61514 -8426 -7228 -6571 9015 35469 44727 65747 45834 3404 -43939
402 -43939 -39804 21130 71350 21203 -20359 15207 36122 36087 2942 -4875 27215 12149 74485
389 74485 50845 -7566 51232 64414 10334 -26707 -53971 -29329 -56879 -38240 -49499 -35018
377 -35018 -2134 41146 97059 40228 13385 14925 3366 7955 18753 4368 19425 28757 11454
364 11454 -25347 23933 17595 13619 12977 30891 79229 35506 24216 31811 48988 31768 70893
351 70893 113088 57125 76830 42368 56321 58517 53095 76763 74969 58000 11283 45483 65921
338 65921 17806 -33608 -4483 3692 -3460 -12963 48989 21000 49785 39860 2850 16123 30158
325 30158 -1297 -29787 36814 90597 32349 28665 35460 20873 10622 -2033 48852 64757
313 64757 14687 -8977 42287 29436 21768 14547 47761 11068 35512 50572 -3377 15932
301 15932 32742 19148 5992 10804 7215 32 -6547 3849 11049 -26211 -9345 3177 -250
288 -250 -41331 -24176 22957 41483 91997 57034 42235 56156 84296 60943 19371 -22686
276 -22686 -61318 -52111 4109 65846 89730 44710 16949 -22522 -23707 -41500 -30317 10028
264 10028 33802 39728 25618 40723 2542 -7289 -11664 -193 16271 56844 64835 53575 46456
251 46456 19429 61763 102219 38662 6941 38564 42355 83815 81665 15878 18209 6316 15980
238 15980 16017 28869 545 13564 22655 15433 8934 11739 8422 -6160 24337 -28201 -19729 42495
224 42495 76831 5636 -29285 18838 38696 19445 38703 -5015 27489 73683 38270 14384
212 14384 21520 41899 43456 41313 36988 42363 1983 30703 32800 36791 3416 -14172 24362
199 24362 41338 30035 46746 22981 48309 35853 31330 79072 46293 21878 53756 78134
187 78134 23189 53745 74005 21704 39783 21202 6701 15942 66993 50702 26415 31204
175 31204 10770 -12001 -8445 12395 20054 10943 -6160 41014 76544 98346 62461 59472 67495
162 67495 65819 68116 57512 34965 28304 39939 7123 -25487 6362 5081 12889 55285 44961
149 44961 56326 81365 85062 73466 6453 -13607 38425 47196 40348 19516 29706 43205 32013
136 32013 25656 27949 55658 32598 48764 41244 -16379 19355 31415 41388 49501 29518 32266
123 32266 -4070 -22700 1291 27237 23120 77900 64256 50625 66996 57684 35672 23829
111 23829 18034 10541 32380 26722 10335 7197 -1446 -7694 20184 34652 7642 17408 37190
98 37190 37772 41148 56850 43125 52234 54900 53342 28176 2136 5625 13163 19384 12372 58443
84 58443 82174 53782 50083 58845 71056 79856 66718 37490 55154 90888 86090 80657 65564
71 65564 27333 28040 -14567 -28485 46819 57958 67748 48383 22515 -19524 -9935 -6570 18559
58 18559 13820 -24380 -23022 9399 19694 7404 3600 26967 79497 58000 49152 67734 34846
45 34846 23764 13832 38189 34643 31884 1463 8021 31738 42731 26200 34861 39628 8972
32 8972 43092 58892 68033 37764 24617 3621 47757 36505 17000 40328 45377 72593 65376
19 65376 56438 108001 69694 80966 67628 23434 58649 45398 36743 45406 9784 24501 6144
6 6144 21516 35309 30678 35034 45655 55390
0 55390
$$ Imaginary data points
##PAGE= N=2
##DATA TABLE= (X++(I..I)), XYDATA
16383 -617993 -621843 -577511 -529569 -515022 -552430 -537811 -531195 -507029 -479262 -454776 -422922 -422525
16371 -422525 -428378 -425340 -395168 -396452 -396223 -380765 -342711 -318192 -303519 -284501 -277779 -253146 -253310
16358 -253310 -253042 -242364 -242892 -249790 -229237 -215865 -201145 -176147 -146700 -136739 -100907 -72189 -68494
16345 -68494 -87659 -74637 -66968 -22360 5363 25346 15328 22761 43957 67337 69169 48032
16333 48032 57301 82040 89691 81721 122936 130492 149301 138578 157781 188634 188801 201626 230303
16320 230303 213381 282316 299730 296604 285059 302004 364487 396702 395399 366060 368456 379698
16308 379698 378389 395614 402298 399274 436201 440879 441299 451945 443295 488837 502358 511297 495756
16295 495756 526065 511920 541534 573992 596066 616688 574635 568811 624389 594884 625206 651116
16283 651116 689653 691187 703896 711736 727390 735126 744217 769831 756889 770095 767257 779530
16271 779530 763966 810596 831870 838481 844658 877762 890450 904688 855493 853886 851309 816618
16259 816618 832859 942686 955610 938858 1009858 992788 949339 968405 972816 972212 1010115 1030256
16247 1030256 1001871 974910 1002982 995792 1022413 1029589 1053333 1094775 1066745 1103331 1137846 1079842
16235 1079842 1044421 1082508 1060414 1085104 1117965 1107253 1131233 1158851 1196064 1194511 1150067
16224 1150067 1163035 1180548 1198940 1238782 1267724 1224440 1204602 1222654 1256064 1236164 1240203
16213 1240203 1256524 1254186 1229591 1225410 1207204 1247642 1280650 1286165 1254132 1211521 1230863 1258546
16201 1258546 1277375 1295879 1314907 1297794 1352120 1360162 1331531 1354239 1362240 1372321 1316387 1332120
16189 1332120 1358338 1367090 1386352 1392204 1397196 1422348 1408866 1372556 1417886 1374842 1397339 1449354
16177 1449354 1407761 1347217 1438969 1483777 1468525 1408305 1442507 1469386 1488837 1486225 1491639 1467275
16165 1467275 1437078 1484115 1464243 1453118 1446203 1426477 1452616 1463059 1507618 1517097 1521145 1503770
16153 1503770 1527519 1485124 1485519 1507242 1471844 1519070 1519775 1583541 1536798 1549621 1569848 1575321
16141 1575321 1553945 1536829 1532481 1560038 1567612 1522270 1507529 1528642 1476296 1511860 1554488 1582876
16129 1582876 1539730 1508192 1539476 1548612 1541514 1524105 1533467 1553043 1557694 1597269 1660372 1606723
16117 1606723 1629145 1638667 1616629 1627376 1598901 1588860 1579430 1564353 1584910 1587839 1655378 1605156
16105 1605156 1573571 1601734 1587251 1598189 1598764 1677870 1636228 1633335 1658730 1584414 1538691 1553804
16093 1553804 1573049 1589951 1635025 1552308 1564811 1592409 1590144 1591431 1573119 1596591 1605777 1646224
16081 1646224 1656658 1631577 1617030 1591162 1594713 1603251 1592138 1587833 1563105 1586464 1594659 1639588
16069 1639588 1653078 1637069 1646272 1652713 1642306 1608807 1582886 1594941 1628883 1625662 1616681 1597528
16057 1597528 1616637 1611158 1611602 1638778 1613830 1626374 1674656 1607339 1654844 1651978 1655909 1702450
16045 1702450 1685551 1614237 1657945 1616396 1637689 1671504 1687515 1683947 1680352 1648290 1662168 1668020
16033 1668020 1641388 1655098 1650700 1648889 1643187 1668107 1654525 1656315 1684507 1640365 1621126 1667936
16021 1667936 1689354 1684619 1671113 1683491 1679351 1648222 1662100 1696986 1674477 1680913 1655179 1699164
16009 1699164 1652244 1651563 1658566 1615348 1622170 1639570 1646030 1698886 1681949 1698149 1685020 1627783
15997 1627783 1632839 1656805 1678787 1681242 1641057 1657694 1661569 1628016 1602335 1707599 1706583 1677874
15985 1677874 1699533 1723930 1679427 1632435 1671085 1668277 1660228 1671503 1658881 1695971 1674390 1649504
15973 1649504 1695795 1676292 1642652 1653552 1667341 1716769 1678371 1662690 1699449 1712837 1661508
15962 1661508 1646073 1644588 1635353 1686914 1695810 1713202 1699200 1684913 1692766 1636896 1686732 1720512
15950 1720512 1683061 1684489 1670250 1677657 1682066 1683276 1694846 1735035 1684593 1666890 1627951 1674910
15938 1674910 1688814 1651438 1616879 1611597 1608488 1633892 1620801 1657646 1641017 1678092 1699905 1627153
15926 1627153 1651286 1654565 1681973 1698245 1690764 1659184 1677813 1686730 1652091 1680083 1660724 1655377
15914 1655377 1639418 1625956 1640749 1690971 1725530 1699720 1666445 1676810 1695091 1652104 1691056
15903 1691056 1701476 1630315 1650666 1735759 1752446 1688615 1683935 1656775 1615305 1661860 1701396
15892 1701396 1732582 1736763 1723127 1733824 1696533 1685347 1697450 1682411 1654378 1688976 1664204
15881 1664204 1675357 1695760 1657051 1683052 1666356 1694805 1667799 1696392 1666563 1681826 1717922
15870 1717922 1708288 1697676 1671280 1677353 1687425 1686645 1703298 1692859 1666582 1644649 1651068 1734017
15858 1734017 1660929 1661328 1706286 1694868 1635866 1633375 1659794 1649572 1648839 1681850 1706366 1690017
15846 1690017 1727022 1745293 1692810 1680624 1705184 1685555 1621352 1646891 1708706 1692717 1699958
15835 1699958 1702383 1719422 1677051 1726832 1730002 1691697 1731280 1765804 1690032 1712157 1720426 1675687
15823 1675687 1759340 1700944 1672928 1704380 1732553 1681742 1638600 1632183 1638880 1648938 1701221 1698089
15811 1698089 1684487 1626235 1625749 1645063 1630208 1696276 1705415 1663241 1681149 1669830 1685405 1727238
15799 1727238 1717461 1706869 1669912 1664807 1662948 1644633 1669160 1720089 1681402 1656694 1633845 1658492
15787 1658492 1682701 1682425 1700318 1699550 1693149 1733012 1732818 1672619 1688372 1672587 1648223 1682493 1635893
15774 1635893 1693954 1680647 1661337 1724147 1684037 1640912 1681130 1686110 1686851 1701354 1701393 1647009
15762 1647009 1625592 1676927 1688548 1656384 1642222 1676261 1680104 1705523 1725655 1730560 1693985 1677971
15750 1677971 1742640 1712081 1688898 1731156 1697804 1733601 1751079 1769674 1774790 1746908 1720391
15739 1720391 1722782 1745812 1716351 1688417 1687455 1702576 1694310 1628440 1680515 1730869 1687305 1714941
15727 1714941 1679418 1704608 1684456 1657338 1696656 1715889 1651034 1656445 1711850 1740986 1676297
15716 1676297 1684361 1718328 1666517 1703274 1722493 1737449 1714025 1662116 1637284 1689741 1735852
15705 1735852 1756033 1737917 1728070 1722510 1680301 1696989 1780733 1784279 1740386 1735000 1676501 1686127
15693 1686127 1715437 1686710 1706379 1706230 1734597 1794283 1775904 1749967 1731861 1747118 1689899 1719481
15681 1719481 1709177 1710449 1703453 1710620 1742505 1730357 1733767 1719623 1707437 1683637 1698582 1726417
15669 1726417 1757149 1718601 1748355 1721780 1717887 1738873 1774584 1767245 1741005 1765533 1752649 1716330
15657 1716330 1721644 1705948 1734947 1680889 1695977 1670898 1687618 1718214 1695026 1685382 1667863 1696406
15645 1696406 1715300 1702851 1684009 1655449 1665959 1671617 1659409 1679778 1713652 1769016 1780104
15634 1780104 1731293 1685199 1651986 1716625 1746544 1738044 1743560 1731746 1735298 1729611 1732304 1744502
15622 1744502 1729765 1692290 1711732 1697043 1727988 1712490 1736691 1696452 1735913 1700749 1674304
15611 1674304 1744115 1711674 1737251 1708630 1735791 1761644 1762244 1716911 1695672 1748939 1739080 1720604
15599 1720604 1741265 1743429 1705288 1668414 1717559 1782642 1792501 1806322 1803307 1750923 1742457 1777819
15587 1777819 1758673 1726791 1724009 1710348 1703995 1724522 1754527 1716728 1702277 1731091 1746357 1721648
15575 1721648 1732564 1708821 1730789 1759792 1742707 1791139 1741487 1721582 1705863 1732905 1759168
15564 1759168 1768348 1746653 1735677 1735603 1748753 1738979 1739912 1727680 1737285 1721747 1763796 1758019 1789147
15551 1789147 1793217 1752423 1758502 1760625 1765124 1708540 1670169 1734169 1748794 1786267 1744636 1687299
15539 1687299 1694681 1741191 1766528 1772967 1734785 1739108 1783825 1761236 1752106 1734876 1775387 1716391
15527 1716391 1721243 1758974 1774810 1760952 1771164 1733859 1735566 1715501 1692288 1749764 1752605 1716729
15515 1716729 1729298 1776369 1786294 1736805 1760654 1786913 1765411 1731182 1736705 1773589 1740572 1717852
15503 1717852 1735491 1724186 1749044 1747267 1739662 1727045 1767881 1818521 1797530 1781810 1762728 1737715
15491 1737715 1777059 1765687 1743796 1753685 1737012 1789352 1813718 1781610 1716214 1750452 1773323
15480 1773323 1792075 1800616 1823796 1785898 1731915 1746604 1756847 1752916 1704378 1719728 1753149 1759781
15468 1759781 1739945 1752720 1761366 1743822 1724782 1761200 1746653 1758990 1723652 1715343 1730322 1694397
15456 1694397 1724219 1761170 1774686 1799232 1787725 1755318 1758932 1747453 1792047 1784608 1764413 1734987
15444 1734987 1731360 1775686 1765021 1703566 1722572 1739088 1766478 1763326 1756153 1809079 1767627 1727173
15432 1727173 1746213 1735392 1776165 1775362 1759026 1744763 1751261 1775860 1739659 1712684 1710669 1732188
15420 1732188 1735062 1755980 1773942 1774325 1744564 1755577 1776720 1818648 1830834 1784295 1779847 1826379
15408 1826379 1826628 1780642 1759575 1725412 1722036 1757937 1752801 1765894 1760347 1760614 1753028 1779203 1796446
15395 1796446 1781938 1742980 1768649 1786952 1764878 1752332 1728875 1749039 1740942 1784811 1776846 1758625
15383 1758625 1783776 1742123 1729519 1726796 1747221 1784458 1760518 1769389 1803923 1792118 1777033 1774501
15371 1774501 1755430 1789958 1804830 1763875 1765016 1770838 1817027 1850507 1777088 1773639 1839566 1804694
15359 1804694 1777290 1769449 1773003 1819127 1808759 1773374 1724835 1764225 1764568 1748572 1776847 1807939
15347 1807939 1811294 1761143 1784696 1762410 1763920 1742728 1783491 1802529 1785093 1763664 1794049 1806172
15335 1806172 1761535 1724463 1721218 1801545 1808283 1798044 1808063 1825049 1790787 1727598 1730791 1804694
15323 1804694 1825854 1831242 1785716 1765164 1728088 1769364 1792800 1788814 1772602 1738327 1740836 1734202
15311 1734202 1710167 1746811 1774934 1797802 1779463 1804706 1784849 1776873 1784179 1781161 1789078 1849753
15299 1849753 1843734 1761566 1740086 1782577 1786441 1769828 1777412 1753019 1756693 1732760 1739277 1769104
15287 1769104 1812259 1818934 1820919 1805740 1798191 1780164 1780296 1758186 1752091 1758851 1768083 1769221 1829946
15274 1829946 1826082 1795563 1779125 1824263 1822922 1827903 1824023 1825993 1830400 1798417 1821185 1822952 1801697
15261 1801697 1802109 1836681 1852343 1841607 1810798 1817953 1813834 1802535 1786410 1755332 1747572 1752633
15249 1752633 1764073 1734668 1731236 1774798 1839555 1831771 1768088 1738128 1793784 1820858 1835080 1855181
15237 1855181 1839787 1808743 1802052 1816068 1784662 1773939 1805572 1849824 1790472 1799343 1813930 1823013
15225 1823013 1823530 1852773 1859769 1825053 1827414 1832409 1861865 1827693 1852048 1865649 1853377 1850922
15213 1850922 1785760 1761259 1755818 1766389 1754556 1757082 1771049 1737953 1759612 1771595 1830686 1839001
15201 1839001 1793145 1810517 1815820 1846862 1849859 1797793 1782500 1826525 1835347 1820706 1794993 1806461
15189 1806461 1853632 1833994 1829057 1801303 1793973 1803827 1805343 1845702 1858342 1848202 1846654 1872490
15177 1872490 1844503 1856149 1877300 1839128 1870476 1886372 1883145 1850634 1811063 1843786 1893839
15166 1893839 1906089 1857067 1827182 1844726 1815932 1823445 1863906 1872434 1917283 1839731 1833722 1783350
15154 1783350 1765855 1792491 1775126 1792908 1802543 1887122 1886221 1887337 1863794 1831463 1795562 1834703
15142 1834703 1847514 1837963 1807829 1809808 1810148 1847285 1836736 1804235 1870015 1879762 1848535 1824053
15130 1824053 1811190 1780139 1795957 1799772 1821706 1814130 1801340 1797382 1786624 1799730 1804571 1809556
15118 1809556 1826741 1792438 1765133 1800535 1847271 1826872 1795431 1821805 1846443 1839030 1864631
15107 1864631 1819659 1790222 1728646 1739997 1806000 1800901 1819205 1807033 1807080 1841046 1888956 1891982
15095 1891982 1897008 1842343 1850527 1880274 1874458 1861682 1855254 1897142 1898208 1842806 1773569 1807661
15083 1807661 1801183 1836421 1808066 1787486 1806939 1822945 1875080 1879471 1886673 1853452 1845043 1866162
15071 1866162 1866173 1847585 1848523 1877049 1858968 1784172 1768160 1831058 1849504 1823893 1879892 1853834
15059 1853834 1835459 1845054 1823504 1827520 1837980 1821614 1875793 1867183 1859040 1870579 1803813 1795385
15047 1795385 1779706 1815633 1814869 1788392 1818105 1786200 1811090 1863911 1790263 1797907 1797280 1811320
15035 1811320 1817024 1817684 1844450 1813307 1825215 1802678 1838483 1856317 1820440 1831573 1829432 1853428
15023 1853428 1852022 1809009 1802027 1834380 1880544 1902539 1876195 1902849 1866460 1833991 1835361 1825719
15011 1825719 1861198 1857099 1814137 1844828 1850122 1851631 1891908 1866350 1881332 1866789 1891526 1901023
14999 1901023 1932063 1870469 1837560 1854731 1865971 1847462 1880282 1873242 1829209 1865877 1853404
14988 1853404 1845514 1847245 1835109 1841130 1848555 1872648 1874843 1907846 1902975 1904010 1929864 1925713 1907940
14975 1907940 1843139 1856946 1848623 1855540 1857746 1886159 1819658 1877233 1871766 1848943 1886247 1952330
14963 1952330 1931736 1892468 1901222 1939791 1912949 1862966 1914718 1969914 1912769 1919355 1920087 1885371
14951 1885371 1853527 1871629 1899254 1860738 1907288 1831974 1860315 1876696 1862553 1865619 1915808
14940 1915808 1905990 1876103 1843426 1852844 1894406 1893441 1851846 1873733 1846832 1839151 1813245 1822916
14928 1822916 1825394 1877986 1849701 1830538 1868381 1851318 1883425 1863241 1899118 1884211 1835721
14917 1835721 1858064 1871804 1881485 1927968 1913194 1848747 1830037 1910563 1905083 1842921 1838505 1836411
14905 1836411 1832592 1834852 1876550 1889539 1911922 1871758 1831974 1814729 1833609 1836569 1829979 1914068
14893 1914068 1928264 1892111 1833289 1812888 1812630 1825976 1873952 1882538 1880097 1913639 1877905 1864985
14881 1864985 1852194 1823608 1781616 1827223 1833758 1891587 1869932 1868095 1856695 1849769 1892225 1900210
14869 1900210 1913186 1932024 1900610 1889801 1902022 1876542 1927128 1907243 1871198 1850698 1859776
14858 1859776 1900934 1892026 1895355 1880569 1894113 1913085 1889017 1882520 1850915 1894426 1871259 1876695
14846 1876695 1888099 1861146 1838520 1860608 1898202 1879766 1871870 1864637 1854474 1840377 1881179 1874685
14834 1874685 1868290 1919761 1939113 1920257 1908846 1940824 1950441 1904210 1916339 1924606 1902521 1863520
14822 1863520 1815894 1874105 1891936 1900725 1909857 1919268 1936508 1935272 1984585 1972911 1904517 1894805
$$ [...]
##END NTUPLES=NMR SPECTRUM
##END=
