##TITLE=1H_TG-2340-XVI-b
 CDCl3
 8 sc, 
 6.7.2023
##JCAMPDX= 6.0         $$ Bruker NMR JCAMP-DX V2.0
##DATA TYPE= NMR SPECTRUM
##DATA CLASS= NTUPLES
##ORIGIN= UXNMR, Bruker Analytische Messtechnik GmbH
##OWNER= root
$$ XWIN-NMR		Version 3.5
$$ Thu Jul  6 15:21:56 2023 Russian Standard Time (UT+4h)  she@DPX200
##.OBSERVE FREQUENCY= 200.13135
##.OBSERVE NUCLEUS= ^1H
##.ACQUISITION MODE= SIMULTANEOUS
##.ACQUISITION SCHEME= undefined
##.AVERAGES= 8
##.DIGITISER RES= 18
##SPECTROMETER/DATA SYSTEM= spect
##.PULSE SEQUENCE= zg30
##.SOLVENT NAME= CDCl3
##.SHIFT REFERENCE= (INTERNAL, CDCl3, 0, 15.7491)
##AUDIT TRAIL= $$ (NUMBER, WHEN, WHO, WHERE, WHAT)
$$ ##TITLE= Audit trail, XWIN-NMR		Version 3.5
$$ ##JCAMPDX= 5.01
$$ ##ORIGIN= Bruker BioSpin GmbH
$$ ##OWNER= she
$$ F:/spectra/data/she/nmr/H-F/1/pdata/1/auditp.txt
$$ ##AUDIT TRAIL=  $$ (NUMBER, WHEN, WHO, WHERE, WHAT)
(   1,<2023-07-06 15:20:36.06 +0400>,<she>,<DPX200>,
      <created by zg, POWCHK disabled, PULCHK disabled
       configuration hash MD5:
       00 E9 B6 7A A2 85 ED C7 34 08 36 98 17 FE 4E 26
       data hash MD5: 16K
       09 02 97 B9 A0 EB 77 61 5A 2E 4B 9F 9C D3 31 C7>)
(   2,<2023-07-06 15:20:38.82 +0400>,<she>,<DPX200>,
      <Start of raw data processing
       efp BC_mod = 2 LB = 0.24 FT_mod = 6 PKNL = 1 PHC0 = -20791.21 PHC1 = 15.65272 SI = 16K 
       data hash MD5: 16K
       47 BA 6D 75 C7 60 DE 52 17 EE B2 A7 A6 55 6C BD>)
(   3,<2023-07-06 15:21:00.98 +0400>,<she>,<DPX200>,
      <pk PHC0 = 6.33304 PHC1 = -8.2 
       data hash MD5: 16K
       0E F2 D9 8E DB 32 A1 DC 29 6B 55 62 96 5D 25 0A>)
(   4,<2023-07-06 15:21:04.39 +0400>,<she>,<DPX200>,
      <abs ABSG = 5 
       data hash MD5: 16K
       F8 76 2F 96 82 75 8D DA 8C 67 66 2F 61 19 85 0B>)
$$ ##END=
$$ 
$$ hash MD5
$$ 48 EE 37 10 97 58 27 ED F5 A6 D9 2E AD 54 F8 D5
##$RELAX= 
##$RELAX= 
##$RELAX= 
##$RELAX= 
##$RELAX= 
##$RELAX= 
$$ Bruker specific parameters
$$ --------------------------
##$DU= <F:/spectra>
##$EXPNO= 1
##$NAME= <H-F>
##$PROCNO= 1
##$TYPE= <nmr>
##$USER= <she>
##$AMP= (0..31)
100 100 100 100 100 100 100 100 100 100 100 100 100 100 100 100 100 100 
100 100 100 100 100 100 100 100 100 100 100 100 100 100 
##$AQSEQ= 0
##$AQ_mod= 1
##$AUNM= <au_zg>
##$AUTOPOS= <>
##$BF1= 200.13
##$BF2= 200.13
##$BF3= 200.13
##$BF4= 200.13
##$BF5= 200.13
##$BF6= 200.13
##$BF7= 200.13
##$BF8= 200.13
##$BYTORDA= 1
##$CFDGTYP= 0
##$CFRGTYP= 5
##$CHEMSTR= <none>
##$CNST= (0..31)
1 1 145 1 1 1 1 1 1 1 1 1 1 1 1 1 1 1 1 1 1 1 1 1 1 1 1 1 1 1 1 1 
##$CPDPRG= <>
##$CPDPRG1= <>
##$CPDPRG2= <>
##$CPDPRG3= <>
##$CPDPRG4= <mlev>
##$CPDPRG5= <mlev>
##$CPDPRG6= <mlev>
##$CPDPRG7= <mlev>
##$CPDPRG8= <mlev>
##$CPDPRGB= <>
##$CPDPRGT= <>
##$D= (0..31)
0 1.2 0 0 0 0 0 0 0 0.06 0 0.03 0 0 0 0 0.0002 0 0 0 0 0 0 0 0 0 0 0 0 
0 0 0 
##$DATE= 1688642435
##$DBL= (0..7)
120 120 120 120 120 120 120 120 
##$DBP= (0..7)
150 150 150 150 150 150 150 150 
##$DBP07= 0
##$DBPNAM0= <>
##$DBPNAM1= <>
##$DBPNAM2= <>
##$DBPNAM3= <>
##$DBPNAM4= <>
$$ [...]
##$SUBNAM3= <"">
##$SUBNAM4= <"">
##$SUBNAM5= <"">
##$SUBNAM6= <"">
##$SUBNAM7= <"">
##$SUBNAM8= <"">
##$SUBNAM9= <"">
##$SW= 18.05172834244
##$SWIBOX= (0..15)
0 0 2 0 0 0 0 0 0 0 0 0 0 0 0 0 
##$SW_h= 3612.71676300578
##$TD= 16384
##$TD0= 1
##$TE= 0
##$TE2= 300
##$TE3= 300
##$TEG= 300
##$TL= (0..7)
0 120 120 120 120 120 120 120 
##$TP= (0..7)
150 150 150 150 150 150 150 150 
##$TP07= 0
##$TPNAME0= <>
##$TPNAME1= <>
##$TPNAME2= <>
##$TPNAME3= <>
##$TPNAME4= <>
##$TPNAME5= <>
##$TPNAME6= <>
##$TPNAME7= <>
##$TPOAL= (0..7)
0.5 0.5 0.5 0.5 0.5 0.5 0.5 0.5 
##$TPOFFS= (0..7)
0 0 0 0 0 0 0 0 
##$TUNHIN= 0
##$TUNHOUT= 0
##$TUNXOUT= 0
##$USERA1= <user>
##$USERA2= <user>
##$USERA3= <user>
##$USERA4= <user>
##$USERA5= <user>
##$V9= 5
##$VALIST= <valist>
##$VCLIST= <CCCCCCCCCCCCCCC>
##$VD= 0
##$VDLIST= <DDDDDDDDDDDDDDD>
##$VPLIST= <PPPPPPPPPPPPPPP>
##$VTLIST= <TTTTTTTTTTTTTTT>
##$WBST= 1024
##$WBSW= 4
##$XGAIN= (0..3)
0 0 0 0 
##$XL= 0
##$YL= 0
##$YMAX_a= 243428
##$YMIN_a= -192724
##$ZGOPTNS= <>
##$ZL1= 120
##$ZL2= 120
##$ZL3= 120
##$ZL4= 120
##$ABSF1= 15.73588
##$ABSF2= -2.315969
##$ABSG= 5
##$ABSL= 3
##$ALPHA= 0
##$AQORDER= 0
##$ASSFAC= 0
##$ASSFACI= 0
##$ASSFACX= 0
##$ASSWID= 0
##$AUNMP= <proc_1d>
##$AZFE= 0.1
##$AZFW= 0.1
##$BCFW= 0
##$BC_mod= 2
##$BYTORDP= 0
##$COROFFS= 0
##$CY= -3
##$DATMOD= 1
##$DC= 0
##$DFILT= <>
##$DTYPP= 0
##$F1P= 0
##$F2P= 0
##$FCOR= 1
##$FTSIZE= 16384
##$FT_mod= 6
##$GAMMA= 0
##$GB= 0
##$INTBC= 1
##$INTSCL= 3.70164e-10
##$ISEN= 128
##$LB= 0.24
##$LEV0= 0
##$LPBIN= 0
##$MAXI= 10000
##$MC2= 0
##$MEAN= 0
##$ME_mod= 0
##$MI= 1.114404
##$NCOEF= 0
##$NC_proc= -6
##$NLEV= 6
##$NOISF1= 3.799351
##$NOISF2= 2.8
##$NSP= 0
##$NTH_PI= 0
##$NZP= 0
##$OFFSET= 15.74909
##$PC= 1
##$PHC0= -20784.88
##$PHC1= 7.452721
##$PH_mod= 1
##$PKNL= yes
##$PPARMOD= 0
##$PSCAL= 0
##$PSIGN= 0
##$REVERSE= no
##$SF= 200.130004493261
##$SI= 16384
##$SIGF1= 3
##$SIGF2= 2
##$SINO= 5.538805
##$SIOLD= 16384
##$SREGLST= <1H.CDCl3>
##$SSB= 0
##$STSI= 16384
##$STSR= 0
##$SW_p= 3612.71676300578
##$SYMM= 0
##$S_DEV= 0
##$TDeff= 16384
##$TDoff= 0
##$TI= <>
##$TILT= no
##$TM1= 0
##$TM2= 0
##$TOPLEV= 0
##$USERP1= <user>
##$USERP2= <user>
##$USERP3= <user>
##$USERP4= <user>
##$USERP5= <user>
##$WDW= 1
##$XDIM= 16384
##$YMAX_p= 295517258
##$YMIN_p= -677944
$$ End of Bruker specific parameters
$$ ---------------------------------
##NTUPLES= NMR SPECTRUM
##VAR_NAME=  FREQUENCY,     SPECTRUM/REAL,   SPECTRUM/IMAG
##SYMBOL=    X,             R,               I
##VAR_TYPE=  INDEPENDENT,   DEPENDENT,       DEPENDENT
##VAR_FORM=  AFFN,          ASDF,            ASDF
##VAR_DIM=   16384,         16384,           16384
##UNITS=     HZ,            ARBITRARY UNITS, ARBITRARY UNITS
##FACTOR=    0.220516191357247, 1,           1
##FIRST=     3151.86549143051, 0,            0
##LAST=      -460.851271575266, 0,           0
##MIN=       -460.851271575266, -677944,     0
##MAX=       3151.86549143051, 295517258,    0
$$ Real data points
##PAGE= N=1
##DATA TABLE= (X++(R..R)), XYDATA
$$ [...]
7151B661790N9427L3208L1246N8364R2680J10301J00972J21236J47422O4185Q9074
$$ 2661790 2721217 2754425 2785671 2844035 2936715 3047016 3147988 3269224 3416646 3480831 3569905
7140C569905R7426K6548R5617R2705J50009K03887J64286K03343K13991J66119
$$ 3569905 3667331 3693879 3789496 3882201 4032210 4236097 4400383 4603726 4817717 4983836
7130D983836K36381K86635K26623K18048K57859K35648K35113K14431K15712K79435
$$ 4983836 5220217 5506852 5733475 5951523 6209382 6445030 6680143 6894574 7110286 7389721
7120G389721K92088L10751L65163L99612M83813N54380O28195Q09013R25642J057530
$$ 7389721 7681809 7992560 8357723 8757335 9241148 9795528 10423723 11232736 12158378 13215908
7110A3215908J188453J426639J640665J982644K491685L037035L752332M861917
$$ 13215908 14404361 15831000 17471665 19454309 21945994 24983029 28735361 33597278
7102C3597278O342325Q000108R284915R735278Q426437M409560o05330n759275
$$ 33597278 39939603 47939711 57224626 66959904 75386341 79795901 79190571 73431296
7094G3431296r134702j0009133r240419p718788o139446m639934l567497k713671
$$ 73431296 64296594 54287461 45047042 37328254 31188808 26548874 22981377 20267706
7086B0267706k194953j791487j473665j200207j091641r25852p06074o61994o19782
$$ 20267706 18072753 16281266 14807601 13607394 12515753 11589901 10883827 10221833 9602051
7077I602051m76996m89840m45562m40862k71423l32477k90673l00453k41712j66645
$$ 9602051 9125055 8635215 8189653 7748791 7477368 7144891 6854218 6553765 6312053 6145408
7067F145408k09844j59967o0889m6411r3734l9480j2000L4947J77549J24124J65430
$$ 6145408 5935564 5775597 5714708 5668297 5574563 5535083 5523083 5558030 5735579 5859703 6025133
7056F025133K69927L05975M57765N57392O12999P41333P59419O59257O09190M97108
$$ 6025133 6295060 6601035 7058800 7616192 8229191 8970524 9729943 10389200 10998390 11495498
7046A1495498L17186K1986k95186o01839r20892q84521p92883p80355p63565p31296
$$ 11495498 11812684 11834670 11539484 10937645 10016753 9132232 8339349 7558994 6795429 6064133
7036F064133n66370m77772l75956l66858k95283k71464k27813k21023j77874p5573
$$ 6064133 5497763 5019991 4644035 4277177 3981894 3710430 3482617 3261594 3083720 3008147
7026C008147j39309j05945p7403q5143j39874j02252p1864n6227j7488j03543
$$ 3008147 2868838 2762893 2685490 2600347 2460473 2358221 2286357 2230130 2212642 2109099
7016B109099m0742o5638m8181k9876M2431k3178j2473l8222r5166o794j8020K6221
$$ 2109099 2068357 2002719 1954538 1924662 1967093 1943915 1931442 1893220 1798054 1791260 1773240 1799461
7004A799461N1783l573J0353L803J8638l9333K7952M7650J1859N1000J41787O9379
$$ 1799461 1851244 1847671 1858024 1861827 1880465 1841132 1869084 1916734 1928593 1979593 2121380 2190759
6992B190759Q6906J45261J25627J82135K66929L34161M62351M85910N51175N15936
$$ 2190759 2277665 2422926 2548553 2730688 2997617 3331778 3794129 4280039 4831214 5347150
6982E347150M78088M92503L35748R0526k31255m32544n72706n22442n11068m92680
$$ 5347150 5825238 6317741 6653489 6744015 6512760 6080216 5507510 4985068 4474000 3981320
6972C981320m73620l96396l67504l01806k16988k10621k04862j52035n0169o1706
$$ 3981320 3507700 3111304 2743800 2441994 2225006 2014385 1809523 1657488 1607319 1545613
6962A545613j50005j12147l0141k1319q4949l8848l2049o6820p4742k6085n8839
$$ 1545613 1395608 1283461 1253320 1232001 1147052 1108204 1076155 1009335 934593 908508 849669
6951H49669l389l4625n9157L0371o9092j9411J2824n6847k8004L1511o6577l3905
$$ 849669 846280 811655 752498 782869 713777 694366 707190 650343 622339 653850 587273 553368
6939E53368J4675O3456P231n3780q138m2657o1442m370J2715J3389o7537l5095
$$ 553368 568043 631499 638730 584950 576812 534155 472713 468343 481058 494447 426910 391815
6927C91815K3224m0710j1857j175o70o1710k1006o4976K146M9988m8833M6779
$$ 391815 415039 374329 362472 361297 360627 298917 277911 212935 215081 265069 216236 263015
6915B63015M6606J5858n8707m9157J1368O011l7568k1277J7557j646j0566Q145
$$ 263015 309621 325479 266772 217615 228983 234994 197426 176149 193706 192060 181494 189639
6903A89639J7170l3806K4274K4121J052k3888k6892k8651L0101j739k1765J7272
$$ 189639 206809 173003 197277 221398 222450 198562 171670 143019 173120 171381 149616 166888
6891A66888j0330j8191L3036M7093m064K4098j1450p5427l9715n2259L3442K5351
$$ 166888 156558 138367 171403 218496 214432 238530 227080 151653 111938 59679 93121 118472
6879A18472N0809j1951l1546K3364j2057m2185m636K8058q966j4991K0904P100
$$ 118472 169281 157330 125784 149148 137091 94906 90270 118328 109362 94371 115275 122375
6867A22375k5775k5449J9240j6731M1518K2657l2666M4747k3188n162L7685k175
$$ 122375 96600 71151 90391 73660 115178 137835 105169 149916 126728 121566 159251 157076
6855A57076k3181j5993J7669m2436k5065j7702j0444K7196L2463K8155l1805r160
$$ 157076 133895 117902 135571 93135 68070 50368 39924 67120 99583 127738 95933 86773
6843H6773k0078M2979L6059n9872k1013M1155K3235j1342l9628J6719J7428L2757
$$ 86773 66695 109674 145733 85861 64848 106003 129238 117896 78268 94987 112415 145172
6831A45172o3444k3015N0342J9529r3720r928j8860K8763L1901M4950r950l3035
$$ 145172 81728 58713 109055 128584 34864 24936 6076 34839 66740 111690 101740 68705
6819F8705J3076k9666j1227K9406n679j9688N2248K6722k4502k0531r115m0450
$$ 68705 81781 52115 40888 70294 64615 44927 97175 123897 99395 78864 69749 29299
6807B9299j119O3544l0921k8992J1484M2250K1953n0679k7191j1509L5501j542
$$ 29299 28180 91724 60803 31811 43295 85545 107498 56819 29628 18119 53620 52078
6795E2078l5076K6694O701J1254l631p4671L787j1047R833O960l44K670Q4179
$$ 52078 17002 43696 50397 61651 58020 -16651 -12864 -23911 -14078 -7118 -7462 -4792 79387
6782G9387K2655N107k5927j2534k4818K2615L9471j5433j7382o851J3193R526
$$ 79387 102042 107149 81222 68688 43870 66485 105956 90523 73141 66290 79483 89009
6770H9009J6094o8256N1967P1267n6673j9791N377L6503m2381K586J1824j2980
$$ 89009 105103 36847 88814 160081 103408 83617 88994 125497 83116 85702 97526 84546
6758H4546n9896r831O4712k6850m8094J7116j2776O0587J3030k2156n4058M511
$$ 84546 24650 14819 79531 52681 4587 21703 8927 69514 82544 60388 6330 10841
6746A0841k8926j481M3175N61l925L2764L3731j0077J2187R245j3540l4956N429
$$ 10841 -18085 -19566 23609 24170 20245 53009 86740 76663 88850 98095 84555 49599 55028
6733E5028o389P565m0993L602J9458J9529o831L5544j055j7706M4607K8511P142
$$ 55028 48639 56204 15211 18813 38271 57800 50969 86513 85458 67752 112359 140870 148012
6720A48012P1275n4960p2901j1193J2677O94R853j1885j0046L825N5580J6147
$$ 148012 219287 164327 91426 80233 92910 93604 103457 91572 81526 85351 140931 157078
6708A57078j8606K1091p078j2214N102J9999K3622K7708L4516N1670J00974M9746
$$ 157078 138472 159563 152485 140271 145373 165372 188994 216702 251218 302888 403862 453608
6696D53608j3783j4470K2937o1277p9528p2079p915P78k8205l0611k3507j5270
$$ 453608 439825 425355 448292 387015 307487 235408 227493 228271 200066 169455 145948 130678
6684A30678J91k446j337P697q2516L696J1282l8588j8359j1113J045K2294M4889
$$ 130678 130869 128423 127086 134783 52267 55963 67245 28657 10298 -815 230 22524 67413
6671F7413l1988J9290k3939k3897O210k1434j7368J1864k0314n844P0437j7397
$$ 67413 35425 54715 30776 6879 13089 -8345 -25713 -13849 -34163 -40007 30430 13033
6659A3033L833L5494m6j8657j5987K4781L7143n1746L5814j638k5683k7225J4217
$$ 13033 16866 52360 52314 33657 17670 42451 79594 27848 63662 62024 36341 9116 23333
6646B3333l321O643N7674L693j7953l2490j3867L146J5971k7097L4770M7923j4285
$$ 23333 20012 26655 84329 88022 70069 37579 23712 26858 42829 15732 50502 98425 84140
6633H4140l0392m5596M936L1755m6643q047K8678m9622J3392j4596L091P0959
$$ 84140 53748 8152 13088 44843 -1800 -9847 18831 -30791 -17399 -31995 -28904 42055
6621D2055r3j7933k0912k4479K7464K0390J1420n3931k6052J2002k8621Q7472
$$ 42055 41962 24029 3117 -21362 6102 26492 37912 -16019 -42071 -30069 -58690 28782
6609B8782k6313k2363L8890L2070K3279p0879J3598j4292l5799L5288J5585j0777
$$ 28782 2469 -19894 18996 51066 74345 3466 17064 2772 -33027 2261 17846 7069
6597G069j5141j6367M5367j9017N361J1491m7098L4077M3430r0437j004N0866
$$ 7069 -8072 -24439 20928 1911 7272 18763 -28335 5742 49172 -41265 -42269 8597
6585H597K5822j0962O3297j0409j5198M540l709m2214k0611j2634K0317J2797
$$ 8597 34419 23457 86754 76345 61147 65687 61978 19764 -847 -13481 6836 19633
6573A9633K0173k896J2968m9958l7674N5521J4900L679N387J3837o7900N1318
$$ 19633 39806 36910 49878 -80 -37754 17767 32667 36346 41733 55570 -12330 38988
6561C8988j3081m5645J2131K8152p428k9635N197N4490k5758O411j6618k0118
$$ 38988 25907 -19738 -7607 20545 13117 -16518 -11321 43169 17411 23822 7204 -12914
6549a2914M5447K0215m849P76L3429n8077J4255L473J1774j8389l4681N2130n479
$$ -12914 32533 52748 47899 48675 82104 24027 38282 41755 53529 35140 459 52589 47110
6536D7110J3515L2358j0078r55p081o375q040p5515O2087J03119J4730q5029o763
$$ 47110 60625 92983 82905 81950 74869 68494 60454 -15061 47026 150145 164875 79846 73083
6523G3083o4774L8615M7647K5440l5170r764L1907p25k5654L1673M664L8436j5597
$$ 73083 8309 46924 94571 120011 84841 75077 106984 106259 80605 112278 116942 155378 139781
6510A39781p3315M500K6417N2229k5704J030k123n2561M306M9710O82k8217o9265
$$ 139781 66466 70966 97383 149612 123908 124938 122815 70254 74560 124270 124952 96735 27470
6497B7470j8940K049O1354J1711m9315L4648l967k022k728K7123m861l6727m2626
$$ 27470 8530 10579 71933 83644 34329 68977 65010 62988 60260 87383 82522 45795 3169
6484C169K4350R7277l606p1969j3229J2879N51p943L7604n869N606N5761n4001
$$ 3169 27519 124796 121190 49221 35992 48871 49422 41479 79083 73214 78820 134581 80580
6471H0580l8253R219L2844K4690j977R11K1512l1003o454K3095N627n3269j6196
$$ 80580 42327 51546 84390 109080 107103 108014 129526 98523 92069 115164 120791 67522 51326
6458E1326M1486K10j9627J5662m8860R651j4081J9760M8186L8540l3207j9593
$$ 51326 92812 93022 73395 89057 40197 49848 35767 55527 103713 142253 109046 89453
6446H9453J4577P748j5678k5075K349N2140j9285m8692M1805m1790R152O360K1002
$$ 89453 104030 111778 96100 71025 73374 125514 106229 57537 99342 57552 66704 73064 94066
6433I4066m3410q032P4778k54k1294J7205L225J0594J2236n0325l1427J6565l999
$$ 94066 50656 42624 117402 117148 95854 113059 116284 126878 139114 88789 57362 73927 69928
6420F9928P106J605L2873k6974m7391J26883O431q377l1117m8526L7474K1129
$$ 69928 77034 78639 111512 84538 37147 164030 170461 162084 130967 82441 119915 141044
6408A41044m0344K4372O570j7390k6626K0867L5384j587m5456M1315j0424M352
$$ 141044 100700 125072 131642 114252 87626 108493 143877 142290 96834 138149 127725 132077
6396A32077M2996J3951j928N459L1535m5048R988m5876k878K3852L4249N2476
$$ 132077 175073 189024 187096 192555 224090 179042 189030 143154 140276 164128 198377 250853
6384B50853r304J739o260m5843L7542J8863r004j0757m4464O499P036o8371J3544
$$ 250853 241549 243288 237028 191185 228727 247590 238586 227829 183365 189864 196900 128529 142073
6371A42073K5265M9874m2389m216M6216m5216K9516j445k6995R645k7504l2013
$$ 142073 167338 217212 174823 170607 216823 171607 201123 199678 172683 182328 154824 122811
6359A22811N207J9259K953k2879J189J6131M1090m5650k5497P6894N9623k5024
$$ 122811 128018 147277 150230 127351 128540 144671 185761 140111 114614 191508 251131 226107
6347B26107k9060l6958K3192M8577K7708L4809n26p904J7030N9552j1294n4221
$$ 226107 197047 160089 183281 231858 259566 294375 293849 285945 302975 362527 351233 297012
6335B97012m1965M601M8883K5940J081k3041o2583P2306j9852k0863O049m0769
$$ 297012 255047 259648 308531 334471 335552 312511 249928 322234 302382 281519 287568 246799
6323B46799j2359L8498k4567j1067J8878l8217R5437m2043r0383J0872L7485J1853
$$ 246799 234440 272938 248371 237304 256182 217965 313402 271359 180976 191848 229333 241186
6311B41186p9272L2670O2173J8813P775M903m4645l6767K1487l231P067J0884
$$ 241186 161914 194584 256757 275570 283345 288248 243603 206836 228323 225092 232159 243043
6299B43043j4394j2392r88J8540Q3455L6836n1187O723Q7371k2618m2157N1008
$$ 243043 228649 216257 215269 233809 317264 354100 302913 309636 397007 374389 332232 383240
6287C83240m9301k5727L0423L3129l4995m4388O275M5029j7172j685K326o0769
$$ 383240 333939 308212 338635 371764 336769 292381 298656 343685 326513 324828 327154 266385
6275B66385R0273N3445o7938j5208L3431K4325q233j0026M8775k665k4319l0789
$$ 266385 356658 410103 342165 326957 360388 384713 376480 366454 415229 412564 388245 357456
6263C57456j6101j0102K8037O6564n285k0186J8840L3441K1606n8949J1426J6495
$$ 357456 341355 331253 359290 425854 420569 400383 419223 452664 474270 415321 426747 443242
6251D43242M1149J0822o4932M3652J5432o247J1471O7293J7374L3561j0603L246
$$ 443242 484391 495213 430281 473933 489365 483118 494589 561882 579256 612817 602214 605460
6239F05460K8469L0887J4676o3342K4350j8792j4951K973J2408k3755L6384l131
$$ 605460 633929 664816 679492 616150 640500 621708 606757 609730 622138 598383 634767 631636
6227F31636O977l545k1506M2584j8877L3993k8569m5877K4236m7524K166j1260
$$ 631636 638613 635068 613562 656146 637269 671262 642693 596816 621052 573528 575694 564434
6215E64434M3870K3326J9891O4489K9959j8321k5894p219j357M3316m3883K9639
$$ 564434 608304 631630 651521 716010 745969 727648 701754 694535 693178 736494 692611 722250
6203G22250N0739n0725k187M3399P0045j1922J3565J1922R382L3103o5209K3631
$$ 722250 772989 722264 720077 763476 833521 821599 835164 847086 856468 889571 824362 847993
6191H47993J5413K4693q98L7761k306j472M98p8036J5553M2812O4531M9269J4933
$$ 847993 863406 888099 887201 924962 922656 921184 921682 843646 859199 902011 966542 1015811 1030744
6178A030744L0472j9769L7455K6072O513L2118j3744r700M8846O67k8576M6412
$$ 1030744 1061216 1041447 1078902 1104974 1111487 1143605 1129861 1120161 1169007 1169674 1141098 1187510
6166A187510q3153n099N9489o8563K494N1757L9998P1453m450O5959N643p5940
$$ 1187510 1104357 1099258 1158747 1090184 1092678 1144435 1184433 1255886 1251436 1317395 1323038 1247098
6154A247098j6169O1700N0714L693N7808K4932j2115o313J9606Q4184M2370k5018
$$ 1247098 1230929 1292629 1343343 1347036 1404844 1429776 1417661 1411348 1430954 1515138 1557508 1532490
6142A532490M1084O3328L7105j2048M1974J6360m034K6553N4183J6247l574R359
$$ 1532490 1573574 1636902 1674007 1661959 1703933 1720293 1716259 1742812 1796995 1813242 1809668 1819027
6130A819027N2598N8160n553N124N1457K8013L1485N3740j1040M3932L9770O1220
$$ 1819027 1871625 1929785 1924232 1929356 1980813 2008826 2040311 2094051 2083011 2126943 2166713 2227933
6118B227933P8232j6276M4031N850j1048J12771K1269k019L4138N9838N9327O1970
$$ 2227933 2306165 2289889 2333920 2339770 2328722 2441493 2462762 2460743 2494881 2554719 2614046 2676016
6106B676016M3607N4044P8370K2152L6201P9103J04132K9348M4067P3918Q4907
$$ 2676016 2719623 2773667 2852037 2874189 2910390 2989493 3093625 3122973 3167040 3240958 3325865
6095C325865O7473Q9509J43279J29283N4182P9549J30876P8693J57439J41338
$$ 3325865 3393338 3482847 3626126 3755409 3809591 3889140 4020016 4098709 4256148 4397486
6085D397486R8321J52062J95961J73148K19444K00260K69344K87651K96464L76096
$$ 4397486 4495807 4647869 4843830 5016978 5236422 5436682 5706026 5993677 6290141 6666237
6075F666237M20945M84907O43594O79699Q73350J093788J376963J743108K123459
$$ 6666237 7087182 7572089 8215683 8895382 9768732 10862520 12239483 13982591 16106050
6066A6106050K315770K406314K112808R43432n65503j517582j501965j266053
$$ 16106050 18421820 20828134 22940942 23884374 23318871 21801289 20299324 19033271
6058A9033271p94144k64220M63786J057508J474050J691756J438949M16880j115504
$$ 19033271 18239127 17974907 18438693 19496201 20970251 22662007 24100956 24517836 23402332
6049B3402332k239758k406316k205488j889512j615432j205031q41181o99755
$$ 23402332 21162574 18756258 16550770 14661258 13045826 11840795 10999614 10299859
6041A0299859n82288m30675l14251l34305k43031j53140j02399j3773k3299J3640
$$ 10299859 9717571 9286896 8972645 8638340 8395309 8242169 8139770 8125997 8102698 8116338
6031H116338N6797J04199J43475J84579K59088K81540K65057M57173N66681N75438
$$ 8116338 8173135 8277334 8420809 8605388 8864476 9146016 9411073 9868246 10434927 11010365
6021A1010365P36951J027646J227173J530698J970422K544496K984381L093954
$$ 11010365 11747316 12774962 14002135 15532833 17503255 20047751 23032132 26126086
6013B6126086K973320J966380J73270j606528k083792k001247j474115p61904
$$ 26126086 29099406 31065786 31239056 29632528 27548736 25547489 24073374 23311470
6005B3311470J5060R53353J656910K047032K043117J281462n80780k500021l310837
$$ 23311470 23326530 24279883 25936793 27983825 30026942 31308404 30727624 28227603 24916766
5996B4916766l172621k849554k464573j983793j562614j187174r76953q24550
$$ 24916766 21744145 18894591 16430018 14446225 12883611 11696437 10719484 9894934
5988I894934o64845o07310m62112m78522l71604k41899l00795k46854k04017k15231
$$ 9894934 9230089 8622779 8160667 7682145 7310541 7068642 6767847 6520993 6316976 6101745
5978F101745j68530j95887q1927j07671j13734j21554r3012j15482j30681p1416
$$ 6101745 5933215 5737328 5655401 5547730 5433996 5312442 5219430 5103948 4973267 4901851
5968D901851l3661m1085j07910J2072q4427p5628j8734k4334r0643n1934m0931
$$ 4901851 4868190 4827105 4719195 4731267 4646840 4571212 4552478 4528144 4437501 4385567 4344636
5957D344636j6115m7179n763r803k5748o0181l6368l9004n2879r1602l6364k7544
$$ 4344636 4328521 4281342 4275579 4265776 4240028 4179847 4143479 4104475 4051596 3959994 3923630 3896086
5945C896086m9290o6817J4725O5130m8428J4029O4447k7090K6565N7723K6723
$$ 3896086 3846796 3779979 3794704 3859834 3811406 3825435 3889882 3862792 3889357 3947080 3973803
5934C973803Q355j5218K4359n004L9591l2867m1875k2648j9810m1418l5072k6624
$$ 3973803 3982158 3966940 3991299 3986295 4025886 3993019 3951144 3928496 3908686 3867268 3832196 3805572
5922C805572J76J7617j8088k3780O304J2199J5277K1519K1639q889P0451P2455
$$ 3805572 3805748 3823365 3805277 3781497 3787801 3800000 3815277 3836796 3858435 3849546 3919997 3992452
5910C992452J7595J2377K405L9004L0410J2400L4587N2344M1419P3610O9269k7507
$$ 3992452 4010047 4022424 4024829 4063833 4094243 4106643 4141230 4193574 4234993 4308603 4377872 4350365
5898D350365J082O6263j3586K8029M288k2480K3851j083M8389N8728j3625l3387
$$ 4350365 4351447 4417710 4404124 4432153 4436441 4413961 4437812 4436729 4485118 4543846 4530221 4496834
5886D496834J6838R4277l011k1408K994Q9968J75594P8102Q4879R9928J09587
$$ 4496834 4513672 4607949 4604938 4583530 4586524 4676492 4852086 4930188 5015067 5114995 5224582
5875E224582N683K6068N5502M7368P3172R8840J02619J80465J44393O2958M8707
$$ 5224582 5230265 5256333 5311835 5359203 5432375 5531215 5633834 5814299 5958692 6021650 6070357
5864F070357J46352J10705P5783J06209J85068J46973J78324K71915J85866K44220
$$ 6070357 6216709 6327414 6403197 6509406 6694474 6841447 7019771 7291686 7477552 7721772
5854G721772J61376R1095J16254N0026O3199J1975L4685O2917j6605K395J3994
$$ 7721772 7883148 7974243 8090497 8140523 8203722 8215697 8250382 8313299 8296694 8299089 8313083
5843H313083m0185l727r848o5365p5305k0510j8385j8571k2318L5038O0709L5598
$$ 8313083 8272898 8269171 8259323 8193958 8118653 8098143 8079758 8061187 8038869 8073907 8134616 8170214
5831H170214J10977J06997J23380J83250J67099J80058J47351J92445K85096L86056
$$ 8170214 8281191 8388188 8511568 8694818 8861917 9041975 9189326 9381771 9666867 10052923
5821A0052923M29232M76370N76295O17861O02689O35820O74039P14206P07160
$$ 10052923 10482155 10958525 11534820 12152681 12755370 13391190 14065229 14779435 15486595
5812A5486595O21056M94082L31433J99485K0136l6637q1877O3347k971P9678J19859
$$ 15486595 16107651 16601733 16933166 17132651 17152787 17116150 17034273 17097620 17094649 17174327 17294186
5801A7294186J50189K16362J51870J28724q9201k35391l09639m95436m32980m58993
$$ 17294186 17444375 17660737 17812607 17941331 17852130 17616739 17307100 16811664 16378684 15919691
5791A5919691l21576l52062l74144k98878k56908k11567j45636l1251K1074O8924
$$ 15919691 15598115 15246053 14871909 14573031 14316123 14104556 13958920 13927669 13948743 14017667
5781A4017667J44144L00051L34485K68181K47943L10545K62309K21286J4247l50473
$$ 14017667 14161811 14461862 14796347 15064528 15312471 15623016 15885325 16106611 16120858 15770385
5771A5770385p73342q21630p54131o66782o61619o98013o50868o49946n15720
$$ 15770385 14997043 14175413 13421282 12754500 12092881 11394868 10744000 10094054 9578334
5762I578334m08587m11484k78914j75501j93583j38877q3496l0268l6914L2224
$$ 9578334 9169747 8758263 8479349 8303848 8110265 7971388 7887892 7857624 7820710 7852934
5752G852934P004L8141Q2055Q2287J44871J63432K08083K22119L36066L80573
$$ 7852934 7859938 7898079 7980134 8062421 8207292 8370724 8578807 8800926 9136992 9517565
5742I517565M82852O27101P32744R02574J140332J466356J792601K006853K017419
$$ 9517565 10000417 10627518 11360262 12262836 13403168 14869524 16662125 18668978 20686397
5733B0686397J928516J925403J680720N10705j112158k017429j874136j673472
$$ 20686397 22614913 24540316 26221036 26731741 25619583 23602154 21728018 20054546
5725B0054546j628378j591030j457050j157753q56758n90532l76429k44871j16478
$$ 20054546 18426168 16835138 15378088 14220335 13363577 12773045 12396616 12151745 12035267
5716A2035267Q5532K72638M08797N87545P50758J029810J445890J868899K157718
$$ 12035267 12120799 12393437 12802234 13389779 14140537 15170347 16616237 18485136 20642854
5707B0642854J967749J912768J981481J564485M1324j629827k264322k071387
$$ 20642854 22610603 24523371 26504852 28069337 28110661 26480834 24216512 22145125
5699B2145125j827648j796827j790655j539554j207025q31665o87880m02520k24993
$$ 22145125 20317477 18520650 16729995 15190441 13983416 13151751 12463871 12061351 11836358
5690A1836358j46996N1265J93488M30376O46675R05309J256460J420645J334505
$$ 11836358 11689362 11740627 11934115 12364491 13011166 13916475 15172935 16593580 17928085
5681A7928085J240250J282998Q42381l90690j394325j617613j332543j296282
$$ 17928085 19168335 20451333 21293714 20903024 19508699 17891086 16558543 15262261
5673A5262261j269568j191520j065399p60738n60640m00200k66757j80165p9241
$$ 15262261 13992693 12801173 11735774 10975036 10414396 10014196 9747439 9567274 9488033
5664I488033M9013J41293K46938M39548O31758Q48577J183457J528467J539407
$$ 9488033 9537046 9678339 9925277 10364825 10996583 11845160 13028617 14557084 16096491
5655A6096491J434421J412816J397988O03482p65528j643640j698035j543519
$$ 16096491 17530912 18943728 20341716 20945198 20179670 18536030 16837995 15294476
5647A5294476j455653j508962j457675j221010r59156p75144o06644n12181m79157
$$ 15294476 13838823 12329861 10872186 9651176 8692020 7916876 7310232 6798051 6318894
5638F318894l90523k41857k04529k53498k20566j62237j36560j19596r8355o4483
$$ 6318894 5928371 5686514 5481985 5228487 5007921 4845684 4709124 4589528 4491173 4426690
5628D426690p0875l0887K0818P4399j6471l8311N07j6423p390o4321l7512j11678
$$ 4426690 4355815 4324928 4345746 4420145 4403674 4365363 4365870 4349447 4342057 4277736 4240224 4128546
5616D128546m5519j18289j20694n7113r6226j06820m8529j7914n611n4913J9610
$$ 4128546 4083027 3964738 3844044 3786931 3690705 3583885 3535356 3517442 3511831 3456918 3476528
5605C476528M4483O1930N6766J33028J66895J61138J31890J14301R5526J2460
$$ 3476528 3521011 3582941 3639707 3772735 3939630 4100768 4232658 4346959 4442485 4454945
5595D454945J7656n6268m8628n4817j51543p6467j21245j42966r9999j47039k9023
$$ 4454945 4472601 4416333 4367705 4312888 4161345 4084878 3963633 3820667 3720668 3573629 3544606
5584C544606o5645o0967L5102L8764J8932J22092J32409J59710K18296J90769
$$ 3544606 3478961 3417994 3453096 3491860 3510792 3632884 3765293 3925003 4143299 4334068
5574D334068J78658J80112N5910J0661o4031j32463j94489j54025j70274j67777
$$ 4334068 4512726 4692838 4748748 4759409 4695378 4562915 4368426 4214401 4044127 3876350
5564C876350j80432k02930j14409j11175j38136r8634j8941k0038o415n2803K5345
$$ 3876350 3695918 3492988 3378579 3267404 3129268 3030634 3011693 2991655 2985240 2932437 2957782
5553B957782K0823O0611Q2172P7824Q6466J16796P3157N0876M0144M5088k9274
$$ 2957782 2978605 3039216 3121388 3199212 3285678 3402474 3475631 3526507 3566651 3611739 3582465
5542C582465p4644j35931j29693j91125j76261j06979r9450n5709j08673p3987
$$ 3582465 3507821 3371890 3242197 3051072 2874811 2767832 2668382 2612673 2504000 2430013
5532B430013n6957o3359K1585Q440K037N0471K1455N0237N4108K8496j0614k0854
$$ 2430013 2373056 2309697 2331282 2339722 2341759 2392230 2413685 2463922 2518030 2546526 2535912 2515058
5520B515058p877j8167j18066o6640n8768p0800r1557n3067l3818j6112l9266
$$ 2515058 2507181 2489014 2370948 2304308 2245540 2174740 2083183 2030116 1996298 1980186 1940920
5509A940920l6688n2195J2894K1030j4644q715k743q868Q762M0500R0721N8719
$$ 1940920 1904232 1852037 1864931 1885961 1871317 1862602 1859859 1850991 1859753 1900253 1990974 2049693
5497B049693O6827N6772O8744L3539J2664q606m6613l9654j08227q6508n4349
$$ 2049693 2116520 2173292 2242036 2275575 2288239 2279633 2233020 2193366 2085139 1998631 1944282
5486A944282j3776l2390q9399m7194K5060l2331J3364K6894J10k2090L4180m7174
$$ 1944282 1930506 1898116 1808717 1761523 1786583 1754252 1767616 1794510 1794620 1772530 1806710 1759536
5474A759536l5050k2806m7626r4384n3775J8431k1890j3716q851k787j1650N0055
$$ 1759536 1724486 1701680 1654054 1559670 1505895 1524326 1502436 1488720 1479869 1477082 1465432 1515487
5462A515487L6664l0203m520J8242L4422N655K4646m898j8059L0151m9721R373
$$ 1515487 1552151 1521948 1517428 1535670 1570092 1575747 1600393 1595495 1577436 1607587 1557866 1567239
5450A567239j7972l3427N075l730N8452N8063j0959J9231k3497M4118M3666k714
$$ 1567239 1549267 1515840 1520915 1517185 1575637 1633700 1622741 1641972 1618475 1662593 1706259 1703545
5438A703545m3032J497k9010k8870L886o5717j2279j3690L6837j6012N9350R4382
$$ 1703545 1660513 1662010 1633000 1604130 1608016 1542299 1530020 1516330 1553167 1537155 1596505 1690887
5426A690887k7206p2895Q971p2618j4711K1684m8123j8512L1156K4062l8287O981
$$ 1690887 1663681 1590786 1599757 1527139 1512428 1534112 1485989 1467477 1498633 1522695 1484408 1491389
5414A491389J8361M1950J2705O4788L103q3182K8208p5802L8764J8014n487L6155
$$ 1491389 1509750 1551700 1564405 1629193 1632296 1549114 1577322 1501520 1540284 1558298 1552811 1588966
5402A588966k9458K8366j9518Q2678m713l2274L4889m6078K5713L1761J5858k1676
$$ 1588966 1559508 1587874 1568356 1651034 1646321 1614047 1648936 1602858 1628571 1660332 1676190 1654514
5390A654514N0299j1525J8768N6175m0964L8926M5644K1787M5022R6917Q8095
$$ 1654514 1704813 1693288 1712056 1768231 1727267 1766193 1811837 1833624 1878646 1975563 2063658
5379B063658K4087O8536O1152K7368J17197J12341R4866M6737R1686J17822P8838
$$ 2063658 2087745 2156281 2217433 2244801 2361998 2474339 2569205 2615942 2707628 2825450 2904288
5368B904288j2119j0767J2945L6363P6807K4366O8560N1593P4812J39859R7604
$$ 2904288 2892169 2881402 2894347 2930710 3007517 3031883 3100443 3152036 3226848 3366707 3464311
5357C464311J34142R0614R6799R2422P2066R9201J11196J06020P3352M2480o9640
$$ 3464311 3598453 3689067 3785866 3878288 3950354 4049555 4160751 4266771 4340123 4382603 4312963
5346D312963n7067q3603j01269q0118n8278p2988q5202n4043j947j7031L4620
$$ 4312963 4255896 4172293 4071024 3990906 3932628 3859640 3774438 3720395 3718448 3701417 3736037
5335C736037L7012n3899l8227p206j382M2535k8853o0291j4654l9790J3642r7406
$$ 3736037 3773049 3719150 3680923 3673717 3672335 3714870 3686017 3625726 3611072 3571282 3584924 3487518
5323C487518q4549l5275j3132j4086j5635r4950o8008m2895q6293j19983m0189
$$ 3487518 3402969 3367694 3354562 3340476 3324841 3229891 3161883 3118988 3032695 2912712 2872523
5312B872523m6516l5180l5360l7744o4747o099o443l7956O646P2852J33184J32862
$$ 2872523 2826007 2790827 2755467 2717723 2652976 2646877 2640434 2602478 2609124 2681976 2815160 2948022
5300B948022m248J32018J25361k8985k4807Q892K7032p3686l4807m1295o0666
$$ 2948022 2943774 3075792 3201153 3172168 3147361 3156253 3183285 3109599 3074792 3033497 2972831
5289B972831j8443K316N32M6973j332J5548k4147Q7592K2763k9035J9405O9049
$$ 2972831 2954388 2956704 2957236 3004209 3002877 3018425 2994278 3081870 3104633 3075598 3095003 3164052
5277C164052P6517K7950j2557q8369k9352j5869n6238L0687p832L6199J3456O9429
$$ 3164052 3240569 3268519 3255962 3167593 3138241 3122372 3066134 3096821 3088989 3125188 3138644 3208073
5265C208073J00090P0462q132K8990m7237j6630M3110P162k3479P376N183j4527
$$ 3208073 3308163 3378625 3370493 3399483 3352246 3335616 3378726 3385888 3362409 3369785 3374968 3360441
5253C360441n2622r720j39969j12145r3452n4638k4467j03764o9177r0646J7936
$$ 3360441 3307819 3298099 3158130 3045985 2952533 2897895 2873428 2769664 2700487 2609841 2627777
5242B627777j3151P0093m7349N8552O8482P4712K3967P6336O7893M5459j3211
$$ 2627777 2614626 2684719 2637370 2695922 2764404 2839116 2863083 2939419 3007312 3052771 3039560
5231C039560r8550m0453p7227k0219l4874r1469r4552q910j6627o527N6439L5610
$$ 3039560 2941010 2900557 2823330 2803111 2768237 2676768 2582216 2573306 2556679 2550152 2606591 2642201
5219B642201N3754L7625L6166M8776L2071L8643K8802K6326N8676R267O4309k5332
$$ 2642201 2695955 2733580 2769746 2818522 2850593 2889236 2918038 2944364 3003040 3012307 3076616 3051284
5207C051284Q180j622K6891L5478j1051J996P398j6561m8850l9352J9653J7484
$$ 3051284 3059464 3057842 3084733 3120211 3109160 3111156 3118554 3101993 3053143 3013791 3033444 3050928
5195C050928j4861M3083R4196O9535M3403N8609O6825J15244o052M7313O6165
$$ 3050928 3036067 3079150 3173346 3242881 3286284 3344893 3411718 3526962 3520910 3568223 3634388
5184C634388O3026O031P1824N9344M5897O9608J3939k9292M0754K0400Q3095N2328
$$ 3634388 3697414 3703445 3775269 3834613 3880510 3950118 3964057 3934765 3975519 3995919 4079014 4131342
5172D131342J7217Q0232Q5054J02400Q1632Q2393J47970R6365Q7707J52708J58874
$$ 4131342 4148559 4228791 4313845 4416245 4497877 4580270 4728240 4824605 4912312 5065020 5223894
5161E223894J89682J69534J47465J97016K03918J76197K77212K86229L68314M25970
$$ 5223894 5413576 5583110 5730575 5927591 6131509 6307706 6584918 6871147 7239461 7665431
5151G665431M29879N54901O97649O83202P15250P24365P15700L88201Q659j2839
$$ 7665431 8095310 8650211 9347860 10031062 10746312 11470677 12186377 12574578 12583237 12570398
5141A2570398N5288K57982L35917O23928R93430J141714J246790J264801J300218
$$ 12570398 12625686 12883668 13219585 13843513 14836943 15978657 17225447 18490248 19790466
5132A9790466O12099q3876m7972J03025J64033M07967N41960M25732L00084M31270
$$ 19790466 20402565 20318689 20270717 20373742 20537775 20945742 21487702 21913434 22213518 22644788
5122B2644788P11361Q58053O26758N22649P60657N58889K79790M32753M98084
$$ 22644788 23356149 24214202 24840960 25363609 26124266 26683155 26962945 27395698 27893782
5113B7893782j09705p33749o04155j25929J36266L09870O01494Q02872L72989
$$ 27893782 27784077 27050328 26446173 26320244 26456510 26766380 27367874 28170746 28543735
5104B8543735n062K53716M25630J03695l5751N0541k23782l66211k04501K4578
$$ 28543735 28538673 28792389 29218019 29321714 29285963 29336504 29112722 28746511 28542010 28566588
5094B8566588r137l51300o41024n12424l14348k70039m3649j67127j027096j654175
$$ 28566588 28557451 28206151 27565127 27052703 26738355 26468316 26424667 26257540 25230444 23576269
5084B3576269j561594j215458j008778q77865m64151j00825J30721K30619M01680
$$ 23576269 22014675 20799217 19790439 18912574 18448423 18347598 18478319 18708938 19110618
5075A9110618M09770N470k10479k07520j01712j52322k86866o1106j1727j37720
$$ 19110618 19520388 19525858 19315379 19107859 19006147 18853825 18566959 18505853 18494126 18356406
5065A8356406k06344j77855p2988k35078n32090p45649p25182o56975n27082m75193
$$ 18356406 18150062 17972207 17899219 17664141 17132051 16386402 15661220 15004245 14477163 14001970
5055A4001970m37941k94556j91776p5653J04276K70574L68104M59744O37944J034266
$$ 14001970 13564029 13269473 13077697 13002044 13106320 13376894 13744998 14204742 14842686 15876952
5045A5876952J125752J154156J324718J423913J300955Q52895M32042M89661K98685
$$ 15876952 17002704 18156860 19481578 20905491 22206446 23059341 23491383 23981044 24279729
5036B4279729l13585r41246q80376p11520q52684r03768p96007m85481k01876
$$ 24279729 23966144 23024898 22144522 21433002 20580318 19676550 18880543 18395062 18193186
5027A8193186M2108K76752P70249Q03826N21955O98470R32926Q39464P94991O55958
$$ 18193186 18235294 18512046 19282295 20086121 20608076 21306546 22239472 23078936 23873927 24529885
5017B4529885O40167Q08481J045802J365163J555634J025537J05378m87439p33499
$$ 24529885 25170052 25978533 27024335 28389498 29945132 30970669 31076047 30588608 29855109
5008B9855109o55018n09091p47531j178136j453331j843834j947855j657881j285108
$$ 29855109 29200091 28691000 27943469 26765333 25312002 23468168 21520313 19862432 18577324
4999A8577324j061103q28258m51948j20769j8055K5244q2241l10655m89989m34256
$$ 18577324 17516221 16687963 16236015 16115246 16097191 16122435 16040194 15729539 15239550 14805294
4989A4805294l46669j96950r6023k91026k17822l03608l99544k96674k80928l70583
$$ 14805294 14458625 14261675 14165652 13874626 13656804 13353196 12953652 12656978 12376050 12005467
4979A2005467l08698m27675n89764n00723m63223l89552k71832j48182M0882J48316
$$ 12005467 11696769 11269094 10679330 10178607 9715384 9325832 9054000 8905818 8946700 9095016
4969I095016J21007Q8947j88218l98903m85828m38835l88285m13066l32922k23658
$$ 9095016 9216023 9304970 9116752 8717849 8232021 7793186 7404901 6991835 6658913 6435255
4959F435255j99557j48426r5601j55421q0613j13496q1753m0100q7071j39568
$$ 6435255 6235698 6087272 5991671 5836250 5755637 5642141 5560388 5520288 5433217 5293649
4949E293649j07152p0996o5362j8684o1050J5600l5565m8636K3852L5587k3524
$$ 5293649 5186497 5115501 5050139 5031455 4970405 4986005 4950440 4901804 4925656 4961243 4937719
4938D937719L9730J4739j3302o8520l0116K571N095j1886l3782J9215o1546J7373
$$ 4937719 4977449 4992188 4978886 4910366 4880250 4882821 4887916 4876030 4842248 4861463 4799917 4817290
4926D817290N5703M0153N2502J3361M4337P1439N1627J5483j7786Q1805J13016
$$ 4817290 4872993 4913146 4965648 4979009 5023346 5094785 5146412 5161895 5144109 5225914 5338930
4915E338930J17923J34560J97497J54293K21519K74029L69366M61174O01447P01351
$$ 5338930 5456853 5591413 5788910 5943203 6164722 6438751 6808117 7269291 7870738 8572089
4905H572089Q81921J026123R50244P74462Q18916N57737k36457r42697j281916
$$ 8572089 9454010 10480133 11430377 12204839 13023755 13581492 13345035 12402338 11120422
4896A1120422j327717j074556q28023n81847m50538l65232k47399j51158j90272
$$ 11120422 9792705 8718149 7890126 7308279 6857741 6492509 6245110 6093952 5903680
4887E903680j59004o3602n8860m0696j0633L0309N351N6796J05292J30305J71921
$$ 5903680 5744676 5681074 5622214 5581518 5570885 5601194 5606545 5663341 5768633 5898938 6070859
4876F070859K51606K83994L41051L85169L87964K04414O1304R4324K66570M71075
$$ 6070859 6322465 6606459 6947510 7332679 7720643 7925057 7986361 8080685 8347255 8818330
4866H818330O22385Q86710J134586J461542J561127J311373N84403p56420j623413
$$ 8818330 9440715 10327425 11462011 12923553 14484680 15796053 16380456 15624036 14000623
4857A4000623j494510j007953o38849k73991l9465K3018l2718J87962M76968R29813
$$ 14000623 12506113 11498160 10859311 10585320 10545855 10568873 10536155 10724117 11201085 12130898
4847A2130898J225441J321548N99731o25945j386984j374250j316440j228068
$$ 12130898 13356339 14677887 15277618 14651673 13264689 11890439 10573999 9345931
4839I345931q03024n37856l51592k37112j95680j93342k58479l09160k95190j73882
$$ 9345931 8542907 8005051 7653459 7416347 7220667 7027325 6768846 6459686 6164496 5990614
4829E990614j50866j58472r5639K6739j9124M3282m3922n8673L9134N2364R5767
$$ 5990614 5839748 5681276 5585637 5612376 5593252 5636534 5592612 5533939 5573073 5625437 5721204
4818E721204J17734J07858K8033R6869J67456J71581J93233K65596L88826M71674
$$ 5721204 5838938 5946796 5974829 6071698 6239154 6410735 6603968 6869564 7258390 7730064
4808G730064N78101O06713N29822K29301n2994j08241j22870o7490J0819J62899
$$ 7730064 8308165 8914878 9444700 9674001 9621007 9512766 9389896 9322406 9333225 9496124
4798I496124K63678N64593P74660O02022O97333Q90612P22070K41959L1672K02819
$$ 9496124 9759802 10324395 11099055 11701077 12398410 13289022 14011092 14253051 14284723 14487542
4788A4487542K48718J10763k64718l87503j99323j12993R5024K34238L46905N52457
$$ 14487542 14736260 14847023 14582305 14194802 13995479 13882486 13977510 14211748 14558653 15111110
4778A5111110P77718Q71655Q55767R38075P70965P14942Q86417R26635J87742
$$ 15111110 15888828 16760483 17616250 18554325 19325290 20040232 20926649 21853284 22041026
4769B2041026n96095o42979k73880j15268l00640m73671k57371j96110j71146
$$ 22041026 21444931 20801952 20528072 20412804 20112164 19638493 19381122 19185012 19013866
4760A9013866j98710M2754L03429M12574K98734K66075N53261O99640L84490M52198
$$ 19013866 18815156 18857910 19161339 19573913 19872647 20138722 20691983 21391623 21776113 22228311
4750B2228311O67042M72463J40726K03984N89198R68601J260347J671469K282637
$$ 22228311 22895353 23367816 23508542 23712526 24301724 25270325 26530672 28202141 30484778
4741C0484778L239974M402547N063619N308989N723184N598425M963203K451152
$$ 30484778 33724752 38127299 43190918 48499907 54223091 59821516 64784719 67235871
4733F7235871n29555l011932n199842n166127m465756m200487l875483l238170
$$ 67235871 66706316 63694384 58494542 53328415 48862659 44662172 40786689 37548519
4725C7548519k454869j380518l72933M15847O01698P41277J149283J007633o96297
$$ 37548519 35093650 33713132 33340199 33756046 34357744 35099021 36248304 37255937 36559640
4716C6559640k091380k149220j677153j435400j312811j042322n57262j33542
$$ 36559640 34468260 32319040 30641887 29206487 27893676 26851354 26294092 26160550
4708B6160550K95491N98528R54950J451893K111387K763514L061172L555952M190892
$$ 26160550 26456041 27054569 28009519 29461412 31572799 34336313 37397485 40953437 45144329
4699D5144329L663747J878911R05048K19293j761514l414350l470799k815789
$$ 45144329 48808076 50686987 51592035 51811328 50049814 46635464 43164665 40348876
4691D0348876k166718j649854j084853k68485P27903J590610K567577L769552
$$ 40348876 38182158 36532304 35447451 35178966 35906869 37497479 40065056 43834608
4683D3834608N362582O652621P263544Q405609Q314597N061605J190167j825440
$$ 43834608 49197190 55849811 63113355 71518964 79833561 84895166 86085333 84259893
4675H4259893n992745r095943r048819q020308p183760o409533n360537m165689
$$ 84259893 78267148 69171205 60122386 52102078 44918318 38508785 33148248 28982559
4667B8982559l238378k586933k117371j717728j503452j280481j008771q37461
$$ 28982559 25744181 23157248 21039877 19322149 17818697 16538216 15529445 14691984
4659A4691984p44031o54222n80913n01911m73196m45206l48266l28704l29936
$$ 14691984 13947953 13293731 12712818 12210907 11737711 11292505 10944239 10615535 10285599
4650A0285599k68850j95328k44795j33547m3040j02135k11499j11009j08336j40404
$$ 10285599 10016749 9821421 9576626 9443079 9400039 9297904 9086405 8975396 8867060 8726656
4640H726656j79031k00157j64002j30393r8651j68739j11004j23561j48413j99562
$$ 8726656 8547625 8347468 8183466 8053073 7954422 7785683 7674679 7551118 7402705 7203143
4630G203143j75207j07285p6851r0655J5301L0544L2101O0046O7090R8158L9479
$$ 7203143 7027936 6920651 6843800 6753145 6768446 6798990 6831091 6891137 6958227 7056385 7095864
4619G095864P4054M2084P4331M8857l6346N3659J39261M7250P1988j1743n9306
$$ 7095864 7169918 7212002 7286333 7335190 7298844 7352503 7491764 7539014 7611002 7599259 7539953
4608G539953J0560n9356q3896j56162q8407m1038k0315M1951J7062M9516R3460
$$ 7539953 7550513 7491157 7407261 7251099 7162692 7121654 7101339 7143290 7160352 7209868 7303328
4597G303328J02048R2501J31554J08954J93234J49990Q4209J64324K52078J20063
$$ 7303328 7405376 7497877 7629431 7738385 7931619 8081609 8165818 8330142 8582220 8702283
4587H702283J46280J33204K7220k0724m2671J5448Q843Q3851J24231K00234K49896
$$ 8702283 8848563 8981767 9008987 8988263 8945592 8961040 8969883 9053734 9177965 9378199 9628095
4576I628095K88937L00904K69253L41658L44651L55614M32958N84279P25025P52950
$$ 9628095 9917032 10217936 10487189 10828847 11173498 11529112 11962070 12546349 13271374 14024324
4566A4024324Q92825J082559J317218J664107K229775K588563K710442K783500
$$ 14024324 14917149 15999708 17316926 18981033 21210808 23799371 26509813 29293313
4558B9293313K796897K044307L91515j042707j414728j078592p09109k60235L99987
$$ 29293313 32090210 34134517 34526032 33483325 32068597 30990005 30280896 30020661 30420648
4549C0420648J001904J365567J573277J687439J016044o30888j710179j798601
$$ 30420648 31422552 32788119 34361396 36048835 37064879 36433991 34723812 32925211
4541C2925211j235301o74182k38231J01156M74997P52793L72366q33169j760806
$$ 32925211 31689910 31015728 30777497 30878653 31353650 32106443 32478809 31645640 29884834
4532B9884834j839339j466392j028880o34660j29267M58897P14983Q04063P77901
$$ 29884834 28045495 26579103 25550223 24915563 24786296 25245193 25960176 26764239 27542140
4523B7542140J14943j231517k086694k288277k129962j868059j811429j571730
$$ 27542140 27657083 26425566 24338872 22050595 19920633 18052574 16241145 14669415
4515A4669415j368918j047247r45172p27078o38803n41704m25739l92760l27193
$$ 14669415 13300497 12253250 11308078 10581000 9942197 9400493 8974754 8581994 8254801
4506H254801k85737k66656k30528k46907j73721j19777j73092r7490j23451p9115
$$ 8254801 7969064 7702408 7471880 7224973 7051252 6931475 6758383 6660893 6537442 6458327
4496F458327q4231j05087l0274m1359n6209j7858m8697n9410j9546L4102k816
$$ 6458327 6374096 6269009 6238735 6197376 6141167 6123309 6074612 6015202 5995656 6029758 6026942
4485F026942l9590L8932M4141J01091J30551O1227J35024J34713J55149K39143
$$ 6026942 5987352 6026284 6070425 6171516 6302067 6363294 6498318 6633031 6788180 7027323
4475G027323L01715L49636L93685N04044N96442Q35608J037049J234324J356151
$$ 7027323 7329038 7678674 8072359 8576403 9172845 10008453 11045502 12279826 13635977
4466A3635977J317323J122435N13671k65353p14451n71698k24235J31565M19729
$$ 13635977 14953300 16075735 16589406 16324053 15609602 15037904 14813669 14945234 15364963
4457A5364963N21517P64372Q11385j38842j189159j241681j007790o90383n02363
$$ 15364963 15886480 16650852 17462237 17323395 16134236 14892555 13884765 13194382 12692019
4448A2692019k14680J60212M64455O45855Q19853O74476J73394k34659l83205
$$ 12692019 12477339 12637551 13102006 13747861 14567714 15242190 15415584 15180925 14797720
4439A4797720l27217k25313r9459J44448M58096M41959J98896m48970r82870j072585
$$ 14797720 14470503 14245190 14145731 14290179 14748275 15190234 15389130 14940160 13957290 12884705
4429A2884705j042983r88646q95828p63214o47327o04806n21134m39738l87076
$$ 12884705 11841722 10853076 9957248 9194034 8546707 7941901 7420767 6981029 6593953
4420F593953k96527k10448j84391j12408q6140j05879q1185m6058m9511j55731
$$ 6593953 6297426 6086978 5902587 5790179 5704039 5598160 5516975 5470917 5421406 5265675
4410E265675j32838o2415j7836P0314Q7872K8116K5520q335k06323j97996j16641
$$ 5265675 5132837 5070422 5052586 5122900 5210772 5238888 5264408 5256073 5049750 4851754 4735113
4399D735113j03981p9312n8429j0845J5193J16949R7696L2056k7861j22127j44139
$$ 4735113 4631132 4551820 4493391 4482546 4497739 4614688 4712384 4744440 4716579 4594452 4450313
4388D450313k20384j91495q0303m9896k4110l0933o0526m5039p6988q5096q4648
$$ 4450313 4229929 4038434 3958131 3908235 3884125 3853192 3792666 3747627 3670639 3585543 3500895
4377C500895m1110L4662O4502M8306M9016J13168J04789j7042l2846j25730n9805
$$ 3500895 3459785 3494447 3558949 3607255 3656271 3769439 3874228 3857186 3824340 3698610 3638805
4366C638805k5924j1289k4971q5361k6857p2785l5120m9804j30666l4081N2780
$$ 3638805 3612881 3601592 3576621 3491260 3464403 3391618 3356498 3306694 3176028 3141947 3194727
4355C194727R290l2663o2311O524j9629k9257Rk8305l3761j03017m3652l3538
$$ 3194727 3204017 3171354 3109043 3115567 3095938 3066681 3066690 3038385 3004624 2901607 2857955 2824417
4343B824417q047n6394n1020n1772J068J2212n5737k5888M747L0207n4889M96
$$ 2824417 2816370 2759976 2708956 2657184 2658252 2670464 2614727 2588839 2593586 2623793 2568904 2569400
4331B569400J6413q014r106Q6732M5361k2615K2515j1245J6453M3285J8077R2716
$$ 2569400 2585813 2577799 2568693 2655425 2700786 2678171 2700686 2689441 2705894 2749179 2767256 2859972
4319B859972R6100m4695J6910M1690j1410n4152j0080n0534r0185j1710J8997
$$ 2859972 2956072 2911377 2928287 2969977 2958567 2904415 2894335 2843801 2753616 2741906 2760903
4308B760903M2301j7005j6197K8267N1685k7371J8427q723M5949N1368q504K182
$$ 2760903 2803204 2786199 2770002 2798269 2849954 2822583 2841010 2832287 2878236 2929604 2921100 2923282
4296B923282J20896K6440K6292Q2876k5909n6514n62K6713k8495P3798M0455j4038
$$ 2923282 3044178 3070618 3096910 3179786 3153877 3097363 3096801 3123514 3095019 3168817 3209272 3195234
4284C195234L5898R6644L7161p754p655j316R869l438j748l2125M5040N2096N5265
$$ 3195234 3231132 3327776 3364937 3357183 3349528 3348212 3358081 3354643 3352895 3320770 3365810 3417906 3473171
4271C473171O3222K1634l1343N7255R2383M5285m1397P5629N2255P588N1919k8456
$$ 3473171 3536393 3558027 3526684 3583939 3676322 3721607 3680210 3755839 3808094 3815682 3867601 3839145
4259C839145J5346K9306O4704l0289N3890J02736N0746J5637O5508R3548M1264
$$ 3839145 3854491 3883797 3948501 3918212 3972102 4074838 4125584 4141221 4206729 4300277 4341541
4248D341541Q262K4351R6127R7705Q8626P9305N8884M4773J09835O4454J35860
$$ 4341541 4349803 4374154 4470281 4567986 4656612 4735917 4794801 4839574 4949409 5013863 5149723
4237E149723J46001J64625J83852J61766J99696K18960J71253O4166P1493J73256
$$ 5149723 5295724 5460349 5644201 5805967 6005663 6224623 6395876 6460042 6531535 6704791
4227F704791J74250J54843J24342J07914O1824J06755J00472J10873R5401R5910
$$ 6704791 6879041 7033884 7158226 7266140 7327964 7434719 7535191 7646064 7741465 7837375
4217G837375J82819R6873J82510J16099J16445J61300K16967J36433K14471J61492
$$ 7837375 8020194 8117067 8299577 8415676 8532121 8693421 8910388 9046821 9261292 9422784
4207I422784J89367J62993K26035J91850J96593K20274K34938J73627K42716K64568
$$ 9422784 9612151 9775144 10001179 10193029 10389622 10609896 10844834 11018461 11261177 11525745
4197A1525745K71132K68727L18643L20932L56513L45005L38595L81856L68249
$$ 11525745 11796877 12065604 12384247 12705179 13061692 13406697 13745292 14127148 14495397
4188A4495397M04574M21240L54422L80013L63722L91398M26793N06482O05461
$$ 14495397 14899971 15321211 15675633 16055646 16419368 16810766 17237559 17744041 18349502
4179A8349502O04303P15723Q13389Q35559Q92528R93376R20433R60026R56278
$$ 18349502 18953805 19669528 20482917 21318476 22211004 23204380 24124813 25084839 26041117
4170B6041117R08178Q62187R06245R73984J068136J103642J256617J361608J596378
$$ 26041117 26949295 27811482 28717727 29691711 30759847 31863489 33120106 34481714 36078092
4161C6078092J866470K225565K559776K955832L307088L760943M294992N144227
$$ 36078092 37944562 40170127 42729903 45685735 48992823 52753766 57048758 62192985
4153F2192985O171350P398776Q964132J0935959J3499003J7258795K2791938K9225817
$$ 62192985 68364335 75763111 84727243 95663202 109162205 126421000 149212938 178438755
4145A78438755L4248362L7684567L1165439J3980135p619345k4780931l1376052
$$ 178438755 212687117 250371684 281537123 295517258 287897913 263116982 231740930
4138B31740930l1502134k9261398k5184697j9493962j4921653j1214708q414302
$$ 231740930 200238796 170977398 145792701 126298739 111377086 100162378 91748076
4131I1748076o161878m832392m497119m910763n565370n831335n471085m905380
$$ 91748076 85586198 80753806 76256687 71345924 65780554 59949219 54478134 49572754
4123D9572754m145700l572845k990534k544923k250608j936530j719896j576090
$$ 49572754 45427054 41854209 38863675 36318752 34068144 32131614 30411718 28835628
4115B8835628j370676j233177j175585j042045r65899q39387p35423o81335n86442
$$ 28835628 27464952 26231775 25056190 24014145 23048246 22208859 21473436 20792101 20205659
4106B0205659n53552l99735l76963m50046n13118n18073m38597l84911l28407
$$ 20205659 19652107 19252372 18875409 18425363 17912245 17394172 16955575 16570664 16242257
4097A6242257k81058k75208k70245m32636l58083l49835k60265j01630r2373j53887
$$ 16242257 15961199 15685991 15415746 14983110 14625027 14275192 14014927 13913297 13820924 13667037
4087A3667037j40910k21629j86972k57689j84350k03203k25436j60976j48586
$$ 13667037 13526127 13304498 13117526 12859837 12675487 12472284 12246848 12085872 11937286
4078A1937286k12016k19191k21092j17220n0746j41236q9604j01401M7658N3836
$$ 11937286 11725270 11506079 11284987 11167767 11117021 10975785 10886181 10784780 10832438 10886274
4068A0886274o3174j12269p8582k3003k3533J9288M6660L2787L3896J64005J66182
$$ 10886274 10823100 10710831 10632249 10609246 10585713 10605001 10651661 10684448 10718344 10882349 11048531
4057A1048531K11774L84782N23089P48698Q00889P87596P91691N78252k54637
$$ 11048531 11260305 11645087 12168176 12916874 13717763 14505359 15297050 15875302 15620665
4048A5620665j049998j211835j150304j106220j072899j013392q37882o55578
$$ 15620665 14570667 13358832 12208528 11102308 10029409 9016017 8178135 7522557
4040G522557n31196m52815l68607l15813k66277k46365k33283k27137j61986j05486
$$ 7522557 6991361 6538546 6169939 5854126 5587849 5341484 5108201 4881064 4719078 4613592
4030D613592p6906j34851j18969j05160r4820j53466q0427j46965n2325q8897
$$ 4613592 4536686 4401835 4282866 4177706 4082886 3929420 3848993 3702028 3649703 3560806
4020C560806r9649j8978n8398o6297m0522l7858j11313j52342j33583p0308J2820
$$ 3560806 3461157 3442179 3383781 3317484 3276962 3239104 3127791 2975449 2841866 2771558 2784378
4009B784378p4881r1119n4054k9151k6027m6555l5139l7206n2496L1695J21416
$$ 2784378 2709497 2618378 2564324 2535173 2509146 2462591 2427452 2390246 2337750 2369445 2490861
3998B490861M552j7583J2293L1666k0969o4142m2186R737L4916L117n2834m5192
$$ 2490861 2495413 2477830 2490123 2521789 2500820 2436678 2394492 2404229 2439145 2442262 2389428 2344236
3986B344236j19236j2475p2969n0811k9965p921l0018r6516n5890p941l4572k9876
$$ 2344236 2225000 2212525 2139556 2088745 2058780 2050859 2020841 1924325 1868435 1860494 1825922 1796046
3974A796046k6449n3698n6214o9451j00915o4595j3980p5529k2121j9115m3418
$$ 1796046 1769597 1715899 1659685 1590234 1489319 1424724 1410744 1335215 1313094 1293979 1250561
3963A250561m4044j0701N4212M8502o020P2068N5412M5467M8899M8954R4961O1080
$$ 1250561 1206517 1195816 1250028 1298530 1292510 1364578 1419990 1465457 1514356 1563310 1658271 1719351
3951A719351O5132N7890M5670P4051j9687o1508q6895l7600n1807m3438n7191
$$ 1719351 1784483 1842373 1888043 1962094 1942407 1880899 1794004 1756404 1704597 1661159 1603968
3940A603968j09859q7566p2147p6600j8666l0376l3151p00j9396J5850m3192n592
$$ 1603968 1494109 1406543 1334396 1257796 1239130 1208754 1175603 1174903 1155507 1171357 1128165 1122573
3928A122573J6308K3413N4918J3395J2744L9571q2452r6968m5132n309m3016k4541
$$ 1122573 1138881 1162294 1217212 1230607 1243351 1282922 1200470 1103502 1058370 1053061 1010045 985504
3916I85504j5673P8361M4828o8595n8655n7375J4994O327k8658L8796N225J8360
$$ 985504 969831 1048192 1093020 1024425 965770 908395 923389 929716 901058 939854 945079 963439
3904I63439k3792p0125L2722k8448P644l5128K982Q2003k4225n5527O6189j2287
$$ 963439 939647 869522 902244 873796 881440 846312 849294 931297 907072 851545 917734 905447
3892I05447L4279k7085J3339J820M764K8324J2543N1002k2920N8192L6507N665
$$ 905447 939726 912641 925980 927800 932564 960888 973431 1024433 1001513 1059705 1096212 1101877
3880A101877k9999M4033l097j7007K1883M0436j124J7463K4088K8354p75j6845
$$ 1101877 1071878 1115911 1112814 1095807 1117690 1158126 1157002 1174465 1198553 1226907 1226132 1209287
3868A209287L9116q428Q603P5685P6798M0966J5052M9760Q9053J61540J40600
$$ 1209287 1248403 1239975 1248578 1324263 1401061 1442027 1457079 1506839 1595892 1757432 1898032
3857A898032J42970J48049K11865K16478K05044Q1941q8855j33979j11767j59757
$$ 1898032 2041002 2189051 2400916 2617394 2822438 2904379 2815524 2681545 2569778 2410021
3847B410021j46708q8928r0172r9236p962L8226L4219Q7647O7056J49348P8989
$$ 2410021 2263313 2174385 2084213 1984977 1977015 2015241 2049460 2137107 2204163 2353511 2432500
3836B432500J41448K70103L60480M28602M25315L37520L57802L92161L42021J52142
$$ 2432500 2573948 2844051 3204531 3633133 4058448 4395968 4753770 5145931 5487952 5640094
3826E640094l28434n44549l64656k89218k98432l45563l99249k61855k66889k06085
$$ 5640094 5311660 4767111 4402455 4113237 3814805 3469242 3069993 2808138 2541249 2335164
3816B335164k05944j24290q9259j75948j72196q8405r3018r9461l8893o4973l5347
$$ 2335164 2129220 2004930 1915671 1739723 1567527 1479122 1386104 1286643 1247750 1182777 1147430
3805A147430q1966r5M6292N590m0001n099J6340l4315k5995j9990n8234Q66l3442
$$ 1147430 1065464 1065369 1111661 1117251 1077250 1072151 1088491 1054176 1028181 1008191 949957 950823 917381
3792I17381p9934j7085M3428o3808o6021j1944K2849L4557K0454o3292K3921N2982
$$ 917381 837447 820362 863790 799982 733961 722017 744866 779423 799877 736585 760506 813488
3780H13488L4881P231K6103q831K1497Q047n5227q8209K6554J02p3706m6248j0338
$$ 813488 848369 855600 881703 872872 894369 902416 847189 758980 785534 785636 711930 665682 655344
3767F55344K8543M6044M3695k1088r023r929K5518m672P7433O806j1431k5586
$$ 655344 683887 729931 773626 752538 743515 733586 759104 754432 831865 838671 827240 801654
3755H01654k2281j8568j6968o4870p0190K0479l0546q1269k8885j8095o303q9750
$$ 801654 779373 760805 743837 678967 608777 629256 598710 517441 488556 470461 464158 374408
3743C74408k3954Q13k0694Q8149N878k8682N331m7804l9873l418N8511L531l9806
$$ 374408 350454 351267 330573 418722 424600 395918 401249 353445 313572 310154 368665 372196 332390
3730C32390l0581k5004M8686l5770K908K4344n339n1592J6831M8753O97J4463
$$ 332390 301809 276805 325491 289721 292629 316973 311634 260042 276873 325626 326323 340786
3718C40786l5106J1804k2038k3590n4399k5254n1833P5475J3134l2814L2355J3461
$$ 340786 305680 317484 295446 271856 217457 192203 140370 215845 228979 196165 228520 241981
3706B41981m2714N4517k6712m2983j2043N56J670l2420j0096P87j6237j3805K4643
$$ 241981 199267 253784 227072 184089 172046 172602 174272 141852 131756 132543 116306 102501 127144
3693A27144k316L0776n511l2584M8813M3521N933j5139k0948k2824J6322k6k6786
$$ 127144 124828 155604 150093 117509 166322 209843 215776 200637 179689 156865 173187 173161 146375
3680A46375L1251L2432O236j205K8763m5169m5198m1559M736K976R0976J0563
$$ 146375 177626 210058 216294 215089 243852 198683 153485 111926 116662 119638 210614 221177
3668B21177p6121N682L3434L1084P7440O299n3196o7447j6232J1361L1626N542
$$ 221177 145056 150738 184172 215256 292696 298995 245799 178352 162120 173481 205107 210649
3656B10649K3662l4267K0148k1224L2925k5926j1868k2224Q564M9148j02932l173
$$ 210649 234311 200044 220192 198968 231893 205967 194099 171875 180439 229587 126655 123482
3644A23482O8130j0169m6977m8756J7695j124l5832P1940k6825j1476K3214L289
$$ 123482 191612 181443 134466 85710 103405 102281 66449 138389 111564 100088 123302 126591
3632A26591j9458J2718R063j8752k4779O2453J1938K4884m8272q348K0820J0611
$$ 126591 107133 119851 128914 110162 85383 147836 159774 184658 136386 128038 148858 159469
3620A59469m403o9511L8975k3858K5954J4497L2431J5390M2002m9802k9625K1389
$$ 159469 155066 85555 124530 100672 126626 141123 173554 188944 230946 181144 151519 172908
3608A72908L290l992J1975L7494k7197j9586K7625j959k0737m7125j3776N3012
$$ 172908 176198 172206 184181 221675 194478 174892 202517 200558 179821 132696 118920 171932
3596A71932m4754m1874N288N4763K6376q111k6256L5202K9887j5590M3688J1342
$$ 171932 127178 85304 90592 145355 171731 163620 137364 172566 202453 186863 230551 241893
3584B41893p5952j0116K3455n334O138l4847n0865k0558j4694J7682K0323j5649
$$ 241893 165941 155825 179280 173946 180084 145237 94372 73814 59120 76802 97125 81476
3572H1476J1261R446J1842L8595R46q88j3585j6330l6205Q875j7303j8236k9111
$$ 81476 92737 102183 114025 152620 153566 152678 139093 122763 86558 95433 78130 59894 30783
3559C0783M8471N5151k0263o867J6950k5197k6265J7553L6759l8065J3723M049
$$ 30783 79254 134405 114142 107275 124225 99028 72763 90316 127075 89010 102733 106782
3547A06782q108j3184K005L4L1408L7853k9945k8259Q440l860l4056k0044K4643
$$ 106782 98674 85490 87495 87529 118937 156790 126845 98586 107026 103166 69110 49066 73709
3534G3709K0838n682O0364l4771m4939j147N2234j7898J81m7834q972r30K0359
$$ 73709 94547 88865 149229 114458 69519 68372 120606 102708 102889 55055 46083 45153 65512
3521F5512L9053n301l1853K905n984M5408K2252l6981J3381j9845J6895J4678
$$ 65512 104565 99264 67411 70316 64332 109740 131992 95011 108392 88547 105442 120120
3509A20120J6440p029L4886k7851p7660O530L2998k2430N0915j4473R487K6520
$$ 120120 136560 129531 164417 136566 58906 65436 98434 76004 126919 112446 121933 148453
3497A48453O198k4827k7810K4782K3618m2285J3376M667N1849R72j9790K4803
$$ 148453 154651 129824 102014 126796 150414 108129 121505 126172 178021 178993 159203 184006
3485A84006J7014o0319J2290m3302j8652K1288R145L8706k5076L363l0945l2724
$$ 184006 201020 140701 152991 109689 91037 112325 121470 160176 135100 138463 107518 74794
3473G4794M413N3526l8310P982J4318J2932K0386M3137k8128n0274L555K8474
$$ 74794 79207 132733 94423 102405 116723 129655 150041 193178 165050 114776 118331 146805
3461A46805p3631K7514K4762L5156o021j6295k9621k217l583L85N4809J6286q215
$$ 146805 73174 100688 125450 160606 154585 138290 108669 106452 102869 103254 158063 174349 166134
3448A66134l2596k2193N0962N8463n333m8313j1083n942j276M3150m3232J0056
$$ 166134 133538 111345 162307 220770 215437 167124 156041 150099 148823 191973 148741 158797
3436A58797Q282j4814O5360m7790k8352j0628j1527j6537M6829L4420N4307j5953
$$ 158797 167079 152265 217625 169835 141483 130855 119328 102791 149620 184040 238347 222394
3424B22394J1195K262L4324k5841K0973L6582k0839j0691M0098R079k3716N6715
$$ 222394 233589 235851 270175 244334 265307 301889 281050 270359 310457 319536 295820 352535
3412C52535M5345J7410L7586m8655m1515m2902M3628J4712o4755L1180l6483q433
$$ 352535 397880 415290 452876 404221 362706 319804 363432 378144 313389 344569 308086 299653
3400B99653m2492J8352Q058M97J173P122j7348K5849N8334J7945m0226J9487L4210
$$ 299653 257161 275513 283571 284068 285241 292363 275015 300864 359198 377143 336917 356404 390614
3387C90614R9693m008M1306P5567Q6790Q4515R1824L6025l394k6747j14173o4193
$$ 390614 490307 486299 527605 603172 689962 774477 866301 902326 898932 872185 758012 693819
3375F93819m4191o9424m2255p8664J8652K6831o9477k1986M4921m5503N6456k438
$$ 693819 649628 580204 537949 459285 477937 504768 435291 413305 458226 412723 469179 466741
3363D66741K1497K8502m8903K044l9019M6029O2627o1803K7932J2088R464J3442
$$ 466741 488238 516740 467837 469881 430862 476891 539518 477715 505647 517735 527199 540641
3351E40641J3515J21734M9497j6831l9565k7606N8334j8628l7960M5847n708j6559
$$ 540641 554156 675890 725387 708556 668991 641385 699719 681091 643131 688978 683270 666711
3339F66711J4589L8905M8795k1518j3283M7887O4511K1313Q2961O5222R4801J10570
$$ 666711 681300 720205 769000 747482 734199 782086 846597 867910 950871 1016093 1110894 1221464
3327A221464K7230L6848N8205M7784L4235j7610j16294k4341j6819p1325j9800
$$ 1221464 1248694 1285542 1343747 1391531 1425766 1408156 1291862 1267521 1250702 1179377 1159577
3316A159577l200n2606n7414N783J0319l3334J0920l5918K9678l3501l9899O5479
$$ 1159577 1156377 1103771 1046357 1052140 1062459 1029125 1040045 1004127 1033805 1000304 960405 1025884
3304A025884J3010M5261l321L5798M0209M7213k919L9754J09297M2130J36403
$$ 1025884 1038894 1084155 1080834 1116632 1156841 1204054 1201135 1240889 1350186 1392316 1528719
3293A528719J18466K51383J76738P0920j00846j21250j11614o5446j40577o4974
$$ 1528719 1647185 1898568 2075306 2146226 2045380 1924130 1812516 1747070 1606493 1541519
3283A541519m8318o1132j2198n4562J5930n27K3144K9588n437R901M6564m683
$$ 1541519 1493201 1432069 1419871 1365309 1381239 1380712 1403856 1433444 1428007 1437908 1484472 1479789
3271A479789k2458j0559R989L2416L5918J2304K5487L7855Q4246J05842J05696
$$ 1479789 1457331 1446772 1456761 1489177 1525095 1537399 1562886 1600741 1684987 1790829 1896525
3260A896525J23313J32386Q3708J9048q4125q7408l0904o9595m9327K506j4817
$$ 1896525 2019838 2152224 2235932 2254980 2170855 2083447 2052543 1982948 1933621 1936127 1921310
3249A921310M3748R4359k2596J492Q7710O5116P9411M2641J1550O8587M6282L0989
$$ 1921310 1965058 2059417 2036821 2038313 2126023 2191139 2270550 2313191 2324741 2393328 2439610 2470599
3237B470599J24404N3929P7619J07926J6739N5771M2796J47882N1549L1350J5610
$$ 2470599 2595003 2648932 2726551 2834477 2851216 2906987 2949783 3097665 3149214 3180564 3196174
3226C196174j0062j0648q4156j81731k06107j97593j50316p2351o5950o3588N994
$$ 3196174 3186112 3175464 3091308 2909577 2703470 2505877 2355561 2283210 2217260 2153672 2159666
3215B159666M0920K9745N901m2707n7558l4449k1087K164j6355j3565J00533J22159
$$ 2159666 2200586 2230331 2236232 2193525 2135967 2101518 2080431 2082595 2066240 2052675 2153208 2275367
3203B275367J23850J29826J11179J03661N0575K5637O9767J20121J26432J40728
$$ 2275367 2399217 2529043 2640222 2743883 2794458 2820095 2889862 3009983 3136415 3277143
3193C277143M8428j22761k97634k67484k02519k28891r2443j27538j74437o9877
$$ 3277143 3325571 3202810 2905176 2637692 2435173 2206282 2113839 1986301 1811864 1741987
3183A741987j012o1420m0523J0035M6291K5458Q3732J22140J13772J30230J65126
$$ 1741987 1740975 1679555 1639032 1649067 1695358 1720816 1804548 1926688 2040460 2170690 2335816
3172B335816K84997K68873K51666K70257J66423k6916O994q43j09613j23784j18845
$$ 2335816 2620813 2889686 3141352 3411609 3578032 3551116 3558110 3557267 3447654 3323870 3205025
3161C205025j57944k81963k32950k26717j87013j87747j05607j20130j2634r3475
$$ 3205025 3047081 2765118 2532168 2305451 2118438 1930691 1825084 1704954 1692320 1598845
3151A598845o6525o4434o0301l6712K3417k2990J7920L5574K0181J40530J35539
$$ 1598845 1532320 1467886 1407585 1370873 1394290 1371300 1389220 1424794 1444975 1585505 1721044
3140A721044J44550J61730J36188J20742k4605j21916j45323k14948j66200j37505
$$ 1721044 1865594 2027324 2163512 2284254 2259649 2137733 1992410 1777462 1611262 1473757
3130A473757j69599j10868r0780p1486l3115n9066q2913l3963m1178k4711k4477
$$ 1473757 1304158 1193290 1102510 1031024 997909 938843 855930 821967 780789 756078 731601
3119G31601p7370o198L8083J49j01059p1587J4523l0630k0481k5436K4l4250j091
$$ 731601 654231 648033 686116 686265 585206 513619 528142 497512 477031 451595 451619 417369 416278
3106D16278L8378K4091p3898q2010N4018m0813J4703j2534j1946L632J7029J2302
$$ 416278 454656 478747 404849 322839 376857 336044 350747 338213 326267 329899 346928 359230
3094C59230k0098m8743O6113o0647j659k4311j00266r52N4145m803n3969n0535
$$ 359230 339132 290389 356502 295855 294196 269885 169619 168667 222812 218009 164040 113505
3082A13505K2947P0051K7361m1270r647L1121J7000k1465q050l5728n081J5032
$$ 113505 136452 206503 233864 192594 182947 214068 231068 209603 201553 165825 160744 175776
3070A75776k4957j6832M5152k4633j459n7663K8969N5676m6364j7541O993l351
$$ 175776 150819 133987 179139 154506 153047 95384 124353 180029 133665 116124 123117 119766
3058A19766j6501m365o162j8867N3269j8242l0014K1815J433K3249J4012O275
$$ 119766 103265 98900 92738 73871 127140 108898 78884 100699 102132 125381 139393 145668
3046A45668q5257l6J6874P4968j5927J3714J3283m5842q043J8141M9333n923m8698
$$ 145668 60411 60375 77249 152217 136290 150004 163287 117445 109402 127543 176876 170953 122255
3033A22255l3183L0102l1286K269O0196l9612k3229J9912j2328j709M3165J8742
$$ 122255 89072 119174 87888 90157 150353 110741 87512 107424 95096 93387 136552 155294
3021A55294R016m6699l4959j4474R168L3811K4476n3503j0920J1773k3369k582
$$ 155294 164310 117611 82652 68178 77346 111157 135633 82130 71210 82983 59614 57032
3009E7032J3977O926J051Q405O6260m4124J6810O979k0428J4753j2597K4517J0454
$$ 57032 71009 77935 78986 87391 153651 109527 126337 133316 112888 127641 115044 139561 150015
2996A50015l685M445J1266n2666K4819k1542L584M4795J125r978n2803L3176J1016
$$ 150015 146330 150775 162041 109375 134194 112652 116236 161031 162156 152178 99375 132551 143567
2983A43567L0566k7740m9102L7037n6351J8792k4499K04J3149O2212r007l0180
$$ 143567 174133 146393 97291 134328 77977 96769 72270 72474 85623 147835 138828 108648
2971A08648J22J6048O6840J0709p153k1880J3877j0783j6099M7065L9256j5785
$$ 108648 108770 124818 191658 202367 195214 173334 187211 176428 160329 207394 246650 230865
2959B30865k4742l6474M8810J7918L851p022q2890K3337N1657o5272J8227N0367
$$ 230865 206123 169649 218459 236377 240228 233206 150316 173653 225310 160038 178265 228632
2947B28632L9162k9464k0763m1312J8275L0903k815N7796J5600k8448m5896L360
$$ 228632 267794 238330 217567 176255 194530 225433 222618 280414 296014 267566 221670 225030
2935B25030L5317k0682K4315Q673L2452R957p8517P9724K089m331J8195j812J3370
$$ 225030 260347 239665 263980 272653 305105 315062 236545 316269 318358 314027 332222 330410 343780
2922C43780O2982N419q903N9773J3633K2246n6028k9260P8880k3205K4971o717
$$ 343780 406762 412181 403278 463051 476684 498930 442902 413642 492522 469317 494288 487571
2910D87571M1667L3382N625K5135j3850k6160o208k3941o1177M4684L0241L8106
$$ 487571 529238 562620 568245 593380 579530 553370 547162 523221 462044 506728 536969 575075
2898E75075J4704k1273M0640J0091j7560P0536O6626P481P733K6922m7154J2628
$$ 575075 589779 568506 609146 619237 601677 672213 738839 746320 754053 780975 733821 746449
2886G46449J905N562l4437k8144l2898n6200M296l039K6940K5944p481m5743l8811
$$ 746449 748354 753916 719479 691335 658437 602237 606533 603494 630434 656378 648897 603154 564343
2873E64343k8880k0547O6702j9993J2109m7031K9036k59l1355n355N0271m4617
$$ 564343 535463 514916 581618 561625 573734 526703 555739 555480 524125 518770 569041 524424
2861E24424m2600Q3338j2315K5595k1369p446q3020k2638k3488P591K2365j0627
$$ 524424 481824 565162 552847 578442 557073 549627 466607 443969 420481 428072 450437 439810
2849D39810m5941k7383k8119K0207N8601p5993m8478J2208N5219L6127l7107k0930
$$ 439810 393869 366486 338367 358574 417175 341182 292704 304912 360131 396258 359151 338221
2837C38221n3704j9527P206l0873m629M068k2157l0120n422Q04j9384m8071K5430
$$ 338221 284517 264990 272196 241323 236694 240762 218605 188485 183063 183867 164483 116412 141842
2824A41842M9481k2951k6543j4208L5265L1400j5500j5981o9066k8219J1100m789
$$ 141842 191323 168372 141829 127621 162886 194286 178786 162805 93739 65520 76620 71831
2812G1831K0957m1646j7499M7375M5408m6426m7714K0157L0758m3600j708J2740
$$ 71831 92788 51142 33643 81018 126426 80000 32286 52443 83201 39601 37893 50633
2800E0633O9294n5760o6089K2216L3014k5326J6574L908o165J9554P16J9114l9159
$$ 50633 119927 64167 -1922 20294 53308 27982 44556 48464 42299 61853 62569 81683 42524
2787D2524j1888l1925k425l0593K5568k6282M6181N3568k2394L8532q6482J6499
$$ 42524 30636 -1289 -3714 -34307 -8739 -35021 11160 64728 42334 80866 -5616 10883
2775A0883M3341o094p314j9706J458k4357K4581J4492q770m3523Q596k5101j9513
$$ 10883 54224 48130 40816 21110 22568 -1789 22792 37284 28514 -15009 -6413 -31514 -51027
2762e1027Q7925k8197l9929K1430K3796n6969l3833l779N1384N1348n0189m864
$$ -51027 36898 8701 -31228 -9798 13998 -42971 -76804 -80583 -29199 22149 -28040 -32904
2750c2904K0547p848N93J1539l0862j5509M7314K258o9794K4776J1542k7456J4792
$$ -32904 -12357 -20205 -19612 -8073 -38935 -54444 -7130 -4872 -74666 -49890 -38348 -65804 -51012
2737e1012L2017m501m6191j4278n276N4831N7279l7637l3205J2173n403l0343
$$ -51012 -18995 -23496 -69687 -83965 -89241 -34410 22869 -14768 -47973 -35800 -41203 -71546
2725g1546M0249K7275j4387J9584k0245n1572J9907K1658K458l2482N6332l247
$$ -71546 -31297 -4022 -18409 1175 -19070 -70642 -50735 -29077 -26619 -59101 -2769 -6016
2713f016p4200j5474K3591J5822n3328J3001K6411K99J660M8865L2037j01980
$$ -6016 -80216 -95690 -72099 -56277 -109605 -96604 -70193 -69894 -68234 -19369 12668 -89312
2701h9312K1762K9853J0564K9080J7009l3214o661m911m4437m0293N556P5309
$$ -89312 -67550 -37697 -27133 1947 18956 -14258 -20919 -25830 -70267 -110560 -105004 -29695
2689b9695j5912o5535L2380Q853k6759J6429J4753M6753J205L388l4891k7327
$$ -29695 -45607 -111142 -78762 -69909 -96668 -80239 -65486 -18733 -17528 -14140 -49031 -76358
2677g6358q060J1852J0668k8576Q9891K0477k2711k155m2620P327J5338J0618
$$ -76358 -84418 -72566 -61898 -90474 -583 19894 -2817 -4972 -47592 -40265 -24927 -14309
2665a4309k5542l6574j8025j9455L6246j5851p750M678L4942Q357R764j0078M0731
$$ -14309 -39851 -76425 -94450 -113905 -77659 -93510 -101260 -96582 -61640 -53283 -43519 -53597 -12866
2652a2866o2950J0318k305k1441j8018K7839K3623j2212J6165n2586J5037k7200
$$ -12866 -75816 -65498 -67803 -89244 -107262 -79423 -55800 -68012 -51847 -104433 -89396 -116596
2640a16596J2012K8711K0036o4102M6569N7991l1966K9339K701j9660K5990p5375
$$ -116596 -104584 -75873 -55837 -119939 -73370 -15379 -47345 -18006 -15305 -34965 -8975 -84350
2628h4350P219l54K0085j6958q278N116J7154J8579J1459n5864l0433j0057K3888
$$ -84350 -77131 -77485 -57400 -74358 -82636 -77520 -60366 -41787 -30328 -86192 -116625 -126682 -102794
2615a02794R983L6595p258k8479L6873P877J4035k5730k0854k7947N9152M7974
$$ -102794 -92811 -56216 -63474 -91953 -55080 -47203 -33168 -58898 -79752 -107699 -48547 -573
2603e73l7041n1940L529L6692n8099k2279O9260l5864J2897k9282L4013J02710
$$ -573 -37614 -89554 -86025 -49333 -107432 -129711 -60451 -96315 -83418 -112700 -78687 24023
2591B4023o8410K715O592k259k743R88k6765k752K5252n3717K4538N4893k4214
$$ 24023 -44387 -41672 -35080 -37339 -40082 -39094 -65859 -68611 -43359 -97076 -72538 -17645 -41859
2578d1859j118j7844j9655k6384L4227k1786M8119K0356J3056n3041l3656k3766
$$ -41859 -42977 -60821 -80476 -106860 -72633 -94419 -46300 -25944 -12888 -65929 -99585 -123351
2566a23351O8891K0949q6410L1954J0254K589j5740J796P596Q840k0086M4067
$$ -123351 -54460 -33511 -119921 -87967 -77713 -75124 -90864 -89068 -81472 -72632 -92718 -48651
2554d8651k1190p12k9250Q2850j0885p3732J1101O8j5778M093J8700L7547j7212
$$ -48651 -69841 -70553 -99803 -16953 -27838 -101570 -90469 -90401 -106179 -102086 -83386 -45839 -63051
2541f3051k9469J9153k4594o4167M4102K6342M1099k2304O132L3712m8871l7522
$$ -63051 -92520 -73367 -97961 -162128 -118026 -91684 -50585 -72889 -66757 -33045 -81916 -119438
2529a19438L4307j8864l7367L6L6474k0313K8412J8276L538J2155n6520N171k5590
$$ -119438 -85131 -103995 -141362 -141326 -104852 -125165 -96753 -78477 -74939 -62784 -119304 -114133 -139723
2516a39723O1432N9355n572m0748M429K4321n940O3304j0470j03355P581N2377
$$ -139723 -78291 -18936 -24508 -65256 -60827 -36506 -42446 20858 10388 -92967 -85386 -33009
2504c3009l2797l1374K6599L0132N194m9786n2048K1997P8382q630l0444j0237
$$ -33009 -65806 -97180 -70581 -40449 -35255 -85041 -137089 -115092 -36710 -45340 -75784 -86021
2492h6021K9568J0616k9013k8629N6320l5711P4271J728m2061J9474j1193l261
$$ -86021 -56453 -45837 -74850 -103479 -47159 -82870 -8599 -6871 -48932 -29458 -40651 -43912
2480d3912O734J5588n275j2048o1378L686J6006L0846p968j1176L6512k1237L4151
$$ -43912 -37178 -21590 -26865 -38913 -100291 -96605 -80599 -49753 -57721 -68897 -32385 -53622 -19471
2467a9471P056k4233O003k724j9046K0907J5835Q467o275k7478m2167j539k4712
$$ -19471 -12415 -36648 -30645 -33369 -52415 -31508 -15673 -7206 -13481 -40959 -83126 -84665 -109377
2454a09377P452O1178p5446Q5419k6191J002L024q344J8757J3332R71J1450j2252
$$ -109377 -101925 -40747 -116193 -30774 -56965 -55963 -52939 -61283 -42526 -29194 -28223 -16773 -29025
2441b9025j1381l8758O326K3851K3273L503k9985R479J8034m7783O755K4314N7525
$$ -29025 -40406 -79164 -72838 -48987 -25714 -22211 -52196 -42717 -24683 -72466 -65711 -41397 16128
2428A6128k0583n3496R466m5924J6679J0176l0516j6048M4147J2636L9146N891
$$ 16128 -4455 -57951 -48485 -94409 -77730 -67554 -98070 -114118 -69971 -57335 -18189 -12298
2416a2298k8452k8384j2948K9113L8915q232k779k0453o0663J7967N9098k0525
$$ -12298 -40750 -69134 -82082 -52969 -14054 -22286 -25065 -45518 -106181 -88214 -29116 -49641
2404d9641J1342L208K800J6156J626j4083r872P570L968j6498K1919J7342l6551
$$ -49641 -38299 -35091 -32291 -16135 -14509 -28592 -38464 -30894 -26926 -43424 -21505 -4163 -40714
2391d0714O364J0597j1412J520m9404K2534O961J6743K1898j6434r714k715L3999
$$ -40714 -34350 -23753 -35165 -33645 -83049 -60515 -53554 -36811 -14913 -31347 -41061 -43776 -9777
2378i777M088o2621R674P4941m8453J790J9382k7922K8338N2842J4603k5237m0264
$$ -9777 -5689 -68310 -58636 16305 -32148 -30358 -10976 -38898 -10560 42282 56885 31648 -8616
2365h616j6387K0672n8427L7274l026L3808L8632J0779j9489k5404n0331M607
$$ -8616 -25003 -4331 -62758 -25484 -28510 5298 43930 54709 35220 9816 -40515 -35908
2353c5908L1176m4965l3828p822K0408j0741K4938j3303M4158q914L7301L385
$$ -35908 -4732 -49697 -83525 -91347 -70939 -81680 -56742 -70045 -25887 -34801 2500 5885
2341E885l2688k8043J0756L6867m8917J9954J9654l4790l5650L9495l3868m1246
$$ 5885 -26803 -54846 -44090 -7223 -56140 -36186 -16532 -51322 -86972 -47477 -81345 -122591
2329a22591n629O0094l675J329N4030q776j1855J0746J6240l433j9270n0136k211
$$ -122591 -128220 -68126 -71801 -70472 -16442 -25218 -37073 -26327 -10087 -13520 -32790 -82926 -85137
2316h5137K6787R135P4021l5487l2215K6083p8176R184J315N0671J1222l5316
$$ -85137 -58350 -49215 24806 -10681 -42896 -16813 -94989 -85805 -84490 -33819 -22597 -57913
2304e7913j6340P4984O5446m9783K2658N224k8499j4999j1892n3915L7244K1691
$$ -57913 -74253 731 66177 16394 39052 44276 15777 778 -11114 -65029 -27785 -6094
2292f094k5481K7170J477k3440J9581K5101Q935n380n6063R98K0296L7469j2482
$$ -6094 -31575 -4405 -2928 -26368 -6787 18314 27249 21869 -34194 -33196 -12900 24569 12087
2279A2087j5859M190L7639j2823k8468q483r917J2653j313J8321j6312m5411m63
$$ 12087 -3772 418 38057 25234 -3234 -11717 -21634 -8981 -10294 8027 -8285 -53696 -54159
2266e4159M7769M3142n3825J714J878l3612j0698j5432J2270K0579n5497M8996
$$ -54159 -6390 36752 -17073 -15359 -13481 -47093 -57791 -73223 -60953 -40374 -95871 -46875
2254d6875l162K6428J3594j5340N219K7241l485l487j0069k8203Q722P8352L7490
$$ -46875 -50037 -23609 -10015 -25355 -20136 7105 3620 133 -9936 -38139 -29417 48935 86425
2241H6425l1002K7677l2630m2835K4978O719k8464n0613J4388O9944L96J7744
$$ 86425 55423 83100 50470 7635 32613 39332 10868 -39745 -25357 44587 44983 62727
2229F2727O153K7675j1882k8801K334N2290o0833m812j8098J0190L2558o591O6551
$$ 62727 68880 96555 84673 55872 58206 110496 49663 44851 26753 36943 69501 62910 129461
2216A29461k4701l2261k3452l7200M5718K4696J7016K6211k0111J4018k6039l8347
$$ 129461 104760 72499 49047 11847 57565 82261 99277 125488 105377 119395 93356 55009
2204E5009l5118K3894L2491J9629M3481j2169L7559p1443k7203q220J3596K5211
$$ 55009 19891 43785 76276 95905 139386 127217 164776 93333 66130 57910 71506 96717
2192I6717j09Q892L1197p100k9115P6649k7089l4460j6514J3505j0986K5646O1345
$$ 96717 96608 105500 136697 129597 100482 177131 150042 115582 99068 112573 101587 127233 188578
2179A88578r362K0134k4308Q846L2200n163j8330j8801J2006l1265Q8244L3140
$$ 188578 179216 199350 175042 183888 216088 210925 192595 173794 185800 154535 242779 275919
2167B75919m0763m0389n0015J1168L6538J1330L1006M9844k3901N2201L6957k2700
$$ 275919 235156 194767 144752 155920 192458 203788 234794 284638 260737 312938 349895 327195
2155C27195j8006N1411p53m8660K4301K4099O408O8861P49k4836M4916L6917l1259
$$ 327195 309189 360600 359847 311187 335488 359587 365995 434856 435605 410769 455685 492602 461343
2142D61343K4438q078J2751J7247J6906j2341j4361O79L0229P4625L3345L3957
$$ 461343 485781 477703 490454 507701 524607 512266 497905 498584 528813 603438 636783 670740
2130F70740q9k283K9606P7961P4778K6844M2631K8698J0983N9663L9339J01856
$$ 670740 670651 668368 697974 775935 850713 877557 920188 948886 959869 1019532 1058871 1160727
2118A160727M294N478Q6327Q9073M6868J6387P0952R1213P3364J61041J95288
$$ 1160727 1165021 1170499 1256826 1345899 1392767 1409154 1480106 1571319 1644683 1805724 2001012
2107B001012J44976K50560K28446J15537J19521K21352K49193M05899M24587N56321
$$ 2001012 2145988 2396548 2624994 2740531 2860052 3081404 3330597 3736496 4161083 4717404
2097D717404Q31339R50898J332880J760150K529453L027364L146763P70165l075068
$$ 4717404 5548743 6499641 7832521 9592671 12122124 15149488 18296251 19066416 15991348
2088A5991348l549528k766240k099436j404045j011539p10747n89789m96867l72045
$$ 15991348 12441820 9675580 7576144 6172099 5160560 4449813 3860024 3363157 2991112
2079B991112k86366j93548j38983q9313l4631k17631j91478j53376j66920j12667
$$ 2991112 2704746 2511198 2372215 2282902 2248271 2030640 1839162 1685786 1518866 1406199
2069A406199p5609j13893l9653n9168n9114l2818p8759m7158j24965o1637m6661
$$ 1406199 1330590 1216697 1177044 1117876 1058762 1025944 947185 900027 775062 713425 666764
2058F66764q0849K3631l0043j3469j2170K5523k7670l6640k5201m8868j889K0230
$$ 666764 585915 609546 579503 566034 553864 579387 551717 515077 489876 441008 439119 459349
2046D59349n2148k2691m2438J7552o7658K8237l6537M0928N8969m4548k7680k4478
$$ 459349 407201 384510 342072 359624 291966 320203 283666 324594 383563 339015 311335 286857
2034B86857n878l749M5894k6616m6607l9151L5157p46l8910j3138j0581n166J5178
$$ 286857 280979 277230 323124 296508 249901 210750 245907 245161 206251 193113 182532 177366 192544
2021A92544k5492k1340j5112M214n002K8354J7133J4064o6537m0574P4708l8349
$$ 192544 167052 145712 130600 134814 129812 158166 175299 189363 122826 82252 156960 118611
2009A18611p0086k9642M4555J01573k7673n9871k7040k3618l6779M3515l493L1232
$$ 118611 48525 18883 63438 165011 137338 77467 50427 26809 -9970 33545 30052 61284
1997F1284k3275m4129K4519O3365j3367k2859p746m4538J009L2519j3343J5015
$$ 61284 38009 -6120 18399 81764 68397 45538 37792 -6746 -5737 26782 13439 28454
1985B8454k6119K5788L1932l4008n355J4914j212K339N431m1090k7092K3620J6011
$$ 28454 2335 28123 60055 26047 20692 35606 34394 36733 42164 1074 -26018 -2398 13613
1972A3613l9738M175m1959k8125O8083r516K4103M5363k186N7118j0604r5021
$$ 13613 -26125 -21950 -63909 -92034 -23951 -33467 -9364 35999 33813 90931 80327 -14694
1960a4694j0474N927K6887K1857o129l2314L7425n019l5042K6090P579J6435j9147
$$ -14694 -25168 -19241 7646 29503 23374 -8940 28485 23466 -11576 14514 22093 38528 19381
1947A9381k7460J3480O1344k4614p765j4462l1664r748M355K2532J0319k9703
$$ 19381 -8079 5401 66745 42131 34366 19904 -11760 -21508 -17153 5379 15698 -14005
1935a4005K8632L0836J298k5844J133r397M2008m9138n6133N7374n95P761L3231
$$ -14005 14627 45463 46761 20917 22050 12653 54661 5523 -50610 6764 6169 13930 47161
1922D7161O658M94l5904p908L0938j9033l620K1030m2897n3183R075O5434q438
$$ 47161 53819 54313 18409 10501 41439 22406 18786 39816 -3081 -56264 -47189 18245 9807
1909I807l5277J2997o901L3217N473p1988M020k4961K2341J1025j8136P2354M10
$$ 9807 -25470 -12473 -19374 13843 19316 -52672 -48652 -73613 -51272 -40247 -58383 13971 14381
1896A4381l9257n4124K3391P3361R160r3708K3930K9251m0665J3784m494K1288
$$ 14381 -24876 -79000 -55609 17752 26912 -66796 -42866 -13615 -54280 -40496 -44990 -23702
1884b3702J202N831L5816j3149R867L904n3232k0687K2037k8281J4899O870l5525
$$ -23702 -22500 -16669 19147 5998 15865 19769 -33463 -54150 -32113 -60394 -45495 -38625 -74150
1871g4150N9775N2789J5883q4791k2632J448l9439J201O448l977N7757K6568k4765
$$ -74150 -14375 38414 54297 -30494 -53126 -51678 -91117 -89916 -83468 -87445 -29688 -3120 -27885
1858b7885o049k2508o4019K1394O2902n131J0087L6681J169j2578K8799O730k1501
$$ -27885 -33934 -56442 -120461 -99067 -36165 -41296 -31209 5472 6641 -5937 22862 29592 8091
1845H091m8629N2062j5468K1308n8022q290l6242K5815M2131n852M3434o453j1581
$$ 8091 -40538 11524 -3944 17364 -40658 -48948 -85190 -59375 -17244 -23096 20338 13885 2304
1832B304L220K0237l6363J4765m1048O077K1509M7532M1313n2549j4117L5734
$$ 2304 5524 25761 -10602 4163 -36885 -30808 -9299 38233 79546 26997 12880 48614
1820D8614J1708o1805l0691L6056m9948J3839M821L2426j6958j8501K2229K034
$$ 48614 60322 -1483 -32174 3882 -46066 -32227 -27406 5020 -11938 -30439 -8210 -6176
1808f176P561k0963K3300J3407m3709l9330M6386J2692o372j9388L5730K9694
$$ -6176 1385 -19578 3722 17129 -26580 -65910 -19524 -6832 -13204 -32592 3138 32832
1796C2832m5191m7069N908Q059L951K7371P014n951J4868O60N849K6863P405j031
$$ 32832 -12359 -59428 -53520 -45461 -41510 -14139 -7125 -13076 1792 2452 8301 35164 42569 41538
1782D1538L5497p0338n6276L2971k6043J0361K4172M8758J3504n9411n9086k1915
$$ 41538 77035 6697 -49579 -16608 -42651 -32290 -8118 40640 54144 -5267 -64353 -86268
1770h6268P0146o913l2519L6121J695J7091l2735P860M279k9984M4312O048j1087
$$ -86268 -16122 -23035 -55554 -19433 -17738 -647 -33382 -25522 -21243 -51227 -6915 -867 -11954
1757a1954k3903k1092k209N7003j4900j5451j8164N8807M5365q6759P170j8726
$$ -11954 -35857 -56949 -59158 -2155 -17055 -32506 -50670 8137 53502 -33257 -26087 -44813
1745d4813L4739o83N8M2182j6321k0849m1935R402P1167n6784l6263L5424K9856
$$ -44813 -10074 -10757 -10699 31483 15162 -5687 -47622 -38220 32947 -23837 -60100 -24676 5180
1732E180Q143k0163K5301k7678m9237j991Q777l147L257K6323j9836J6681j0806
$$ 5180 13323 -6840 18461 -9217 -58454 -60445 -51668 -54815 -51558 -25235 -45071 -28390 -39196
1719c9196J0559M0895j7296O5079m7542p6310k1265J6066L7566L2138p166j2706
$$ -39196 -28637 12258 -5038 60041 12499 -63811 -85076 -69010 -31444 694 -6472 -19178
1707a9178n6852o339L1206l2215j5842M1183O0182m5351l066r344K7467k4785
$$ -19178 -76030 -82369 -51163 -83378 -99220 -58037 2145 -43206 -46272 -55616 -28149 -52934
1695e2934K103k5401k340r401M0007K5038n1017m1022K7445N0602j0277k2057
$$ -52934 -50831 -76232 -78572 -87973 -47966 -22928 -73945 -114967 -87522 -36920 -47197 -69254
1683f9254K4778o955J2267m7813J8617K9085L31o470j7528L4723j531J608o0017
$$ -69254 -44476 -51431 -39164 -86977 -68360 -39275 -38944 -45414 -62942 -28219 -29750 -28142 -88159
1670h8159O394j6812J3095J6339K348J4199K7282k620J7577k645L9107j4243n6261
$$ -88159 -81765 -98577 -85482 -69143 -66795 -52596 -25314 -27934 -10357 -13002 26105 11862 -44399
1657d4399N0929k283j7161J0834l568l1848P117N8680m5140o561J3614l3899k1778
$$ -44399 6530 4247 -12914 -2080 -5648 -37496 -30379 28301 -16839 -23400 -9786 -43685 -65463
1644f5463J843L3384n320J2173j26L247L5405k6166l2734N219j9673k0748O4867
$$ -65463 -63620 -30236 -35556 -23383 -23509 -20262 15143 -11023 -43757 -38538 -58211 -78959 -14092
1631a4092p136L5426k6766l6211K0243K7729J0137j1921n2831L9022K3210j0078
$$ -14092 -21228 14198 -12568 -48779 -28536 -807 9330 -2591 -55422 -16400 6810 -3268
1619c268j1770n75K0154k5612j1469l6740P297K4867l6572R199L6195M143J3754
$$ -3268 -15038 -15613 4541 -21071 -32540 -69280 -61983 -37116 -73688 -64489 -28294 -24151 -10397
1606a0397J5005M0497j5635l1347N841J1268j3977j2548l0248K5666l4057n493
$$ -10397 4608 45105 29470 -1877 3964 15232 1255 -11293 -41541 -15875 -49932 -55425
1594e5425K5275m7843R331M0251N421J5820M407l928n1252L5491j3744k4999J7954
$$ -55425 -30150 -77993 -68662 -28411 -22990 -7170 -2763 -6691 -57943 -22452 -36196 -61195 -43241
1581d3241m6876L5076K2007n832k960L5711L9562J4067q255o7539r878p192J2549
$$ -43241 -90117 -55041 -33034 -38866 -41826 -6115 33447 47514 39259 -28280 -38158 -45350 -32801
1568c2801Q6568k9980l8717M321N0448l9098m4610J0006K6166j1083n2549L0517
$$ -32801 53767 23787 -14930 -10609 39839 741 -43869 -33863 -7697 -18780 -71329 -40812
1556d0812K0190m6252K0500J7152j5047N0174K678m7415k3107k6052K4997K6900
$$ -40812 -20622 -66874 -46374 -29222 -44269 5905 8583 -38832 -61939 -87991 -62994 -36094
1544c6094N4694j9096K6713L3249m8807n5378l2173L4229M9636j5505k6590k1481
$$ -36094 18600 -496 26217 59466 10659 -44719 -76892 -42663 6973 -8532 -35122 -56603
1532e6603n668J9126J2566R593l2801K9419k0749N748j9376M5667k8907K5043
$$ -56603 -62271 -43145 -30579 -20986 -53787 -24368 -45117 -39369 -58745 -13078 -41985 -16942
1520a6942K9776J727p284m0779m0407m990P4219O117k7418m2968K3236k2347L3454
$$ -16942 12834 14561 7277 -33502 -73909 -78899 -4680 1437 -25981 -68949 -45713 -68060 -34606
1507c4606P1248l6217P352M4557j8765n9015L1105j1520n737l3521J15305n6377
$$ -34606 36642 425 7777 52334 33569 -25446 5659 -5861 -11598 -45119 70186 13809
1495A3809l9651j389n581K6308K2623l5182N32M3159k9957l6518J6118N422p506
$$ 13809 -25842 -27231 -32812 -6504 16119 -19063 -18531 24628 -5329 -41847 -25729 -20307 -27813
1482b7813K9575n231Q95m3966j8856N0041Q024k125M8995m5909j2768k6341K4053
$$ -27813 1762 -3469 -2574 -46540 -65396 -15355 -7331 -9456 39539 -6370 -19138 -45479 -21426
1469b1426l8896l0931J4369J9093O7569k6379l4906M7874r973l9523J9768J2748
$$ -21426 -60322 -91253 -76884 -57791 9778 -16601 -51507 -3633 -13606 -53129 -33361 -20613
1457b0613J6163J7041o4793M4108n3987k408M0492J8832J5687k8595K5298j1691
$$ -20613 -4450 12591 -52202 -8094 -62081 -64489 -23997 -5165 10522 -18073 7225 -4466
1445d466j2062j29J7119J0752k127r405o0423j2393m90M1512K9665q468P9l230
$$ -4466 -16528 -16657 462 11214 9087 -318 -60741 -73134 -73624 -32112 -2447 -10915 -10836 -14066
1431a4066O475n975K3252l1096P182p187P740L3459P598J7839O835o6758n8087
$$ -14066 -7591 -13566 9686 -21410 -14228 -21415 -13675 19784 27382 45221 52056 -14702 -72789
1418g2789L9166l779M6001K2420m4158n857j4439p7194M7910L4965Q9934k6541
$$ -72789 -33623 -37402 8599 31019 -13139 -18996 -33435 -110629 -62719 -27754 62180 35639
1406C5639q142j3551l2275k4058j3o311j0623M6933l5010J5831J7685m7360j4161
$$ 35639 27497 13946 -18329 -42387 -42400 -48711 -59334 -12401 -47411 -31580 -13895 -61255 -75416
1393g5416L7777q562O9975M5073o0828j3430k492L8571J9507L235l9192k9440
$$ -75416 -37639 -46201 23774 68847 8019 -5411 -7903 30668 50175 53410 14218 -15222
1381a5222k3548r932L4801m2880K3890R57l9324k0246L2016R4424l3643j6557
$$ -15222 -38770 -48702 -13901 -56781 -32891 -31934 -71258 -91504 -59488 34936 1293 -15264
1369a5264n467j1022O6032L838k9504J9353l5097J0174L543k973j9347l576j1565
$$ -15264 -20731 -31753 34279 38117 8613 27966 -7131 3043 6586 3613 -15734 -19310 -30875
1356c0875Q535j0134K9557p176k7911L444k5403K1208J2080N0735l8191M084K9939
$$ -30875 -22340 -32474 -2917 -10093 -38004 -34560 -59963 -38755 -26675 24060 -14131 -10047 19892
1343A9892j1254m8470k1118l7881K7600J5363r285r851N2321K3002j3974K6911
$$ 19892 8638 -39832 -60950 -98831 -71231 -55868 -65153 -75004 -22683 319 -13655 13256
1331A3256k2314l7774o66P82O3503n7588K8433j9995l6610l3183L7347R566L412
$$ 13256 -9058 -46832 -47498 -46716 16787 -40801 -12368 -32363 -68973 -102156 -64809 -55243 -51831
1318e1831L8959R752J04k8648j4890j9419O3227L2730j790m585m3018o088J555
$$ -51831 -12872 -3120 -3016 -31664 -46554 -65973 -2746 29984 28194 23609 -19409 -25497 -23942
1305b3942N4263p1914k8114N969J0107K1495K3951o2413k0874L9092M6075K8426
$$ -23942 30321 -41593 -69707 -63738 -53631 -32136 -8185 -70598 -91472 -52380 -6305 22121
1293B2121n0410k1407M852M5027M6850j7197l0016j1131o167M7903k3801k1518
$$ 22121 -28289 -49696 -44844 183 47033 29836 -180 -11311 -17478 30425 6624 -14894
1281a4894j6741K5133J2750l0794J3877k1678k2069J1834K2899J8188k8181j4132
$$ -14894 -31635 -6502 6248 -24546 -10669 -32347 -54416 -42582 -19683 -1495 -29676 -43808
1269d3808J4746k0889P301o394M154J3212q299j8573j0244M5960J6457k2868k5421
$$ -43808 -29062 -49951 -42650 -49044 -44890 -31678 -39977 -58550 -68794 -22834 -6377 -29245 -54666
1256e4666K1520L195K5793K8180Q16J8525O5411p2036l8008m4393K9050l928L4397
$$ -54666 -33146 -29951 -4158 24022 24838 43363 108774 36738 -1270 -45663 -16613 -20541 13856
1243A3856K4903j2127m5634K3283J6496n673l5268k1278K2777j8038R1805n0093
$$ 13856 38759 26632 -19002 4281 20777 15104 -20164 -41442 -18665 -36703 55102 5009
1231E009m4832j4699J9827Q0581K2883J0416p4153L4923J3739j9250p4347J3773
$$ 5009 -39823 -54522 -34695 45886 68769 79185 5032 39955 53694 34444 -39903 -26130
1219b6130j0449R414j2451N515o2743l6457P9495M8735m7568L3562K9647j1178
$$ -26130 -36579 -27165 -39616 -34101 -96844 -133301 -53806 -5071 -52639 -19077 10570 -608
1207f08J1491n9589K895K6476N653j6882j9545l8241J6506M5664q429K235L2703
$$ -608 10883 -48706 -45811 -19335 -13682 -30564 -50109 -88350 -71844 -26180 -34609 -32374 329
1194C29J491L3727j6297N017p544k6237Q47K4321l9743q602L8464O5760P331j8724
$$ 329 1820 35547 19250 24267 16723 -9514 -8667 15654 -24089 -32691 5773 71533 78864 60140
1180F0140r721n946l1862o5830k6267M0616n092M954N9444k8988N4339k0316l1247
$$ 60140 50419 44473 12611 -53219 -79486 -38870 -43962 -39008 20436 -8552 45787 25471 -5776
1167e776K2109m3806p367J3032k5828K0001L0376j7804M6140P573k0471j5571
$$ -5776 16333 -27473 -34840 -21808 -47636 -27635 2741 -15063 31077 38650 18179 2608
1155B608l6925N842l3443m1552R1644M1873l821k0747j7137o061J8682L6960j5980
$$ 2608 -34317 -28475 -61918 -103470 -11826 30047 26226 5479 -11658 -17719 963 37923 21943
1142B1943j5453J9170R801J032j8416j6279k0706K7299l5824N9106J8319m4388
$$ 21943 6490 25660 35461 36493 18077 1798 -18908 8391 -27433 31673 49992 5604
1130E604K0797J5212m1723P06M1542N4062p8837n4294J7644k0932K7742N1501
$$ 5604 26401 41613 -110 596 42138 96200 17363 -36931 -19287 -40219 -12477 39024
1118C9024j2913k5590l6067L9557J2235j3158l1724M3157P829l0841K2451J7827
$$ 39024 26111 521 -35546 4011 16246 3088 -28636 14521 22350 -8491 13960 31787
1106C1787l6348o276j4205k0021Q1115J0155r397l1266k2724M7219N516j7356
$$ 31787 -4561 -10837 -25042 -45063 36052 46207 36810 5544 -17180 30039 35555 18199
1094A8199k119m1014L2169j0164j3074K3645L9865R693n0889o0856K1486j9470
$$ 18199 16080 -24934 7235 -2929 -16003 7642 47507 57200 6311 -54545 -33059 -52529
1082e2529M2726N6753m1217j5584j0426L3997k8454l562q310L2470K3668k3711
$$ -52529 -9803 46950 5733 -9851 -20277 13720 -14734 -18296 -26606 5864 29532 5821
1070E821q066l6556J0987K7203M5028m9876k0565J4577K3321j9303l5621M4697
$$ 5821 -2245 -38801 -27814 -611 44417 -5459 -26024 -11447 11874 -7429 -43050 1647
1058A647J2529p9534J7642N6299M591O203n7990m0904K0549J3839L2882K2820
$$ 1647 14176 -65358 -47716 8583 13174 19377 -38613 -79517 -58968 -45129 -12247 10573
1046A0573j947q671J7533o9222N8632M6897k5319k5318J0402L9862p044k3026
$$ 10573 8626 -45 17488 -51734 6898 53795 28476 3158 13560 53422 46378 23352
1034B3352k221K661k6694k092k4417r096J5505j3235K6078k133j1051k9088M8125
$$ 23352 21131 23792 -2902 -4994 -29411 -38507 -23002 -36237 -10159 -12292 -23343 -52431 -4306
1021d306J5172j6679L679j2274j7618N3514L4846o2576k7653r946N938N2542k7149
$$ -4306 10866 -5813 -2134 -14408 -32026 21488 56334 -6242 -33895 -43841 -37903 14639 -12510
1008a2510K6595o896O550M8433j6222j7846l3497J3494R074K4872j9004k1600
$$ -12510 14085 7189 13739 62172 45950 28104 -5393 8101 17175 42047 23043 1443
996A443k7680k0984O1409K7144l9220M5089K4415m248k0981j9305J9125q54l1225
$$ 1443 -26237 -47221 14188 41332 2112 47201 71616 67368 46387 27082 46207 45353 14128
983A4128O7291r1153k2840p341K3431M5519Q534m246l2625j9345l387L6625k4782
$$ 14128 81419 -9734 -32574 -39915 -16484 29035 37569 33323 698 -18647 -22034 14591 -10191
970a0191J7088K6000k9509l5786Q869l8128N1063L6264k0282K5798J1562n6440
$$ -10191 6897 32897 3388 -32398 -23529 -61657 -10594 25670 5388 31186 42748 -13692
958a3692L9405j0844j4135N7498j8043n881J0716r202m3221L3140M5920r571m4017
$$ -13692 25713 14869 734 58232 40189 34308 45024 35822 -7399 25741 71661 62090 18073
945A8073k5324j4043K0570m794j6507L4929J3728j4231n8592j7731O7556J03739
$$ 18073 -7251 -21294 -724 -5518 -22025 12904 26632 12401 -46191 -63922 3634 107373
933A07373n6644k8193j6533n3629L5100j1801K7061O256k2715k2387p215l736
$$ 107373 50729 22536 6003 -47626 -12526 -24327 2734 8990 -13725 -36112 -43327 -47063
921d7063k323O012M5998k4450L0231k1030j8392K02k8687K0448k0252k93K5886
$$ -47063 -49386 -43374 2624 -21826 8405 -12625 -31017 -30815 -59502 -39054 -59306 -59599 -33713
908c3713M2823M2098m320j0325L7421k9521m3482k0096l3742O6575K471j9966
$$ -33713 9110 51208 46888 36563 73984 44463 981 -19115 -52857 13718 16189 -3777
896c777j2404n6854K6493L8331q348K1196n6819N7193K4093j2837L2858l2565
$$ -3777 -16181 -73035 -46542 -8211 -16559 4637 -52182 5011 29104 16267 49125 16560
884A6560l3591j8177K1893M5067J9289m8122k1877l1573m0332N8741P2678P1153
$$ 16560 -17031 -35208 -13315 31752 51041 2919 -18958 -50531 -90863 -32122 40556 111709
872A11709o5968k1148M5073j5980K1891j4649o6668J3623j646o2733K5914K97
$$ 111709 45741 24593 69666 53686 75577 60928 -5740 7883 6237 -56496 -30582 -30285
860c0285M1050K1080l8967J9049L3283l6730M8643M4480m1874k6324J5853l5569
$$ -30285 10765 31845 -7122 11927 45210 8480 57123 101603 59729 33405 49258 13689
848A3689L7326j9886n0959l3903j6001K2990P2607N923j884J1649p234p3217j3991
$$ 13689 51015 31129 -19830 -53733 -69734 -46744 25863 31786 29902 41551 34317 -38900 -52891
835e2891J6071P417K7719N1669m2546Q568r591k0998K5750L0014j0336N476j7509
$$ -52891 -36820 -29403 -1684 49985 7439 16007 6416 -14582 11168 41182 30846 36322 18813
822A8813l7334O3181j1320j2119o80M994M0414l1826L926K6570j8805Q74r557
$$ 18813 -18521 44660 33340 21221 20541 25535 65949 34123 38049 64619 45814 46688 37131
809C7131j4133j2780o0111M3004l2008j7067N1449J7435k0473m956P6994n8181
$$ 37131 22998 10218 -49893 -6889 -38897 -55964 -4515 12920 -7553 -12509 64485 6304
797F304n681M3494K7215n6772P1J1724L4694m8349n9818K2293K6151q741l3744
$$ 6304 623 44117 71332 14560 14631 26355 61049 12700 -47118 -24825 1326 -7415 -41159
784d1159l6496N2066k9828K9665j7815m43M7913O635j1381p3339K8337P0314O6791
$$ -41159 -77655 -25589 -55417 -25752 -43567 -44010 3903 10538 -843 -74182 -45845 24469 91260
771I1260k1467o5371M1119J3545l3699p32j9686k0608K7256k6573N0506K8563
$$ 91260 69793 4422 45541 59086 25387 24655 4969 -15639 11617 -14956 35550 64113
759F4113k1666p6757k603j7180l4457L7444J3270n301M3770R7n2389j7332L2882
$$ 64113 42447 -34310 -36913 -54093 -88550 -51106 -37836 -43137 633 730 -51659 -68991 -36109
746c6109M2420M4954K4870k2625k1281L408k5597k363m655j2656J787K0409L1314
$$ -36109 6311 51265 76135 53510 32229 35637 10040 7677 3022 -9634 -7847 12562 43876
733D3876j0928o1030j2759P9787l7558L9539K7245o946j5535L3885n9770J329
$$ 43876 32948 -28082 -40841 38946 1388 40927 68172 61226 45691 79576 19806 21135
721B1135J2207K8712j418k4145M177L559K0767k0760n9216L1264l1336k4601N1512
$$ 21135 33342 62054 60636 36491 40668 44227 64994 44234 -14982 16282 -15054 -39655 11857
708A1857j1486K3075P51J0360K5369l8188J8899J5509Q9m2794L8951M571l9171
$$ 11857 371 23446 24197 34557 59926 21738 40637 56146 56235 13441 52392 56963 17792
$$ [...]
##END NTUPLES=NMR SPECTRUM
##END=
