##TITLE=1H_TG-2340-XVI-a
 CDCl3
 8 sc, 
 4.7.2023
##JCAMPDX= 6.0         $$ Bruker NMR JCAMP-DX V2.0
##DATA TYPE= NMR SPECTRUM
##DATA CLASS= NTUPLES
##ORIGIN= UXNMR, Bruker Analytische Messtechnik GmbH
##OWNER= root
$$ XWIN-NMR		Version 3.5
$$ Tue Jul  4 13:50:46 2023 Russian Standard Time (UT+4h)  she@DPX200
##.OBSERVE FREQUENCY= 200.13135
##.OBSERVE NUCLEUS= ^1H
##.ACQUISITION MODE= SIMULTANEOUS
##.ACQUISITION SCHEME= undefined
##.AVERAGES= 8
##.DIGITISER RES= 18
##SPECTROMETER/DATA SYSTEM= spect
##.PULSE SEQUENCE= zg30
##.SOLVENT NAME= CDCl3
##.SHIFT REFERENCE= (INTERNAL, CDCl3, 0, 15.7436)
##AUDIT TRAIL= $$ (NUMBER, WHEN, WHO, WHERE, WHAT)
$$ ##TITLE= Audit trail, XWIN-NMR		Version 3.5
$$ ##JCAMPDX= 5.01
$$ ##ORIGIN= Bruker BioSpin GmbH
$$ ##OWNER= she
$$ F:/spectra/data/she/nmr/H-F/1/pdata/1/auditp.txt
$$ ##AUDIT TRAIL=  $$ (NUMBER, WHEN, WHO, WHERE, WHAT)
(   1,<2023-07-04 13:49:11.92 +0400>,<she>,<DPX200>,
      <created by zg, POWCHK disabled, PULCHK disabled
       configuration hash MD5:
       00 E9 B6 7A A2 85 ED C7 34 08 36 98 17 FE 4E 26
       data hash MD5: 16K
       EC 2E 7A D6 C7 17 9B A9 DB 46 B5 0E DA D8 AE 09>)
(   2,<2023-07-04 13:49:15.25 +0400>,<she>,<DPX200>,
      <Start of raw data processing
       efp BC_mod = 2 LB = 0.24 FT_mod = 6 PKNL = 1 PHC0 = -20630.91 PHC1 = 11.45272 SI = 16K 
       data hash MD5: 16K
       61 79 57 93 DF 98 B1 21 C6 69 D6 0C 53 03 5F 7E>)
(   3,<2023-07-04 13:49:36.06 +0400>,<she>,<DPX200>,
      <pk PHC0 = -0.3966329 PHC1 = -1.600001 
       data hash MD5: 16K
       8B E7 64 8A 80 83 7C 52 59 BC 28 35 1F 7A D7 6D>)
(   4,<2023-07-04 13:49:39.51 +0400>,<she>,<DPX200>,
      <abs ABSG = 5 
       data hash MD5: 16K
       92 5A 25 36 04 47 65 AE DC 91 44 8C FC 68 86 3B>)
$$ ##END=
$$ 
$$ hash MD5
$$ 25 D8 83 A0 3A CC A4 62 67 42 7E 3D 05 0F 6F 38
##$RELAX= 
##$RELAX= 
##$RELAX= 
##$RELAX= 
##$RELAX= 
##$RELAX= 
$$ Bruker specific parameters
$$ --------------------------
##$DU= <F:/spectra>
##$EXPNO= 1
##$NAME= <H-F>
##$PROCNO= 1
##$TYPE= <nmr>
##$USER= <she>
##$AMP= (0..31)
100 100 100 100 100 100 100 100 100 100 100 100 100 100 100 100 100 100 
100 100 100 100 100 100 100 100 100 100 100 100 100 100 
##$AQSEQ= 0
##$AQ_mod= 1
##$AUNM= <au_zg>
##$AUTOPOS= <>
##$BF1= 200.13
##$BF2= 200.13
##$BF3= 200.13
##$BF4= 200.13
##$BF5= 200.13
##$BF6= 200.13
##$BF7= 200.13
##$BF8= 200.13
##$BYTORDA= 1
##$CFDGTYP= 0
##$CFRGTYP= 5
##$CHEMSTR= <none>
##$CNST= (0..31)
1 1 145 1 1 1 1 1 1 1 1 1 1 1 1 1 1 1 1 1 1 1 1 1 1 1 1 1 1 1 1 1 
##$CPDPRG= <>
##$CPDPRG1= <>
##$CPDPRG2= <>
##$CPDPRG3= <>
##$CPDPRG4= <mlev>
##$CPDPRG5= <mlev>
##$CPDPRG6= <mlev>
##$CPDPRG7= <mlev>
##$CPDPRG8= <mlev>
##$CPDPRGB= <>
##$CPDPRGT= <>
##$D= (0..31)
0 1.2 0 0 0 0 0 0 0 0.06 0 0.03 0 0 0 0 0.0002 0 0 0 0 0 0 0 0 0 0 0 0 
0 0 0 
##$DATE= 1688464151
##$DBL= (0..7)
120 120 120 120 120 120 120 120 
##$DBP= (0..7)
150 150 150 150 150 150 150 150 
##$DBP07= 0
##$DBPNAM0= <>
##$DBPNAM1= <>
##$DBPNAM2= <>
##$DBPNAM3= <>
##$DBPNAM4= <>
$$ [...]
##$SUBNAM3= <"">
##$SUBNAM4= <"">
##$SUBNAM5= <"">
##$SUBNAM6= <"">
##$SUBNAM7= <"">
##$SUBNAM8= <"">
##$SUBNAM9= <"">
##$SW= 18.05172834244
##$SWIBOX= (0..15)
0 0 2 0 0 0 0 0 0 0 0 0 0 0 0 0 
##$SW_h= 3612.71676300578
##$TD= 16384
##$TD0= 1
##$TE= 0
##$TE2= 300
##$TE3= 300
##$TEG= 300
##$TL= (0..7)
0 120 120 120 120 120 120 120 
##$TP= (0..7)
150 150 150 150 150 150 150 150 
##$TP07= 0
##$TPNAME0= <>
##$TPNAME1= <>
##$TPNAME2= <>
##$TPNAME3= <>
##$TPNAME4= <>
##$TPNAME5= <>
##$TPNAME6= <>
##$TPNAME7= <>
##$TPOAL= (0..7)
0.5 0.5 0.5 0.5 0.5 0.5 0.5 0.5 
##$TPOFFS= (0..7)
0 0 0 0 0 0 0 0 
##$TUNHIN= 0
##$TUNHOUT= 0
##$TUNXOUT= 0
##$USERA1= <user>
##$USERA2= <user>
##$USERA3= <user>
##$USERA4= <user>
##$USERA5= <user>
##$V9= 5
##$VALIST= <valist>
##$VCLIST= <CCCCCCCCCCCCCCC>
##$VD= 0
##$VDLIST= <DDDDDDDDDDDDDDD>
##$VPLIST= <PPPPPPPPPPPPPPP>
##$VTLIST= <TTTTTTTTTTTTTTT>
##$WBST= 1024
##$WBSW= 4
##$XGAIN= (0..3)
0 0 0 0 
##$XL= 0
##$YL= 0
##$YMAX_a= 224348
##$YMIN_a= -298962
##$ZGOPTNS= <>
##$ZL1= 120
##$ZL2= 120
##$ZL3= 120
##$ZL4= 120
##$ABSF1= 15.71841
##$ABSF2= -2.33344
##$ABSG= 5
##$ABSL= 3
##$ALPHA= 0
##$AQORDER= 0
##$ASSFAC= 0
##$ASSFACI= 0
##$ASSFACX= 0
##$ASSWID= 0
##$AUNMP= <proc_1d>
##$AZFE= 0.1
##$AZFW= 0.1
##$BCFW= 0
##$BC_mod= 2
##$BYTORDP= 0
##$COROFFS= 0
##$CY= -3
##$DATMOD= 1
##$DC= 0
##$DFILT= <>
##$DTYPP= 0
##$F1P= 0
##$F2P= 0
##$FCOR= 1
##$FTSIZE= 16384
##$FT_mod= 6
##$GAMMA= 0
##$GB= 0
##$INTBC= 1
##$INTSCL= 3.70164e-10
##$ISEN= 128
##$LB= 0.24
##$LEV0= 0
##$LPBIN= 0
##$MAXI= 10000
##$MC2= 0
##$MEAN= 0
##$ME_mod= 0
##$MI= 1.114404
##$NCOEF= 0
##$NC_proc= -6
##$NLEV= 6
##$NOISF1= 3.799351
##$NOISF2= 2.8
##$NSP= 0
##$NTH_PI= 0
##$NZP= 0
##$OFFSET= 15.74358
##$PC= 1
##$PHC0= -20631.31
##$PHC1= 9.852718
##$PH_mod= 1
##$PKNL= yes
##$PPARMOD= 0
##$PSCAL= 0
##$PSIGN= 0
##$REVERSE= no
##$SF= 200.130005594729
##$SI= 16384
##$SIGF1= 3
##$SIGF2= 2
##$SINO= 5.538805
##$SIOLD= 16384
##$SREGLST= <1H.CDCl3>
##$SSB= 0
##$STSI= 16384
##$STSR= 0
##$SW_p= 3612.71676300578
##$SYMM= 0
##$S_DEV= 0
##$TDeff= 16384
##$TDoff= 0
##$TI= <>
##$TILT= no
##$TM1= 0
##$TM2= 0
##$TOPLEV= 0
##$USERP1= <user>
##$USERP2= <user>
##$USERP3= <user>
##$USERP4= <user>
##$USERP5= <user>
##$WDW= 1
##$XDIM= 16384
##$YMAX_p= 295385151
##$YMIN_p= -1154634
$$ End of Bruker specific parameters
$$ ---------------------------------
##NTUPLES= NMR SPECTRUM
##VAR_NAME=  FREQUENCY,     SPECTRUM/REAL,   SPECTRUM/IMAG
##SYMBOL=    X,             R,               I
##VAR_TYPE=  INDEPENDENT,   DEPENDENT,       DEPENDENT
##VAR_FORM=  AFFN,          ASDF,            ASDF
##VAR_DIM=   16384,         16384,           16384
##UNITS=     HZ,            ARBITRARY UNITS, ARBITRARY UNITS
##FACTOR=    0.220516191357247, 1,           1
##FIRST=     3150.76272636384, 0,            0
##LAST=      -461.954036641941, 0,           0
##MIN=       -461.954036641941, -1154634,    0
##MAX=       3150.76272636384, 295385151,    0
$$ Real data points
##PAGE= N=1
##DATA TABLE= (X++(R..R)), XYDATA
$$ [...]
$$ plain form
7087 9825080 9602051 9393987 9231134 9282860 9208729 9437925 9635718 10100600 10729431 11391423
7077 11391423 12061515 12594106 12906226 12846167 12334195 11242726 9982990 8792167 7881231
7068 7881231 7079394 6488800 6068899 5740519 5460126 5324583 5170159 5126808 4994472 4921049
7058 4921049 4788868 4592537 4416740 4315992 4176827 3996944 3919720 3913045 4015457 3955091
7048 3955091 3918302 4008751 4280905 4517291 4660723 4950201 5292114 5427067 5579416 5728169
7038 5728169 5732357 5720662 5582355 5454845 5147349 4800911 4475771 4277157 4158252 3980517
7028 3980517 3888921 3774023 3749682 3650212 3722617 3859835 4018029 4264004 4584300 4860992
7018 4860992 4985621 5282627 5859703 6639767 7480934 8516350 9787144 11474342 13211891
$$ packed form
7087I825080k23029k08064j62853N1726p4131K29196J97793M64882O28831O61992
7077A1391423O70092N32591L12120o0059n11972j091469j259736j190823r10936
7068G881231q01837n90594m19901l28380k80393j35543j54424m3351j32336p3423
7058D921049j32181j96331j75797j00748j39165j79883p7224o675J02412o0366
7048C955091l6789R0449K72154K36386J43432K89478L41913J34953J52349J48753
7038E728169M188j1695j38307j27510l07496l46438l25140j98614j18905j77735
7028C980517r1596j14898k4341r9470P2405J37218J58194K45975L20296K76692
7018D860992J24629K97006N77076P80064Q41167J035416J270794J687198J737549
$$ plain form
7009 13211891 14589103 15189949 14712779 13363122 11314272 9376261 7798300 6568902
7001 6568902 5591110 4799023 4289823 3856153 3483629 3141635 2919856 2733019 2560602 2505512
6991 2505512 2316568 2100832 1906941 1794977 1857997 1649665 1584120 1597306 1552104 1441094
6981 1441094 1406505 1278955 1173527 1143644 1026334 1057456 968548 930297 873028 894082 983796
6970 983796 938521 793458 784318 759042 794422 819332 841094 713740 676071 730773 747542
6959 747542 692329 720505 728874 645126 580253 522837 588663 496935 418378 471320 523123 502389
6947 502389 537490 500002 449739 368287 358252 468533 474088 490264 400267 353585 464095
6936 464095 528658 539022 588935 570080 457246 499264 503464 401719 492406 514433 418037
$$ packed form
7009A3211891J377212O00846m77170j349657k048850j938011j577961j229398
7001F568902r77792p92087n09200m33670l72524l41994k21779j86837j72417n5090
6991B505512j88944k15736j93891j11964O3020k08332o5545J3186m5202j11010
6981A441094l4589j27550j05428k9883j17310L1122q8908l8251n7269K1054Q9714
6970I83796m5275j45063r140k5276L5380K4910K1762j27354l7669N4702J6769
6959G47542n5213K8176Q369q3748o4873n7416O5826r1728p8557N2942N1803k0734
6947E02389L5101l7488n0263q1452j0035J10281N555J6176q9997m6682J10510
6936D64095O4563J0364M9913j8855j12834M2018M200j01745R0687K2027r6396
$$ plain form
6925 418037 469407 478778 381950 343118 356533 486498 512831 425761 447535 449495 368338 329432
6913 329432 451416 541557 600539 610686 548340 583520 497248 553636 697265 736679 710919
6902 710919 727864 766801 876948 1037332 1325290 1694783 2025964 2321322 2277082 1811999
6892 1811999 1312263 1175123 1056617 922225 645284 448690 462363 419877 428431 470016
6882 470016 411734 464778 403703 346085 344930 271512 263812 323868 313136 311958 337848 265207
6870 265207 197099 209882 271620 207656 175837 290868 245679 266176 261932 266622 305485 248946
6858 248946 223478 183588 203809 277801 275129 322162 391380 387537 239507 262386 390478 365253
6846 365253 328049 351108 273154 148964 201662 192061 185946 204992 241134 186273 188185 199262
$$ packed form
6925D18037N1370R371r6828l8832J3415J29965K6333q7070K1774J960q1157l8906
6913C29432J21984R0141N8982J0147o2346L5180q6272N6388J43629L9414k5760
6902G10919J6945L8937J10147J60384K87958L69493L31181K95358m4240m65083
6892A811999m99736j37140j18506j34392k76941j96594J3673m2486Q554M1585
6882D70016n8282N3044o1075n7618j155p3418p700O0056j0732j178K5890p2641
6870B65207o8108J2783O1738o3964l1819J15031m5189K0497m244M690L8863n6539
6858B48946k5468l9890K0221P3992k672M7033O9218l843j48030K2879J28092k5225
6846C65253l7204K3059p7954j24190N2698r601o115J9046L6142n4861J912J1077
$$ plain form
6834 199262 213875 234880 246839 286662 157606 147737 249794 271002 343088 216922 207118
6823 207118 202993 35869 92355 73284 136687 225940 172192 127384 159325 167955 98172 105085
6811 105085 127021 191472 131488 105693 61561 84959 203044 162466 175035 159592 148708
6800 148708 194761 179309 184945 162815 159722 221692 189674 107985 119257 122493 128936 92617
6788 92617 79400 104810 158256 87496 121676 115864 85125 151891 84735 153827 155065 125202
6776 125202 153576 92188 129489 233921 312305 372806 332453 300460 216066 107150 21908
6765 21908 74106 96966 140111 80858 63336 82099 59470 141489 124679 96332 180176 257482
6753 257482 164058 -18886 -4182 57542 -79164 -16514 52727 29996 103823 152154 160308
$$ packed form
6834A99262J4613K1005J1959L9823j29056r869J02057K1208P2086j26166r804
6823B07118m125j67124N6486j9071O3403Q9253n3748m4808L1941Q630o9783O913
6811A05085K1936O4451n9984k5795m4132K3398J18085m0578J2569j5443j0884
6800A48708M6053j5452N636k2130l093O1970l2018q1689J1272L236O443l6319
6788I2617j3217K5410N3446p0760L4180n812l0739O6766o7156O9092J238k9863
6776A25202K8374o1388L7301J04432P8384O0501m0353l1993q4394j08916q5242
6765B1908N2198K2860M3145n9253j7522J8763k2629Q2019j6810k8347Q3844P7306
6753B57482r3424j82944J4704O1724j36706O2650O9241k2731P3827M8331Q154
$$ plain form
6742 160308 73368 -10583 104198 135672 79616 -18395 135605 158579 61784 243794 262261
6731 262261 134113 61139 -75276 -1321 69659 82587 116139 86119 199271 195902 153284
6720 153284 179935 191113 217098 208764 104782 150249 229179 214655 192079 255046 333013 468998
6708 468998 441694 413740 454801 524296 545382 492225 469314 460913 315414 240550 203560 170488
6696 170488 160939 137490 55248 53158 200811 159868 165568 187334 137013 227546 211844 168174
6684 168174 200205 181558 159897 155074 113847 13696 47809 139529 246369 185170 157772
6673 157772 154206 108523 178487 216896 178454 178476 124234 106678 76571 53217 115041 252645
6661 252645 252584 225719 235741 168144 151498 57981 88481 227188 259817 169664 126233 154273
$$ packed form
6742A60308q6940q3951J14781L1474n6056r8011J54000K2974r6795J82010J8467
6731B62261j28148p2974j36415P3955P0980J2928L3552l0020J13152l369m2618
6720A53284K6651J1178K5985q334j03982M5467P8930j4524k2576O2967P7967J35985
6708D68998k7304k7954M1061O9495K1086n3157k2911q401j45499p4864l6990l3072
6696A70488r549k3449q2242k090J47653m0943N700K1766n0321R0533j5702m3670
6684A68174L2031j8647k1661m823m1227j00151L4113R1720J06840o1199k7398
6673A57772l566m5683O9964L8409l8442K2n4242j7556l0107k3354O1824J37604
6661B52645o1k6865J0022o7597j6646r3517L0500J38707L2629r0153m3431K8040
$$ plain form
6649 154273 123839 17784 19905 60876 11805 47615 126178 107085 105601 129312 35848 23860
6637 23860 114918 186339 139588 39887 37447 25622 20026 184564 230965 261499 108599 43273
6625 43273 6513 -55236 22387 12967 52295 48554 87355 131599 64650 48328 221873 236278
6613 236278 147347 152154 208297 181717 97299 168598 104564 39994 106050 143882 105779 136354
6601 136354 68701 85073 63443 25857 147063 94386 76116 71411 94339 30255 135095
6590 135095 160717 70796 75386 119392 110559 138433 53451 56878 -9357 -5688 90405 83593 -1608
6577 -1608 3722 -10852 11272 111731 175245 242118 116066 120302 155021 150421 154180 115143
6565 115143 -41718 84519 204617 143315 109502 123219 129941 122248 58618 67710 41362 162203
$$ packed form
6649A54273l0434j06055K121M0971m9071L5810P8563j9093j484K3711r3464j1988
6637B3860R1058P1421m6751r9701k440j1825n596J64538M6401L0534j52900o5326
6625D3273l6760o1749P7623r420L9328l741L8801M4244o6949j6322J73545J4405
6613B36278q8931M807N6143k6580q4418P1299o4034o4570O6056L7832l8103L0575
6601A36354o7653J6372k1630l7586J21206n2677j8270m705K2928o4084J04840
6590A35095K5622q9921M590M4006q833K7874q4982L427o6235L669R6093o812q5201
6577a608N330j4574K2124J00459O3514O6873j26052M236L4719m600L759l9037
6565A15143j56861J26237J20098o1302l3813J3717O722p693o3630R092k6348J20841
$$ plain form
6553 162203 159318 104188 146132 -26395 97237 230482 155197 61785 13115 -14569 58219
6542 58219 157288 101523 8341 154746 197951 219817 209569 152727 193544 216075 281319 211195
6530 211195 264688 355831 332023 311284 354872 298504 341415 297108 215901 234925 178505 153389
6518 153389 174592 172674 157792 135884 101989 94529 33203 115054 159732 59658 109697 76682
6506 76682 186486 299312 279535 213538 207604 256460 198333 290390 189823 181203 221258 247374
6494 247374 167891 194166 276458 180128 239583 225747 181636 135746 133145 198360 215325 117920
6482 117920 87206 89174 86409 211992 244578 176148 221229 149601 217464 170203 62263 191986
6470 191986 130873 132081 92854 212818 187762 221413 195415 128027 112083 85560 189502
$$ packed form
6553A62203k885n5130M1944j72527J23632J33245p5285r3412m8670k7684P2788
6542E8219R9069n5765r3182J46405M3205K1866j0248n6842M0817K2531O5244p0124
6530B11195N3493R1143k3808k0739M3588n6368M2911m4307q1207J9024n6420k5116
6518A53389K1203j918j4882k1908l3895p460o1326Q1851M4678j00074N0039l3015
6506G6682J09804J12826j9777o5997n934M8856n8127R2057j00567q620M0055K6116
6494B47374p9483K6275Q2292r6330N9455j3836m4111m5890k601O5215J6965r7405
6482A17920l0714J968k765J25583L2586o8430M5081p1628O7863m7261j07940J29723
6470A91986o1113J208l9227J19964k5056L3651k5998o7388j5944k6523J03942
$$ plain form
6459 189502 217419 242543 203334 151887 205692 204570 208462 202264 104049 48063 74266 186949
6447 186949 177450 114268 177005 340460 282380 167197 256085 144838 155211 149763 22208
6436 22208 82194 167219 122782 77955 4371 75617 101924 174525 265932 107198 123427 233362
6424 233362 230118 150547 107647 66856 33399 65539 187688 155966 149399 39604 121229 183988
6412 183988 126461 90064 93508 151185 143050 113047 169705 198217 218874 207534 270892 245790
6400 245790 212252 220315 219877 228235 200155 150204 191860 157875 262889 276528 225569 209148
6388 209148 260711 247027 221404 193098 187378 261648 186959 273809 336894 224807 158036 155586
6376 155586 81110 83410 82367 171810 217722 252868 274855 290598 244443 304144 317944 179577
$$ packed form
6459A89502K7917K5124l9209n1447N3805j122L892o198r8215n5986K6203J12683
6447A86949r499o3182O2737J63455n8080j15183Q8888j11247J0373n448j27555
6436B2208N9986Q5025m4437m4827p3584P1246K6307P2601R1407j58734J6229J09935
6424B33362l244p9571m2900m0791l3457L2140J22149l1722o567j09795Q1625O2759
6412A83988n7527l6397L444N7677q135l0003N6658K8512K0657j1340O3358k5102
6400B45790l3538Q063m38Q358k8080m9951M1656l3985J05014J3639n0959j6421
6388B09148N1563j3684k5623k8306n720P4270p4689Q6850O3085j12087o6771k450
6376A55586p4476K300j043Q9443M5912L5146K1987J5743m6155N9701J3800j38367
$$ plain form
6364 179577 160783 168282 179231 138897 220870 286961 218816 297019 279750 365795 407774 427329
6352 427329 444055 377762 364418 321995 422329 455116 326752 368142 338154 387356 307708
6341 307708 341610 436378 402754 329132 267252 284628 287979 320639 269295 187963 255550 204511
6329 204511 93597 268930 245092 233374 230300 202636 312836 452657 354886 345266 332164
6318 332164 343356 417551 355938 360269 315557 355902 330118 320992 374121 393902 419992 374528
6306 374528 338220 306888 429120 409043 354460 410577 406919 415824 310191 254943 305439 409103
6294 409103 380999 356698 352449 417363 352803 324524 291251 237495 256159 346997 384452 357235
6282 357235 277404 343719 367031 386585 382069 272862 247834 245865 312051 301578 380111 391492
$$ packed form
6364A79577j8794P499J0949m0334Q1973O6091o8145P8203j7269Q6045M1979J9555
6352D27329J6726o6293j3344m2423J00334L2787j28364M1390k9988M9202p9648
6341C07708L3902R4768l3624p3622o1880J7376L351L2660n1344q1332O7587n1039
6329B04511j10914J75333k3838j1718l074k7664J10200J39821r7771r620j3102
6318C32164J1192P4195o1613M331m4712M0345k5784r126N3129J9781K6090m5464
6306C74528l6308l1332J22232k0077n4583N6117l658Q905j05633n5248N0496J03664
6294D09103k8104k4301m249O4914o4560k8279l3273n3756J8664R0838L7455k7217
6282C57235p9831O6315K3312J9554m516j09207k5028j969O6186j0473P8533J1381
$$ plain form
6270 391492 370715 437698 387211 433664 435116 334773 423553 421902 381576 460060 555322 580200
6258 580200 562704 600927 642933 532612 371574 403145 580835 590352 572248 613719 612079
6247 612079 584989 617602 668732 551182 605220 549572 461187 497923 485462 575115 524943
6236 524943 456019 481968 554622 566843 566411 593047 648965 550324 474867 528448 676984 686018
6224 686018 617894 694229 703870 587196 701522 678108 637990 610079 587616 652253 721227
6213 721227 728850 847128 795585 816367 858830 815996 732201 701877 812061 851903 618093
6202 618093 573241 716742 813633 810353 681434 756374 705760 745273 770725 825218 870053
6191 870053 833051 861390 875246 856224 872391 861643 836806 826031 827731 902513 1023399 1112605
$$ packed form
6270C91492k0777O6983n0487M6453J452j00343Q8780j651m0326P8484R5262K4878
6258E80200j7496L8223M2006j10321j61038L1571J77690R517j8104M1471j640
6247F12079k7090L2613N1130j17550N4038n5648q8385L6736j2461Q9653n0172
6236E24943o8924K5949P2654J2221m32K6636N5918r8641p5457N3581J48536R034
6224F86018o8124P6335R641j16674J14326k3414m0118k7911k2463O4637O8974
6213G21227P623J18278n1543K0782M2463m2834q3795l0324J10184L9842k33810
6202F18093m4852J43501R6891l280j28919P4940n0614L9513K5452N4493M4835
6191H70053l7002K8339J3856j9022J6167j0748k4837j0775J700P4782J20886Q9206
$$ plain form
6179 1112605 1019044 955204 1046025 973060 1027905 1029455 1032499 1088510 1030727 1086608 1240638 1187929
6167 1187929 1135336 1119393 1189517 1181825 1152965 1204628 1287160 1249879 1270863 1303064 1390011 1323209
6155 1323209 1324529 1356162 1407918 1419834 1384983 1428214 1488975 1599784 1570859 1712966 1705435
6144 1705435 1707488 1677314 1548267 1656867 1653602 1641693 1732008 1785076 1764904 1856538 1853330 1812354
6132 1812354 1858510 1876180 1880592 1963536 2052870 2029428 2200685 2135589 2097010 2103059 2259007
6121 2259007 2367869 2371895 2329570 2395568 2522013 2503423 2549929 2610688 2603961 2681233 2723396
6110 2723396 2793000 2903174 2980621 3050317 3154896 3236898 3288369 3413321 3511572 3658593 3775255
6099 3775255 3851436 3928427 4085399 4192503 4229337 4369316 4468240 4591195 4844663 5133705
$$ packed form
6179A112605r3561o3840R0821p2965N4845J550L044N6011n7783N5881J54030n2709
6167A187929n2593j5943P0124p692k8860N1663Q2532l7281K0984L2201Q6947o6802
6155A323209J320L1633N1756J1916l4851M3231O0761J10809k8925J42107p531
6144A705435K053l0174j29047J08600l265j1909R0315N3068k0172R1634l208m0976
6132A812354M6156J7670M412Q2944Q9334k3442J71257o5096l8579O049J55948
6121B259007J08862M026m2325O5998J26445j8590M6506O0759o727P7272M2163
6110B723396O9604J10174P7447O9696J04579Q2002N1471J24952R8251J47021J16662
6099C775255P6181P6991J56972J07104L6834J39979R8924J22955K53468K89042
$$ plain form
6089 5133705 5523797 5800077 6043683 6419487 6838257 7377053 7951730 8693731 9759927
6080 9759927 10942351 12328693 14316133 16932154 19936903 22461488 23136152 21809643
6072 21809643 19215748 16907894 15510272 14850381 14727284 15165820 16343220 18178023 20522213
6063 20522213 22736936 23511856 21970518 19033076 16057046 13674283 11904266 10703387
6055 10703387 9861760 9199333 8721341 8367884 8015449 7626226 7367875 7315175 7181762 7096924
6045 7096924 7186369 7273915 7402071 7434720 7480537 7596759 7830822 8164348 8445980 8729700
6035 8729700 9022374 9435765 10141821 10843011 11643850 12693423 13982988 15710757 18175699
6026 18175699 21331129 25194657 28890321 31021032 30369127 27241793 23996600 21710620
$$ packed form
6089E133705L90092K76280K43606L75804M18770N38796N74677P42001J066196
6080I759927J182424J386342J987440K616021L004749K524585O74664j326509
6072B1809643k593895k307854j397622o59891j23097M38536J177400J834803K344190
6063B0522213K214723P74920j541338k937442k976030k382763j770017j200879
6055A0703387q41627o62427m77992l53457l52435l89223k58351n2700j33413q4838
6045G096924Q9445Q7546J28156L2649M5817J16222K34063L33526K81632K83720
6035H729700K92674M13391P06056P01190Q00839J049573J289565J727769K464942
6026A8175699L155430L863528L695664K130711o51905l127334l245193k285980
$$ plain form
6018 21710620 20309267 19805271 19945066 20805184 22765475 25520104 28568717 30610359 29936615
6009 29936615 26459649 22085195 18367515 15635385 13452513 11970686 10817583 9852191
6001 9852191 9159050 8437282 7956022 7548025 7237602 6969013 6784785 6616866 6527568 6328861
5991 6328861 6184881 6122045 6004030 5796197 5634007 5512231 5335590 5278425 5137460 5147330
5981 5147330 5077158 5046819 5042988 4956648 4915236 4893114 4939373 5059981 5071496 5009489 5103469
5970 5103469 5083030 5045999 5133591 5134854 5078382 5048343 4974112 4856865 4954015 4794222 4806925
5959 4806925 4827984 4824893 4818492 4871930 4932178 4972089 4960633 4998446 5024008 5148004 5255455
5948 5255455 5437283 5614152 5639250 5847850 5924019 5972829 6063547 6115587 6000969 6082445 6111408
$$ packed form
6018B1710620j401353n03996J39795Q60118J960291K754629L048613K041642o73744
6009B9936615l476966m374454l717680k732130k182872j481827j153103r65392
6001I852191o93141p21768m81260m07997l10423k68589j84228j67919q9298j98707
5991F328861j43980o2836j18015k07833j62190j21776j76641n7165j40965R870
5981E147330p0172l0339l831q6340m1412k2122M6259J20608J1515o2007R3980
5970E103469k0439l7031Q7592J263n6472l0039p4231j17247R7150j59793J2703
5959D806925K1059l091o401N3438O0248L9911j1456L7813K5562J23996J07451
5948E255455J81828J76869K5098K08600P6169M8810R0718N2040j14618Q1476K8963
$$ plain form
5937 6111408 6169426 6319422 6485218 6543001 6678304 6854262 7026507 7066161 7090073 7141849
5927 7141849 7178531 7226489 7129185 7048979 7037753 6956455 6916103 6803495 6668947 6677494 6732068
5916 6732068 6811682 6860293 6886777 7176592 7287043 7463999 7740840 8015690 8207068 8289633
5906 8289633 8479083 8664405 8948658 9254477 9482409 9657979 9993157 10440523 10758464 11097706
5896 11097706 11367989 11577361 11777554 11871830 12013426 12124407 12266761 12483786 12577468 12680380
5886 12680380 12852963 13067265 13549362 13952478 14178356 14552991 14860360 15015721 15085394 15125669
5876 15125669 15114407 14838928 14583137 14225618 13842337 13571731 13334458 13046817 12861505 12649417
5866 12649417 12532339 12539290 12523796 12604821 12765111 13057745 13197454 13237004 13323996 13411085 13574697
$$ packed form
5937F111408N8018J49996J65796N7783J35303J75958J72245L9654K3912N1776
5927G141849L6682M7958r7304q0206j1226q1298m0352j12608j34548Q547N4574
5916F732068P9614M8611K6484K89815J10451J76956K76841K74850J91378Q2565
5906H289633J89450J85322K84253L05819K27932J75570L35178M47366L17941L39242
5896A1097706K70283K09372K00193R4276J41596J10981J42354K17025R3682J02912
5886A2680380J72583K14302M82097M03116K25878L74635L07369J55361O9673M0275
5876A5125669j1262k75479k55791l57519l83281k70606k37273k87641j85312k12088
5866A2649417j17078O951j5494Q1025J60290K92634J39709L9550Q6992Q7089J63612
$$ plain form
5855 13574697 13886239 14262682 14605415 15165068 15812026 16508219 17305781 18168729 19056497
5846 19056497 20102593 21409974 22790790 24073641 25307364 26380935 26972506 26853482
5838 26853482 26141960 25193002 24263355 23648333 23309976 23173337 23121092 23080861 23052199 22935184
5828 22935184 22735914 22662639 22427454 22278587 22209480 22030398 21949796 21932770 21952148 21851341
5818 21851341 21591349 21241823 20936711 20611121 20111276 19752107 19496354 19374826 19404668 19537871
5808 19537871 19717103 19845998 19861447 19707430 19062627 17976338 16763089 15830425 15115510
5799 15115510 14621682 14182881 13856803 13550467 13295478 13143947 12918214 12711527 12501258
5790 12501258 12379531 12035333 11871914 11510456 11140149 10875050 10674468 10541468 10362548
$$ packed form
5855A3574697L11542L76443L42733N59653O46958O96193P97562Q62948Q87768
5846A9056497J046096J307381J380816J282851J233723J073571N91571j19024
5838B6853482p11522r48958r29647o15022l38357j36639n2245m0231k8662j17015
5828B2935184j99270p3275k35185j48867o9107j79082q0602j7026J9378j00807
5818B1851341k59992l49526l05112l25590m99845l59169k55753j21528K9842J33203
5808A9537871J79232J28895J5449j54017o44803j086289j213249r32664p14915
5799A5115510m93828m38801l26078l06336k54989j51531k25733k06687k10269
5790A2501258j21727l44198j63419l61458l70307k65099k00582j33000j78920
$$ plain form
5781 10362548 10334498 10457652 10563117 10697574 10720612 10773387 10792286 10849625 10756663 10899549
5771 10899549 11109436 11321824 11514080 11786254 11968378 12044063 12193812 12163949 12176788 12259733
5761 12259733 12512642 12812203 13112278 13530321 14104194 14763719 15754938 17082701 18810019
5752 18810019 21021094 23850382 27153430 30550133 32725487 32100332 29163424 25689212
5744 25689212 22771825 20952289 19578202 18565452 17815679 17282682 16931496 16650497 16336471
5735 16336471 16297500 16510753 16881533 17497186 18137045 18899366 19839933 20793506 21970531
5726 21970531 23644574 25757558 28546712 31587157 34334827 35014548 32529912 28477455
5718 28477455 24461942 21234471 18923932 17317088 16065731 15159267 14374832 13769297 13410637
$$ packed form
5781A0362548k8050J23154J05465J34457K3038N2775J8899N7339r2962J42886
5771A0899549K09887K12388J92256K72174J82124P5685J49749k9863J2839Q2945
5761A2259733K52909K99561L00075M18043N73873O59525R91219J327763J727318
5752A8810019K211075K829288L303048L396703K175354o25155k936908l474212
5744B5689212k917387j819536j374087j012750p49773n32997l51186k80999l14026
5735A6336471l8971K13253L70780O15653O39859P62321R40567R53573J177025
5726B1970531J674043K112984K789154L040445K747670O79721k484636m052457
5718B8477455m015513l227471k310539j606844j251357r06464p84435o05535l58660
$$ plain form
5709 13410637 13165332 13028574 12955383 13072920 13245170 13721384 14468626 15331412 16551099
5700 16551099 18176209 20234379 22400853 24256872 24539774 22665248 19806004 17329473
5692 17329473 15504798 14099268 13089427 12331167 11760862 11270180 11014341 10750370 10593599
5683 10593599 10605668 10487622 10542502 10696105 11001432 11506272 12136979 12854452 13730046 15192813
5673 15192813 17300738 19702597 22170887 23723343 23095743 20412448 17264928 14681976
5665 14681976 12680061 11206194 10000818 9200423 8587141 8117255 7638570 7258168 6988724
5656 6988724 6715946 6321418 6054461 5941576 5758190 5677241 5442803 5305433 5283384 5109700
5646 5109700 5066172 4918206 4812460 4866480 4831903 4669006 4615191 4583207 4550118 4694673 4818299
$$ packed form
5709A3410637k45305j36758p3191J17537J72250M76214P47242Q62786J219687
5700A6551099J625110K058170K166474J856019K82902j874526k859244k476531
5692A7329473j824675j405530j009841p58260n70305m90682k55839k63971j56771
5683A0593599J2069j18046N4880J53603L05327N04840O30707P17473Q75594J462767
5673A5192813K107925K401859K468290J552456o27600k683295l147520k582952
5665A4681976k001915j473867j205376q00395o13282m69886m78685l80402k69444
5656F988724k72778l94528k66957j12885j83386q0949k34438j37370k2049j73684
5646E109700m3528j47966j05746N4020l4577j62897n3815l1984l3089J44555J23626
$$ plain form
5635 4818299 4815543 4829931 4895493 4899805 4821284 4889193 4707905 4686348 4596644 4494332 4422097
5624 4422097 4367612 4276874 4082724 4077224 4105593 4127827 4178480 4230568 4170352 4184274 4102180
5613 4102180 4131709 4264123 4320946 4443544 4519541 4461795 4393515 4296725 4341284 4229971 4134838
5602 4134838 4060658 3982562 3878223 3883084 3776222 3785066 3824868 3810080 3818524 3842664 3948461
5591 3948461 4007921 4050604 4162272 4306002 4430251 4634516 4827491 4806890 4942990 5131032
5581 5131032 5130132 5077800 4942419 5004029 5106029 5015490 4952755 4854942 4779096 4648456 4578612
5570 4578612 4570210 4539196 4469370 4525969 4596618 4625717 4693688 4797912 4973955 5067720 5093414
5559 5093414 5108698 5124019 5057341 4992503 4880121 4817162 4853153 4853504 4728886 4579967 4380543
$$ packed form
5635D818299k756J4388O5562M312p8521O7909j81288k1557q9704j02312p2235
5624D422097n4485r0738j94150n500K8369K2234N0653N2088o0216J3922q2094
5613D102180K9529J32414N6823J22598P5997n7746o8280r6790M4559j11313r5133
5602D134838p4180p8096j04339M861j06862Q844L9802j4788Q444K4140J05797
5591C948461N9460M2683J11668J43730J24249K04265J92975k0601J36100J88042
5581E131032r00n2332j35381O1610J02000r0539o2735r7813p5846j30640o9844
5570D578612q402l1014o9826N6599P0649K9099O7971J04224J76043R3765K5694
5559E093414J5284J5321o6678o4838j12382o2959L5991L51j24618j48919j99424
$$ plain form
5548 4380543 4228560 4210285 4163569 4162129 4071088 4047296 4101564 4180502 4162283 4102448 4113802
5537 4113802 4173141 4260358 4321338 4411009 4406928 4419492 4444764 4538392 4546706 4425283 4316037
5526 4316037 4292880 4253616 4122178 4128059 4172027 4086928 4057339 4055044 4084277 4049831 4075115 4157761
5514 4157761 4064614 4035278 4227824 4393525 4399462 4525597 4787796 5058860 5395469 5648344
5504 5648344 5856801 5907608 5854481 5675914 5416237 5215492 5032932 4897336 4703267 4622319
5494 4622319 4681556 4813461 4863972 4894553 5072334 5203715 5286907 5120427 4889429 4572971
5484 4572971 4300354 3945732 3770756 3564408 3553184 3500312 3398995 3303241 3241140 3318013
5474 3318013 3288687 3122331 3178931 3214601 3225786 3242676 3132071 3122412 3069730 3169829 3156516
$$ packed form
5548D380543j51983j8275m6716j440r1041k3792N4268P8938j8219n9835J1354
5537D113802N9339Q7217O0980Q9671m081J2564K5272R3628Q314j21423j09246
5526D316037k3157l9264j31438N881M3968q5099k9589k295K9233l4446K5284Q2646
5514D157761r3147k9336J92546J65701N937J26135K62199K71064L36609K52875
5504E648344K08457N0807n3127j78567k59677k00745j82560j35596j94069q0948
5494D622319N9237J31905N0511L0581J77781J31381Q3192j66480k30998l16458
5484D572971k72617l54622j74976k06348j1224n2872j01317r5754o2101P6873
5474C318013k9326j66356N6600L5670J1185J6890j10605r659n2682J00099j3313
$$ plain form
5463 3156516 3148214 3117246 3016069 2996657 2999554 3055682 3143130 3166864 3256444 3248851 3259228 3360067
5451 3360067 3431716 3607565 3731482 3704008 3542259 3353725 3376682 3404180 3378521 3286519 3305835
5440 3305835 3349164 3417911 3447820 3525287 3665478 3643589 3596693 3599178 3574096 3450324 3363051
5429 3363051 3367623 3226316 3187235 3264672 3311899 3426602 3352649 3212647 3294289 3354580 3431805
5418 3431805 3474334 3467887 3484134 3588472 3582082 3700707 3828723 3963897 3958762 4092330 4265747
5407 4265747 4465538 4484756 4356027 4350740 4243075 4264877 4366635 4426658 4492337 4606170 4815823
5396 4815823 5017505 5129587 5408843 5695968 5936423 6133547 6155974 6222979 6348844 6479585
5386 6479585 6539075 6668858 6776419 6806331 6737454 6510365 6319543 6185318 6168882 6265664
$$ packed form
5463C156516q302l0968j01177j9412K897N6128Q7448K3734Q9580p593J0377J00839
5451C360067P1649J75849J23917k7474j61749j88534K2957K7498k5659r2002J9316
5440C305835M3329O8747K9909P7467J40191k1889m6896K485k5082j23772q7273
5429C363051M572j41307l9081P7437M7227J14703p3953j40002Q1642O0291P7225
5418C431805M2529o447J6247J04338o390J18625J28016J35174n135J33568J73417
5407D265747J99791J9218j28729n287j07665K1802J01758O0023O5679J13833K09653
5396D815823K01682J12082K79256K87125K40455J97124K2427O7005J25865J30741
5386F479585N9490J29783J07561K9912o8877k27089j90822j34225j6436R6782
$$ plain form
5376 6265664 6247985 6270787 6438220 6521288 6670584 6623804 6623013 6537267 6478931 6369759 6383646
5365 6383646 6430059 6570819 6623552 6557975 6496755 6541852 6506080 6387494 6289437 6196489 6225914
5354 6225914 6206089 6203339 6218361 6347984 6471266 6678463 6930914 7329620 7615599 7816708
5344 7816708 7944457 7912874 8086163 8340928 8327826 8134656 7848505 7680309 7588144 7517901
5334 7517901 7436462 7323889 7036113 6870323 6749872 6785329 6925967 7079386 7209123 7198321
5324 7198321 7233169 7527641 7902306 8004090 7980781 7903300 7952228 8009226 8071917 8062602 7904571
5313 7904571 7662726 7500510 7500335 7578253 7515872 7541144 7413986 7170613 6842464 6537017 6190377
5302 6190377 6038056 6031319 6043351 6110174 6125598 6251999 6318405 6380898 6269585 6053382 5748965
$$ packed form
5376F265664j7679K2802J67433Q3068J49296m6780p91q5746n8336j09172J3887
5365F383646M6413J40760N2733o5577o1220M5097l5772j18586r8057r2948K9425
5354F225914j9825k750J5022J29623J23282K07197K52451L98706K85979K01109
5344G816708J27749l1583J73289K54765j3102j93170k86151j68196r2165p0243
5334G517901q1439j12573k87776j65790j20451L5457J40638J53419J29737j0802
5324G198321L4848K94472L74665J01784k3309p7481M8928N6998O2691r315j58031
5313G904571k41845j62216j75P7918o2381K5272j27158k43373l28149l05447l46640
5302F190377j52321o737J2032O6823J5424J26401O6406O2493j11313k16203l04417
$$ plain form
5291 5748965 5552815 5511673 5499341 5539466 5681507 5624437 5541747 5493419 5448893 5513967 5650820
5280 5650820 5672902 5664893 5627774 5605758 5612928 5560224 5584089 5698609 5848641 5812998 5763888
5269 5763888 5743281 5902916 5938257 6076272 6135700 6182112 6210792 6118142 5950626 5755060 5543533
5258 5543533 5480045 5424685 5359868 5260747 5148399 5156937 5131312 5090584 5111031 5111414 5123761 5141108
5246 5141108 5223658 5200224 5206339 5367541 5398810 5572543 5597815 5589087 5672436 5605653 5604048 5592319
5234 5592319 5497893 5456915 5322203 5112107 5048533 4922961 4900276 5003641 4977336 4992852 5056443
5223 5056443 5124636 5101619 5123550 5097658 5174578 5314079 5398433 5367911 5437595 5471223 5535444
5212 5535444 5472537 5463353 5476776 5480163 5604152 5645712 5571338 5530354 5473605 5635400 5709832
$$ packed form
5291E748965j96150m1142j2332M0125J42041n7070q2690m8328m4526O5074J36853
5280E650820K2082q009l7119k2016P170n2704K3865J14520J50032l5643m9110
5269E763888k0607J59635L5341J38015N9428M6412K8680r2650j67516j95566k11527
5258E543533o3488n5360o4817r9121j12348Q538k5625m0728K0447L83J2347J7347
5246E141108Q2550k3434O115J61202L1269J73733K5272q728Q3349o6783j605j1729
5234E592319r4426m0978j34712k10096o3574j25572k2685J03365k6305J5516O3591
5223E056443O8193k3017K1931k5892P6920J39501Q4354l0522O9684L3628O4221
5212E535444o2907r184J3423L387J23989M1560p4374m0984n6749J61795P4432
$$ plain form
5201 5709832 5799790 5882478 5991462 6134681 6289735 6445761 6510479 6658391 6805225 6945519
5191 6945519 7071030 7161424 7190219 7179568 7219269 7174707 7155239 7303497 7371505 7456451 7554637
5180 7554637 7743064 7857873 8063520 8205119 8330745 8432755 8604396 8833373 9150554 9392156
5170 9392156 9616737 9868863 10259315 10657514 11223910 11845877 12386504 13083198 13887346 14783566
5160 14783566 15741539 16366476 16200997 15660719 15468933 15536338 15774514 16227847 17068043 18048969
5150 18048969 19502207 21260658 23100383 24406236 24236663 23576040 23061592 23247627 23912685
5141 23912685 24934845 25786393 26073111 26428111 27142877 28546155 30331078 31630240 33026144
5132 33026144 34408903 36035859 38040678 40223387 41303621 40110472 37416773 34623370
$$ packed form
5201E709832Q9958Q2688J08984J43219J55054J56026O4718J47912J46834J40294
5191F945519J25511R0394K8795j0651L9701m4562j9468J48258O8008Q4946R8186
5180G554637J88427J14809K05647J41599J25626J02010J71641K28977L17181K41602
5170I392156K24581K52126L90452L98199N66396O21967N40627O96694Q04148Q96220
5160A4783566R57973O24937j65479n40278j91786O7405K38176M53333Q40196R80926
5150A8048969J453238J758451J839725J305853j69573o60623n14448J86035O65058
5141B3912685J022160Q51548K86718L55000P14766J403278J784923J299162J395904
5132C3026144J382759J626956K004819K182709J080234j193149k693699k793403
$$ plain form
5124 34623370 32724726 31973423 32007677 32607455 32661203 32003950 31381051 31222099 31492666 31144674
5114 31144674 30528154 29828498 28954297 28312572 28349372 28976818 29490524 29562855 29662541 29995022
5104 29995022 30361049 30819078 30930135 29889270 27723576 25515919 23915697 22724283 21963535
5095 21963535 21496353 21227231 21115773 21173895 21395913 21679236 21602078 21119277 20695901 20623427
5085 20623427 20782305 20725698 20424182 20154433 20326845 20370899 19793909 19037411 18592918 18587801
5075 18587801 18783004 19311762 19699407 20059677 20315490 20186431 19884786 19692622 19544739
5066 19544739 19745909 20167146 21074683 22474496 24278830 26552546 29084148 31078958 31490390
5057 31490390 31206198 31231286 31359599 30465140 28714249 27311574 26801690 27073498 27966495
$$ packed form
5124C4623370j898644p51303L4254N99778N3748o57253o22899j58952K70567l47992
5114C1144674o16520o99656q74201o41725L6800O27446N13706P2331R9686L32481
5104B9995022L66027M58029J11057j040865k165694k207657j600222j191414p60748
5095B1963535m67182k69122j11458N8122K22018K83323p7158m82801m23376p2474
5085B0623427J58878n6607l01516k69749J72412M4054n76990p56498m44493n117
5075A8587801J95203N28758L87645L60270K55813j29059l01645j92164j47883
5066A9544739K01170M21237R07537J399813J804334K273716K531602J994810M11432
5057C1490390k84192K5088J28313q94459j750891j402675n09884K71808Q92997
$$ plain form
5048 27966495 28752881 28333185 27196742 26342384 26193724 26701274 27943480 29617912 31708928
5039 31708928 33483742 34389006 35785302 38185036 41402783 44416973 46154354 46918061
5031 46918061 48645801 50650365 50400459 49388267 49628335 49732660 49939540 50414606 48585227
5022 48585227 45781909 42773962 39067605 35917485 33599070 30741889 27872895 25460217
5014 25460217 23804960 22994561 22771933 23151427 24164814 25340060 26160249 26515608 25715355
5005 25715355 24502792 22899437 21330958 20453383 20035631 20036282 20304676 19775478 18597373
4996 18597373 17641358 17077624 16800836 16911550 16348372 15192446 14037653 13173919 12468722
4987 12468722 12039882 12007262 12247089 12803139 13329944 13705954 13084510 11898685 10850207
$$ packed form
5048B7966495P86386m19696j136443q54358j48660N07550J242206J674432K091016
5039C1708928J774814R05264J396296K399734L217747L014190J737381P63707
5031D6918061J727740K004564k49906j012192K40068J04325K06880M75066j829379
5022D8585227k803318l007947l706357l150120k318415k857181k868994k412678
5014B5460217j655257q10399k22628L79494J013387J175246Q20189L55359q00253
5005B5715355j212563j603355j568479q77575m17752O51K68394n29198j178105
4996A8597373r56015n63734k76788J10714n63178j155926j154793q63734p05197
4987A2468722m28840l2620K39827N56050N26805L76010o21444j185825j048478
$$ plain form
4978 10850207 10058682 9473938 8971147 8615649 8272437 7999622 7707285 7462018 7332612
4969 7332612 7105631 7084957 7064375 7073163 7028671 6935454 6928329 6798962 6756341 6753074 6778742 6577308
4957 6577308 6417309 6408503 6394067 6414579 6364496 6350614 6373907 6463484 6503530 6435563 6501198
4946 6501198 6509611 6618743 6621905 6626625 6653621 6509331 6516922 6598281 6683000 6822492 6906625 6963985
4934 6963985 6957193 7031462 7158428 7146161 7113522 7114011 7255170 7365055 7459827 7602534 7806307
4923 7806307 8132413 8545321 8891211 9393284 9942152 10392678 11180827 12208261 13568117
4914 13568117 15119571 16707623 17821728 19151186 20901500 22589664 22639921 21276698
4906 21276698 19093521 16476049 14420129 12834367 11699532 10991292 10455126 9992037 9682636
$$ packed form
4978A0850207p91525n84744n02791l55498l43212k72815k92337k45267j29406
4969G332612k26981k0674k0582Q788m4492r3217p125j29367m2621l267K5668k01434
4957F577308j59999q806j4436K0512n0083j3882K3293Q9577M0046o7967O5635
4946F501198Q413J09132L162M720K6996j44290P591Q1359Q4719J39492Q4133N7360
4934F963985o792P4269J26966j2267l2639M89J41159J09885R4772J42707K03773
4923G806307L26106M12908L45890N02073N48868M50526P88149J027434J359856
4914A3568117J551454J588052J114105J329458J750314J688164N0257j363223
4906B1276698k183177k617472k055920j585762j134835p08240n36166m63089l09401
$$ plain form
4897 9682636 9406734 9275994 9212725 9226548 9223101 9266853 9278406 9453601 9685056 9891561 10232271
4886 10232271 10679662 11379722 12295372 13242662 13851422 13675701 13543939 13516668 13839826 14691866
4876 14691866 15814993 17025433 18324694 19344293 20329590 22098344 25057930 28476977
4868 28476977 30592187 28912374 25190256 22125030 20144858 18912703 17947553 17329231
4860 17329231 17258283 17632008 18636391 20114515 22174368 24928705 27864875 28624552 26185911
4851 26185911 22771855 20287787 18891670 17880286 16900312 15698048 14425873 13514248
4843 13514248 13053702 12708254 12640153 12672250 12473498 12001479 11570533 11162492 10880843 10727571
4833 10727571 10713706 10679515 10613681 10639987 10707960 10757883 10875116 10971557 11223414 11430948 11715019
$$ packed form
4897I682636k75902j30740o3269J3823l447M3752J1553J75195K31455K06505L40710
4886A0232271M47391P00060R15650R47290O08760j75721j31762k7271L23158Q52040
4876A4691866J123127J210440J299261J019599R85297J768754K959586L419047
4868B8476977K115210j679813l722118l065226j980172j232155r65150o18322
4860A7329231p0948L73725J004383J478124K059853K754337K936170P59677k438641
4851B6185911l414056k484068j396117j011384r79974j202264j272175r11625
4843A3514248m60546l45448o8101L2097j98752m72019m30946m08041k81649j53272
4833A0727571j3865l4191o5834K6306O7973M9923J17233R6441K51857K07534K84071
$$ plain form
4822 11715019 12098962 12529723 12990256 13528778 14320483 15435295 16789138 18449691 20093870
4813 20093870 21186005 21904676 22876828 24240744 25854470 27705857 27935679 26788350 25904952
4804 25904952 25863040 26502569 26547863 25917182 24686799 23406775 22731941 22703198 23176614 24373793
4794 24373793 26087803 27985176 29439387 30526392 31713580 33389216 35584144 38393584
4786 38393584 40479024 39135431 36231534 34040902 33035510 32604948 31765621 31017185 30954864
4777 30954864 30695280 30290842 30059308 30276769 30823157 30907826 30935981 31336809 32428192 33599148
4767 33599148 34418282 35486960 36939802 37270902 36207363 35397701 35529378 36525957 38344564
4758 38344564 40893419 44600119 49884003 57366547 66851009 78648696 92807646 102208272
$$ packed form
4822A1715019L83943M30761M60533N38522P91705J114812J353843J660553J644179
4813B0093870J092135P18671R72152J363916J613726J851387K29822j147329q83398
4804B5904952m1912O39529M5294o30681j230383j280024o74834k8743M73416J197179
4794B4373793J714010J897373J454211J087005J187188J675636K194928K809440
4786C8393584K085440j343593k903897k190632j005392m30562q39327p48436o2321
4777C0954864k59584m04438k31534K17461N46388Q4669K8155M00828J091383J170956
4767C3599148Q19134J068678J452842L31100j063539q09662J31677R96579J818607
4758C8344564K548855L706700N283884P482544R484462J1797687J4158950R400626
$$ plain form
4750 102208272 103740533 98468789 85402250 70555755 58600983 50162881 44578543 40639925
4742 40639925 37828391 36043645 35008185 34732995 35396053 37038303 39228675 41650901
4734 41650901 42399661 39965023 36257888 32861600 30487763 29000709 28061464 27389473 27201214
4725 27201214 27260258 27605273 28408136 29455861 30992969 33177314 36131921 40040281 44637455
4716 44637455 50026048 54376391 56104285 56776159 55293233 50532879 44743795 39973551
4708 39973551 36648108 34456418 33034114 32384417 32369913 32765292 33784130 35242192 37383532
4699 37383532 40224018 44125040 49451912 56259723 64592131 74923808 84483417 91973532
4691 91973532 100387178 104817224 102220149 98148842 89696298 75441086 61268620 50163602
$$ packed form
4750A02208272J532261n271744j3066539j4846495j1954772q438102n584338l938618
4742D0639925k811534j784746j035460k75190O63058J642250K190372K422226
4734D1650901P48760k434638l707135l396288k373837j487054r39245o71991j88259
4725B7201214N9044L45015Q02863J047725J537108K184345K954607L908360M597174
4716D4637455N388593M350343J727894O71874j482926m760354n789084m770244
4708C9973551l325443k191690j422304o49697j4504L95379J018838J458062K141340
4699C7383532K840486L901022N326872O807811Q332408J0331677R559609P490115
4691I1973532Q413646M430046k597075m071307q452544j4255212j4172466j1105018
$$ plain form
4683 50163602 42385825 36739304 32366284 28838034 26000789 23706813 21860974 20284342
4675 20284342 18988242 17957270 17072779 16336342 15661037 15130450 14698685 14193156 13712013
4666 13712013 13235991 12848114 12313422 11957443 11664824 11392363 11118798 10892092 10797787 10767243
4656 10767243 10795705 10702417 10603917 10507748 10393252 10195525 10011872 9780880 9704869 9802465
4646 9802465 9931095 9911271 9818844 9797818 9641457 9538749 9504562 9488029 9427952 9415766 9420943
4635 9420943 9518867 9474684 9401588 9471040 9377725 9430009 9416596 9463274 9591855 9665919 9627098
4624 9627098 9650050 9620779 9733159 9849997 9676861 9509371 9363609 9136728 8944261 8908475
4614 8908475 8893524 8841598 8831328 8786417 8720631 8729266 8844096 8994714 9335078 9409941 9465657
$$ packed form
4683E0163602p777777n646521m373020l528250k837245k293976j845839j576632
4675B0284342j296100j030972q84491p36437o75305n30587m31765n05529m81143
4666A3712013m76022l87877n34692l55979k92619k72461k73565k26706r4305l0544
4656A0767243K8462r3288r8500r6169j14496j97727j83653k30992p6011R7596
4646I802465J28630j9824r2427k1026j56361j02708l4187j6533o0077j2186N177
4635I420943R7924m4183p3096O9452r3315N2284j3413M6678J28581P4064l8821
4624I627098K2952k9271J12380J16838j73136j67490j45762k26881j92467l5786
4614H908475j4951n1926j0270m4911o5786Q635J14830J50618L40364P4863N5716
$$ plain form
4603 9465657 9601830 9758239 9886446 9997380 10162637 10123395 10133739 10075798 10007258 10141460
4593 10141460 10255996 10303766 10519364 10874515 11229862 11693930 12120424 12634102 13346049 14027249
4583 14027249 14837413 15782001 17009236 18404200 20050027 21796843 23983302 26804906
4575 26804906 30429531 34405731 37714202 38613015 36581319 33251515 30318043 28371961
4567 28371961 27571337 27669481 28716211 30720469 33711312 37125678 39802768 40165888 37804567
4558 37804567 34558753 31867045 30306035 29847009 30408799 31788058 33648765 35074334
4550 35074334 34658638 32295936 29181019 26402443 24647982 23758084 23497895 23784849 24800740
4541 24800740 26334518 28140806 29326414 28837883 26498391 23421087 20695675 18868095
$$ packed form
4603I465657J36173J56409J28207J10934J65257l9242J0344n7941o8540J34202
4593A0141460J14536M7770K15598L55151L55347M64068M26494N13678P11947O81200
4583A4027249Q10164R44588J227235J394964J645827J746816K186459K821604
4575B6804906L624625L976200L308471Q98813k031696l329804k933472j946082
4567B8371961q00624R8144J046730K004258K990843L414366K677090L63120k361321
4558C7804567l245814k691708j561010m59026N61790J379259J860707J425569
4550C5074334m15696k362702l114917k778576j754461q89898k60189K86954J015891
4541B4800740J533778J806288J185608m88531k339492l077304k725412j827580
$$ plain form
4533 18868095 17413315 16101809 15050059 14106981 13363776 12850097 12556389 12283694 12231273
4524 12231273 12075600 11795067 11511945 11230402 10931233 10640231 10462332 10372823 10338038 10343218
4514 10343218 10395247 10567446 10885489 11088477 11209788 11249733 11233694 11323430 11268139 11252543
4504 11252543 11206838 11110561 11028412 10860617 10664920 10621146 10559250 10583659 10741847 10937513
4494 10937513 11151713 11496718 11812070 12313871 12833116 13283073 13959823 14859618 15900124
4485 15900124 17055656 18370945 19975046 22198582 25161765 28751085 31711945 32794358
4477 32794358 31600305 28850266 26480123 25077618 24945500 26174046 28342187 31278093
4469 31278093 34113884 33817965 30147401 26226529 23303632 21701206 20869135 20681168 21176966
$$ packed form
4533A8868095j454780j311506j051750r43078p43205n13679k93708k72695n2421
4524A2231273j55673k80533k83122k81543k99169k91002j77899q9509l4785N180
4514A0343218N2029J72199L18043K02988J21311L9945j6039Q9736n5291j5596
4504A1252543m5705r6277q2149j67795j95697m3774o1896K4409J58188J95666
4494A0937513K14200L45005L15352N01801N19245M49957O76750Q99795J040506
4485A5900124J155532J315289J604101K223536K963183L589320K960860J082413
4477C2794358j194053k750039k370143j402505j32118J228546K168141K935906
4469C1278093K835791k95919l670564l920872k922897j602426q32071j87967M95798
$$ plain form
4460 21176966 22521674 24410102 26656836 28234681 28465489 27436799 26189527 25180635
4452 25180635 24250643 23965648 24672391 26109811 27161297 27430700 26115041 22803819 19344727
4443 19344727 16764705 15040477 13826684 12964500 12421985 12040967 11778835 11491720 11098469
4434 11098469 10574646 9927736 9259477 8648701 8197833 7904402 7719755 7523193 7507161 7498154
4424 7498154 7340431 7376501 7348728 7216007 7120916 6954660 6906082 6962289 7049276 7099731 7120112
4413 7120112 7163895 7003016 6845387 6796254 6684476 6682265 6708055 6831342 7185376 7453260
4403 7453260 7583333 7555955 7445574 7324608 7145620 7087519 7013785 6975930 6977902 6973410 6992648
4392 6992648 6849401 6621298 6499219 6457507 6349334 6278178 6286473 6298822 6359596 6346966 6449991
$$ packed form
4460B1176966J344708J888428K246734J577845K30808j028690j247272j008892
4452B5180635r29992k84995P06743J437420J051486K69403j315659l311222l459092
4443A9344727k580022j724228j213793q62184n42515l81018k62132k87115l93251
4434A1098469n23823o46910o68259o10776m50868k93431j84647j96562j6032r007
4424G498154j57723L6070k7773j32721r5091j66256m8578N6207Q6987N0455K0381
4413G120112M3783j60879j57629m9133j11778k211K5790J23287L54034K67884
4403G453260J30073k7378j10381j20966j78988n8101p3734l7855J972m492J9238
4392F992648j43247k28103j22079m1712j08173p1156Q295J2349O0774j2630J03025
$$ plain form
4381 6449991 6488348 6296683 6117730 5816514 5761348 5704628 5474426 5340169 5125566 4862513
4371 4862513 4646783 4419439 4165805 4032620 3990432 3877039 3904809 3768887 3689068 3588549
4361 3588549 3552691 3471195 3355204 3337105 3358401 3273747 3174135 3264501 3456730 3454838 3418126
4350 3418126 3372444 3321944 3135417 3171055 3200152 3241752 3326017 3311408 3393698 3517524 3493797
4339 3493797 3702700 3908250 3931378 4052525 4310047 4402030 4530163 4570090 4588241 4650077
4329 4650077 4487524 4449370 4270079 4350544 4300110 4221641 4166831 4236231 4312163 4323078 4483551
4318 4483551 4643453 4649842 4720771 4767933 4786424 4750491 4809376 4916013 4989655 4968856 5052579
4307 5052579 5088027 5008776 4905911 4752888 4500866 4269924 4193895 4266429 4290745 4162489
$$ packed form
4381F449991L8357j91665j78953l01216n5166n6720k30202j34257k14603k63053
4371D862513k15730k27344k53634j33185m2188j13393K7770j35922p9819j00519
4361C588549l5858q1496j15991j8099K1296q4654r9612R0366J92229j892l6712
4350C418126m5682n0500j86527L5638K9097M1600Q4265j4609Q2290J23826k3727
4339C493797K08903K05550K3128J21147K57522R1983J28133L9927J8151O1836
4329D650077j62553l8154j79291Q0465n0434p8469n4810O9400P5932J0915J60473
4318D483551J59902O389P0929M7162J8491l5933N8885J06637P3642k0799Q3723
4307E052579L5448p9251j02865j53023k52022k30942p6029P2534K4316j28256
$$ plain form
4297 4162489 4185910 4185803 4172019 4196326 4288643 4320801 4335144 4341545 4353837 4369605 4387146 4367338
4285 4367338 4501494 4714130 4829783 4874942 5043181 5149537 5175258 5346209 5387277 5458947
4275 5458947 5419574 5474812 5530409 5418087 5373912 5416210 5383224 5444958 5526231 5581895 5658308
4264 5658308 5727433 5736977 5742980 5840326 5983583 6190355 6283215 6311352 6544801 6590210 6885850
4253 6885850 7132116 7395324 7533942 7713399 7924581 8146496 8453157 8788026 9185817 9219279
4243 9219279 9215652 9239576 9311131 9541173 9716225 9887551 10057041 10203823 10258954 10328883 10295612
4232 10295612 10249727 10317636 10459040 10555409 10837012 11073270 11224501 11431221 11714835 12018620
4222 12018620 12369434 12823182 13257915 13688510 13899597 14212618 14622607 14920840 15190631
$$ packed form
4297D162489K3421j07j3784K4307R2317L2158J4343O401J2292J5768J7541j9808
4285D367338J34156K12636J15653M5159J68239J06356K5721J70951M1068P1670
4275E458947l9373N5238N5597j12322m4175M2298l2986O1734Q1273N5664P6413
4264E658308O9125R544O003R7346J43257K06772R2860K8137K33449M5409K95640
4253F885850K46266K63208J38618J79457K11182K21915L06661L34869L97791L3462
4243I219279l627K3924P1555K30042J75052J71326J69490J46782N5131O9929l3271
4232A0295612m5885O7909J41404R6369K81603K36258J51231K06720K83614L03785
4222A2018620L50814M53748M34733M30595K11087L13021M09989K98233K69791
$$ plain form
4213 15190631 15562693 15770996 15954482 16304543 16548823 16738827 17010599 17105875 17329601 17690847
4203 17690847 18168051 18585096 19103504 19632103 20124854 20380240 20650279 20791274 21080608
4194 21080608 21442435 21915673 22303308 22968651 23706274 24593279 25592155 26725465 27948465
4185 27948465 29232071 30679287 32639412 34816116 37323483 39535210 40773503 41732345
4177 41732345 42783750 43147366 42670880 41697000 40889110 40339131 40262479 40528438 41354138
4168 41354138 42501829 44170155 46206674 48800391 51619054 55071851 58774613 63021225
4160 63021225 68008114 74131850 81763711 91222024 102555632 117017551 135959723 162617894
4152 162617894 197917969 240418123 279003518 295385151 284835909 250856228 211755843
$$ packed form
4213A5190631L72062K08303J83486L50061K44280J90004K71772R5276K23726L61246
4203A7690847M77204M17045N18408N28599M92751K55386K70039J40995K89334
4194B1080608L61827M73238L87635O65343P37623Q87005R98876J133310J223000
4185B7948465J283606J447216J960125K176704K507367K211727J238293R58842
4177D1732345J051405L63616m76486r73880q07890n49979p6652K65959Q25700
4168D1354138J147691J668326K036519K593717K818663L452797L702762M246612
4160F3021225M986889O123736P631861R458313J1333608J4461919J8942172K6658171
4152A62617894L5300075M2500154L8585395J6381633j0549242l3979681l9100385
$$ plain form
4145 211755843 178512814 152858852 133416558 119386293 110475488 105677086 103553787
4138 103553787 102580306 99736035 93693469 84799641 75219355 67087211 60303057 54968772
4130 54968772 50690094 47024003 44014508 41092973 38336139 35849813 33517509 31748219
4122 31748219 30193653 28921380 27781452 26760107 25901253 25374917 24845886 24309222 23725845
4113 23725845 22928124 22296494 21934861 21565072 21205814 20859120 20563477 19964431 19320418
4104 19320418 18523387 17791079 17260952 16944833 16437296 16138193 16030070 15654645 15296936
4095 15296936 15056751 14776888 14596898 14618717 14686628 14497286 14280319 14330030 14213482 14024664
4085 14024664 13903242 13673086 13247200 13072663 13167466 13205967 13372583 13665347 14026947 14609979
$$ packed form
4145B11755843l3243029k5653962j9442294j4030265q910805m798402k123299
4138A03553787r73481k844271o042566q893828r580286q132144o784154n334285
4130E4968772m278678l666091l009495k921535k756834k486326k332304j769290
4122C1748219j554566j272273j139928j021345q58854n26336n29031n36664n83377
4113B3725845p97721o31630l61633l69789l59258l46694k95643n99046o44013
4104A9320418p97031p32308n30127l16119n07537k99103j08123l75425l57709
4095A5296936k40185k79863j79990K1819O7911j89342k16967M9711j16548j88818
4085A4024664j21422k30156m25886j74537R4803L8501J66616K92764L61600N83032
$$ plain form
4075 14609979 15257045 16090547 17080257 18536472 20375649 22613103 25689954 29345063 33341863
4066 33341863 37546480 40713874 40009471 35475896 29721036 24871900 21233320 18526941
4058 18526941 16291303 14582676 13157933 11990429 10935748 10105457 9473932 8820591 8428823
4049 8428823 8165751 7832504 7599652 7348878 7177571 6945570 6557143 6342609 6224927 6004421
4039 6004421 5813510 5693639 5723949 5688780 5698244 5719441 5671864 5592728 5592584 5524175 5387048
4028 5387048 5407856 5424785 5387705 5440348 5385735 5383122 5279114 5230470 5123859 5014674 4968047
4017 4968047 5021613 4972272 5029486 4991577 5003201 5040895 5097519 5038269 4980998 5086214 5047173
4006 5047173 5065402 5076738 5077384 5080991 5153123 5292299 5476837 5500380 5600760 5718770 5746481
$$ packed form
4075A4609979O47066Q33502R89710J456215J839177K237454L076851L655109L996800
4066C3341863M204617L167394p04403m533575n754860m849136l638580k706379
4058A8526941k235638j708627j424743j167504j054681q30291o31525o53341l91768
4049H428823k63072l33247k32852k50774j71307k32001l88427k14534j17682k20506
4039F004421j90911j19871L0310l5169R464K1197m7577p9136j44o8409j37127
4028E387048K0808J6929l7080N2643n4613k613j04008m8644j06611j09185m6627
4017D968047N3566m9341N7214l7909J1624L7694N6624n9250n7271J05216l9041
4006E047173J8229J1336O46L607P2132J39176J84538K3543J00380J18010K7711
$$ plain form
3995 5746481 5724766 5765202 6005902 6174569 6295136 6575729 6906969 7452423 8029189 8717524
3985 8717524 9469971 10600116 11747042 13112545 14591968 15764480 15289112 13615780 12087383
3976 12087383 10924141 10014858 9401620 8865244 8558238 8485432 8235778 8164978 8127827 8163410
3966 8163410 8295769 8390379 8582360 8836761 9078738 9299222 9562139 9750632 10062717 10380461
3956 10380461 10537790 10669870 10749382 10895616 10852543 10834262 10996131 10981770 11012556 10918652
3946 10918652 10784547 10782735 10794158 10767758 10689170 10533660 10338610 10058929 9799740 9596582
3936 9596582 9271509 8981173 8777365 8382003 8115186 7926518 7591013 7196999 6964320 6849807
3926 6849807 6612328 6400651 6221628 6073658 5897410 5715129 5603015 5440536 5274898 5044976
$$ packed form
3995E746481k1715M0436K40700J68667J20567K80593L31240N45454N76766O88335
3985H717524P52447J130145J146926J365503J479423J172512m75368j673332j528397
3976A2087383j163242r09283o13238n36376l07006p2806k49654p0800l7151L5583
3966H163410J32359R4610J91981K54401K41977K20484K62917J88493L12085L17744
3956A0380461J57329J32080P9512J46234m3073j8281J61869j4361L0786r3904
3946A0918652j34105j812J1423k6400p8588j55510j95050k79681k59189k03158
3936I596582l25073k90336k03808l95362k66817j88668l35505l94014k32679j14513
3926F849807k37479k11677j79023j47970j76248j82281j12114j62479j65638k29922
$$ plain form
3916 5044976 4865046 4695220 4698187 4655976 4553248 4423644 4285373 4292837 4305543 4234436 4187784
3905 4187784 4175764 4079667 4254010 4390025 4442898 4404293 4356388 4319658 4243683 4141278 4047223
3894 4047223 4007954 4093940 4213730 4253955 4282747 4350164 4300410 4285225 4376658 4533259 4593362
3883 4593362 4555536 4656467 4761325 4873429 5086859 5231086 5329090 5399373 5637243 5826038
3873 5826038 6007396 6089780 6193827 6533598 6759111 7191845 7714597 8068736 8442983 8889948
3863 8889948 9466498 10188687 11034163 12262542 13660875 15065522 16789046 18938045 22172496
3854 22172496 26381527 30736091 35901965 40210718 38521381 32387251 26231596 21448257
3846 21448257 18139975 15876360 14292429 13182223 12435625 11926097 11173997 9987578 8957371
$$ packed form
3916E044976j79930j69826K967m2211j02728j29604j38271P464J2706p1107m6652
3905D187784j2020r6097J74343J36015N2873l8605m7905l6730p5975j02405r4055
3894D047223l9269Q5986J19790M0225K8792O7417m9754j5185R1433J56601O0103
3883D593362l7826J00931J04858J12104K13430J44227R8004P0283K37870J88795
3873E826038J81358Q2384J04047L39771K25513M32734N22752L54139L74247M46965
3863H889948N76550P22189Q45476J228379J398333J404647J723524K148999L234451
3854B2172496M209031M354564N165874M308753j689337o134130o155655m783339
3846B1448257l308282k263615j583931j110206p46598n09528p52100j186419j030207
$$ plain form
3837 8957371 8142114 7509623 6961303 6519821 6265343 5952622 5672221 5553732 5391355 5327346
3827 5327346 5361623 5425104 5425363 5601329 5846439 6108372 6419439 6462045 6099324 5607785 5173247
3816 5173247 4812690 4504305 4351090 4205870 4205567 4195722 4178266 4201533 4236519 4358535 4488252
3805 4488252 4653808 4752694 4880501 4979896 5152554 5507288 5597538 5142774 4658756 4291239
3795 4291239 4016873 3792122 3711049 3526903 3472193 3618318 3518902 3564211 3745469 3852864
3785 3852864 3834778 3817336 3909533 4000646 4134275 4273802 4377221 4232592 3842955 3496554
3775 3496554 3285578 2984015 2760259 2711424 2573166 2460296 2414059 2422171 2396577 2331402 2320081
3764 2320081 2247984 2105026 1956193 1920955 1902123 1720401 1517728 1548440 1615063 1737088
$$ packed form
3837H957371q15257o32491n48320m41482k54478l12721k80401j18489j62377o4009
3827E327346L4277O3481K59J75966K45110K61933L11067M2606l62721m91539m34538
3816E173247l60557l08385j53215j45220l03r845j7456K3267L4986J22016J29717
3805D488252J65556R8886J27807R9395J72658L54734R0250m54764m84018l67517
3795D291239k74366k24751q1073j84146n4710J46125r9416M5309J81258J07395
3785C852864j8086j7442R2197R1113J33629J39527J03419j44629l89637l46401
3775C496554k10976l01563k23756m8835j38258j12870m6237Q112k5594o5175j1321
3764B320081p2097j42958j48833l5238j8832j81722k02673L0712O6623J22025
$$ plain form
3754 1737088 1696461 1619493 1606176 1631906 1641338 1641829 1797185 1890185 1906075 1789552 1715943 1622232
3742 1622232 1585469 1366967 1333734 1275083 1196771 1154708 1061107 1133591 963342 917097 988739
3731 988739 950117 882515 922532 1007906 879057 910558 946105 899073 951667 852171 790275
3720 790275 782659 775255 816282 842166 853184 800076 826979 804576 664146 706611 722323 622164
3708 622164 639511 670662 659013 707499 810647 798970 779278 794566 910711 881310 830172
3697 830172 705491 740461 871497 871429 812158 815538 856955 774016 806783 795836 869893 906890
3685 906890 785690 778304 866711 910035 942000 934034 846083 840874 920534 884057 832398 877945
3673 877945 933313 919562 974306 976686 893915 904384 886651 887770 959382 963731 853220 962037
$$ packed form
3754A737088m0627p6968j3317K5730R432M91J55356R3000J5890j16523p3609r3711
3742A622232l6763k18502l3233n8651p8312m2063r3601P2484j70249m6245P1642
3731I88739l8622o7602M0017Q5374j28849L1501L5547m7032N2594r9496o1896
3720G90275p616p404M1027K5884J1018n3108K6903k2403j40430M2465J5712j00159
3708F22164J7347L1151j1649M8486J03148j1677j9692J5288J16145k9401n1138
3697H30172j24681L4970J31036o8n9271L380M1417q2939L2767j0947P4057L6997
3685I06890j21200p386Q8407M3324L1965p966q7951n209P9660l6477n1659M5547
3673H77945N5368j3751N4744K380q2771J0469j7733J119P1612M349j10511J08817
$$ plain form
3661 962037 1005132 1018304 1055260 1196410 1255836 1356989 1537143 1668166 1537582 1406560
3651 1406560 1284834 1161350 1060452 1009445 1043457 997855 969684 875798 844538 899734 940420
3640 940420 938529 1004560 1133258 1275333 1260733 1395316 1366406 1264664 1123244 1013026 932022
3629 932022 880980 784212 816639 894138 840221 854337 921701 895069 1054298 1111705 1222350
3618 1222350 1357151 1284196 1239032 1152607 923974 889708 938674 804694 707557 750711 836544
3607 836544 820481 778964 770220 798009 871516 986537 1059031 1118325 1130582 995914 921763
3596 921763 836755 864739 774811 613678 620025 613552 571329 564255 502882 364255 357541 456408
3584 456408 442300 396423 403327 377202 449132 441085 343505 441543 392946 352742 312219 342402
$$ packed form
3661I62037M3095J3172L6956J41150N9426J01153J80154J31023j30584j31022
3651A406560j21726j23484j00898n1007L4012m5602k8171r3886l1260N5196M0686
3640I40420j891O6031J28698J42075j4600J34583k8910j01742j41420j10218q1004
3629I32022n1042r6768L2427P7499n3917J4116O7364k6632J59229N7407J10645
3618A222350J34801p2955m5164q6425k28633l4266M8966j33980r7137M3154Q5833
3607H36544j6063m1517q744K7789P3507J15021P2494N9294J2257j34668p4151
3596I21763q5008K7984q9928j61133O347o473m2223p074o1373j38627o714R8867
3584D56408j4108m5877O904k6125P1930q047r7580R8038m8597m0204m0523L0183
$$ plain form
3572 342402 378366 416207 362696 340582 424615 505602 512814 526717 550935 531700 482301 389661
3560 389661 457062 481139 540435 601013 500694 415445 554048 497497 411522 331277 296438
3549 296438 246949 303343 302994 306072 321202 360254 381975 422463 425704 435778 348573 279004
3537 279004 312729 313099 353194 361664 322528 341099 316162 207079 260994 256575 196720 289597
3525 289597 301059 235920 218609 274072 308760 261376 224843 381076 351206 352290 296801 266948
3513 266948 230275 293922 277176 302743 344941 388535 314532 285203 416486 285963 235176
3502 235176 330458 411857 362729 226160 138317 181314 236721 241939 217066 247005 369425
3491 369425 432624 337462 298921 300744 425474 457772 320371 218668 181728 165598 274394
$$ packed form
3572C42402L5964L7841n3511k2114Q4033Q0987P212J3903K4218j9235m9399r2640
3560C89661O7401K4077N9296O0578j00319q5249J38603n6551q5975q0245l4839
3549B96438m9489N6394l49L078J5130L9052K1721M0488L241J0074q7205o9569
3537B79004L3725L70M0095Q470l9136J8571k4937j09083N3915m419n9855R2877
3525B89597J1462o5139j7311N5463L4688m7384l6533J56233k9870J084n5489k9853
3513B66948l6673O3647j6746K5567M2198M3594p4003k9329J31283j30523n0787
3502B35176R5282Q1399m9128j36569q7843M2997N5407N218k4873K9939J22420
3491C69425O3199r5162l8541J823J24730L2298j37401j01703l6940j6130J08796
$$ plain form
3480 274394 235792 213564 176800 194889 216900 324117 329131 294322 277969 298959 360770 401530
3468 401530 415360 400966 308211 365426 377714 282042 194713 274202 331230 325001 229222 337165
3456 337165 485551 318202 399360 361286 406775 447234 479995 329379 250982 251249 270615
3445 270615 361711 421442 418845 432544 516182 423473 421982 439797 412631 465121 433422 491559
3433 491559 503506 458953 425020 467211 498646 546752 643955 625302 766693 791746 748495
3422 748495 739062 714160 693213 697573 632378 615814 682676 675434 688016 821794 805049 608278
3410 608278 587377 611879 600729 573144 643273 722385 712366 721060 726052 724630 883508 1038734
3398 1038734 1042510 1021919 1013156 1154244 1256856 1400271 1511187 1620005 1672860 1676071 1637117
$$ packed form
3480B74394l8602k2228l6764J8089K2011J07217N014l4809j6353K0990O1811M0760
3468D01530J3830j4394r2755N7215J2288r5672q7329P9489N7028o229r5779J07943
3456C37165J48386j67349Q1158l8074M5489M0459L2761j50616p8397K67J9366
3445B70615R1096N9731k597J3699Q3638r2709j491J7815k7166N2490l1699N8137
3433D91559J1947m4553l3933M2191L1435M8106R7203j8653J41391K5053m3251
3422G48495r433k4902k0947M360o5195j6564O6862p242J2582J33778j6745j96771
3410F08278k0901K4502j1150k7585P0129P9112j0019Q694M992j422J58878J55226
3398A038734L776k0591q763J41088J02612J43415J10916J08818N2855L211l8954
$$ plain form
3387 1637117 1604620 1678704 1714660 1459563 1273563 1144254 994346 1009239 937787 852022 825226
3376 825226 835081 883498 866055 916634 926123 933650 961044 977809 1065582 1103577 1086913 1070322
3364 1070322 1051645 1006025 1085181 1173944 1207152 1221912 1169465 1177016 1147581 1106349 1154335 1050029
3352 1050029 1067887 1164993 1269308 1307545 1318368 1440440 1442023 1449503 1543321 1574238 1614562
3341 1614562 1655879 1714658 1776359 1820734 1985049 2295376 2567816 2805644 2975406 2844893
3331 2844893 2517971 2321567 2243134 2211440 2204640 2174726 2126436 2011679 1932939 1987693 2037636
3320 2037636 2115856 2156396 2229345 2271924 2259178 2256579 2387894 2427112 2418555 2516841 2640745
3309 2640745 2752932 2852751 3042680 3170791 3466871 3762303 4297499 4884689 5254725 5163909
$$ packed form
3387A637117l2497P4084L5956k55097j86000j29309j49908J4893p1452q5765k6796
3376H25226R855M8417j7443N0579R489P527K7394J6765Q7773L7995j6664j6591
3364A070322j8677m5620P9156Q8763L3208J4760n2447P551k9435m1232M7986j04306
3352A050029J7858R7106J04315L8237J0823J22072J583P480R3818L0917M0324
3341A614562M1317N8779O1701M4375J64315L10327K72440K37828J69762j30513
3331B844893l26922j96404p8433l1694o800k9914m8290j14757p8740N4754M9943
3320B037636P8220M0540P2949M2579j2746k599J31315L9218q557R8286J23904
3309B640745J12187R9819J89929J28111K96080K95432N35196N87190L70036r0816
$$ plain form
3299 5163909 4545948 4045795 3679361 3505092 3489883 3531290 3519866 3420644 3281092 3311565
3289 3311565 3352321 3342184 3400338 3417930 3489843 3539701 3599164 3741253 3773719 3823544 3868882
3278 3868882 3892852 4008654 4201272 4194131 4224958 4368089 4533042 4774558 5095483 5459946
3268 5459946 5636595 5487284 5331148 5245964 5175333 5101943 5092371 5132947 5196191 5278705 5425315
3257 5425315 5567081 5729354 5903798 6131582 6332119 6550924 6821175 7035492 7429301 7855460
3247 7855460 8246291 8466507 8704386 8893418 8987138 9048757 9055764 8997967 8940404 8766338 8746019
3236 8746019 8838798 8839171 8915136 8917459 8600821 8042331 7380677 6929229 6546730 6167512 5918407
3225 5918407 5721432 5681005 5580956 5368639 5267870 5185558 5094228 4890120 4715174 4689837
$$ packed form
3299E163909o17961n00153l66434j74269j5209M1407j1424r9222j39552L0473
3289C311565M0756j0137N8154J7592P1913M9858N9463J42089L2466M9825M5338
3278C868882K3970J15802J92618p141L0827J43131J64953K41516L20925L64463
3268E459946J76649j49311j56136q5184p0631p3390r572M0576O3244Q2514J46610
3257E425315J41766J62273J74444K27784K00537K18805K70251K14317L93809M26159
3247G855460L90831K20216K37879J89032R3720O1619P007n7797n7563j74066k0319
3236H746019R2779L73P5965K323l16638n58490o61654m51448l82499l79218k49105
3225E918407j96975m0427j00049k12317j00769q2312r1330k04108j74946k5337
$$ plain form
3215 4689837 4776512 4892173 4861678 4777375 4674243 4594732 4597285 4656402 4774786 4984235 5214025
3204 5214025 5439806 5861053 6306484 6731482 6405407 5678943 5083578 4715326 4486343 4325265
3194 4325265 4212472 4213207 4370177 4432327 4651704 4942916 5111899 5124647 5393852 5855001
3184 5855001 6564095 7355760 8240784 8407956 7521669 6397532 5580867 5038112 4735632
3175 4735632 4461489 4292119 4265858 4319919 4394837 4356948 4404922 4242946 3937829 3671058
3165 3671058 3422739 3367984 3518030 3423923 3409587 3648129 3834526 4124916 4721001 5267133
3155 5267133 5741921 6311086 6197038 5478371 4656083 4056492 3667003 3218183 2770200 2507758
3145 2507758 2315039 2107434 1999132 1822979 1798886 1804623 1583839 1525686 1425512 1319582
$$ packed form
3215D689837Q6675J15661l0495q4303j03132p9511K553N9117J18384K09449K29790
3204E214025K25781M21247M45431M24998l26075p26464n95365l68252k28983j61078
3194D325265j12793P35J56970O2150K19377K91212J68983J2748K69205M61149
3184E855001P09094P91665Q85024J67172q86287j124137q16665n42755l02480
3175D735632k74143j69370k6261N4061P4918l7889M7974j61976l05117k66771
3165C671058k48319n4755J50046r4107j4336K38542J86397K90390N96085N46132
3155E267133M74788N69165j14048p18667q22288n99591l89489m48820m47983k62442
3145B507758j92719k07605j08302j76153k4093N737k20784n8153j00174j05930
$$ plain form
3135 1319582 1317720 1350504 1300914 1277433 1250641 1226344 1136982 1048460 977116 927316 890593 985165
3123 985165 986957 878605 868225 817784 811741 722488 699921 699196 734928 676305 639434 632230
3111 632230 610642 578249 681809 637216 585542 514613 478363 553912 604160 532564 522034
3100 522034 492000 481987 432569 451364 516780 416460 391907 573808 591409 475552 421038
3089 421038 389282 467607 497107 422910 412563 432756 431218 426202 432103 375975 312486 274980
3077 274980 409924 424551 428872 397257 295379 364226 304597 415051 323983 357919 407888
3066 407888 401198 357343 297653 362878 330113 231892 278800 229096 270060 313449 262345 195500
3054 195500 190661 242339 236268 359597 313728 309522 328173 275147 338379 391568 209110 223615
$$ packed form
3135A319582j862L2784m9590k3481k6792k4297q9362q8522p1344m9800l6723R4572
3123I85165J792j08352j0380n0441o043q9253k2567p25L5732n8623l6871p204
3111F32230k1588l2393J03560m4593n1674p0929l6250P5549N0248p1596j0530
3100E22034l0034j0013m9418J8795O5416j00320k4553J81901J7601j15857n4514
3089D21038l1756P8325K9500p4197j0347K0193j538n016N901n6128o3489l7506
3077B74980J34944J4627M321l1615j01878O8847n9629J10454r1068L3936M9969
3066D07888o690m3855n9690O5225l2765r8221M6908m9704M0964M3389n1104o6845
3054A95500m839N1678o071J23329m5869m206J8651n3026O3232N3189j82458J4505
$$ plain form
3042 223615 300773 248079 258796 190086 299939 303373 314465 358072 259080 343811 341619 218249
3030 218249 174701 283354 371135 356490 359754 313451 282922 317039 388763 301190 221123 166486
3018 166486 242384 265830 461192 448113 389596 373936 303590 300710 285224 267399 221132 256958
3006 256958 276079 256162 282342 286353 309212 333968 457499 355640 289384 342860 460532
2995 460532 558943 511910 491627 548223 522262 431548 595709 562016 466709 525633 417194
2984 417194 435457 543103 401522 491128 463860 403456 459270 527875 591745 695309 536767
2973 536767 576807 625427 701327 841267 695177 555211 577166 613113 604617 696281 720989
2962 720989 611102 703220 679590 699017 770670 832510 877981 817377 839574 836482 809060 950121
$$ packed form
3042B23615P7158n2694J0717o8710J09853L434J1092M3607r8992Q4731k192j23370
3030B18249m3548J08653Q7781j4645L264m6303l0529L4117P1724q7573q0067n4637
3018A66486P5898K3446J95362j3079n8517j5660p0346k880j5486j7825m6267L5826
3006B56958J9121j9917K6180M011K2859K4756J23531j01859o6256N3476J17672
2995D60532R8411m7033k0283N6596k5961r0714J64161l3693r5307N8924j08439
2984D17194J8263J07646j41581Q9606k7268o0404N5814O8605O3870J03564j58542
2973E36767M0040M8620P5900J39940j46090j39966K1955L5947q496R1664K4708
2962G20989j09887R2118k3630J9427P1653O1840M5471o0604K2197l092k7422J41061
$$ plain form
2950 950121 967458 874807 927530 1028042 978499 1008526 1052932 1076510 1140969 1252067 1237910
2939 1237910 1317023 1429389 1367738 1421691 1488921 1633409 1689962 1758216 1832932 2016783 2200759
2928 2200759 2311158 2422647 2572773 2614690 2786373 2947727 2944640 2863812 2862465 2885403 2799177
2917 2799177 2811016 2791258 2670460 2603558 2732501 2715190 2741022 2786147 2761282 2776776 2886957
2906 2886957 2763597 2832824 3052999 3235024 3358915 3483791 3701629 3891186 4322633 4913867
2896 4913867 5427040 5705568 5770132 5507645 4951009 4388674 4005429 3587565 3411974 3085148
2886 3085148 2942034 2817737 2640173 2514675 2475240 2492407 2370237 2198851 2111023 2140102
2876 2140102 2131406 2134345 2138736 2250517 2236830 2192082 2193979 2230376 2378567 2460156 2487115 2483689
$$ packed form
2950I50121J7337r2651N2723J00512m9543L0027M4406K3578O4459J11098j4157
2939A237910P9113J12366o1651N3953O7230J44488N6553O8254P4716J83851J83976
2928B200759J10399J11489J50126M1917J71683J61354l087q0828j347K2938q6226
2917B799177J1839j9758j20798o6902J28943j7311K5832M5125k4865J5494J10181
2906B886957j23360O9227K20175J82025J23891J24876K17838J89557M31447N91234
2896D913867N13173K78528O4564k62487n56636n62335l83245m17864j75591l26826
2886C085148j43114j24297j77564j25498l9435J7167j22170j71386q7828K9079
2876B140102q696K939M391J11781j3687m4748J897L6397J48191Q1589K6959l426
$$ plain form
2864 2483689 2517046 2457811 2340548 2249500 2023177 1846240 1753952 1606699 1423369 1352471
2854 1352471 1308504 1206336 1200204 1114622 1017439 1029876 1072652 923265 920746 885411 778732
2843 778732 746917 688941 680018 735487 711961 690116 678866 715462 717559 497616 488046 585951
2831 585951 506535 512114 443347 297842 337357 411378 429993 355362 372580 362175 336551 311636
2819 311636 242073 297828 369406 224393 211405 380170 402267 385407 359680 363958 283558
2808 283558 172611 136792 72252 96071 142611 179746 172555 136121 107337 162237 219953 160453
2796 160453 75836 50631 32836 -29033 35314 192457 207453 162249 176615 156321 97703
2785 97703 197558 240164 228355 146327 57714 16186 84678 138388 13220 1758 153035
$$ packed form
2864B483689L3357n9235j17263r1048k26323j76937r2288j47253j83330p0898
2854A352471m3967j02168o132q5582r7183J2437M2776j49387k519l5335j06679
2843G78732l1815n7976q923N5469k3526k1845j1250L6596K097k19943r570R7905
2831E85951p9416N579o8767j45505L9515P4021J8615p4631J7218j0405k5624k4915
2819C11636o9563N5755P1578j45013j2988J68765K2097j6860k5727M278q0400
2808B83558j10947l5819o4540K3819M6540L7135p191l6434k8784N4900N7716n9500
2796A60453q4617k5205j7795o1869O4347J57143J4996m5204J4366k0294n8618
2785I7703R9855M2606j1809q2028q8613m1528O8492N3710j25168j1462J51277
$$ plain form
2774 153035 182959 156300 81636 91291 148920 111316 280277 173917 98996 76908 72894 16634
2762 16634 9780 42414 83665 59978 27061 -87980 -62516 39924 -7511 70336 9200 58830
2750 58830 12260 74254 37579 7473 11260 43605 24073 22642 20784 56173 25223 -59519
2738 -59519 -35054 18887 -24186 690 -26778 -18551 62104 -49476 7463 86643 -1139 12439
2726 12439 73537 63566 -39521 -97326 -67746 -88281 -46732 85073 73904 80028 97793 136749
2714 136749 37023 19626 -44573 4595 70872 18341 86970 86324 61095 39507 55576 -4303
2702 -4303 70917 35028 24182 13377 -87140 -80979 75755 77106 15566 -141781 -103098 -44950
2690 -44950 -35245 -16554 -74862 -74341 -78227 -20258 -84861 -21336 30129 98869 125622 -16770
$$ packed form
2774A53035K9924k6659p4664R655N7629l7604J68961j06360p4921k2088m014n6260
2762A6634o854L2634M1251k3687l2917j15041K5464J02440m7435P7847o1136M9630
2750E8830m6570O1994l6675l0106L787L2345j9532j431j858L5389l0950q4742
2738e9519K4465N3941m3073K4876k7468Q227Q0655j11580N6939P9180q7782J3578
2726A2439O1098r971j03087n7805K9580k0535M1549J31805j1169O124J7765L8956
2714A36749r9726j7397o4199M9168O6277n2531O8629o46k5229k1588J6069n9879
2702d303P5220l5889j0846j0805j00517O161J56734J351o1540j57347L8683N8148
2690d4950R705J8691n8308N21l886N7969o4603O3525N1465O8740K6753j42392
$$ plain form
2678 -16770 37678 -19157 -61702 -84365 68499 82312 -33359 -94349 -97833 15191 61367
2667 61367 -14984 -31456 -63503 -99265 -107089 -91740 -82693 -139032 -127598 -87599 -85752 -31803
2655 -31803 -77264 -118776 -79697 -29618 -55336 24983 -11533 -126857 7128 12286 5684 10334
2643 10334 34963 -35666 6220 -1511 -30827 25839 38387 19574 -7934 5557 113308 70020
2631 70020 31473 74705 19320 8115 25349 24659 -38270 -74912 -82404 18687 29622 -14437
2619 -14437 64154 57316 -8916 21436 100424 20540 -57943 -55039 -18399 -59581 5203 -32933
2607 -32933 -21869 16195 -17141 31027 -11020 -5668 -82883 -70462 6497 11381 -49809 50143
2595 50143 17956 -46831 -32035 62937 -17485 -65009 18135 43522 -38830 -33915 -84250 -26464
$$ packed form
2678a6770N4448n6835m2545k2663J52864J3813j15671o0990l484J13024M6176
2667F1367p6351j6472l2047l5762p824J5349R047n6339J1434L9999J847N3949
2655c1803m5461m1512L9079N0079k5718Q0319l6516j15324J33985N158o602M650
2643A0334K4629p0629M1886p731k9316N6666J2548j8813k7508J3491J07751m3288
2631G0020l8547M3232n5385j1205J7234o90o2929l6642p492J01091J0935m4059
2619a4437P8591o838o6232L0352P8988p9884p8483K904L6640m1182O4784l8136
2607c2933J1064L8064l3336M8168m2047N352p7215J2421P6959M884o1190R9952
2595E0143l2187o4787J4796R4972q0422m7524Q3144K5387q2352M915n0335N7786
$$ plain form
2583 -26464 94538 50496 43273 42111 3507 -4529 -4601 -74640 2196 -68945 -23443 -33843 -29695
2570 -29695 43270 49832 28306 57593 -86551 -123150 -95030 18049 79047 38030 -113862
2559 -113862 -163641 -57689 29230 139289 58838 78171 5923 -132435 -63574 22012 47501
2548 47501 76884 128643 149224 24010 -30940 71843 92649 13356 -20861 16795 10309 104949
2536 104949 85338 70645 100568 90270 -10427 48948 26165 -101857 -57577 -111017 -21991
2525 -21991 63224 26264 21442 -3417 12413 4520 9186 41433 -11821 -8079 -71017 -91139 -72425
2512 -72425 -102920 -77458 -89740 18349 -27515 -141506 -73539 -3236 -71396 -87967 -37938
2501 -37938 -122332 -19067 -46156 -31152 6551 -40452 -67901 -86461 -112582 -70795 -17680 -46986
$$ packed form
2583b6464J21002m4042p223j162l8604q036p2p0039P6836p1141M5502j0400M148
2570b9695P2965O562k1526K9287j44144l6599K8120J13079O0998m1017j51892
2559a13862m9779J05952Q6919J10059q0451J9333p2248j38358O8861Q5586K5489
2548D7501K9383N1759K0581j25214n4950J02783K0806p9293l4217L7656o486R4640
2536A04949j9611j4693K9923j0298j00697N9375k2783j28022M4280n3440Q9026
2525b1991Q5215l6960m822k4859J5830p893M666L2247n3254L742o2938k0122J8714
2512g2425l0495K5462j2282J08089m5864j13991O7967P0303o8160j6571N0029
2501c7938q4394J03265k7089J5004L7703m7003k7449j8560k6121M1787N3115k9306
$$ plain form
2489 -46986 -73306 -11804 30368 -923 -82282 -68287 14322 -87992 -75141 -16897 -37570 -83728
2477 -83728 13785 -19863 -95452 -44644 -28632 70439 6137 -60092 -76064 -50850 -92596 -12797
2465 -12797 29876 750 -59210 -6146 25585 9952 -32908 -9064 -3831 -8181 25272 28149
2453 28149 10667 -34036 -38809 -88790 -40720 15988 -21636 7581 -16959 -68198 5739 -98264
2441 -98264 -161053 -121045 -90673 29108 13977 -80245 -33952 -82382 -86391 -77610 -107168 -95666
2429 -95666 -31393 1427 -39979 -90857 -93775 -39871 28337 1175 55757 73412 75316 72951
2417 72951 78767 -57482 -129877 9205 95924 73975 -55090 60751 47977 -31906 24840
2406 24840 -8478 -56931 -135603 -58085 -73265 -23156 -69167 -94940 -60134 34064 128386 -12023
$$ packed form
2489d6986k6320O1502M2172l1291q1359J3995Q2609j02314J2851N8244k0673m6158
2477h3728R7513l3648p5589N0808J6012R9071o4302o6229j5972K5214m1746P9799
2465a2797M2673k9126n9960N3064L1731j5633m2860K3844N233m350L3453K877
2453B8149j7482m4703m773m9981M8070N6708l7624K9217k4540n1239P3937j04003
2441i8264o2789M0008L0372J19781j5131r4222M6293m8430m009Q781k9558J1502
2429i5666O4273L2820m1406n0878k918N3904O8208k7162N4582J7655J904k365
2417G2951N816j36249p2395J39082Q6719k1949j29065J15841j2774p9883N6746
2406B4840l3318m8453p8672P7518j5180N0109m6011k5773L4806R4198R4322j40409
$$ plain form
2394 -12023 39062 218804 179227 115128 119639 148068 138828 5726 -46166 -83233 -88498 -54047
2382 -54047 -339 72220 -1441 -12154 86037 51289 113629 56163 47789 65227 42490 55461
2370 55461 72133 80455 47678 19669 93636 184115 127159 139408 172049 95422 149329 206098
2358 206098 206687 186403 87688 -39176 72048 85568 22709 -24759 3536 132339 81812
2347 81812 42276 -13014 -36996 8727 66856 15816 -70164 -12095 13172 59190 139212 74771
2335 74771 5346 28063 7968 -94689 -72393 136678 101827 31822 5549 18613 -2289
2324 -2289 66494 83456 37849 73195 58337 13908 -25336 45068 74412 46702 112296 83687
2312 83687 6392 52899 1257 -45741 -37264 60519 26621 33715 47265 -57928 -121664 -80165
$$ packed form
2394a2023N1085J79742l9577o4099M511K8429r240j33102n1892l7067n265L4451
2382e4047N3708P2559p3661j0713R8191l4748O2340n7466q374J7438k2737J2971
2370E5461J6672Q322l2777k8009P3967R0479n6956J2249L2641p6627N3907N6769
2358B06098N89k0284r8715j26864J11224J3520o2859m7468K8295J28803n0527
2347H1812l9536n5290k3982M5723N8129n1040q5980N8069K5267M6018Q0022o4441
2335G4771o9425K2717k0095j02657K2296K09071l4851p0005k6273J3064k0902
2324b289O8783J6962m5607L5346j4858m4429l9244P0404K9344k7710O5594k8609
2312H3687p7295M6507n1642m6998Q477R7783l3898P094J3550j05193o3736M1499
$$ plain form
2300 -80165 -13534 94763 149648 59701 24476 18514 40075 159664 58070 111277 121504
2289 121504 123956 54314 61272 12725 -44289 6265 33331 73845 29036 24087 39480 95165
2277 95165 -6142 14377 43064 -49064 8773 58030 66602 -54924 -79479 -107700 -63960 36765
2265 36765 45837 4366 10671 -65446 -72777 19950 36367 3515 -5556 76327 130217 42696 27998
2252 27998 149730 142331 183835 112388 87199 123593 92345 197641 230992 102521 91269
2241 91269 188714 154138 90265 152270 135497 163290 210409 146976 161376 171725 167240 177333
2229 177333 170761 178677 72962 116108 263576 180810 107557 140736 149723 226701 110668 132676
2217 132676 151816 242245 268028 230084 182391 293999 244224 249874 202426 153466 195187 252149
$$ packed form
2300h0165O6631J08297N4885q9947l5225n962K1561J19589j01594N3207J0227
2289A21504K452o9642O958m8547n7014N0554K7066M0514m4809m949J5393N5685
2277I5165j01307K0519K8687r2128N7837M9257Q572j21526k4555k8221M3740J00725
2265C6765R072m1471O305p6117p331R2727J6417l2852r071Q1883N3890q7521j4698
2252B7998J21732p399M1504p1447k5189L6394l1248J05296L3351j28471j1252
2241I1269R7445l4576o3873O2005j6773K7793M7119o3433J4400J0349m485J0093
2229A77333o572P916j05715M3146J47468q2766p3253L3179Q987P6978j16033K2008
2217A32676J9140R0429K5783l7944m7693J11608m9775N650m7448m8960M1721N6962
$$ plain form
2205 252149 193499 110659 190125 258600 292355 355535 371875 284842 306571 351169 273523 255732
2193 255732 315806 298059 215300 184377 271007 305682 361078 373249 379467 378702 361963 340550
2181 340550 316050 508513 574559 473028 481309 525348 628686 572889 668306 600918 549722
2170 549722 543765 509349 538680 685301 712293 738589 735427 719541 732539 771129 735977 737572
2158 737572 826516 741994 817927 899877 917760 949552 1006828 976309 979685 952535 979381 948610
2146 948610 1076143 1137038 1142698 1186357 1218097 1318479 1266048 1170713 1125869 1405437 1558637
2135 1558637 1553678 1575822 1598790 1634826 1654167 1795503 1969833 2049554 2164472 2252414 2291410
2124 2291410 2397420 2513335 2614000 2730165 2857347 2961447 3059685 3244387 3396759 3496203
$$ packed form
2205B52149n8650q2840P9466O8475L3755O3180J6340q7033K1729M4598p7646j7791
2193B55732O0074j7747q2759l0923Q6630L4675N5396J2171O218p65j6739k1413
2181C40550k4500J92463O6046j01531Q281M4039J03338n5797R5417o7388n1196
2170E49722n957l4416K9331J46621K6992K6296l162j5886J2998L8590l5152J595
2158G37572Q8944q4522P5933Q1950J7883L1792N7276l0519L376k7150K6846l0771
2146I48610J27533O0895N660M3659L1740J00382n2431r5335m4844K79568J53200
2135A558637m959K2144K2968L6036J9341J41336J74330P9721J14918Q7942L8996
2124B291410J06010J15915J00665J16165J27182J04100R8238J84702J52372R9444
$$ plain form
2114 3496203 3732296 4002229 4288454 4753149 5322654 5725910 5904791 6209206 6515360 7042381
2104 7042381 7656493 8530001 9797743 11337483 13028363 15554575 19318907 25392539 32756870
2095 32756870 39543721 39395542 31710986 23913630 18368722 14781359 12100922 10017723
2087 10017723 8425574 7492560 6570028 5853011 5355852 5075457 4848986 4632894 4355160
2078 4355160 3981297 3633394 3292686 2958409 2745008 2626938 2526585 2300400 2169535 2110409
2068 2110409 1974929 1807774 1614411 1609679 1585097 1510608 1438028 1391087 1310404 1256275 1226972
2057 1226972 1136366 1147682 1113086 1027816 933567 894525 910308 868954 834666 912134 761931
2046 761931 678182 658162 676517 672116 650523 632723 617567 660232 604105 518147 510724 539678
$$ packed form
2114C496203K36093K69933K86225M64695N69505M03256J78881L04415L06154N27021
2104G042381O14112Q73508J267742J539740J690880K526212L764332O073632P364331
2095C2756870O786851j48179p684556p797356n544908l587363k680437k083199
2087A0017723j592149r33014r22532p17017m97159k80395k26471k16092k77734
2078D355160l73863l47903l40708l34277k13401j18070j00353k26185j30865n9126
2068B110409j35480j67155j93363m732k4582p4489p2580m6941q0683n4129k9303
2057A226972r0606J1316l4596q5270r4249l9042J5783m1354l4288P7468j50203
2046G61931q3749k0020J8355m401k1593j7800j5156M2665n6127q5958p423K8954
$$ plain form
2034 539678 441168 361718 434329 460956 472474 503560 572946 545717 422166 460614 433552
2023 433552 443492 356672 301439 342277 346111 326754 259505 336493 304885 225275 211958 390412
2011 390412 349548 305518 200404 167175 235921 301544 345104 304043 288611 171465 159510
2000 159510 116712 166811 104705 89080 104438 36675 42591 63679 141898 149726 60079 55043
1988 55043 136209 93176 35850 -57374 31793 184815 144800 83578 56304 51994 125348 182262
1976 182262 103222 105506 86913 156747 96990 26625 1650 73557 44883 26469 47568 90293
1964 90293 104246 190151 110962 20570 46172 48951 33382 9652 -2697 32913 118803 62827
1952 62827 -49485 -62104 -22891 3734 86879 61696 -6655 1586 97080 24247 41897 62363
$$ packed form
2034E39678r8510p9450P2611K6627J1518L1086O9386k7229j23551L8448k7062
2023D33552R940q6820n5233M0838L834j9357o7249P6988l1608p9610j3317J78454
2011C90412m0864m4030j05114l3229O8746O5623M3560m1061j5432j17146j1955
2000A59510m2798N0099o2106j5625J5358o7763N916K1088P8219P828q9647n036
1988E5043Q1166m3033n7326r3224Q9167J53022m0015o1222k7274m310P3354N6914
1976A82262p9040K284j8593O9834n9757p0365k4975P1907k8674j8414K1099M2725
1964I0293J3953Q5905p9189r0392K5602K779j5569k3730j2349L5610Q5890n5976
1952F2827j12312j2619L9213K6625Q3145k5183o8351Q241R5494p2833J7650K0466
$$ plain form
1940 62363 55453 76102 14462 30508 129906 123074 87956 63669 89095 76381 95844 181435
1928 181435 47648 61000 -34221 -27689 7571 -22279 94504 18470 103089 153440 44832
1917 44832 10215 27087 -33596 -119752 -87714 -41850 1961 -51791 -44265 95440 25722 44489
1905 44489 14424 20496 87640 -1851 -13658 27619 18212 -56140 35529 80742 6484 51806
1893 51806 144636 120088 160954 34039 43809 102904 24987 45493 105226 38846 81717 86036
1881 86036 -19430 5256 -9425 134092 115912 64340 21483 -72114 16152 12013 75054 136682
1869 136682 23038 -75802 -110076 -69282 -75519 -32320 19843 3014 595 -73250 -55716 21631
1857 21631 -16513 46062 68147 -5894 34496 120346 48685 -32403 -55854 -29886 68565 120879
$$ packed form
1940F2363o910K0649o1640J6046R9398o832l5118k4287K5426j2714J9463Q5591
1928A81435j33787J3352r5221O532L5260k9850J16783p6034Q4619N0351j08608
1917D4832l4617J6872o0683q6156L2038M5864M3811n3752P526J39705o9718J8767
1905D4489l0065O072O7144q9491j1807M1277r407p4352R1669M5213p4258M5322
1893E1806R2830k4548M0866j26915R770N9095p7917K0506N9733o6380M2871M319
1881H6036j05466K4686j4681J43517j8180n1572m2857r3597Q8266m139O3041O1628
1869A36682j13644r8840l4274M0794o237M3199N2163j6829k419p3845J7534P7347
1857B1631l8144O2575K2085p4041M0390Q5850p1661q1088k3451K5968R8451N2314
$$ plain form
1845 120879 86116 -84035 -13228 65867 -4152 35722 -29564 30835 -40312 -32361 103486
1834 103486 43774 50302 69297 50101 144226 165115 203175 176045 178543 145360 214071 222189
1822 222189 132694 19660 46535 41740 42659 103142 2328 -91133 -90226 -73706 -131109 -34660
1810 -34660 -11629 -77381 -70955 19817 70576 17877 77865 65758 408 -72254 -71802 22779
1798 22779 -22804 71061 49678 70560 92156 37570 29082 -11820 -20523 -3070 -64353 12425
1786 12425 -44527 -91188 -74883 -109630 -36384 37999 -85640 -91425 -18978 -3911 -11047 -1028
1774 -1028 -40616 -65893 235 53660 48718 -26816 20320 104807 21799 -42118 -82881 -30325
1762 -30325 -25110 -37376 -18268 6996 -5694 -13358 269 -58000 -26664 -29778 -56005 -154367
$$ packed form
1845A20879l4763j70151P0807P9095p0019L9874o5286O0399p1147P951J35847
1834A03486n9712O528J8995j9196R4125K0889L8060k7130K498l3183O8711Q118
1822B22189q9495j13034K6875m795R19O0483j00814r3461R07J6520n7403R6449
1810c4660K3031o5752O426R0772N0759n2699N9988j2107o5350p2662M52R4581
1798B2779m5583R3865k1383K0882K1596n4586q488m0902q703J7453o1283P6778
1786A2425n6952m6661J6305l4747P3246P4383j23639n785P2447J5067p136J0019
1774a028l9588k5277O6128N3425m942p5534M7136Q4487q3008o3917m0763N2556
1762c0325N215j2266J9108K5264j2690p664J3627n8269L1336l114k6227r8362
$$ plain form
1750 -154367 -82699 -79739 -56813 -9666 48593 -5538 77241 77332 -1526 -19860 -56299 2217
1738 2217 -28108 -10085 -56747 -113078 -99221 37964 83230 -7838 49470 43054 60568 58388
1726 58388 24685 -7729 7822 -30110 7125 5414 -36632 -45044 -72202 -25477 -12572 -62316
1714 -62316 -69872 3148 -4820 88160 68897 9980 -23394 -16854 -102272 -160007 -59911 -56277
1702 -56277 -56452 -51225 -86946 22886 101267 106061 72428 31396 45563 4713 25667 -6789
1690 -6789 -35396 678 -66837 -64699 -67152 -89260 -68388 -23098 50459 18353 42411 28597
1678 28597 -77960 -13940 -25841 -94814 -135088 -127281 -90912 -67983 -77949 -56825 26152 30760
1666 30760 37401 502 50718 9412 -14679 -89586 -93891 -15708 -82010 -38672 -42149 -45513 17482
$$ packed form
1750a54367P1668K960K2926M7147N8259n4131Q2779R1p8858j8334l6439N8516
1738B217l0325J8023m6662n6331J3857J37185M5266r1068N7308o416J7514k180
1726E8388l3703l2414J5551l7932L7235j711m2046q412k7158M6725J2905m9744
1714f2316p556P3020p968R2980j9263n8917l3374O540q5418n7735J00096L634
1702e6277j75N227l5721J09832P8381M794l3633m1032J4167m0850K0954l2456
1690f789k8607L6074o7515K138k453k2108K0872M5290P3557l2106K4058j3814
1678B8597j06557O4020j1901o8973m0274P807L6369K2929r966K1124Q2977M608
1666C0760O641l6899N0216m1306k4091p4907m305P8183o6302M3338l477l364O2995
$$ plain form
1653 17482 -12810 -43536 -52849 -100908 -12927 -54099 -131964 -96109 -85174 -110863 -116133 -97641
1641 -97641 17050 -17520 -56349 -66827 -24318 -83969 -37478 19433 -100841 29589 -19217
1630 -19217 -74054 -100492 -56046 10639 40434 55308 -52706 60717 56087 65988 112866 107605
1618 107605 72610 49831 55700 -6362 7852 -55199 -16622 12786 -12321 27754 -3733 -65891
1606 -65891 -69318 -86044 6461 -10200 -37915 -93316 -82567 -102443 92699 87752 -25570 65277
1594 65277 -15975 -55173 -83754 75652 34797 36721 64241 -26742 -11545 73597 82250 -16766
1582 -16766 -33389 -27011 -64832 -91854 -121976 -105531 -15638 -42256 -164474 -152899 -85942 -98855
1570 -98855 -134149 -148516 -131847 -126682 -55096 77873 30796 -98613 -86688 21339 -16108
$$ packed form
1653A7482l0292l0726r313m8059Q7981m1172p7865L5855J0935k5689n270J8492
1641i7641J14691l4570l8829j0478M2509n9651M6491N6911j20274J30430m8806
1630a9217n4837k6438M4446O6685K9795J4874j08014J13423m630R901M6878n261
1618A07605l4995k2779N869o2062J4214o3051L8577K9408k5107M0075l1487o2158
1606f5891l427j6726R2505j6661k7715n5401J0749j9876J95142m947j13322R0847
1594F5277q1252l9198k8581J59406m0855J924K7520r0983J5197Q5142Q653r9016
1582a6766j6623O378l7821k7022l0122J6445Q9893k6618j22218J1575O6957j2913
1570i8855l5294j4367J6669N165P1586J32969m7077j29409J1925J08027l7447
$$ plain form
1559 -16108 -96066 -67963 -37575 6906 821 -6198 -29905 -12904 -38294 -22495 28050 -10053
1547 -10053 63194 -6118 -47173 -28604 -50444 -44798 -135055 -163856 -164632 -18273 20526 -38683
1535 -38683 -64975 30267 9563 -30880 -56604 12520 77590 19176 -70699 -103733 -68481 -44158
1523 -44158 -77307 -25470 -63176 -93092 -82140 -65425 30919 -9891 -115554 -114906 -11812 -25106
1511 -25106 30980 17562 -51769 -1507 36965 -159 46821 61278 2027 -57306 -85369 -44475
1499 -44475 50652 75509 86460 31401 6159 67812 35865 -48709 -142630 -62656 -36106 -43710
1487 -43710 -15746 -92153 -26139 51832 91683 63096 -20085 -77792 -57981 -76199 -126077 -121469
1475 -121469 10352 15642 -51427 32761 48442 -111886 -101072 -89965 -38224 -2604 19907
$$ packed form
1559a6108p9958K8103L0388M4481o085p019k3707J7001k5390J5799N0545l8103
1547a0053P3247o9312m1055J8569k1840N646r0257k8801p76J46359L8799n9209
1535c8683k6292R5242k0704m0443k5724O9124O5070n8414q9875l3034L5252K4323
1523d4158l3149N1837l7706k9916J0952J6715R6344m0810j05663O48J03094j3294
1511b5106N6086j3418o9331N0262L8472l7124M6980J4457n9251n9333k8063M0894
1499d4475R5127K4857J0951n5059k5242O1653l1947q4574r3921P9974K6550p604
1487d3710K7964p6407O6014P7971L9851k8587q3181n7707J9811j8218m9878M608
1475a21469J31821N290o7069Q4188J5681j60328J0814J1107N1741L5620K2511
$$ plain form
1464 19907 -51248 -60290 -15762 -90635 -85988 -53461 -73473 -62793 -48867 -89287 -55466 -2008
1452 -2008 -104024 -89224 -48374 20720 57263 -36880 15241 -13873 -38930 -79746 -57918 -81039
1440 -81039 -56931 -64461 -115240 -110618 -104788 -21788 -6564 8373 31527 32950 18448 15824 -41972
1427 -41972 50137 13881 -43197 -30417 12137 7182 14044 37185 -59005 -16390 24410 -24928
1415 -24928 6014 -487 -14415 6015 -24980 92922 73178 -74143 -159701 -78766 77535
1404 77535 72677 -37622 -8279 19236 106929 47385 11768 1717 -18602 -47135 -79780 -21355
1392 -21355 -30110 -32299 49521 90019 23536 -62713 -83922 -97046 -75949 27443 -51610 -57338
1380 -57338 -90223 -102701 -88279 -163695 -112286 -57612 16678 43251 -22848 -53346 -13162 -44693
$$ packed form
1464A9907p1155r042M4528p4873M647L2527k0012J0680J3926m0420L3821N3458
1452b008j02016J4800M0850O9094L6543r4143N2121k9114k5057m0816K1828k3121
1440h1039K4108p530n0779M622N830Q3000J5224J4937K3154J423j4502k624n7796
1427d1972R2109l6256n7078J2780M2554m955O862K3141r6190M2615M0800m9338
1415b4928L0942o501j3928K0430l0995J17902j9744j47321q5558Q0935J56301
1404G7535m858j10299K9343K7515Q7693n9544l5617j0051k0319k8533l2645N8425
1392b1355q755k189Q1820M0498o6483q6249k1209j3124K1097J03392p9053n728
1380e7338l2885j2478J4422p5416N1409N4674P4290K6573o6099l0498M0184l1531
$$ plain form
1368 -44693 -73263 -65325 -14229 27457 65780 -35547 37549 59915 -12687 -30408 -97729 34953
1356 34953 84332 74920 90968 -8338 -12783 -84299 -50106 3082 -16762 -28435 -58098 -110503
1344 -110503 -147292 -45442 -15490 44253 101228 659 23933 52895 27372 35962 -11317
1333 -11317 -87993 -19346 33209 15801 -5751 -102776 -111320 -70491 -50884 -68104 -124288 -140356
1321 -140356 -61740 -50066 -29665 36126 -11185 -109842 -197069 -108535 19784 71897 109308
1310 109308 87955 -36731 -35033 32731 63196 83269 39196 -31936 20651 83916 81950 21770
1298 21770 -98102 -76647 -29501 80955 15506 -41886 -90434 -77646 -49716 -80897 -110856
1287 -110856 8400 45007 -33785 -55654 -32520 -18516 42461 13202 -9666 17207 42409
$$ packed form
1368d4693k8570P938N1096M1686L8323j01327P3096K2366p2602j7721o7321J32682
1356C4953M9379r412J6048r9306m445p1516L4193N3188j9844j1673k9663n2405
1344a10503l6789J01850K9952N9743N6975j00569K3274K8962k5523Q590m7279
1333a1317p6676O8647N2555j7408k1552r7025q544M0829J9607j7220n6184j6068
1321a40356P8616J1674K0401O5791m7311r8657q7227Q8534J28319N2113L7411
1310A09308k1353j24686J698O7764L0465K0073m4073p1132N2587O3265j966o0180
1298B1770j19872K1455M7146J10456o5449n7392m8548J2788K7930l1181k9959
1287a10856J19256L6607p8792k1869K3134J4004O0977k9259k2868K6873K5202
$$ plain form
1276 42409 -28404 -43464 10176 -14321 48412 129150 111991 67216 -2580 15706 -12199 27964
1264 27964 3141 18672 124350 -1136 -82156 -83596 -109846 -149714 -92148 -84131 -114754 -81725
1252 -81725 -160536 -152747 51770 15946 -78746 -103494 -147422 -114135 -42077 65514 124966 72626
1240 72626 43502 36870 15342 -14585 33823 96796 23016 7258 36573 -17013 -55778 -122209
1228 -122209 -106006 -1791 40955 -1192 -45996 -18237 -40703 -48977 12205 29520 14905 75712
1216 75712 56550 134999 -2099 77192 124274 2851 34366 52898 97571 20220 -32233
1205 -32233 40410 17145 -41455 -26100 66076 62095 61629 74163 31259 -27066 -162216 -109654
1193 -109654 41183 -12493 -50043 -33224 9738 65963 2002 99095 130051 125577 63706 74114
$$ packed form
1276D2409p0813j5060N3640k4497O2733Q0738j7159m4775o9796J8286k7905M0163
1264B7964k4823J5531J05678j25486q1020j440k6250l9868N7566Q017l0623L3029
1252h1725p8811P789K04517l5824r4692k4748m3928L3287P2058J07591N9452n2340
1240G2626k9124o632k1528k9927M8408O2973p3780j5758K9315n3586l8765o6431
1228a22209J6203J04215M2746m2147m4804K7759k2466q274O1182J7315j4615O0807
1216G5712j9162P8449j37098P9291M7082j21423L1515J8532M4673p7351n2453
1205c2233P2643k3265n8600J5355R2176l981m66J2534m2904n8325j35150N2562
1193a09654J50837n3676l7550J6819M2962N6225o3961R7093L0956m474o1871J0408
$$ plain form
1181 74114 -26960 -5276 -58811 -19464 -90419 -83235 -26688 -23342 -6445 -200 10238 -16451
1169 -16451 10896 25004 14518 48613 52349 122924 -10783 28196 42310 -55221 -127948 -96386
1157 -96386 -25742 11618 56305 -9212 -25673 -4540 -28622 27802 4914 -116788 -52468 20930
1145 20930 -58544 -46916 -12520 3969 872 58998 37660 -118765 -61624 -82402 -156909 -121577
1133 -121577 -113168 -217461 -161866 -147871 -115605 -160186 -42501 -27984 21035 -50905 -15319
1122 -15319 14552 -41012 -36931 29811 107799 113608 58730 62 -5229 1861 96158 4161 112718
1109 112718 148636 90203 27478 53961 102927 -35144 -186775 -170508 -120998 -69072 -99448
1098 -99448 -111952 18755 83133 41959 9005 72233 -12722 109241 -21696 -21355 94707
$$ packed form
1181G4114j01074K1684n3535L9347p0955P184N6547L346J6897O245J0438k6689
1169a6451K7347J4108j0486L4095L736P0575j33707L8979J4114r7531p2727L1562
1157i6386P0644L7360M4687o5517j6461K1133k4082N6424k2888j21702O4320P3398
1145B0930p9474J1628L4396J6489l097N8126k1338j56425N7141k0778p4507L5332
1133a21577Q409j04293N5595J3995L2266m4581J17685J4517M9019p1940L5586
1122a5319K9871n5564M081O6742P7988N809n4878n8668n291P090R4297r1997J08557
1109A12718L5918n8433o2725K6483M8966j38071j51631J6267M9510N1926l0376
1098i9448j2504J30707O4378m1174l2954O3228q4955J21963j30937L41J16062
$$ plain form
1087 94707 69408 -842 -61549 -70040 19691 83583 42249 -247 -67219 -70328 -103938 -103667 -43136
1074 -43136 -15445 -28535 -19756 -29580 -49049 67817 -48695 -67926 -37554 -119525 -43337 422
1062 422 -35120 -30897 -18710 -18156 -60975 -35824 -10407 -41938 -60230 -46111 -55372 26816 141011
1049 141011 68370 -4481 -58799 -4635 20230 17429 16307 33661 107097 30984 -74255 -66972
1037 -66972 -72626 41958 -8195 20048 -119545 -130334 31275 60465 94819 123858 112385
1026 112385 31104 16837 73541 26502 -51891 -56469 -128333 -51674 -56591 -161172 -67942 93203
1014 93203 70806 33618 19712 26797 -2543 -1796 43210 21793 227 -81906 -32215 -29020 -3485
1001 -3485 -23716 51082 82888 90737 24599 -40948 -43358 -60336 -66819 34203 62511 -76231
$$ packed form
1087I4707k5299p0250o0707q491Q9731O3892m1334m2496o6972l109l3610K71O0531
1074d3136K7691j3090Q779r824j9469J16866j16512j9231L0372q1971P6188M3759
1062D22l5542M223J2187N54m2819K5151K5417l1531j8292J4119r261Q2188J14195
1049A41011p2641p2851n4318N4164K4865k801j122J7354P3436p6113j05239P283
1037f6972n654J14584n0153K8243j39593j0789J61609K9190L4354K9039j1473
1026A12385q1281j4267N6704m7039p8393m578p1864P6659m917j04581R3230J61145
1014I3203k2397l7188j3906P085k9340P47M5006k1417k1566q2133M9691L195K5535
1001c485k0231P4798L1806P849o6138o5547k410j6978o483J01022K8308j38742
$$ plain form
989 -76231 -3486 -878 67762 58496 -16378 38646 -20189 -21029 4624 4166 29898 14872 -63171
976 -63171 -66435 -4372 12638 56360 35094 23898 -37217 -34125 -73688 -131058 -23398 52865
964 52865 33022 20537 -11564 -15543 -80610 -133051 -85068 -15129 54691 119688 3281 -76941
952 -76941 18331 67682 -77969 -56232 -52645 -78414 -82113 -71265 952 -30799 47605 61708
940 61708 106854 91637 94028 -59502 -85908 -16646 5516 -74206 -53880 -47133 -95624 -31166
928 -31166 9977 -101537 -92215 -69258 -45352 -45065 -78553 -40371 -23242 -94444 -110934 13584
916 13584 78559 -48872 -9498 -63820 -75761 33026 27590 58001 -2319 -56283 -52020 -90002
904 -90002 -174719 -148379 -178880 -58155 -69902 16837 -554 -61877 -141699 -89300 44267 147244
$$ packed form
989g6231P2745K608O8640r266p4874N5024n8835q40K5653m58K5732j5026p8043
976f3171l264O2063J7010M3722k1266j1196o1115L092l9563n7370J07660P6263
964E2865j9843j2485l2101l979o5067n2441M7983O9939O9820O4997j16407q0222
952g6941R5272M9351j45651K1737L587k5769l699J0848P2217l1751P8404J4103
940F1708M5146j5217K391j53530k6406O9262K2162p9722K0326O747m8491O4458
928c1166M1143j11514R322K2957K3906K87l3488L8182J7129p1202j6490J24518
916A3584O4975j27431L9374n4322j1941J08787n436L0411o0320n3964M263l7982
904i0002q4717K6340l0501J20725j1747Q6739j7391o1323p9822N2399J33567J02977
$$ plain form
892 147244 42065 1261 8632 2011 -25230 61442 126340 31856 30681 -23483 -34923 -63671
$$ packed form
892A47244j05179m0804P371o621k7241Q6672O4898r4484j175n4164j1440k8748
$$ [...]
##END NTUPLES=NMR SPECTRUM
##END=
