##TITLE=1H_TG-2340-XV
 CDCl3
 8 sc, 
 28.9.2023
##JCAMPDX= 6.0         $$ Bruker NMR JCAMP-DX V2.0
##DATA TYPE= NMR SPECTRUM
##DATA CLASS= NTUPLES
##ORIGIN= UXNMR, Bruker Analytische Messtechnik GmbH
##OWNER= root
$$ XWIN-NMR		Version 3.5
$$ Thu Sep 28 14:13:55 2023 Russian Standard Time (UT+4h)  she@DPX200
##.OBSERVE FREQUENCY= 200.13135
##.OBSERVE NUCLEUS= ^1H
##.ACQUISITION MODE= SIMULTANEOUS
##.ACQUISITION SCHEME= undefined
##.AVERAGES= 8
##.DIGITISER RES= 18
##SPECTROMETER/DATA SYSTEM= spect
##.PULSE SEQUENCE= zg30
##.SOLVENT NAME= CDCl3
##.SHIFT REFERENCE= (INTERNAL, CDCl3, 0, 15.7425)
##AUDIT TRAIL= $$ (NUMBER, WHEN, WHO, WHERE, WHAT)
$$ ##TITLE= Audit trail, XWIN-NMR		Version 3.5
$$ ##JCAMPDX= 5.01
$$ ##ORIGIN= Bruker BioSpin GmbH
$$ ##OWNER= she
$$ F:/spectra/data/she/nmr/H-F/1/pdata/1/auditp.txt
$$ ##AUDIT TRAIL=  $$ (NUMBER, WHEN, WHO, WHERE, WHAT)
(   1,<2023-09-28 14:12:26.59 +0400>,<she>,<DPX200>,
      <created by zg, POWCHK disabled, PULCHK disabled
       configuration hash MD5:
       00 E9 B6 7A A2 85 ED C7 34 08 36 98 17 FE 4E 26
       data hash MD5: 16K
       43 6D 12 8D 10 D2 CD 36 DC 66 FE 97 B3 FA EA DE>)
(   2,<2023-09-28 14:12:33.90 +0400>,<she>,<DPX200>,
      <Start of raw data processing
       efp BC_mod = 2 LB = 0.24 FT_mod = 6 PKNL = 1 PHC0 = -21871.82 PHC1 = 11.05271 SI = 16K 
       data hash MD5: 16K
       0A 67 A2 F0 FA 19 11 44 A9 04 B3 87 E9 21 02 01>)
(   3,<2023-09-28 14:12:53.37 +0400>,<she>,<DPX200>,
      <pk PHC0 = 3.238227 PHC1 = -1.6 
       data hash MD5: 16K
       82 9C EB 7E EB C8 59 7F 18 A1 CB 65 53 E8 F5 A0>)
(   4,<2023-09-28 14:12:57.51 +0400>,<she>,<DPX200>,
      <abs ABSG = 5 
       data hash MD5: 16K
       F3 61 C7 DB F2 14 B0 01 D7 23 7E C3 CB 99 AE 62>)
$$ ##END=
$$ 
$$ hash MD5
$$ 28 9A 49 7D BD 3E 4B ED 33 9E E2 77 66 85 95 82
##$RELAX= 
##$RELAX= 
##$RELAX= 
##$RELAX= 
##$RELAX= 
##$RELAX= 
$$ Bruker specific parameters
$$ --------------------------
##$DU= <F:/spectra>
##$EXPNO= 1
##$NAME= <H-F>
##$PROCNO= 1
##$TYPE= <nmr>
##$USER= <she>
##$AMP= (0..31)
100 100 100 100 100 100 100 100 100 100 100 100 100 100 100 100 100 100 
100 100 100 100 100 100 100 100 100 100 100 100 100 100 
##$AQSEQ= 0
##$AQ_mod= 1
##$AUNM= <au_zg>
##$AUTOPOS= <>
##$BF1= 200.13
##$BF2= 200.13
##$BF3= 200.13
##$BF4= 200.13
##$BF5= 200.13
##$BF6= 200.13
##$BF7= 200.13
##$BF8= 200.13
##$BYTORDA= 1
##$CFDGTYP= 0
##$CFRGTYP= 5
##$CHEMSTR= <none>
##$CNST= (0..31)
1 1 145 1 1 1 1 1 1 1 1 1 1 1 1 1 1 1 1 1 1 1 1 1 1 1 1 1 1 1 1 1 
##$CPDPRG= <>
##$CPDPRG1= <>
##$CPDPRG2= <>
##$CPDPRG3= <>
##$CPDPRG4= <mlev>
##$CPDPRG5= <mlev>
##$CPDPRG6= <mlev>
##$CPDPRG7= <mlev>
##$CPDPRG8= <mlev>
##$CPDPRGB= <>
##$CPDPRGT= <>
##$D= (0..31)
0 1.2 0 0 0 0 0 0 0 0.06 0 0.03 0 0 0 0 0.0002 0 0 0 0 0 0 0 0 0 0 0 0 
0 0 0 
##$DATE= 1695895945
##$DBL= (0..7)
120 120 120 120 120 120 120 120 
##$DBP= (0..7)
150 150 150 150 150 150 150 150 
##$DBP07= 0
##$DBPNAM0= <>
##$DBPNAM1= <>
##$DBPNAM2= <>
##$DBPNAM3= <>
##$DBPNAM4= <>
$$ [...]
##$SUBNAM3= <"">
##$SUBNAM4= <"">
##$SUBNAM5= <"">
##$SUBNAM6= <"">
##$SUBNAM7= <"">
##$SUBNAM8= <"">
##$SUBNAM9= <"">
##$SW= 18.05172834244
##$SWIBOX= (0..15)
0 0 2 0 0 0 0 0 0 0 0 0 0 0 0 0 
##$SW_h= 3612.71676300578
##$TD= 16384
##$TD0= 1
##$TE= 0
##$TE2= 300
##$TE3= 300
##$TEG= 300
##$TL= (0..7)
0 120 120 120 120 120 120 120 
##$TP= (0..7)
150 150 150 150 150 150 150 150 
##$TP07= 0
##$TPNAME0= <>
##$TPNAME1= <>
##$TPNAME2= <>
##$TPNAME3= <>
##$TPNAME4= <>
##$TPNAME5= <>
##$TPNAME6= <>
##$TPNAME7= <>
##$TPOAL= (0..7)
0.5 0.5 0.5 0.5 0.5 0.5 0.5 0.5 
##$TPOFFS= (0..7)
0 0 0 0 0 0 0 0 
##$TUNHIN= 0
##$TUNHOUT= 0
##$TUNXOUT= 0
##$USERA1= <user>
##$USERA2= <user>
##$USERA3= <user>
##$USERA4= <user>
##$USERA5= <user>
##$V9= 5
##$VALIST= <valist>
##$VCLIST= <CCCCCCCCCCCCCCC>
##$VD= 0
##$VDLIST= <DDDDDDDDDDDDDDD>
##$VPLIST= <PPPPPPPPPPPPPPP>
##$VTLIST= <TTTTTTTTTTTTTTT>
##$WBST= 1024
##$WBSW= 4
##$XGAIN= (0..3)
0 0 0 0 
##$XL= 0
##$YL= 0
##$YMAX_a= 153463
##$YMIN_a= -110627
##$ZGOPTNS= <>
##$ZL1= 120
##$ZL2= 120
##$ZL3= 120
##$ZL4= 120
##$ABSF1= 15.74359
##$ABSF2= -2.308259
##$ABSG= 5
##$ABSL= 3
##$ALPHA= 0
##$AQORDER= 0
##$ASSFAC= 0
##$ASSFACI= 0
##$ASSFACX= 0
##$ASSWID= 0
##$AUNMP= <proc_1d>
##$AZFE= 0.1
##$AZFW= 0.1
##$BCFW= 0
##$BC_mod= 2
##$BYTORDP= 0
##$COROFFS= 0
##$CY= -3
##$DATMOD= 1
##$DC= 0
##$DFILT= <>
##$DTYPP= 0
##$F1P= 0
##$F2P= 0
##$FCOR= 1
##$FTSIZE= 16384
##$FT_mod= 6
##$GAMMA= 0
##$GB= 0
##$INTBC= 1
##$INTSCL= 3.70164e-10
##$ISEN= 128
##$LB= 0.24
##$LEV0= 0
##$LPBIN= 0
##$MAXI= 10000
##$MC2= 0
##$MEAN= 0
##$ME_mod= 0
##$MI= 1.114404
##$NCOEF= 0
##$NC_proc= -7
##$NLEV= 6
##$NOISF1= 3.799351
##$NOISF2= 2.8
##$NSP= 0
##$NTH_PI= 0
##$NZP= 0
##$OFFSET= 15.74248
##$PC= 1
##$PHC0= -21868.58
##$PHC1= 9.452709
##$PH_mod= 1
##$PKNL= yes
##$PPARMOD= 0
##$PSCAL= 0
##$PSIGN= 0
##$REVERSE= no
##$SF= 200.130005816264
##$SI= 16384
##$SIGF1= 3
##$SIGF2= 2
##$SINO= 5.538805
##$SIOLD= 16384
##$SREGLST= <1H.CDCl3>
##$SSB= 0
##$STSI= 16384
##$STSR= 0
##$SW_p= 3612.71676300578
##$SYMM= 0
##$S_DEV= 0
##$TDeff= 16384
##$TDoff= 0
##$TI= <>
##$TILT= no
##$TM1= 0
##$TM2= 0
##$TOPLEV= 0
##$USERP1= <user>
##$USERP2= <user>
##$USERP3= <user>
##$USERP4= <user>
##$USERP5= <user>
##$WDW= 1
##$XDIM= 16384
##$YMAX_p= 347599605
##$YMIN_p= -300428
$$ End of Bruker specific parameters
$$ ---------------------------------
##NTUPLES= NMR SPECTRUM
##VAR_NAME=  FREQUENCY,     SPECTRUM/REAL,   SPECTRUM/IMAG
##SYMBOL=    X,             R,               I
##VAR_TYPE=  INDEPENDENT,   DEPENDENT,       DEPENDENT
##VAR_FORM=  AFFN,          ASDF,            ASDF
##VAR_DIM=   16384,         16384,           16384
##UNITS=     HZ,            ARBITRARY UNITS, ARBITRARY UNITS
##FACTOR=    0.220516191357247, 1,           1
##FIRST=     3150.54266960159, 0,            0
##LAST=      -462.17409340419, 0,            0
##MIN=       -462.17409340419, -300428,      0
##MAX=       3150.54266960159, 347599605,    0
$$ Real data points
##PAGE= N=1
##DATA TABLE= (X++(R..R)), XYDATA
$$ [...]
9283 3735112 3732629 3844228 3968183 3990048 4116604 4299460 4476254 4638947 4880547 5075923
9273 5075923 5012587 5047184 5050586 5150098 5328031 5430764 5332103 5114596 4883631 4675785 4542222
9262 4542222 4394603 4382034 4356345 4385245 4414853 4410533 4370421 4400153 4388250 4464671 4467151 4436172
9250 4436172 4461980 4556238 4598186 4609898 4583204 4651005 4697901 4775015 4895358 4933115 5009525
9239 5009525 5080719 5196040 5242238 5414361 5595482 5762680 5826707 5780633 5668791 5583990
9229 5583990 5486337 5291700 4868551 4480886 4238470 4061237 3972359 3882471 3808524 3731277
9219 3731277 3800637 3825038 3666902 3626788 3524125 3553020 3515301 3450249 3413786 3401130 3368886
9208 3368886 3299143 3344116 3365972 3308698 3336404 3307971 3314421 3344469 3387558 3340295 3305451 3362614
9196 3362614 3394762 3388064 3397715 3405368 3375023 3343895 3250518 3320218 3365834 3322404 3308356 3323919
9184 3323919 3422274 3444115 3499888 3502866 3543581 3618915 3646744 3716989 3766431 3764819 3757362 3829990
9172 3829990 3899479 3912579 3885223 3978792 3994055 4001841 4031978 4058965 4045237 4055864 4030986 4071916
9160 4071916 4183041 4306065 4376945 4449674 4464523 4520934 4595269 4629755 4679498 4726036 4790719
9149 4790719 4853691 4942191 4965587 5071063 5177942 5261239 5265708 5348919 5436074 5486452 5515090
9138 5515090 5558491 5701013 5779301 5854750 5969190 6045828 6127972 6216789 6331553 6489808 6575033
9127 6575033 6683450 6753656 6789861 6996679 7170005 7258339 7374555 7545438 7754203 7896193
9117 7896193 8058162 8229250 8419590 8628935 8903323 9130494 9393477 9678281 9915490 10250333
9107 10250333 10620030 11021521 11469724 11803901 12298285 12828821 13331464 13885651 14427031
9098 14427031 14943703 15408505 15787751 16146282 16540626 17027128 17591936 17965375 18081977
9089 18081977 18170479 18217549 18333504 18583329 19044969 19624274 20403722 21281049 22235352 23359038
9079 23359038 24629256 26175467 28127491 30434290 33054611 35914075 38787619 42136580
9071 42136580 46051433 50283073 53933878 55460889 55187236 55862882 58465991 62376267
9063 62376267 66086162 66455750 62822119 57163515 51259096 46642982 43771340 42096099
9055 42096099 41025408 40337896 39593726 37898363 35591718 33553621 32379262 31726727 31588638
9046 31588638 31893515 32465397 33354020 34591155 36357556 38641286 41379034 44698473 48534689
9037 48534689 52168651 55109143 58082067 60770815 62970378 65815183 69736570 75104765
9029 75104765 79403833 80213462 79930699 79888813 78751844 76161478 70594307 62599533 55356958
9020 55356958 50199482 46136310 43179099 41660369 41138632 41285906 41134234 39805139 37193556
9011 37193556 33892829 30899174 28793692 27534051 26841333 26440625 26222688 25878671 25449698
9002 25449698 24932770 24193974 23635946 23382988 23564925 24020421 24499244 24545588 24172245 23728103
8992 23728103 23655680 24006945 24737998 25569470 26396489 27090238 27617661 27948669 28374275 29172264
8982 29172264 30476528 31887296 32217828 31897507 31665378 31078503 30079462 28288949 25715502
8973 25715502 23190539 21371494 20263545 19569815 19139457 18844053 18712205 18746439 18989693
8964 18989693 19314209 19518580 19286574 18706654 18164541 17624004 16838384 15789407 14448508
8955 14448508 12916263 11646742 10755861 10124827 9640365 9310059 9014196 8726166 8595938
8946 8595938 8482942 8263894 7984998 7806472 7564471 7444774 7316352 7218856 7131023 7013234
8936 7013234 6968962 6987978 6834638 6685744 6645322 6622271 6534143 6540221 6523948 6527612 6473356
8925 6473356 6534810 6565671 6577331 6556421 6617729 6602186 6662939 6682437 6654704 6700538 6746247
8914 6746247 6836836 6899253 6908418 6982187 7083201 7159253 7218785 7363597 7426594 7451711 7621779
8903 7621779 7806429 7873653 7978172 8146646 8244210 8319737 8472604 8569419 8711720 8833154
8893 8833154 8966933 9199106 9325263 9538423 9724430 9871642 10040666 10220218 10371535 10646202
8883 10646202 10859201 11162193 11419143 11623122 11800718 12191179 12517270 12759531 13057599
8874 13057599 13417026 13741435 14108039 14485229 14949418 15416745 15895928 16382578 16850386
8865 16850386 17421186 17994901 18544285 19106229 19754014 20654173 21753210 23126136 24746304
8856 24746304 26531825 28476537 30267665 31938961 33969561 36471395 39454118 42635492
8848 42635492 44938806 46453512 47829106 48644255 47557692 44300663 40653412 38233312
8840 38233312 37117785 37019156 37537983 38387496 39173958 39299209 38927579 38753481 39005413
8831 39005413 39622360 40520935 41606881 42851584 44158052 45884200 47711623 49335491
8823 49335491 50478874 51188737 52346906 54559157 57878223 62176303 66821049 71951620
8815 71951620 77640509 82130345 85154511 86605658 85139394 80698345 74812735 69761816
8807 69761816 66757813 65257080 64645047 63039201 59329592 55343115 52363885 50590741
8799 50590741 49740452 49448436 49656598 50518445 51549874 52436488 52829755 52734088 52018535
8790 52018535 50824011 49649387 48906209 49164377 50173802 51529279 52713470 53457122 53059963
8781 53059963 52448307 52930497 54720044 57379563 59618219 61428821 61705083 59610843 56030598
8772 56030598 51299493 46357225 42396070 39364114 36904979 35215940 34227958 33722284
8764 33722284 33459478 32841342 31839609 30890292 30287642 30176953 30285952 30369066 30073277
8755 30073277 29260112 28024820 26492081 24837054 23202623 21983082 21125763 20363248 19715336
8746 19715336 19080843 18620491 18303803 18032794 17798481 17682075 17662364 17695660 17843187 18016380
8736 18016380 18258377 18288875 18104565 17718335 17111879 16457517 15839311 15328202 14917271 14666547
8726 14666547 14536708 14463633 14374100 14217749 14044272 13951938 13914077 13895936 13937553 14011097 14098988
8715 14098988 14231704 14540117 14924584 15337404 15924910 16532503 17175704 18110206 19108214
8706 19108214 20342657 21963063 24034296 26608918 30020011 34366499 39695115 44034726
8698 44034726 43712441 40820260 38987822 39013640 40040929 41394194 40896753 38435730 36241375
8689 36241375 35141476 34632341 34232395 32985892 31060792 29698158 28799944 27902879 26792510
8680 26792510 25793512 25230906 25043528 25039930 25043160 24845674 24618995 24618546 25096915 25955882 27081791
8669 27081791 28233185 28743770 28756568 29144945 30559212 32976867 36142798 39812721 42881947
8660 42881947 44310440 43869797 41781125 37958323 34017172 31445391 30272582 30328938 30894730
8651 30894730 31304419 31232934 30329808 28376836 26231903 24501774 23330376 22672717 22140409
8642 22140409 21618176 20711077 19817159 18764239 17732616 16982161 16497746 16406764 16715519
8633 16715519 17183891 17611333 17773113 17636644 17787483 18243858 18844999 19234545 18590629
8624 18590629 17516693 16942207 16688123 16536913 16282281 15563925 14862157 14414375 13978386
8615 13978386 13610994 13288500 13031253 12827677 12452843 11900705 11242774 10395112 9470787
8606 9470787 8579648 7878286 7375629 6972908 6664624 6247256 5776160 5477174 5153616 4889807
8596 4889807 4789551 4604112 4527322 4345316 4279171 4250332 4175926 4127440 4136889 4164547 4193018
8585 4193018 4173368 4151923 4178224 4103857 3930216 3892798 3837265 4039248 4125543 3742696 3484028
8574 3484028 3219579 3077298 2911473 2784825 2568347 2407849 2318477 2250200 2095186 2007509
8564 2007509 1998368 1987627 1886664 1798228 1810732 1761785 1777263 1729032 1732064 1758963 1741977 1702723
8552 1702723 1685294 1707449 1618974 1562558 1501357 1577891 1536217 1470079 1430770 1337502 1342438 1382420
8540 1382420 1339104 1224276 1148555 1172100 1093783 1002081 943217 972095 906487 915060 889517
8529 889517 871394 924032 888284 805533 783273 797633 746347 689816 645220 633796 699010 699712
8517 699712 677097 640115 587267 571730 529796 537622 563300 605889 568894 502108 474415 493317
8505 493317 450754 451530 422412 417446 477761 510020 485247 499847 537526 504455 448978 466721
8493 466721 508253 509117 485962 457606 429315 451298 407277 365881 373991 384851 453829 477281
8481 477281 513875 615240 548886 484729 476439 425168 387794 390686 419773 360587 285446 208765
8469 208765 214836 281499 362439 366065 390209 433163 403392 404674 384536 344417 416509 421893
8457 421893 402131 453632 425185 363524 374300 430122 411353 401680 524794 533868 453120 523705
8445 523705 511194 535953 544838 487365 430525 418745 469281 487197 511816 494756 395139 401855
8433 401855 389772 375137 366723 367296 307756 269321 310766 303443 290145 266959 247510 269583
8421 269583 284624 333848 316189 337290 344014 315741 234837 297668 280426 209145 213444 211147
8409 211147 185906 233539 294843 258513 238443 228829 280855 250120 183855 169227 161104 171413
8397 171413 173911 81447 112415 176701 199945 189656 176121 159945 129893 118221 148779 91411
8385 91411 112933 107006 139370 144001 121070 33340 -2682 65813 15812 62720 65983 -17890
8373 -17890 23421 30114 60084 82416 16747 -78402 -59167 -26555 9716 74968 61831 67723
8361 67723 51987 -8252 -54436 -19199 -1504 -14731 -27881 -28241 -79168 -90656 -10608 -22525
8349 -22525 -31659 -55175 -73576 -78201 -70132 -89284 -57486 -58033 -26248 46989 22178 72506 54876
8336 54876 53368 -14093 -28559 -12758 23463 69763 106901 93029 60652 51551 76933 -21773
8324 -21773 -25013 47006 6240 58114 46348 65238 109524 46123 52049 75986 24273 -4578
8312 -4578 -57995 -15299 52558 59705 37833 72755 82101 129395 141044 142298 116796 127702 109805
8299 109805 149868 52663 114335 198086 172757 172907 88727 63244 52501 88385 11879 10990
8287 10990 60688 86924 88256 109687 34074 -15041 14500 84586 59790 20306 -1506 -8920
8275 -8920 16973 -31911 -13505 47052 14531 -52003 -124740 -52245 -24970 -10643 55165 37030
8263 37030 53994 107965 127193 16000 -27285 -41318 -85417 -65808 -65434 -683 55807 61028
8251 61028 8795 23383 31278 -8102 -44307 -48132 -73964 -120369 -119424 -43920 -58358 -56417 12792
8238 12792 38875 16653 -94140 -55414 -76748 -175607 -100083 8901 37251 49220 -40867
8227 -40867 -134464 -124401 -29928 -8978 34728 55319 -29352 -83869 -105163 -157879 -156894 -103728
8215 -103728 -53951 -107126 -196433 -177192 -89361 -75718 -92904 -99207 -127270 -98622 -108557 -130267
8203 -130267 -134165 -103547 -116276 -135185 -56869 -151688 -99839 -18021 -19990 81867 212847 -55949
8191 -55949 -232457 -115541 -242361 -252671 -220823 -144334 -123108 -140981 -81522 -92771 -221136
8180 -221136 -194288 -159487 -121074 -177796 -198677 -193777 -231602 -151551 -127848 -165688 -199167 -205800
8168 -205800 -155652 -150004 -115685 -128374 -83584 -88683 -114152 -97928 -151923 -127185 -209838 -132152
8156 -132152 -81519 -130222 -114093 -129515 -143922 -133114 -129955 -144339 -155275 -130229 -149184 -103968
8144 -103968 -129860 -181746 -119965 -127108 -156644 -164505 -183178 -113327 -135570 -139767 -147836 -175978
8132 -175978 -187110 -200356 -152169 -179657 -178004 -158203 -143818 -132050 -176657 -195775 -174814 -140310
8120 -140310 -158958 -164499 -110032 -145880 -186128 -207885 -296023 -300428 -167798 -181099 -175582 -165148
8108 -165148 -167282 -147131 -202522 -158927 -136407 -140001 -148921 -167563 -148927 -151543 -177618 -193580
8096 -193580 -158543 -126773 -157237 -205521 -147586 -138248 -180354 -163003 -155539 -158007 -125965 -119491
8084 -119491 -83741 -121192 -230720 -220345 -195564 -198240 -213109 -192564 -159476 -119106 -150730 -166315
8072 -166315 -108310 -117552 -125877 -98444 -162722 -177680 -172731 -140917 -124879 -146412 -100416 -96190
8060 -96190 -114645 -196159 -252801 -156163 -76037 -138252 -116052 -202514 -217809 -181414 -193890 -188075
8048 -188075 -120112 -137371 -146355 -157991 -164607 -180014 -196997 -219919 -164870 -96327 -46907 -54771
8036 -54771 -46344 -42888 -122738 -120369 -135606 -136966 -133867 -158738 -186079 -157180 -174239 -164600 -126144
8023 -126144 -131489 -165248 -91978 -181426 -184841 -192550 -236026 -216991 -208426 -129110 -79725 -42192
8011 -42192 -80936 -113575 -127523 -106942 -111360 -111928 -99076 -94882 -141575 -178070 -138084 -99371 -71945
7998 -71945 -63534 -67953 -107142 -71339 -84516 -153535 -173654 -124819 -107123 -96109 -113499 -152326
7986 -152326 -219334 -229725 -200354 -228857 -212542 -109864 -154460 -215972 -224862 -167132 -173613 -190283
7974 -190283 -160118 -109304 -57852 -80259 -61171 -64223 -96942 -54817 -93938 -78714 -66620 -38967
7962 -38967 -87262 -176656 -124787 -79357 -77576 -68031 -71452 -49717 -59965 -120396 -72214 -76661 -97789
7949 -97789 -88008 -78845 -99432 -107712 -134340 -53501 36439 -106422 -104248 -56734 -74862 -77316 -106325
7936 -106325 -148723 -75547 -61400 -123450 -112792 -143671 -154030 -133169 -116666 -134359 -82795 -65706
7924 -65706 -78151 -72085 -105056 -96342 -113156 -160748 -199231 -114376 -91610 -10960 9220 -30799
7912 -30799 -32223 -124334 -61980 -136395 -58115 -53379 -74505 -107566 -98099 -122646 -103910 -125855
7900 -125855 -105309 -157378 -176047 -172975 -129960 -102102 -120256 -141251 -135150 -161165 -199530 -169677
7888 -169677 -88952 -112009 -137700 -152288 -142263 -144469 -127768 -55507 -126418 -132430 -120043 -133855
7876 -133855 -151271 -167479 -155604 -125244 -138773 -154826 -203215 -173701 -104390 -122358 -79236 -84425
7864 -84425 -50980 -70962 -80112 -98756 -83203 -64349 -136438 -81257 -65876 -129128 -120396 -115919
7852 -115919 -158800 -27838 -13475 -51311 -140147 -114393 -175173 -143117 -74046 -87691 -106292
7841 -106292 -119554 -129205 -118183 -44089 -22258 -51623 -75629 -62436 -108125 -118362 -97956 -127285
7829 -127285 -82760 -38324 -35698 -64541 9766 -35203 -38350 13710 34694 -48853 -92320 -33338
7817 -33338 56743 29435 -58064 -132612 -151689 -97976 -62497 -171799 -192797 -216381 259013
7806 259013 339106 21837 25189 -32168 -54537 -54157 -56446 -46553 -5605 -24601 -20826 -42051 -2893
7793 -2893 23315 8777 -105864 -83262 -41643 26414 182 -33385 -45397 -79221 -31869 -72010
7781 -72010 -94046 -75816 -55319 -101304 -94137 5386 -47273 -68030 -116855 -105026 -90182 -48491
7769 -48491 -33970 -19784 25239 30341 -70838 -82486 -63920 -28549 2320 -2321 -44048 -42004
7757 -42004 -56990 -42434 -34241 -13678 -69028 -110219 -34257 -18908 -30651 -52948 -4011 -30109
7745 -30109 -13986 60544 61429 40640 40826 64640 -32067 -53709 -1818 1848 -14031 28950 87432
7732 87432 77165 56698 9451 38908 84819 140978 142798 86745 55991 159510 273758 375400
7720 375400 444022 541479 579095 428219 316480 248894 203958 111101 110038 77179 96420
7709 96420 166772 127042 159212 87097 66586 31272 51870 64423 48897 52686 -6849 -19593
7697 -19593 -59427 -3786 -15574 -23843 -4505 -56158 -83186 -65082 30432 8980 -18636 -59477
7685 -59477 -77406 32342 -12263 -20617 82513 51673 -18885 -57815 -33563 -32644 -29330 -43453
7673 -43453 12449 -742 25466 -10352 -43463 -30630 -24011 -97867 -107571 -40957 7149 15753
7661 15753 -19153 32299 19033 5407 6112 21049 -22798 -40795 -45069 -12967 -14965 -2338 -3513
7648 -3513 16547 15261 4613 -33429 22262 1752 49085 16762 -39233 -90718 -88294 -61724
7636 -61724 -51625 -41770 -90541 -70090 -27227 26370 28813 33191 32917 175 8326 -27657 -22551
7623 -22551 51386 25718 13374 22153 -25012 8022 -1605 41230 33189 43156 14714 -69534 -33328
7610 -33328 -71494 -54532 -7087 24008 37196 74456 4056 -66397 -56470 -59340 19365 72113
7598 72113 -11172 19742 21401 6478 10634 34595 56995 84070 70405 89148 43060 70756
7586 70756 -14175 9511 25730 106285 116802 56995 55641 79084 44646 -90552 8297 31657
7574 31657 30915 20024 -53089 23451 83903 84027 92154 87091 82440 82157 89440 96656 135701 103685
7560 103685 82591 108767 128675 49291 10713 90898 44092 -20348 32493 86110 66049 29656
7548 29656 58240 110722 186647 146531 96435 144006 62704 117983 99286 61880 129347 159887
7536 159887 127057 98742 88398 113191 119347 113639 134939 95754 108339 134982 116141 132140
7524 132140 134325 134518 153459 213756 248752 187671 260373 253535 209965 199786 228612 270303
7512 270303 325246 273983 268414 279549 303237 339087 360976 365342 416229 456020 524196 579998
7500 579998 575801 598683 663841 658417 624629 669640 553320 420491 428688 418728 362538 316865
7488 316865 330695 272048 258854 268172 254424 281599 340415 343909 328935 355694 290079 219689
7476 219689 283703 230548 256570 259788 311140 304031 282322 276179 269399 253669 303905 286682
7464 286682 253517 239211 184632 189054 226997 225174 153586 180883 250422 227800 214379 221992
7452 221992 243035 329144 275449 281006 278979 257804 252023 293941 269276 325140 333579 369482
7440 369482 384058 429851 380556 274024 282387 288212 330956 336539 274352 268485 358678 346189
7428 346189 320654 340936 368318 335815 294355 299554 254877 303762 272240 228211 236841 301830
7416 301830 288701 263997 343315 264101 269247 268476 213224 186315 211468 222162 208474 193284
7404 193284 205724 234840 230832 311611 265365 244351 188006 174500 236236 247593 195320 295300
7392 295300 348867 352824 341049 292517 291230 311639 279455 312741 259195 263789 248341 274766
7380 274766 312059 319948 312251 305038 351960 275898 318813 331239 328859 281859 283792 279625 242978
7367 242978 299300 381702 355554 342606 369231 375712 346930 305889 288732 240025 293854 295708
7355 295708 247190 294134 272297 297396 332421 338216 306562 279486 244505 270478 278905 307246
7343 307246 303900 325437 327478 354716 379547 300518 315537 370317 368444 376917 388541 351381
7331 351381 355682 415614 410278 424060 426114 422305 343586 346634 340431 329712 396152 439209 427941
7318 427941 316179 381150 424812 413428 394631 455238 502825 508325 460251 402866 435402 397327
7306 397327 400422 447260 475201 473076 446090 450141 484563 537363 550698 471579 466545 468337 464003
7293 464003 503319 445902 520974 511195 496936 458960 435957 517670 505296 577340 628573 610812
7281 610812 549919 547864 618497 541292 429825 484911 506228 456663 381431 440246 452977 442962
7269 442962 460352 456535 485676 563958 518675 559115 644807 637955 656256 662678 624383 578581
7257 578581 624316 636208 637238 627568 666904 683103 702566 716649 727172 785610 755042 804198
7245 804198 766147 721594 762257 786563 780890 689250 714332 716663 751226 787345 807581 839222
7233 839222 791369 830203 872911 828543 861839 886141 926367 952991 975076 1050434 1019390 970228
7221 970228 960678 1009424 1076476 1031662 1010521 1013560 998245 1036616 1115025 1141460 1161644 1200250
7209 1200250 1230428 1177852 1187232 1237793 1312036 1420342 1405179 1379446 1443202 1508491 1562949
7198 1562949 1607835 1574556 1590815 1657027 1737113 1769478 1823575 1881268 1834657 1784321 1862931
7187 1862931 1961103 1953976 1977009 2031963 2079094 2183212 2177023 2163827 2203798 2193282 2271609 2285356
7175 2285356 2298327 2333964 2373849 2397400 2499463 2581911 2668040 2701618 2694521 2704920 2712745 2815782
7163 2815782 2951301 3027058 3035594 3111341 3202302 3288185 3294440 3295072 3308042 3442856 3557680 3620535
7151 3620535 3729773 3765494 3930343 4099219 4214950 4427614 4611463 4782939 4912865 5045816
7141 5045816 5191512 5341379 5531822 5752450 5940299 6173993 6471918 6675159 6867733 7094697
7131 7094697 7373561 7472170 7578664 7751200 7952016 8107920 8376698 8716223 9012472 9321944
7121 9321944 9664907 10022576 10441215 10922809 11527090 12248185 13098741 14047821 15211580
7112 15211580 16504632 18131472 20015147 22229164 24902157 28055574 31885592 36922526
7104 36922526 43424850 51673921 61403046 71715438 80859540 85483421 83667309 75247013
7096 75247013 62794007 49543529 38590908 30619406 25208678 21447931 18778482 16805352
7088 16805352 15260548 14007165 12978420 12145973 11431760 10794800 10241799 9806614 9382153
7079 9382153 9044171 8640648 8317405 8021433 7709843 7443772 7259065 7110398 6848165 6696323
7069 6696323 6562117 6371288 6310790 6341777 6373082 6381429 6441924 6535894 6527590 6599730 6792877
7058 6792877 6974284 7314647 7682652 8133355 8675148 9358148 10140288 11033154 12062799
7049 12062799 13308869 14789469 16494446 18342489 20217592 21839071 23355602 24439049
7041 24439049 24837388 24405767 23024285 20828854 18193777 15501169 12968731 10952914
7033 10952914 9510955 8445679 7574830 6905687 6324238 5806236 5273614 4914362 4598762
7024 4598762 4379685 4136790 3934936 3762453 3587261 3486895 3319546 3224599 3184568 3057963
7014 3057963 2995734 2982831 2905014 2813856 2730391 2704947 2642215 2638418 2561327 2505755 2463787 2498371
7002 2498371 2461807 2438468 2464405 2545025 2529063 2548946 2571606 2618151 2676384 2686007 2745625 2854403
6990 2854403 2930931 2965558 3127310 3258279 3408218 3718723 3993777 4238643 4692431 5183180
6980 5183180 5745495 6459973 7220410 8009759 8973070 9962100 10866021 11546342 11757717 11533672
6970 11533672 10737040 9463844 8067522 6724399 5589232 4711270 4027662 3535491 3166347
6961 3166347 2870234 2645133 2430342 2268796 2126709 2004170 1847293 1760545 1691468 1635657
6951 1635657 1630759 1487228 1353568 1314973 1259723 1199167 1097160 1070282 1081833 1097903 1012633
6940 1012633 1037721 1015738 992884 992038 922054 943498 946522 916407 813735 807923 814968 763686
6928 763686 751461 764598 806961 774903 725571 711372 698818 598322 564102 581848 600882
6917 600882 635207 579288 554723 546868 499751 510185 517126 554288 560689 511363 524480 577586
6905 577586 592130 563280 537244 537570 498084 469932 481235 530672 489873 427315 458671 475529
6893 475529 520094 475124 423252 482534 554956 532958 519160 441715 496250 444466 467690 460369
6881 460369 466845 441478 443792 428840 329788 404945 349726 380645 350829 333423 307342 315085
6869 315085 325929 338574 334994 323029 310618 262260 263472 322112 337260 310340 276463 290117
6857 290117 275532 296841 314141 312469 315048 266734 311407 303670 349514 394036 374461 351638
6845 351638 391723 338881 331083 265181 289980 332670 308654 320574 323447 311069 314209 316270
6833 316270 315512 348658 292741 313288 318478 309965 336672 310312 319454 293194 324452 292777 302966
6820 302966 280999 281658 342444 299383 300561 348126 335117 249934 189678 235414 314428 333183
6808 333183 317680 352247 389563 321131 299019 307094 307811 297988 285852 258472 249949 262926 292798
6795 292798 293660 318844 218235 228976 208697 253526 297092 330140 317712 261053 317066 281830
6783 281830 246230 268724 206235 274486 311604 239127 192152 248228 266433 251144 290744 275261
6771 275261 287066 250122 204634 169027 193548 227193 218672 251653 287451 205892 221606 231282
6759 231282 230012 209765 206145 163828 132849 159049 215076 245919 184834 190456 211276 230126
6747 230126 248168 222279 261398 235016 237622 293250 233793 318798 383469 370785 296095 272639
6735 272639 285990 285945 222043 222969 193272 194233 287173 260038 184771 195096 260165 263139 307530
6722 307530 318975 333048 278688 358388 248093 187342 224494 190065 196224 172168 203744 234279
6710 234279 335374 354516 330550 349742 385575 420826 452364 408287 452365 525076 617902
6699 617902 626932 669936 651956 569219 556575 419720 363101 365644 342818 334193 281008 305481
6687 305481 317116 332012 300757 243908 326072 257723 183311 248804 349498 335160 304547
6676 304547 264656 225344 192544 241784 187066 213567 204981 190361 188560 194744 249723 248667
6664 248667 288561 233809 244459 251217 270548 274525 239364 197644 246092 297912 237840 199744
6652 199744 212175 227823 290759 361535 278238 284893 299031 317012 354946 330594 311214 269047
6640 269047 287118 327098 292748 278798 345655 296192 234649 271301 305143 261642 208773 214939
6628 214939 177194 186154 232920 292753 264177 239393 264144 155729 181080 238442 233648 202133
6616 202133 182382 176389 212868 191496 154618 195207 180822 205059 258682 288218 251831 187502
6604 187502 189443 250843 245664 204427 181163 168984 133842 190467 204003 221868 260485 279159
6592 279159 274255 277383 239358 198702 218938 283096 301174 294703 262998 261728 258222 260137 322100
6579 322100 298780 285576 223779 289890 285128 266104 325492 343008 291874 285230 292518 293178 320412
6566 320412 355625 378591 357651 300071 292206 301417 273159 219024 250757 262632 258292 219641
6554 219641 220599 238105 238554 239183 290297 212187 250122 341946 261923 303438 295946 300262 332499
6541 332499 329530 375116 339674 380138 365994 364390 297700 285890 335566 315630 323698 370484
6529 370484 361466 317977 296779 356282 356416 297859 316776 373492 398772 417193 441391 435519
6517 435519 500898 575081 640265 571306 544785 480710 407525 381956 410264 333434 337106 289114
6505 289114 305871 317992 313362 277751 296412 311477 348771 351979 294060 277191 262982 249996
6493 249996 252185 293003 309885 351947 366839 352117 344501 349215 343280 317377 337395 357945
6481 357945 345148 337310 353557 316401 309191 266522 234216 273578 350514 378815 377940 432446
6469 432446 396539 363244 418897 413951 382852 346257 298252 334403 362820 408859 376355 272507
6457 272507 340949 383382 355149 298118 322496 388543 404663 412372 338847 350490 353245 328613
6445 328613 322824 395287 441097 390672 376346 375992 385737 379264 375732 361795 298452 285983 269739
6432 269739 420238 472984 418198 445733 469977 435338 474982 541404 507684 415922 333957
6421 333957 307658 402239 471152 442274 458982 422346 395445 398744 434224 486318 458021 463789
6409 463789 461583 420243 447214 485046 500411 472466 524737 556129 520355 550540 597881 619963
6397 619963 601653 600623 639191 661687 568343 621620 614133 583605 629943 564328 545794 549752
6385 549752 561398 625882 664292 601582 614975 675555 685588 643163 546247 544630 527277 521971
6373 521971 543871 567700 587581 628269 643362 626673 646347 565178 533357 564880 562176 529880
6361 529880 543245 565458 570426 566207 598537 573417 629519 607347 554531 614537 660373 672953
6349 672953 625251 632061 601625 603843 658053 749663 783058 800333 807383 815591 799633 730388
6337 730388 742549 773625 778667 760494 764238 813783 843666 776115 744399 749298 760947 812207
6325 812207 734134 669947 674013 693461 743072 741397 728363 740799 690580 741892 768232 736215
6313 736215 669931 685220 720671 693140 672201 731227 723132 675774 646992 649952 689614 728890
6301 728890 743226 734108 820313 775812 742166 798018 785890 752335 814582 795794 820308 777277
6289 777277 767676 833304 839890 776948 808105 802918 874583 887258 860915 855975 902351 871650
6277 871650 874556 876368 866984 868940 855301 899152 840485 854579 857871 893009 951629 1022833 1008608
6264 1008608 1040262 1042976 1011221 986843 1004402 925932 922593 926708 975680 1041056 1066517 1008890
6252 1008890 996064 1082364 1082820 1042729 978313 1034174 1086297 1065265 1066762 1070577 1105655 1146088
6240 1146088 1189902 1232785 1205058 1145952 1087452 1154731 1140325 1092725 1121546 1012902 1022502
6229 1022502 1046692 1038761 1124938 1162799 1104207 1036269 1142020 1111391 1057560 1061265 1091944 1080671
6217 1080671 1108393 1124300 1088719 1166886 1124736 1046356 1069235 1099275 1161901 1173702 1194976
6206 1194976 1131566 1176119 1229868 1273873 1280217 1223725 1228370 1249709 1300901 1355481 1360891 1318910
6194 1318910 1322910 1334726 1327955 1314074 1281913 1306833 1301860 1327311 1364599 1405853 1414720 1407266
6182 1407266 1470050 1432374 1446183 1419488 1489975 1463247 1444876 1396142 1387430 1512851 1501643
6171 1501643 1498875 1516560 1577753 1575243 1624190 1620435 1597004 1643631 1624290 1672919 1676702 1730158
6159 1730158 1776698 1835080 1872040 1848992 1864962 1946513 1974785 1996948 1966796 2026238 2053208
6148 2053208 2058694 2057306 2087109 2153096 2163245 2211998 2219235 2245428 2281614 2280664 2300767 2365356
6136 2365356 2420044 2406895 2376473 2375525 2418612 2493457 2488252 2569274 2664817 2621314 2723799 2751526
6124 2751526 2733259 2750409 2810551 2874051 2896716 2911782 2986553 3003046 3032296 3075747 3139117
6113 3139117 3155230 3247728 3345652 3362658 3459961 3495415 3691163 3739610 3770444 3829407 3897729
6102 3897729 4006582 4151949 4270474 4354190 4378463 4497499 4675048 4761752 4832399 4928919
6092 4928919 5041594 5118797 5193271 5302024 5431618 5540850 5642527 5818406 5988568 6195164
6082 6195164 6365507 6573568 6817795 7086267 7404114 7794295 8221072 8648224 9254835 9967697
6072 9967697 10772608 11785576 13025013 14595779 16642856 19037186 21592646 24115298
6064 24115298 25882443 26033350 24272675 21593349 19360712 18038706 17605943 18013321 19066404
6055 19066404 20592696 22557359 24492685 25822335 25656404 23433107 20070788 16743021
6047 16743021 14388736 12778070 11674812 10833524 10218000 9805974 9499560 9242296 9030453
6038 9030453 8964827 8876651 8829483 8820970 8875283 8850731 8933918 9081444 9184459 9398033 9708181
6027 9708181 10000173 10303630 10677263 11216677 11873798 12690401 13664753 14820936 16227935
6018 16227935 18005830 20396935 23319690 26557654 29921676 32765166 34096223 32910500
6010 32910500 29686716 26129776 23691048 22599868 22476276 23315131 24971659 27225938
6002 27225938 29773928 32013876 32841878 31169207 27201281 22443321 18380730 15605791
5994 15605791 13582956 12098561 11034589 10201674 9541130 9091722 8735922 8425500 8200505
5985 8200505 7978230 7885238 7745484 7574676 7421868 7348139 7149521 6986557 6870019 6677812
5975 6677812 6506755 6328768 6208999 6095415 5978223 5902455 5831554 5822545 5751195 5771729 5756386
5964 5756386 5803819 5734573 5622314 5603760 5568892 5550119 5518976 5506049 5532872 5557057 5578739
5953 5578739 5604275 5658954 5665643 5636954 5668952 5686789 5707838 5755803 5853970 5809961 5763401 5802650
5941 5802650 5843006 5829849 5895541 5937067 6030714 6077606 6135857 6251474 6244467 6313799 6380449
5930 6380449 6456672 6485270 6417840 6457095 6466621 6527348 6621345 6564494 6525010 6611321 6674758 6721933
5918 6721933 6731695 6756507 6761578 6806403 6839721 6974372 7079469 7070581 7023936 7117684 7260721
5907 7260721 7209479 7321343 7477666 7617309 7690831 7812045 7896801 7916705 8016813 8089189
5897 8089189 8225387 8395193 8441050 8552712 8568479 8584871 8654732 8735027 8866259 8869518 8872901
5886 8872901 8935323 8953702 9018852 9166783 9290350 9356199 9497047 9589009 9737808 9844374
5876 9844374 9886095 9919002 9974169 10198142 10407205 10649498 10853274 10936091 10973395 11010694 11096612
5865 11096612 11180800 11285088 11431870 11557660 11839068 12059474 12336301 12668097 12985620 13264526
5855 13264526 13617099 13885539 14108208 14355128 14657571 14911832 15159802 15427922 15784456
5846 15784456 16014524 16193610 16359337 16667972 16927375 17220773 17564652 17860349 18035655
5837 18035655 18025395 17901532 17590834 17385535 17232067 17121518 17121184 17187464 17235628 17291706 17386400
5826 17386400 17581793 17678334 17885530 18226487 18545076 18958422 19426015 19898524 20443082 21051851
5816 21051851 21770995 22436588 23230544 24019684 24828150 25667616 26498830 27503586 28561699
5807 28561699 29587372 30650824 31498038 32044387 32373410 32722206 33181588 33757132 34373829
5798 34373829 35138815 36009773 36834689 37564135 38272195 38782023 39116797 39245131 38953375
5789 38953375 38311106 37312544 35875722 34272032 32624989 31166591 30116593 29277016 28787204
5780 28787204 28471058 28324573 28409639 28653023 28975427 29514802 30251107 31135184 32020410 32791404
5770 32791404 33589024 34521408 35308470 35496274 34935554 33573397 31822100 29674079 27069590
5761 27069590 24424291 22227645 20524439 19350096 18333458 17489365 16867318 16393137 16029169
5752 16029169 15760473 15658692 15547359 15540432 15646461 15834060 16184909 16708639 17205293 17843828
5742 17843828 18663357 19667416 21064166 22776032 24728101 26737653 28846431 31148612
5734 31148612 32743943 33025231 31677606 28847989 25414928 22181721 19810663 18240309
5726 18240309 17202419 16477632 15938014 15684840 15519516 15464559 15640394 15887017 16257619
5717 16257619 16774696 17490963 18374051 19464877 20968195 22836979 24936717 27041109 29441096
5708 29441096 31811232 33226636 32834197 30832699 27516587 23640999 20380324 18121403
5700 18121403 16564691 15544192 14854241 14449955 14139379 13929159 13948676 14066867 14289994
5691 14289994 14560638 15075185 15802032 16825904 18036732 19404077 20856976 22370719 23932023
5682 23932023 24644209 24067536 22517267 20092832 17418355 15337840 13884931 12867802
5674 12867802 12203340 11773469 11483939 11309539 11216768 11236062 11367536 11585260 11932589 12301070
5664 12301070 12793260 13466276 14412245 15712432 17224274 18655273 20291806 22160859 23702818
5655 23702818 24109270 23148527 21048277 18210059 15309175 13070084 11570483 10529409
5647 10529409 9771619 9188261 8752124 8319238 8061277 7802789 7687533 7554607 7337650
5638 7337650 7239221 7104944 7010737 6915727 6805520 6806908 6813849 6726282 6715147 6669648 6619294
5627 6619294 6628998 6630603 6669094 6605768 6616723 6675404 6712015 6709423 6765859 6879977 6931681 6949560
5615 6949560 6978820 7007950 7114347 7145883 7228036 7330433 7361137 7485245 7559954 7643321 7699096
5604 7699096 7812418 7838293 7936508 8042464 8095400 8098331 8138584 8162310 8168691 8255350 8327210
5593 8327210 8320008 8371638 8477534 8517301 8504756 8541510 8628508 8679036 8664697 8687405 8721251
5582 8721251 8733902 8920319 9016877 9160504 9217847 9213853 9217296 9174897 9125866 9054723 8930299
5571 8930299 8774987 8608405 8452037 8293978 8236129 8140001 7996714 8000238 7948039 7839394
5561 7839394 7763075 7731884 7637314 7602646 7577906 7514152 7421218 7375894 7323877 7312244 7288565
5550 7288565 7326371 7370867 7357273 7320606 7186491 7106511 6980403 6844543 6714131 6582801
5540 6582801 6442085 6308269 6186670 5989677 5954615 5917905 5806663 5746832 5717233 5661711
5530 5661711 5606999 5583030 5571300 5611458 5582047 5576884 5432747 5319371 5262290 5085256 4976454
5519 4976454 4869760 4804983 4780465 4747547 4684150 4676279 4543365 4415444 4457264 4464537 4410998
5508 4410998 4366448 4345255 4339626 4252165 4161524 4214431 4301979 4305916 4318757 4344195 4358830 4385932
5496 4385932 4372280 4324107 4241074 4074479 4045906 3966076 3852872 3854578 3851029 3748395 3704018
5485 3704018 3744358 3673907 3687192 3783013 3784979 3763321 3712546 3694877 3682689 3627945 3625801 3558171
5473 3558171 3537431 3494900 3465937 3474700 3508581 3440417 3431978 3424601 3452889 3455057 3492618 3507315
5461 3507315 3586614 3564303 3565665 3614702 3570485 3595634 3655264 3674027 3636054 3666605 3629458 3583682
5449 3583682 3640506 3680809 3746344 3793369 3745444 3688488 3693713 3641471 3646164 3628284 3624052 3610275
5437 3610275 3629439 3663309 3660838 3713632 3730611 3813687 3845095 3842801 3858050 3828034 3790976 3826643
5425 3826643 3783539 3777066 3774180 3755818 3790254 3758484 3759642 3751019 3771703 3750905 3732928 3701335
5413 3701335 3727406 3828226 3820626 3859663 3861532 3872063 3928247 4001334 4009312 3989765 3962979 3877498
5401 3877498 3892150 3962872 4011816 3953125 3968819 3948438 3947986 3950622 3963656 4021491 3994872 4040563
5389 4040563 4005311 4055216 4076736 4038927 4016420 4092614 4154640 4272965 4292684 4315200 4339849
5378 4339849 4394818 4493056 4555230 4573155 4705044 4808588 4960678 5059520 5086814 5113608 5109832
5367 5109832 5154550 5204357 5322843 5479567 5516284 5665532 5857244 6094435 6438066 6740010
5357 6740010 7110788 7438436 7806077 8163658 8356421 8458142 8596953 8648295 8611475 8430665
5347 8430665 8276044 8121968 8008805 7878799 7773610 7762773 7806324 7933969 8049145 8180922
5337 8180922 8304566 8415461 8444105 8418784 8407847 8297280 8153971 8117699 8048606 7834795
5327 7834795 7568287 7341155 7109079 6963593 6772909 6594063 6340713 6132912 5964557 5750321
5317 5750321 5592603 5440212 5391595 5258403 5197885 5023735 4941024 4848185 4727715 4654179
5307 4654179 4638355 4692975 4787101 4874445 4815673 4827829 4789205 4699415 4642922 4614676 4554462
5296 4554462 4487662 4418632 4323050 4304410 4342073 4353300 4376158 4456677 4432592 4404284 4468795
5285 4468795 4447481 4439402 4486150 4478645 4481608 4567974 4699434 4765316 4705865 4626186 4584305 4524745
5273 4524745 4587366 4642104 4678010 4725035 4764536 4785859 4779629 4796148 4810629 4714029 4751491 4761204
5261 4761204 4781831 4834262 4877650 4898734 4853627 4897975 4976661 4970500 4945792 4962354 4938361 4901496
5249 4901496 4835636 4812173 4759462 4732440 4817405 4792928 4822371 4895414 4941614 4998345 5057599
5238 5057599 5118909 5280473 5320922 5328613 5374337 5360964 5347024 5274154 5415399 5453475 5444499
5227 5444499 5433277 5387289 5491799 5583566 5564770 5645300 5690575 5689038 5739687 5739177 5719272 5775429
5215 5775429 5795938 5786571 5884131 5946360 5914602 5946143 6035561 6100877 6094523 6126944 6184349 6274740
5203 6274740 6246269 6207080 6166370 6152199 6175219 6257050 6356876 6428945 6437119 6443196 6506189 6559931
5191 6559931 6544131 6543677 6620365 6687303 6672012 6720143 6733757 6734980 6791865 6877365 6955371 6966782
5179 6966782 6933848 6989575 7068494 7069229 7188223 7270859 7366164 7502262 7533434 7681974 7728895
5168 7728895 7795811 7868339 8012481 8211312 8340952 8474289 8606498 8874184 9053959 9291998
5158 9291998 9452081 9729204 10042491 10436399 10725932 11117795 11669391 12229645 12977421 13823320
5148 13823320 14706363 15625444 16258902 16544478 16571481 16311045 16185874 16423713 16976019 17915249
5138 17915249 19172717 20498158 21927134 23476816 24699916 25198130 25013037 24401489 24008040
5129 24008040 24066304 24709648 25529164 26120149 26533138 26879560 27674449 28697038 29595835
5120 29595835 30437402 30999685 31334878 31647371 32096885 32376380 32131061 31534925 30614622
5111 30614622 30208694 30472895 31452522 32800258 34004858 34672542 34955629 35029068 35326116
5102 35326116 35797316 36163920 36189735 36144507 36256088 36640292 37578231 38797801 40113403
5093 40113403 41471832 42759976 43785803 44559706 44807225 43893885 41703385 38564790 34933429
5084 34933429 31873270 29668606 28489485 28102697 28309975 28793671 29614598 30462847 31218656
5075 31218656 31668869 31933882 32091502 32652823 33472244 34257570 34888221 35266136 35414488
5066 35414488 35106419 34386262 33474556 32148790 30900365 29959200 29222518 28747883 28797330
5057 28797330 29200274 29674227 30154972 30565751 30817708 31049732 31527200 31974557 32508961
5048 32508961 33395337 34845278 36587238 37839211 38460503 38833827 39001865 39111910 39085692
5039 39085692 38927733 38724313 38449912 38322965 38259081 38370912 39419839 41075845 42856957
5030 42856957 44556650 46187197 47371736 47991350 47899059 47491765 47315328 47590631 47605105
5021 47605105 47607583 47857365 49007132 51615834 54540906 56558095 57714515 57063966 55020179
5012 55020179 53205346 51821361 50783516 50007345 48271654 45305871 41560648 37350549
5004 37350549 34167650 32040101 30772788 29897077 29376040 29059211 28971220 28669426 27659422
4995 27659422 26225279 24602103 23652206 23563180 23404681 23280539 23208053 22573295 21918549
4986 21918549 21401915 20784710 20329302 20028402 19374068 18294857 16957719 15544827 14536147
4977 14536147 13913027 13705099 13691712 13798533 14056938 14309838 14102730 13396289 12188742
4968 12188742 11059067 10359363 9871612 9518761 9285923 9152976 9021704 9047965 9038885 9050757
4958 9050757 9017594 8874852 8753326 8628156 8393947 8198315 7956015 7659487 7434801 7249760
4948 7249760 7180776 7106538 7045218 7060044 7128041 7165020 7079767 7059118 7128548 7127545 7109101 7166670
4936 7166670 7220010 7205101 7172605 7126033 7163942 7179343 7119881 7124461 7136444 7163108 7174678 7207693
4924 7207693 7351177 7471864 7561141 7664495 7805290 8008591 8143534 8424920 8730165 8961181
4914 8961181 9378114 9931431 10505689 11174963 11998459 13164746 14513353 16059236 18003174
4905 18003174 20033427 21587102 22804933 23990997 23759232 21895103 18821666 15719841
4897 15719841 13529478 12130017 11126789 10436551 9938007 9526847 9318257 9126502 9026423
4888 9026423 8973662 9026358 9012578 9064037 9125025 9288769 9398580 9601681 9892071 10228613
4878 10228613 10673494 11255269 11878937 12638705 13323169 13656943 13829929 13954231 14340399
4869 14340399 15179501 16497665 18111334 20220716 23006874 25961227 28341930 30115556
4861 30115556 29160537 25120944 21150549 18777456 17644235 17252488 17376463 17652105 17854129
4852 17854129 18099131 18921791 20670830 22962284 25402331 27447405 26748430 23343123 19790637
4843 19790637 17064950 14900652 13221505 12126320 11444211 11087789 10894508 10858597 10585577
4834 10585577 9889377 9237758 8929481 8624292 8456862 8331183 8220335 8218305 8216867 8205772
4824 8205772 8157603 8082327 8093530 8182170 8340343 8477313 8605858 8836571 9128651 9369595
4814 9369595 9736387 10203163 10794887 11653069 12759726 13906545 15084725 15583891 15336891
4805 15336891 14931241 14541811 14394990 14428901 14855299 15728510 16911904 18212491 19725630
4796 19725630 21548883 22710295 23019669 22655063 21898916 21909898 21973657 21616619 20671519
4787 20671519 19534805 18697116 18581647 19005227 19956384 21286290 22817509 24379079 26141872
4778 26141872 27548034 28613971 29596642 31122598 32553679 32565801 31134606 28452937 26247628
4769 26247628 25084147 24156867 23512347 22751245 21854544 21062626 20302994 20039731 20432459
4760 20432459 20834341 21012149 21143802 21249918 21321714 21266121 21151380 20894552 20197015 18899209
4750 18899209 16881266 14631240 13237181 12227263 11518933 11048260 10725441 10517440 10361313
4741 10361313 10254667 10246965 10314473 10372244 10542694 10812694 11068813 11308975 11667375 12203620
4731 12203620 12797360 13410569 14105057 14984652 16129834 17615288 19567743 21720110 23849829
4722 23849829 26282053 28555800 29355577 28362702 25901564 22620506 20054855 18568711
4714 18568711 17876953 17643887 17776547 18211949 19050610 20179582 21710086 23747110 26358309
4705 26358309 29453703 33052478 37369552 41729800 44558212 46149669 46139406 43514132
4697 43514132 39268630 33951615 28277961 23896357 20917679 19057723 17935814 17237146
4689 17237146 16994111 17072900 17424175 18224029 19516464 21325662 23359334 25444915 27893215
4680 27893215 29989902 30082345 28026298 24188231 19648164 16019320 13457920 11811066
4672 11811066 10530098 9608705 8844896 8335330 7860360 7499933 7144836 6868728 6625203
4663 6625203 6486601 6328186 6227419 6054057 5881302 5856067 5785965 5656562 5546912 5463664
4653 5463664 5486284 5512537 5463944 5440258 5451304 5471236 5524239 5639257 5690187 5678823 5712715
4642 5712715 5786874 5779052 5736444 5852128 5860641 5864206 5835074 5661594 5647630 5625956 5565958 5482097
4630 5482097 5549165 5647559 5705358 5788615 5843854 6002756 6201776 6297747 6389542 6554481 6696088
4619 6696088 6769127 6812598 6836017 6866524 6990926 7058010 7051426 7020149 7000099 7125594 7180588
4608 7180588 7157756 7172166 7207763 7275335 7378439 7513091 7706390 7986391 8197154 8341539
4598 8341539 8479550 8558689 8665686 8768862 8870406 9078029 9270642 9390121 9605343 9746253
4588 9746253 9895886 10023509 10106765 10122901 10158055 10183793 10333755 10616849 10949291 11257992
4578 11257992 11469760 11771979 12086580 12418188 12765199 13186246 13637935 14164399 14957544
4569 14957544 15899079 16777515 17780989 19092458 20752510 22907248 25598814 28572264
4561 28572264 31719971 34956266 37470738 38209091 36941479 34213591 31371396 29539237
4553 29539237 29029396 29681493 31120842 33037217 35211738 37451271 38902905 38764697 36896118
4544 36896118 33837955 30989320 29425397 29259817 29974365 31246216 32794717 33868078
4536 33868078 33699379 31983917 29380422 26885256 25261664 24622614 24871801 25685876 26803940
4527 26803940 28059277 29261004 29729878 28771070 26418992 23124394 19895778 17441561
4519 17441561 15701904 14416930 13422239 12667318 12066346 11686952 11342684 11024095 10795168
4510 10795168 10604616 10468768 10306225 10114623 9871315 9657799 9444095 9334746 9261352 9116885
4500 9116885 8996544 8924462 8884480 8839121 8843979 8845262 8767486 8772251 8854429 8798354 8815684 8887244
4488 8887244 8966252 9148674 9331628 9500170 9753549 10086567 10517572 10902190 11301400 11838297
4478 11838297 12415596 13202938 14008392 15022632 16279541 17884584 19943730 22287490 24995018
4469 24995018 27813051 30183398 31330129 30287172 27939183 25509053 24326850 24664499
4461 24664499 25935854 27436346 29554802 31566407 31444630 29120526 25293291 22143934
4453 22143934 20525267 19905991 20183840 21116146 22427218 24107850 25965273 27519590 27877047
4444 27877047 26989736 25609504 24234814 23371224 23161543 23755791 24758416 25725003 26082715
4435 26082715 24784150 22149284 18902979 16200610 14492937 13275673 12279518 11390561
4427 11390561 10599646 9842045 9216776 8617300 8207268 7860481 7586298 7538153 7364723 7306961
4417 7306961 7243768 7182555 7031408 6804680 6567165 6415990 6403169 6376577 6497195 6623239
4407 6623239 6744238 6761379 6711271 6551055 6288735 6170371 6109302 6037911 5942107 5945896 6025452
4396 6025452 6083059 6148522 6229475 6156681 5918657 5735815 5622682 5401879 5240678 5187724
4386 5187724 5133274 5144981 5072949 4983254 4891709 4739229 4702484 4639031 4644285 4680074 4787789
4375 4787789 4919883 4985637 5086536 5070246 5137848 5048741 4950571 4892000 4892947 4955806 4985149
4364 4985149 5001166 4994916 5048238 5091444 5196542 5168384 5170354 5303815 5306462 5230191 5260619 5199015
4352 5199015 5166888 5108977 5119955 5180357 5166733 5224786 5236455 5142897 5144369 5177077 5072300
4341 5072300 5045406 5128902 5113757 4926452 4877350 4901690 4896864 4881474 4811943 4695516 4681689
4330 4681689 4590377 4538617 4614937 4513307 4436490 4463680 4383621 4310329 4279383 4321469 4293248
4319 4293248 4314933 4261150 4182465 4162477 4172217 4200248 4241840 4345684 4412569 4479047 4504173
4308 4504173 4589385 4640158 4696375 4726646 4673832 4749675 4841503 4930291 5074171 5285257 5447992
4297 5447992 5592532 5702180 5751809 5785310 5785611 5741718 5683665 5626388 5627150 5591144 5538927 5601309
4285 5601309 5556277 5593607 5618004 5725668 5678180 5774056 5908999 5942165 6065137 6192811 6304509
4274 6304509 6324800 6428253 6503407 6632992 6680141 6696464 6653598 6658455 6611266 6582685 6593965
4263 6593965 6638208 6647068 6589824 6585408 6632061 6631840 6629027 6671085 6681975 6756418 6886349 7018143
4251 7018143 7092767 7193902 7357701 7464295 7641653 7804353 7932886 8096126 8287767 8558221
4241 8558221 8762138 8955221 9238517 9418877 9620720 9865064 10160784 10337681 10489524 10662933
4231 10662933 10739995 10819504 10890728 11060903 11183738 11436445 11608425 11774026 11962159 12139086
4221 12139086 12301343 12451577 12677527 12864157 12993881 13145520 13271316 13312580 13464024 13660092
4211 13660092 13837664 14039589 14256660 14638959 14966614 15215806 15599002 15967270 16243259
4202 16243259 16537111 16946527 17301544 17661045 18024606 18372734 18707281 19051054 19564243
4193 19564243 20107339 20617599 21110940 21626040 22196515 22782503 23511732 24207445 24973050
4184 24973050 25787730 26528951 27350740 28225322 29210979 30178689 31225347 32241750 33221889
4175 33221889 34141084 35078934 35947273 36777589 37690839 38681337 39728848 40922056 42228467
4166 42228467 43730476 45272983 47171375 49392311 52061767 55187189 58730987 62605754
4158 62605754 66997966 71791200 77591952 84458460 92892361 102832328 114693810 128681108
4150 128681108 146167084 168459690 198138983 234367030 275034977 315972687 344006123
4143 344006123 347599605 325697614 289299981 252097286 218340349 185904114 157261333
4136 157261333 134985034 120079213 110528116 104614491 100775298 97590430 93207046 86464448
4128 86464448 77582190 68496315 60631634 54395538 49435422 45461362 42005786 39140589
4120 39140589 36680252 34602008 32634569 30752218 29031161 27472532 26120487 24910358
4112 24910358 23824935 22855053 22034223 21356892 20749543 20154320 19630633 18978881 18244201
4103 18244201 17529458 16924584 16387212 15992234 15674931 15349292 15092467 14850164 14574939
4094 14574939 14394586 14124904 13909091 13716544 13443027 13176849 12992719 12826114 12673096
4085 12673096 12558556 12378151 12248001 12161282 12055793 12050786 11986307 11963676 11942200 11882257 12015458
4074 12015458 12104628 12126831 12133265 12085034 11978372 11855432 11842500 11857392 11859347 11790080 11872539
4063 11872539 11844160 11983873 12091138 12268051 12397922 12707166 12982641 13303178 13855522 14552775
4053 14552775 15492273 16746981 18290404 20059133 21969992 23843756 25841054 27124977
4045 27124977 26911011 25197375 22214813 18755360 16014159 14113240 12711294 11717744
4037 11717744 10986165 10437726 9926110 9430144 9035969 8750674 8479371 8239194 8011857
4028 8011857 7877035 7707017 7563372 7358844 7022908 6677068 6424456 6091392 5897013 5707095
4018 5707095 5562803 5383688 5229128 5150195 5053418 4905711 4836876 4813160 4665034 4577408
4008 4577408 4433252 4319929 4284405 4295729 4335502 4303962 4258346 4251953 4200437 4118367 3954416
3997 3954416 3864477 3830549 3807005 3786267 3817666 3846432 3836654 3802279 3836559 3745961 3629935
3986 3629935 3585919 3481296 3427624 3442751 3410293 3424580 3361376 3269899 3351546 3394412 3472720
3975 3472720 3571317 3623407 3644400 3617138 3585661 3542362 3463861 3316683 3265826 3276472 3229595
3964 3229595 3173979 3195933 3136029 3120890 3172773 3246185 3283652 3385058 3466097 3551581 3664022
3953 3664022 3794756 4041433 4237811 4478717 4808040 5187486 5622116 6102713 6661611 7332236
3943 7332236 8313754 9425983 10502109 11452438 11856503 11337523 9641797 7650433 6091722
3934 6091722 5113558 4536102 4067542 3731038 3479078 3226153 3041159 2956992 2924424 2926641
3924 2926641 2836902 2713313 2586162 2452946 2338533 2284315 2238364 2210399 2158854 2193585 2138699
3913 2138699 2060208 1987582 1909998 1875728 1870397 1765569 1746776 1706342 1686303 1758038 1754163 1773403
3901 1773403 1742830 1660433 1663768 1736992 1689696 1717867 1734364 1717146 1738617 1744606 1802474 1865490
3889 1865490 1847580 1831735 1847439 1883120 1839104 1914429 1941290 1977013 1997536 2047504 2091506
3878 2091506 2192992 2262235 2290696 2380383 2358253 2434718 2446301 2472517 2543783 2456347 2436175
3867 2436175 2605657 2676660 2806712 2923626 3031511 3146376 3276931 3320833 3417726 3543995
3857 3543995 3662966 3732657 3948500 4156789 4243769 4155870 4066933 3919573 3719134 3690625
3847 3690625 3633148 3547835 3566260 3672683 3815410 3989676 4209703 4454179 4701709 5029914
3837 5029914 5445147 6008268 6656551 7539445 8401070 9213080 10187589 11299758 11964566
3828 11964566 11982591 11376402 10482774 9166460 7541146 6264440 5425745 4810622 4415417
3819 4415417 4174024 4000400 3801832 3603251 3413574 3227552 2970858 2706069 2541226 2448346
3809 2448346 2327606 2295381 2266214 2147055 2134296 2097015 2092151 2086112 2094390 2127530 2190549 2245857
3797 2245857 2214622 2268009 2253466 2191203 2104499 1915868 1780218 1761458 1674899 1604480 1605370
3786 1605370 1674224 1716135 1665569 1681800 1808594 1936642 1937404 1963051 2035611 2099037 2206124
3775 2206124 2202597 2227712 2202629 2149739 2110781 1968662 1808015 1782997 1756237 1711786 1747735
3764 1747735 1753705 1752201 1867180 1888051 2032204 2181100 2201455 2284423 2345268 2367336 2410286
3753 2410286 2349537 2186102 2049056 1904808 1781205 1651209 1543507 1546459 1490091 1404113
3743 1404113 1389341 1275217 1319694 1209174 1248880 1261027 1301647 1294601 1257527 1284294 1235410
3732 1235410 1226780 1219543 1217103 1095064 1043262 1058667 1066857 1087399 1079902 1129388 1161182 1232372
3720 1232372 1248900 1261954 1242413 1260868 1252880 1247248 1287290 1276318 1192871 1142499 1099707 1086470
3708 1086470 1066419 1088574 1046389 925013 972522 988557 946016 966764 933971 905134 864072
3697 864072 871213 870457 911123 921585 920906 965619 928705 952047 982093 1060561 1036384 1034176 1031803
3684 1031803 978180 933681 942789 920240 894213 910099 915096 939969 939636 949826 964578 898926
3672 898926 897484 910255 931260 918673 987603 1028331 998524 983820 978977 1045613 1050874 1037920
3660 1037920 1037681 1074843 1078840 1061373 1069451 1144841 1203177 1144624 1030396 994699 1080552 1078339
3648 1078339 1071065 1091339 1027676 1038298 1052777 1075518 1121264 1092309 1069276 1100756 1120505 1055772
3636 1055772 1013032 1024821 1064965 1087643 1068285 1088353 1064061 1092802 1133211 1104148 1149227
3625 1149227 1191756 1240269 1184472 1279956 1315334 1322873 1372180 1442632 1432547 1405962 1390790 1335447
3613 1335447 1276064 1196777 1144217 1169255 1187779 1166815 1130998 1145098 1170119 1140411 1168085
3602 1168085 1168619 1239937 1324803 1373882 1436420 1442523 1396501 1363921 1295169 1301870 1299512 1269773
3590 1269773 1303517 1331740 1309187 1306716 1308689 1301015 1305578 1337526 1355573 1330947 1349645 1422450
3578 1422450 1392027 1387753 1327978 1271524 1221761 1162342 1221779 1160112 1146741 1178033 1203501 1219194
3566 1219194 1225489 1258430 1191085 1162568 1082162 1187742 1239384 1204116 1237330 1180907 1130729
3555 1130729 1169126 1121576 1162740 1193920 1120437 1082101 1073435 1046421 1109088 1176468 1143168 1146360
3543 1146360 1196701 1240609 1241300 1192332 1207789 1188734 1132093 1150568 1168829 1165554 1128496 1150813
3531 1150813 1142737 1101835 1065803 1124129 1104312 1097675 1105842 1160281 1122340 1180632 1203088 1147414
3519 1147414 1146407 1169612 1207527 1210140 1199875 1186948 1201824 1265194 1282359 1200256 1146779 1175165
3507 1175165 1206488 1181820 1175137 1234170 1244820 1278132 1263606 1300603 1284794 1282727 1365490 1317085
3495 1317085 1312797 1344613 1352967 1395979 1407258 1480381 1432857 1437669 1435163 1442520 1530458 1468812
3483 1468812 1390430 1309851 1353039 1297076 1373515 1433533 1436631 1414825 1434112 1411157 1357943 1335848
3471 1335848 1427095 1426677 1384245 1403048 1373041 1373821 1344718 1356636 1316054 1345022 1335599 1312363
3459 1312363 1355936 1380628 1362436 1358322 1391088 1418128 1401292 1476470 1470972 1495308 1487397 1503625
3447 1503625 1487312 1477979 1463523 1403032 1421553 1447399 1441065 1416576 1413797 1466399 1521875 1476009
3435 1476009 1505217 1530826 1550926 1535575 1556786 1583907 1579681 1593364 1620251 1603059 1621508 1656461
3423 1656461 1704007 1624801 1701328 1844049 1907016 1925511 1987468 2045998 2044938 2069009 2036777
3412 2036777 1873166 1858601 1916176 1841581 1854096 1849913 1814244 1877216 1876383 1874840 1922808 1894801
3400 1894801 1876202 1940279 1981997 1997018 2021724 2117560 2149177 2163946 2176877 2229835 2322049
3389 2322049 2409563 2526899 2584682 2709643 2873470 2947207 2967625 2997464 3043628 2945600 2833495
3378 2833495 2759458 2754222 2697181 2609338 2621599 2614453 2638825 2642801 2622978 2667392 2745181 2735627
3366 2735627 2743006 2802231 2880190 2894966 2990563 3006164 2921779 2922615 2960052 2969088 2902243 2931173
3354 2931173 2971011 2977906 3062784 3118775 3209048 3190629 3220656 3183397 3092044 3057618 3055017 3123150
3342 3123150 3175666 3196056 3136724 3084228 3138036 3209166 3201451 3290664 3410459 3504314 3599582
3331 3599582 3638535 3711711 3842519 3993015 4075595 4142003 4177878 4098037 4007784 4034522 4093574
3320 4093574 4230033 4247858 4343416 4332340 4440903 4552047 4675558 4773954 4916999 5109152
3310 5109152 5163362 5223124 5216345 5187127 5136471 5125065 5123714 5135684 5164339 5250042 5299120 5369946
3298 5369946 5623870 5845149 6047620 6297284 6361853 6294892 6175826 6085202 6093721 6173925 6204303
3287 6204303 6277235 6357768 6368945 6397051 6486975 6600067 6713470 6738831 6747488 6818003 6910896
3276 6910896 7067206 7177077 7388339 7416164 7541779 7788031 7918512 8021114 8188173 8423608
3266 8423608 8620109 8985836 9430788 9829270 10271842 10703488 11056434 11348424 11388577 11171257
3256 11171257 10820465 10736408 10702349 10780669 10947539 11224775 11519386 11885443 12227202 12568404
3246 12568404 13012942 13551014 14134679 14723411 15391603 16057684 16669680 17282743 17726138
3237 17726138 17987322 18041733 17772827 17158605 16483629 15694135 15037407 14626384 14411567 14192840
3227 14192840 14011008 13650865 12806797 11611438 10605960 9910117 9322117 8876026 8485714
3218 8485714 8282292 8051422 7886973 7658630 7470498 7364555 7301632 7228216 7123901 7020810
3208 7020810 6947005 6863862 6836748 6920433 6867744 6821908 6763251 6743563 6730814 6777783 6932232
3197 6932232 7024507 7064699 7075871 7001564 6747194 6234293 5713855 5311136 5060543 4888196
3187 4888196 4637337 4575200 4503805 4490383 4527521 4588854 4543918 4566782 4584095 4632687 4670259
3176 4670259 4839950 5018945 5042932 5116964 5195954 5137223 4965854 4864796 4732070 4691285
3166 4691285 4580306 4437104 4168980 3894816 3759368 3628023 3491268 3370279 3310162 3325613
3156 3325613 3285173 3215631 3147523 3114008 3103609 3122735 3164640 3137888 3142201 3161561 3153847 3146548
3144 3146548 3199439 3196394 3224456 3295529 3338682 3285866 3172387 3038434 3011567 2977515 2946099
3133 2946099 2822299 2722988 2656922 2604605 2564002 2464807 2444435 2412083 2388814 2364247 2402736
3122 2402736 2342719 2276353 2246180 2188775 2147195 2104046 2099799 2156800 2162224 2097453 2130669 2140345
3110 2140345 2125196 2140555 2073313 1995575 1979097 2002359 1971916 1956467 1937129 1873877 1850253
3099 1850253 1872523 1935402 1971702 1934413 1889191 1857660 1878379 1818813 1810001 1802582 1710151 1672857
3087 1672857 1580188 1644199 1649683 1659664 1653208 1656881 1611840 1615076 1611772 1581560 1646982 1596844 1578437
3074 1578437 1551309 1541479 1581335 1607137 1592681 1597811 1585286 1532093 1547905 1583872 1592423 1486509
3062 1486509 1518075 1555644 1546364 1497160 1472510 1485204 1527881 1572925 1517737 1463940 1464539 1490480
3050 1490480 1505870 1487990 1489643 1547089 1474105 1386418 1288143 1328286 1397795 1411190 1354557 1352483
3038 1352483 1345834 1281706 1388369 1397339 1363599 1412768 1399726 1314137 1305683 1271152 1264728 1290895
3026 1290895 1261694 1362195 1240840 1199838 1253089 1261151 1285201 1264613 1297344 1331835 1370926
3015 1370926 1331028 1335793 1343722 1358072 1415384 1368125 1395332 1429272 1446799 1411442 1472188 1418625
3003 1418625 1495657 1494500 1512669 1593341 1581662 1619936 1652238 1689228 1714107 1713194 1674981 1627621
2991 1627621 1620281 1657222 1616364 1598875 1714373 1755181 1747315 1787166 1753830 1786599 1804135 1815434
2979 1815434 1750543 1765155 1775106 1803440 1869849 1894947 1981691 2066703 2084603 2086298 2111471 2138982
2967 2138982 2224211 2243328 2325502 2358957 2383061 2373888 2348144 2353502 2312246 2236936 2245110 2332109
2955 2332109 2338817 2351304 2365563 2348697 2349202 2349567 2381291 2412408 2382099 2330620 2397195 2451617
2943 2451617 2545637 2591476 2651700 2764419 2716629 2731121 2798118 2914744 2952475 2972760 3001495
2932 3001495 3083097 3193206 3273138 3321686 3447072 3481846 3510593 3578120 3644565 3672127 3777288
2921 3777288 3792421 3793102 3824197 3853697 3870306 3943037 3904025 3958540 3995838 4015201 4093043 4092075
2909 4092075 4145457 4208585 4358010 4456304 4568346 4715063 4812102 4960916 5127785 5306272
2899 5306272 5502108 5634349 5706105 5786636 5818737 5871783 5876194 5749819 5611084 5397186 5258441
2888 5258441 5069776 4951704 4924519 4918233 4860113 4802838 4846031 4827178 4915703 4908207 4952385
2877 4952385 5080334 5121862 5093768 5120815 5206107 5266265 5276760 5273189 5335143 5340278 5331241 5232741
2865 5232741 5120002 4951114 4820160 4746772 4538869 4392686 4243300 4159491 4188552 4061974
2855 4061974 4001433 3951673 3902022 3806607 3761392 3723388 3675840 3624184 3568561 3450409 3372531
2844 3372531 3324697 3204277 3116769 2948061 2882115 2777483 2651086 2528624 2376538 2297533
2834 2297533 2326008 2253680 2167557 2087803 2050033 1993839 1983359 1961944 1974236 1961289 1854667
2823 1854667 1819885 1779022 1716739 1610157 1632996 1634906 1582655 1465941 1515936 1455894 1461627
2812 1461627 1448486 1402927 1354782 1287683 1302053 1258295 1180828 1140888 1205664 1220363 1186077
2801 1186077 1142039 1063907 990632 979392 996116 1002319 1047861 1012865 967535 904845 908219 918303
2789 918303 884861 849672 848436 847045 840964 824805 879852 856589 833232 852868 808496 772671
2777 772671 746393 746075 736616 675730 622966 675180 615417 591097 531945 592378 643058 581311
2765 581311 617302 570559 535630 502687 525355 542063 490093 496704 438630 463948 418676 330110
2753 330110 359020 365780 434622 369698 305810 371689 407231 391530 367239 349436 323654 345559
2741 345559 324146 293368 210492 262547 274064 340065 317061 262709 281194 282729 292382 227842
2729 227842 219430 215206 192032 174534 174754 190894 250876 287763 242227 218732 180884 170629
2717 170629 140109 112400 133666 148178 158641 145607 114068 147400 195214 156846 114718 123198
2705 123198 138361 165548 151737 102013 122231 62372 59721 32978 9678 75481 70505 143438
2693 143438 119007 55586 63586 77096 66891 24788 59117 70097 63093 2969 25847 26045
2681 26045 40200 110889 96740 62433 23479 23705 -11216 -2028 99237 134383 143106 84243
2669 84243 55046 50236 51535 88079 92364 50737 17983 47667 86207 82420 57790 33954 29204
2656 29204 90653 4002 -55920 -10636 -14212 25202 48628 18481 62491 96523 172407 95428
2644 95428 -19026 -49490 -35979 8704 93468 33872 11262 8541 -36346 -22421 -23418 52695
2632 52695 61924 58366 58778 59014 56129 34231 65394 86386 76367 68114 49196 47476 55677 17402
2618 17402 -897 32926 31877 85638 50074 37513 60321 19484 47905 23470 -12264 -45309
2606 -45309 -41633 -52216 -55684 -38386 -30305 -20221 -28911 -11462 -38106 -35425 -68704 10007 64446
2593 64446 67962 1160 -42059 -5182 -11634 -13680 -24656 -40289 -16910 -9611 -7425 -32283 -21585
2580 -21585 -7336 6198 -607 -17981 -47724 -17073 34927 395 -47042 -18705 -5702 18567
2568 18567 68859 22077 -28730 -44205 -66227 -54319 -16128 -27187 -21105 -21719 -20916 -2488 -17979
2555 -17979 29795 -16636 -47013 -72513 -74477 -30851 -34146 -13049 33440 25716 94929 95330 19759
2542 19759 30685 -16966 -56795 17422 -32944 -60739 2203 -15895 -12131 -45900 -59469 -76397
2530 -76397 -82175 -128040 -101967 -61359 9969 -72509 -56951 -32184 -87115 -88229 -44735 -48473
2518 -48473 -51464 -13907 -33760 -65841 -71893 -81869 -44199 -65263 -127809 -143535 -119469 -29360
2506 -29360 -23223 -50457 -62908 -95967 -57511 -24242 -63969 -101576 -115727 -114022 -123540 -129109 -28252
2493 -28252 -8333 -83872 -49358 -37187 -9321 -20342 -46646 -48031 -69307 -96266 -107692 -67182
2481 -67182 -73341 -98675 -135924 -53480 -12860 -81319 -100834 -72626 -72741 -33970 -9603 -59696
2469 -59696 -31429 -37115 -77818 -69557 -76302 -122260 -72014 -29898 6384 -54054 -154031 -139708
2457 -139708 -93260 -102086 -91238 -65204 -63176 -30131 -76216 -95543 -99923 -187804 -99839 -63477
2445 -63477 -118647 -93616 -127200 -151184 -86049 -85938 -113376 -139426 -172596 -99921 -79744 -64977
2433 -64977 -1796 38178 51202 -39401 -122790 -89468 7259 4922 -40649 -66347 -40600 -4002
2421 -4002 -23058 -37033 -95888 -74880 -30788 -79926 -75141 -84455 -135015 -105988 -76602 -49982
2409 -49982 -28609 -25782 -33400 -111825 -82876 -91785 -80767 -76498 -85835 -37847 -47859 -72265 -22372
2396 -22372 -8386 -36601 -24586 -34550 -54094 -75206 -7311 12526 38035 -6738 -30165 13022
2384 13022 9097 -60301 -22718 -47740 -21118 -22271 -3681 7659 -55483 49541 10581 -66606
2372 -66606 -34780 -32553 -15933 -14453 6127 69440 119057 106292 69147 97775 122326 85972
2360 85972 27079 -12472 13861 74160 -11646 -7723 -17570 -66478 20315 51656 -19329 -51397
2348 -51397 -10013 32603 68256 70221 88775 82391 18989 -18750 -68174 -60128 -67298 -107538 -81268
2335 -81268 -94733 -51449 -33688 1381 35749 -24869 -72464 -84747 -46095 -44068 3075 79452
2323 79452 88192 -9652 -3429 -42603 -100462 -81405 -127549 -65711 -15540 9580 -13526 -25308
2311 -25308 25644 -66364 -95972 -33693 -17130 -6089 44679 -18278 -31699 29718 12390 -44272
2299 -44272 -56892 -21737 53951 33721 52260 60961 103031 20270 -17289 14991 -39638 12072
2287 12072 20140 20221 25660 58786 74552 80147 94215 106201 39862 -30437 -11969 37614 8726
2274 8726 -15258 6462 58613 69971 47727 47606 70807 96791 57261 38385 40115 35057 74376
2261 74376 28624 34306 62983 55356 72217 53287 53137 211 41817 56302 45105 54531 77360
2248 77360 36839 -7973 18061 7224 -11751 23154 86676 48702 71404 53259 24071 65012
2236 65012 91556 80884 79986 68883 111119 132355 127671 98319 113254 84019 100222 148958
2224 148958 65501 65227 139539 206256 175756 217069 275086 185938 192760 199380 214623 221008 221430
2211 221430 208365 188009 117287 171594 205890 220191 232472 248482 230414 296500 280042 243253
2199 243253 288440 294625 285053 299538 337275 247514 261615 249711 278555 348707 385692 462784
2187 462784 403880 335291 375611 461296 489197 450794 449005 485542 480021 491007 529781 546289
2175 546289 515406 515673 531551 542455 580083 566056 600339 627862 653153 624294 589557 581622
2163 581622 582253 606614 640828 672253 698204 729101 741807 754265 809151 815134 809021 820951
2151 820951 807983 837258 854243 891640 962189 1053061 1074362 1008946 1067714 1141559 1202227 1271190
2139 1271190 1308672 1354117 1459377 1481868 1564635 1598200 1653169 1695839 1794090 1871094 1966061
2128 1966061 1983861 2074291 2105466 2149101 2160267 2265893 2261962 2385258 2493867 2596543 2736729
2117 2736729 2938117 3113134 3362811 3694375 4017724 4414659 4728752 4940438 5210422 5556897
2107 5556897 6084881 6749173 7650719 8658528 10004025 11588912 13772845 16785319 21068173
2098 21068173 26602180 32138493 33225726 26133238 18527289 13743855 10729549 8646883
2090 8646883 7027466 5843116 5067155 4579071 4196817 3863887 3562986 3388010 3279619
2081 3279619 3111470 2878270 2536103 2254733 2077801 1971685 1824505 1652661 1524637 1382589
2071 1382589 1311926 1245689 1175125 1067601 1016879 936945 911661 883278 892658 786617 749117
2060 749117 708834 664722 653490 639892 551800 487051 504223 531950 479307 501316 450863 438765
2048 438765 480952 477814 405867 441786 425819 343282 387592 367231 370580 341593 321368 291060
2036 291060 235805 263452 246464 240955 225313 206046 198314 180758 182224 182433 230758 222110 197362
2023 197362 272860 229599 196666 211536 186581 174348 161239 136224 45865 49181 73992 53432
2011 53432 23942 115802 118539 68618 121550 103732 77707 73305 155816 166446 101709 64344
1999 64344 108288 75554 26826 84260 44582 -4009 35387 43247 30238 83133 69656 30402
1987 30402 30657 12246 40383 14339 -42526 14238 -3177 -64921 -59688 32234 64158 -2390
1975 -2390 -21550 14269 38947 57542 33455 -1756 35953 9747 47287 28023 3289 3361 -39299
1962 -39299 -46369 32632 45383 -1739 83039 105783 119190 57139 32914 17670 -41645 15716
1950 15716 -102874 -49675 31299 74059 99774 41322 -16652 -27463 2764 -49027 -22247 17668
1938 17668 -36476 -22132 -726 51733 40140 -52039 -56522 -102251 -66190 -21600 8138 23404
1926 23404 24893 14308 39960 89811 47280 54500 25240 -15547 -14271 -25939 -13735 -10252 13973
1913 13973 -2848 7238 -17537 -21112 -39535 -46737 -18984 -55738 -29030 5025 331 -66775
1901 -66775 -35783 9607 -6379 -48504 -69967 -41597 -852 -36840 -58474 -27439 -94893 -107603
1889 -107603 -92262 -94325 -75155 -16175 28567 38593 -35255 -17709 -15364 54871 44472 -74267
1877 -74267 -33524 -24646 -51863 -31777 -67706 -95010 -65645 -18825 -58458 -49209 -34850 48325
1865 48325 -69560 -75457 -26639 -15565 19420 -11931 -56952 -25237 4587 -37376 -59889 -82583
1853 -82583 -69131 -50583 -47076 -16327 -41200 -112437 -100561 -48921 -51573 -91235 -68398 -10200
1841 -10200 -6198 -70818 -31644 -88943 20965 68227 26939 20469 64806 88176 48739 69043
1829 69043 142451 159083 193111 74845 36987 105781 28068 34576 50681 13622 -5771 -44558
1817 -44558 31979 -7269 -17051 -8465 -57379 -43022 -39264 15028 42619 -22177 -57474 -50721 -44929
1804 -44929 -81445 -130723 -100635 9734 6499 37107 53805 2791 7104 -92889 -61451 -134745
1792 -134745 -126025 -80404 -77023 -55707 -54859 -7637 7390 -42247 -83777 -55745 -71846 -89029
1780 -89029 -61919 -94392 -79285 12374 -20924 -34190 -24549 -11223 -55761 -103188 -113395 -61809
1768 -61809 -42529 27283 21515 -25149 -45294 -11802 -8624 -13768 -49445 14597 23574 -9559 -71089
1755 -71089 -142774 -82005 13578 15783 -31254 9798 -54861 -37682 -29558 -17370 -64233 -56006
1743 -56006 -45501 4572 37025 45010 27351 -41354 -66959 -38865 -33148 -40648 -31705 -40415 -40847
1730 -40847 -56608 -74211 -10041 -87079 -136123 -103472 -43500 -16245 -9379 -21145 4453 1371
1718 1371 -23133 161 -17722 5199 -7066 -53785 -128882 -92798 26934 -20061 -78378 -81594
1706 -81594 -117178 -138628 -81405 -80162 -172632 -108065 -76844 -104841 -72480 -22916 39755 -5170
1694 -5170 6897 -13865 -95849 -88753 6487 28813 10862 -62070 -79565 -3821 -11376 -18187 937
1681 937 43546 37815 -14154 20170 10075 10391 13405 -10771 20553 -20025 -81337 -90165 -80809
1668 -80809 -3579 -24288 -113605 -81802 -62915 -33087 -59241 -27027 -6376 -2904 -14902 -46035
1656 -46035 -54493 -73208 -78626 -6613 4561 -20867 -11601 -6056 -33311 4222 -20764 -31433 35690
1643 35690 45623 21566 43132 23009 -9999 -15848 15150 848 -34960 -22469 -86809 -86650 -119331
1630 -119331 -78366 -36421 -37025 11789 -25070 -96003 5573 -29418 -23437 -65648 -105243 -40799
1618 -40799 -110660 -79270 -84729 -47045 -98570 -59521 -23560 -24201 -6567 -25218 -32825 40966 -4015
1605 -4015 9725 47813 -20833 -30514 -49600 -4347 -3448 -22949 -67041 -53459 -34948 39396 29411
1592 29411 -25581 -12156 -51853 -33616 -13720 19632 16685 56216 69818 42272 -27007 -43023
1580 -43023 -42776 -68490 -36476 -45109 -49929 -28487 -11145 -33535 12935 -33025 -67701 -82978 -62296
1567 -62296 -66403 -126165 -81366 -77082 -67617 -99318 -80461 4466 -54483 -25558 -7848 -26036
1555 -26036 -7544 -25850 -52758 -17943 -48765 -107685 -98128 -56290 44660 30420 10008 18861
1543 18861 2541 18360 31107 1633 -82628 -149800 -143062 -78738 -61249 -12101 -23719 -37211
1531 -37211 -1094 -49939 -60407 -81721 -47659 -70117 -71634 -62740 -74157 -40993 -52632 -17964
1519 -17964 16349 -53348 -35232 -19435 -67104 -29116 -10712 -69361 -60163 -42529 19294 48480
1507 48480 9284 -54633 -80544 -69496 -59046 -22967 -53334 -28967 6953 74233 12224 -24709
1495 -24709 4271 46936 95723 -4789 -72125 -79025 -95577 -4518 31949 -55005 -22512 -49306
1483 -49306 -80964 -69954 -122078 -66941 -6246 58420 12401 -8424 -52075 -3439 -18816 -34938
1471 -34938 -10349 -28911 -20635 -6161 -17794 -58947 -48472 -102108 -89632 -52628 -44851 -16486
1459 -16486 -31525 6331 29323 12904 -28983 -63441 -72194 -85647 -147875 -135432 -99678 -72921
1447 -72921 -41423 -71911 -17453 -814 -53725 -64584 -86507 -48172 -70573 -111259 -11979 -45268
1435 -45268 -60318 -95258 -119568 -38832 -7944 18216 17863 -6481 21360 55382 78331 52824
1423 52824 21611 -52998 -47966 3175 -11320 -15423 -79032 -43601 6522 -65523 -30411 -22961
1411 -22961 12229 -47219 -31344 -17932 -8466 -6786 -67469 -94112 -74196 -46136 -32161 -66088
1399 -66088 -82078 -71532 -138071 -97189 -71372 -51123 -36066 -61064 -77492 -144979 -97690 -22756
1387 -22756 -27525 -51457 -37498 -28444 -57303 -46854 -36694 -66501 -76382 -19371 45665 62161
1375 62161 20941 -21433 -13396 -414 -5808 -57555 -37588 -13843 -38820 7489 27659 10257
1363 10257 -37789 -130546 -32255 -21855 -74924 -14973 -34181 6590 -29299 -56781 -53249 -66770
1351 -66770 2860 10804 1369 4788 6987 -30 -16488 20913 -41388 -53677 -39321 -17714 -37459
1338 -37459 -37347 -27864 -42091 -17277 -47531 -39234 -10442 -30942 11166 49793 -5486 -33717 -2887
1325 -2887 -14833 -27892 -48774 -74077 -82923 -54855 -25049 -36133 -697 -12102 -41689 -50095
1313 -50095 -20665 33291 15111 20323 90382 50051 1355 42249 40635 27815 -16179 10325
1301 10325 -5865 14371 -34828 -75721 -41856 -49752 -72257 -60955 29484 48414 -2421 -46638
1289 -46638 -35192 -52154 -69252 -21474 -8126 22978 -9343 -62829 -40717 -4234 -34410 -8412
1277 -8412 -2705 -3687 4649 14284 37860 -28049 3150 27127 51243 25817 35602 3144 -15135
1264 -15135 -10081 -44374 -19304 -9504 -46740 -62893 -63282 -75493 -48425 -3782 76601 40773 -28021
1251 -28021 22732 35428 58901 110690 88250 89625 67340 70334 52446 50247 37619 50559
1239 50559 91604 34157 37934 -21174 -7630 26285 35838 16474 6583 -29786 -34840 -10230 27497
1226 27497 37093 63599 130712 107278 104692 79842 56899 50315 -39968 -70410 -70455 -62353 -74239
1213 -74239 -105194 -61192 -29055 -36135 -72885 -24994 -59903 -95740 -114811 -73069 -33697 -69534
1201 -69534 -42404 1030 43109 87915 73991 96316 120715 26217 29075 58430 12377 20711
1189 20711 -75243 -7644 32484 -35780 -11541 74544 127213 107337 23558 36221 23311 -23564
1177 -23564 -22753 -11148 -13540 -35274 -63602 -91301 -14267 3369 -8580 6970 58955 99271
1165 99271 35340 -96811 -34562 4286 -26426 -135579 -109420 -70512 -49394 -434 1188 -32692
1153 -32692 8129 -71370 -31366 40047 49946 54444 -37751 46192 118722 101788 22043 -81395
1141 -81395 -106928 -79857 11784 8816 -16177 -40874 -23564 18569 27540 25795 -32757 13073
1129 13073 54011 19060 -12042 58264 89954 48564 -5707 5572 20813 25381 6855 3876
1117 3876 -39421 -45044 4236 20297 19918 59116 13016 18012 30137 19680 50185 -32427 -58218
1104 -58218 -66940 -81351 -52438 16346 3743 -60652 -67487 9744 14165 6746 -30584 -63517 14987
1091 14987 41580 -23833 1827 -40159 -71707 -35897 -92085 -24882 -2812 40451 49714 20991
1079 20991 -55054 -54029 -54487 -36460 -7113 -16573 42013 38985 21908 -19628 60723 47225 4948
1066 4948 8737 -34330 -58895 -18121 -29243 -72080 -16471 -28250 -66010 -64812 6416 14618 -2718
1053 -2718 -33585 -29465 18975 22005 50923 19840 -23271 34412 3209 10656 -29602 14047 15372
1040 15372 15724 56821 45140 89876 71229 6169 29470 64123 15228 -2187 -9244 -33808
1028 -33808 -18737 -4353 -33626 18837 -8900 30085 57817 -3611 49019 88245 87981 87196 22996
1015 22996 -24107 4249 56064 39645 -1508 19341 55472 -12227 -34939 -57283 -21269 -1293
1003 -1293 -7995 8225 -20295 78610 48169 -19705 -52128 -38056 -8967 8924 73889 16380
991 16380 70190 101924 16718 16036 22027 71580 73467 26651 -26136 10162 -74049 -65733 -1614
978 -1614 10285 -25009 -12887 24817 236 -47267 -39376 -13894 -19860 -48213 -69184 -13880 -25956
965 -25956 28781 54640 12329 -35655 16105 45368 46288 88025 110412 13511 33566 39926 -3579
952 -3579 -6199 9620 15544 85131 62191 34692 7306 14804 -8369 -60911 -36899 36317 20904
939 20904 -39304 16716 3671 -11058 5932 57386 84564 13656 -58330 -46563 -31376 -70328
927 -70328 -27587 -26204 -7660 8702 -37674 -54016 -55790 14208 33657 -4622 -79671 -51133
915 -51133 9070 37407 -33393 -24206 33605 38481 74139 -15861 2229 34070 62792 115829
903 115829 89500 62260 35754 -27417 66167 109400 82392 136324 103657 -43683 -52175 -34167
891 -34167 -21979 56671 84930 22001 3119 -14412 -17738 -13278 9767 30840 12708 -32403
879 -32403 -61627 -48729 -119589 -80427 -59055 -59806 -71850 -79068 -23257 28596 -24841 -17286 -58635
866 -58635 -31235 -21866 9411 -19396 -39753 -73230 -71549 -646 9590 -68429 -83295 13845
854 13845 43258 17773 23233 36543 42876 50672 34116 63587 65507 80380 88690 16455 -13306
841 -13306 1192 5399 16670 -47090 -93145 -45404 -18655 42671 51391 25011 -17538 9118
829 9118 48393 29915 19434 5276 25960 19406 -19780 10433 -644 -16842 -16809 -35251 -28162
816 -28162 -48436 -10964 -15848 -21133 26615 -5719 45129 35412 -5254 35652 11536 -33093 -52970
803 -52970 -84118 5071 14378 -30207 -60703 3276 64461 21601 16094 76398 87059 16644
791 16644 74696 34475 -65398 -70933 -3273 13304 -9025 -9020 -14861 69196 81571 17898 63066
778 63066 40513 74194 3782 -37474 -23054 11985 -20515 -31103 20477 21051 -5886 -52733
766 -52733 -57745 -66556 -93967 -65937 243 10025 -7614 46345 74667 48653 14191 39065 -7908
753 -7908 -5382 5986 12359 -23956 -59028 -30860 35202 -15292 15050 11126 -68224 -34196 52023
740 52023 55656 12195 22865 -57142 -40308 44438 68965 65343 89 -14919 9183 -19455
728 -19455 44346 34926 5506 14199 -245 -41724 -59478 -48140 -32773 -73365 -65897 -32380 -34828
715 -34828 6813 -6583 -58437 -54533 -15764 -55208 -47169 -14376 -79510 -107089 -21681 11782
703 11782 -55278 17404 -11545 -27357 25993 13306 21462 15841 -10205 25071 2601 19688
691 19688 66142 45903 -7224 -32457 31732 13058 -56876 -51724 -22700 13019 38342 24418
679 24418 30127 -14090 -10155 -5433 2160 4565 -11546 13203 -5841 89363 140066 140328 44073
666 44073 -16250 37051 11609 3553 33277 47389 93313 76092 36809 48247 9640 14109
654 14109 33103 62352 84707 91700 24403 56262 21544 -13784 -48634 -21761 47723 23720
642 23720 -19863 20082 64256 -34723 -38836 -2846 23941 10780 64761 15910 79039 118904
630 118904 86552 109027 46944 8411 4851 -17852 -23120 -37460 -11974 -55126 -116559 -51864
618 -51864 -47659 -58277 -14663 -2669 5565 38485 226 -56952 8268 41320 71061 117687
606 117687 145690 78487 23401 -14753 50796 64201 -29432 -28232 -18924 -21032 9682 38989
594 38989 49685 82830 79598 82003 68679 49525 71838 68194 56611 7853 46607 77288 35217
581 35217 32980 31108 452 33732 86532 99624 86159 -860 -30089 -83406 -72548 -35306
569 -35306 -33730 -29345 -55160 -44999 39572 17750 -8196 23170 47259 12578 30347 8239
557 8239 -33126 27784 -30784 6366 95506 70962 16782 1711 31371 -20855 31477 39246
545 39246 83702 46482 -41173 25630 37766 35749 16636 -53880 -64779 -44669 -7859 -15917
533 -15917 39115 1638 39095 -46450 -8191 46054 39022 24405 43521 -48043 -41356 -13221
521 -13221 46944 72552 -1584 45087 51565 41721 -16779 -35103 -42339 71820 66598 16325 -24449
508 -24449 27625 45682 -16141 -3511 18971 23947 27687 -5274 -3187 26989 38560 -37051 -16424
495 -16424 -11254 74421 93760 102829 64443 44453 18142 37572 -7985 -15907 -12544 21129 77775
482 77775 8499 73376 85712 4478 -27047 12466 16465 -45465 -55812 -29047 83844 7274
470 7274 12629 27205 21310 58035 68835 54408 40412 101671 106439 66020 22655 92441 24659
457 24659 14221 32043 50641 83413 95865 61654 94176 101898 18825 -13971 2873 -44933
445 -44933 2622 4715 17574 44805 59116 64904 34395 80825 25784 15994 10172 36202 63532
432 63532 -24442 39265 24353 -13589 85666 112315 67032 53637 118655 51703 69857 95644
420 95644 50239 -19446 4137 -35359 -6830 14771 40795 31702 25585 26428 -18885 -4615 -8947
407 -8947 32306 59054 6566 -32132 -1647 -39482 -32031 49407 84323 -14223 -17928 -33088 533
394 533 22510 66932 23587 19942 39528 -13854 47144 18853 15524 78526 109893 72692 6512
381 6512 52977 25459 -2314 6176 73488 33531 -7799 -77972 -62278 17812 63932 41770
369 41770 -19265 -30230 -37876 -6616 -3339 19294 -25052 -26914 26495 47950 9748 5222 8942
356 8942 50998 79725 57538 56989 88147 47878 27990 43194 86937 48379 53752 13024 -93429
343 -93429 -54810 -10679 15429 1723 11692 113606 143592 95834 81905 74598 15176 46184
331 46184 27132 4272 -42804 7089 10120 11463 18045 -14557 86165 60844 45170 23311
319 23311 3325 -23127 -18792 -35494 19734 22997 -10059 15336 -11798 58061 103776 61565
307 61565 66357 46186 -33723 8458 4198 -48083 18399 -45480 -62081 2167 -7028 -19014 16733
294 16733 19458 -22862 49318 104981 52348 35905 24726 -19036 -25830 -18433 -22689 26183 4228
281 4228 38296 47654 14864 49824 76584 48093 -139 29649 25727 32802 -6671 -43901 -36392
268 -36392 1926 53584 88050 59745 86983 74399 27611 37305 32936 24012 -1951 -20768 32475
255 32475 16956 35724 -31986 -82113 -8297 10722 36633 24868 78256 81234 93587 117412
243 117412 56211 8475 19799 25781 60882 83036 66781 -38497 15948 100908 130783 57641
231 57641 47471 43602 5008 -39173 -10632 -23576 -26715 -37514 23346 -1256 -52507 51189
219 51189 64468 24971 55635 27861 -9200 -6863 -37590 30870 16622 40672 57509 90828
207 90828 92280 80053 6886 -35542 -42411 35 34809 33799 30834 31171 25257 22345 -11900 34852
193 34852 22733 51496 67969 103217 9423 18267 71555 70464 102643 105170 78442 58727 55444
180 55444 48571 34991 44907 -7108 -17539 -6774 13302 74433 74255 36150 16182 52937 43955
167 43955 18577 69549 27962 8320 97672 9766 34872 12952 688 67149 40508 -14746
155 -14746 -28708 10991 13818 -2871 53072 68349 10260 -5203 19331 -2864 38848 45519
143 45519 13420 91465 96243 14495 12868 -6304 26809 40410 41932 41439 79381 114656 148372
130 148372 105645 12540 14049 16607 1664 36138 53943 63732 30760 40776 79975 39508
118 39508 -29905 -2892 33775 20226 8144 -7058 25498 69490 50112 9246 13284 39819
106 39819 38535 6019 10319 -18610 -21548 3980 -32 -11263 -5692 -31214 2798 45550 77230
93 77230 152888 146766 125536 72804 70385 60347 78883 35215 71526 95346 54739 106429 46596
80 46596 29599 9092 8859 34269 24825 45014 59902 79936 65670 82573 105774 33772 -9303
67 -9303 -25767 -27042 -14594 33307 38860 40032 17208 24099 29797 48314 52655 779 13098 41604
53 41604 35827 40805 53944 62694 76910 42171 31443 27648 29833 52802 43433 84951 85766 87455
39 87455 71839 15316 14794 -10042 8077 38932 69371 53235 -25357 -18276 20027 48060 36341
26 36341 66250 37653 31463 49179 51461 44154 42376 66160 25174 4316 -588 -486 38352 63939
12 63939 69318 85487 78776 102476 83703 40181 26139 54029 56462 51070 24389 28144
0 28144
$$ Imaginary data points
##PAGE= N=2
##DATA TABLE= (X++(I..I)), XYDATA
16383 -721202 -733591 -720701 -705012 -698147 -647540 -623058 -626646 -619082 -585054 -595808 -559089 -522901
16371 -522901 -515902 -526093 -538572 -498867 -456668 -425298 -404264 -363776 -324953 -366545 -357875 -331766
16359 -331766 -338903 -332149 -265294 -253479 -308799 -310283 -235621 -199027 -164986 -112944 -109229 -184136
16347 -184136 -186645 -104656 -43523 -46672 6081 -30760 -46580 -38023 -14847 -9677 24434 104955
16335 104955 116691 105923 66921 116220 162987 159543 168529 166156 188294 224241 234945 272718
16323 272718 279943 291587 277569 296327 307632 327706 342693 314586 313078 400148 404344 401373
16311 401373 474599 547702 544025 519508 558365 577069 546167 583612 559829 550791 601693 609205
16299 609205 626091 619641 579972 612511 622239 683484 689375 680570 654124 678280 743612 721746
16287 721746 692515 679964 705050 758924 791994 803375 774449 850304 861188 841827 869503
16276 869503 884091 913744 986355 978404 962619 962266 980419 1001773 1023915 1007033 1000726 1017272
16264 1017272 1008773 1009356 1015166 1083458 1083327 1092281 1103006 1083287 1072394 1098422 1178815 1192634 1115995
16251 1115995 1162882 1138363 1137328 1151180 1208524 1241110 1268429 1225212 1186968 1155077 1257953
16240 1257953 1243703 1220063 1249886 1277689 1301617 1291662 1284517 1341897 1397224 1379307 1401116 1375559
16228 1375559 1340840 1364386 1390052 1320298 1367276 1399611 1378086 1451732 1497331 1464689 1416876
16217 1416876 1423710 1458287 1541207 1561034 1520694 1489330 1491212 1462184 1484725 1491862 1517405 1563653
16205 1563653 1581308 1612740 1555089 1571332 1569441 1591919 1559128 1611643 1654816 1632706 1684032
16194 1684032 1688529 1664060 1708910 1670715 1607078 1602091 1608248 1670123 1694121 1674113 1686654 1672794
16182 1672794 1646750 1625911 1700452 1721056 1708452 1662646 1694104 1680764 1677911 1666315 1704053
16171 1704053 1725833 1699090 1737138 1692352 1731255 1814641 1793021 1773122 1874622 1801736 1793451
16160 1793451 1790394 1732832 1695578 1743012 1773469 1771927 1778978 1823945 1811662 1810479 1820031 1825030
16148 1825030 1813438 1828365 1837278 1830152 1838438 1816282 1837890 1878644 1908092 1838106 1818390 1831480
16136 1831480 1832869 1852219 1832710 1869792 1880974 1850572 1839008 1868452 1841475 1879958 1876007 1852517
16124 1852517 1820192 1854771 1839103 1842842 1831699 1780482 1758877 1811251 1834111 1816515 1863057
16113 1863057 1870559 1884367 1870622 1890436 1883281 1930982 1834623 1828061 1819412 1840383 1863917 1889980
16101 1889980 1923062 1904810 1892008 1885641 1907832 1929523 1929651 1938991 1930507 1944568 1971381 1951936
16089 1951936 1904638 1959465 1948257 1895652 1904596 1943596 1944182 1924028 1858847 1887424 1923949 1941349
16077 1941349 1936482 1933257 1938670 1995167 2029710 2017681 1965358 1976220 1938277 1911318 1980472 2004872
16065 2004872 1966721 1922205 1938632 1973896 1899200 1898254 1848430 1929967 1992967 1944607 1970507 1946960
16053 1946960 1987067 1929353 1912767 1936459 1928714 1942556 1990851 1973721 1987360 1964333 1878244
16042 1878244 1870140 1906396 1930549 1990858 2007590 1997632 1970985 1954376 2011051 1981022 1972348 1990308
16030 1990308 1942484 1944254 1904923 1950295 1959227 1951229 1983423 2008674 2026522 2025046 1953090 1954229
16018 1954229 1921652 1967871 1963750 2015943 1990240 1972999 1951738 2005893 2028098 2017674 1953901
16007 1953901 1962995 2009075 1986584 1927634 1907796 1929227 1982761 1958785 1983705 2015620 1947921
15996 1947921 1900076 1894305 1944451 1937354 1927202 1929090 1964539 1927446 2001516 2080833 2059590 2001357
15984 2001357 1997564 2027103 1989840 1959638 1925466 1924661 1942851 1936664 1959048 1915118 2010680 2033087
15972 2033087 1939059 1968139 1955700 1918685 1912195 1964398 1956857 1886391 1935712 1979808 2020607 1954909
15960 1954909 1961987 1939350 1959666 1955725 1962786 1968808 2000970 1984562 1972353 1979237 1998872 2018017
15948 2018017 2004061 2003669 1982223 2019073 2040667 1999149 2008985 2032689 1992439 1952504 1958617 2028816
15936 2028816 2082431 1988482 1971832 1962732 1971235 2023138 2047809 2014093 1904937 1945141 1924604
15925 1924604 1943806 1972108 1964399 1985266 1956283 1937106 1914582 1948558 1987151 2048696 2030826
15914 2030826 1970984 1929277 1963203 2033440 2027579 1979073 1996712 2064992 2058544 2095374 2061993 2064248
15902 2064248 2013363 1983971 1974048 1913362 1964029 1996218 2005933 1939713 1940934 1933442 1962468 1981326
15890 1981326 1967665 1930868 1950098 1998773 1991756 1980298 1959909 2022347 2021587 2078816 2010455 1968075
15878 1968075 2022952 2018458 2003673 2012281 2036495 1986049 1971066 2022490 1953588 1965048 1990124 2009658
15866 2009658 2010333 2034020 2043810 2033550 2014145 2060233 2032435 2020761 2002423 2026514 2026971 2005198
15854 2005198 2091700 2100648 2095351 2050536 2050678 2014751 2003987 1989814 1970199 1978124 2044461 2053145
15842 2053145 2057884 2052230 2016747 1998769 2039768 2056404 2068880 2060557 2037602 2081098 1979431 1929433
15830 1929433 1963799 2013778 2072723 2055709 2056474 2046989 2015230 2023987 2043738 1996282 1954958 1932813
15818 1932813 2037994 2088598 2023081 2044107 2079673 2036622 2065299 2049542 2017346 2011681 1972720
15807 1972720 2034453 2045597 2006443 2019323 2088950 2009159 1944961 2033586 2103623 2042701 1992783
15796 1992783 2033391 2063879 2073499 2044537 2033565 2047144 2030358 2029957 2043236 2015434 2031641 2024815
15784 2024815 1995199 2011960 2022303 2018916 2027636 2023480 2048075 2037279 2018608 2044503 2048467 2033595
15772 2033595 2049826 2026376 1993729 2017628 2057856 2026441 2005630 2025955 2108157 2047580 2006121
15761 2006121 2042197 2051412 2090167 2052462 2017480 1987525 2000495 2002136 1979210 1989758 2012953 1996170
15749 1996170 2019523 1965085 2011508 2010647 2031428 2066247 2072430 2057305 1973428 1933729 1967432 2002863
15737 2002863 2035974 2047693 2016992 2062020 2042624 2036617 2078954 2091064 2059253 2113105 2080227
15726 2080227 2098718 2093950 2024730 2045190 2051949 2070364 2139852 2115015 2040148 2036363 2069915 2157470
15714 2157470 2149512 2137532 2096588 2051669 2041763 2049472 1981291 1951635 1987466 2023840 2006027 1943522
15702 1943522 1947596 2036358 2039254 2007998 1992537 2003196 2007425 1991085 1960493 2008223 1922767 1970531
15690 1970531 2054776 1949260 2012830 1994249 2048804 2050131 2074933 2116095 2091143 2109852 2119028
15679 2119028 2094578 2082209 2052361 2048390 2057952 2142481 2091679 1968100 1926547 1932256 1966211 2034609
15667 2034609 2039201 2039502 2032938 2057527 2143216 2153579 2181417 2050135 2017842 1989831 1952379 2035988
15655 2035988 2108943 2095246 2074069 2022675 2063639 2049931 2068697 2082965 2025510 2068954 2080745
15644 2080745 2051034 2040182 2092238 2109978 2139686 2088796 2086595 2059117 2041868 2024258 2057762
15633 2057762 2064597 2028124 1983480 2003124 2103467 2112270 2088048 2051659 1990531 2001995 2038887
15622 2038887 2021014 2065831 1991845 1984158 2037063 1992381 2017311 2032921 2057382 2034336 1992671
15611 1992671 1992585 1997151 2061422 2065973 2018780 2043871 2071864 2104061 2101333 2132981 2171388 2121104
15599 2121104 2084638 2070515 2015084 1994155 2031955 2086255 2063412 2041263 2062156 2030744 2043782
15588 2043782 2029166 2040689 2056990 2094507 2091410 2040732 2026536 2001820 2014536 2003966 2092138
15577 2092138 2095557 2071259 2069622 2079836 2078545 2062010 2080347 2064072 2066399 2045451 2074798 2125452
15565 2125452 2082754 2051579 2063234 2096288 2113852 2075762 2122162 2204401 2170251 2114227 2125931
15554 2125931 2171647 2120021 2097979 2045638 1997998 2033454 2054396 2056180 2049456 2077392 2043293 2083716
15542 2083716 2072386 2051654 2030015 2033773 2081271 2122838 2087251 2103685 2152270 2182217 2152749
15531 2152749 2112177 2130864 2132166 2168731 2172759 2117410 2134277 2163924 2118695 2073536 2102307 2069996
15519 2069996 2074561 2086522 2054534 2066998 2073200 2066373 2094675 2100023 2059859 2027697 2079714 2085587
15507 2085587 2091084 2103397 2143920 2084952 2049176 2037858 2085702 2025535 2042063 2099078 2153680
15496 2153680 2155509 2123711 2083437 2070927 2109553 2136918 2134377 2043787 2093789 2072497 2007269 2039906
15484 2039906 2086153 2087960 2117592 2103492 2097708 2076704 2194749 2115365 2042890 2032502 2112906
15473 2112906 2101439 2057810 2000843 2115309 2148473 2185374 2214139 2208482 2208939 2184367 2148456 2154852
15461 2154852 2153682 2043130 2087850 2073342 2076321 2100902 2111610 2029328 2036661 2106441 2109136 2065629
15449 2065629 2023132 2042578 2059884 2062518 2061211 2106908 2077557 2119597 2147725 2126405 2073903 2090968
15437 2090968 2120795 2108620 2162109 2101604 2082734 2071239 2099172 2134324 2096220 2101861 2118109
15426 2118109 2160328 2175127 2145613 2106121 2092956 2115425 2139959 2074629 2099438 2174778 2120727
15415 2120727 2148651 2111850 2123361 2097052 2129395 2144707 2119575 2068795 2115479 2164312 2119714
15404 2119714 2062087 2060919 2049622 2047568 2044184 2038499 2061578 2040458 2063794 2049977 2067976 2096273
15392 2096273 2132563 2120624 2104374 2113936 2116912 2118726 2146377 2166502 2134206 2167907 2204931 2122219
15380 2122219 2110212 2106696 2126335 2166192 2106733 2090218 2084913 2089652 2078002 2101534 2104901 2063363
15368 2063363 2108001 2179623 2203685 2162706 2090790 2053461 2079981 2015096 2038347 2080837 2166439
15357 2166439 2150313 2210175 2176068 2088671 2135208 2158834 2155444 2092423 2094690 2150244 2152726 2166581
15345 2166581 2202799 2168727 2150098 2174111 2135762 2102429 2080264 2138861 2137004 2135513 2180247 2147492
15333 2147492 2181682 2137127 2102532 2085775 2105468 2102815 2125053 2048322 2011765 2106019 2173006
15322 2173006 2148736 2163084 2129746 2142726 2083193 2092010 2090116 2116570 2088446 2159077 2123861 2062911
15310 2062911 2085753 2126884 2133756 2124438 2164585 2169136 2212261 2181619 2210722 2165461 2134335 2089437
15298 2089437 2102905 2102920 2043355 2130330 2162734 2124089 2148968 2122918 2171528 2182445 2129015 2140042
15286 2140042 2148669 2131416 2169599 2184369 2227234 2218617 2209179 2248060 2261548 2208648 2199764 2179099
15274 2179099 2159374 2230697 2167331 2137785 2165138 2170250 2162242 2101555 2107360 2064433 2172605 2219074
15262 2219074 2217508 2204502 2127608 2118364 2191513 2232744 2176712 2218362 2162331 2112680 2118752 2115141
15250 2115141 2142579 2167477 2133209 2171759 2169956 2184560 2176363 2132206 2094798 2047742 2127272 2154875
15238 2154875 2126363 2161594 2159581 2126496 2122759 2167229 2191815 2171135 2193242 2124100 2182743 2136256
15226 2136256 2119755 2129603 2090435 2115473 2119203 2098548 2146090 2171801 2146166 2102404 2104876 2136600
15214 2136600 2175201 2195112 2089089 2009985 2115397 2167771 2196728 2133118 2104308 2120286 2038569
15203 2038569 2115756 2176783 2188002 2218935 2271286 2207589 2172231 2131541 2186591 2152221 2145775
15192 2145775 2207779 2226316 2170838 2159181 2222354 2200021 2178133 2186061 2149944 2154786 2214737 2200021
15180 2200021 2191146 2159007 2166243 2140621 2103616 2123189 2181185 2115665 2148359 2160056 2153288 2174889
15168 2174889 2189456 2230326 2129983 2157225 2166523 2175664 2223790 2192573 2132958 2085174 2075573 2107466
15156 2107466 2172121 2164683 2190502 2212920 2158229 2184734 2194316 2239945 2265441 2243592 2170915 2111806
15144 2111806 2105833 2125191 2086345 2143939 2180327 2203555 2228104 2174267 2161486 2120697 2126048 2122500
15132 2122500 2119666 2135982 2217211 2240739 2253046 2283781 2302891 2247516 2289561 2282283 2261762 2243778
15120 2243778 2167275 2160488 2177654 2255650 2265173 2229343 2250150 2196745 2124270 2154580 2216012 2235774
15108 2235774 2198091 2196376 2162353 2203142 2223372 2221942 2256024 2263188 2294690 2233900 2193123 2223211
15096 2223211 2182331 2194041 2197653 2154212 2152911 2169550 2175001 2181321 2210606 2207764 2268484 2220432
15084 2220432 2142461 2203306 2167566 2134828 2110044 2178423 2250952 2287444 2250253 2196990 2195148
15073 2195148 2275348 2253668 2252250 2232076 2214148 2235029 2198035 2201246 2217014 2252510 2274508 2232707
15061 2232707 2272081 2228708 2166416 2172254 2149542 2182383 2154378 2207058 2237104 2207297 2192193
15050 2192193 2161710 2212805 2216445 2217329 2226909 2195915 2188673 2213174 2257547 2226398 2210076 2185195
15038 2185195 2220972 2220088 2274582 2214870 2189753 2165519 2168425 2155022 2217338 2211985 2217677 2144224
15026 2144224 2122966 2139722 2175268 2195767 2195789 2223504 2181259 2254442 2248682 2235011 2217692 2241206
15014 2241206 2212505 2233633 2188558 2194438 2258235 2217313 2200757 2186671 2206834 2189729 2193875 2260223
15002 2260223 2191062 2238488 2223586 2232895 2219835 2186038 2208281 2197578 2272630 2310131 2332212
14991 2332212 2295412 2275007 2280591 2201995 2175642 2236014 2235589 2265980 2243655 2276782 2277472 2207271
14979 2207271 2187915 2221145 2287191 2248328 2286603 2238581 2238191 2276856 2226405 2264474 2295676 2217417
14967 2217417 2277326 2312247 2266203 2240067 2249932 2276122 2268910 2243197 2212509 2238015 2267650 2258983
14955 2258983 2245703 2264128 2260256 2287540 2277319 2175329 2187216 2208323 2274014 2269473 2254062
14944 2254062 2250259 2201467 2235884 2205427 2185513 2218326 2248639 2256086 2265715 2247615 2271499 2271645
14932 2271645 2255878 2235292 2281833 2225959 2192736 2248618 2278110 2217514 2232233 2274541 2233814
14921 2233814 2204866 2233845 2291733 2352614 2321257 2225691 2197769 2240964 2201019 2139429 2154736
14910 2154736 2208461 2263849 2275438 2279546 2290560 2291257 2215348 2250611 2280816 2216015 2229157 2247397
14898 2247397 2260516 2223321 2292320 2212659 2199376 2254899 2236430 2246252 2269934 2323202 2320461 2345703
14886 2345703 2301377 2270001 2275443 2232991 2231010 2247416 2340188 2327282 2238482 2253091 2284314 2300278
$$ [...]
##END NTUPLES=NMR SPECTRUM
##END=
