##TITLE=1H_TG-2340-XIIb
 CDCl3
 8 sc, 
 13.7.2023
##JCAMPDX= 6.0         $$ Bruker NMR JCAMP-DX V2.0
##DATA TYPE= NMR SPECTRUM
##DATA CLASS= NTUPLES
##ORIGIN= UXNMR, Bruker Analytische Messtechnik GmbH
##OWNER= root
$$ XWIN-NMR		Version 3.5
$$ Thu Jul 13 14:05:44 2023 Russian Standard Time (UT+4h)  she@DPX200
##.OBSERVE FREQUENCY= 200.13135
##.OBSERVE NUCLEUS= ^1H
##.ACQUISITION MODE= SIMULTANEOUS
##.ACQUISITION SCHEME= undefined
##.AVERAGES= 8
##.DIGITISER RES= 18
##SPECTROMETER/DATA SYSTEM= spect
##.PULSE SEQUENCE= zg30
##.SOLVENT NAME= CDCl3
##.SHIFT REFERENCE= (INTERNAL, CDCl3, 0, 15.7502)
##AUDIT TRAIL= $$ (NUMBER, WHEN, WHO, WHERE, WHAT)
$$ ##TITLE= Audit trail, XWIN-NMR		Version 3.5
$$ ##JCAMPDX= 5.01
$$ ##ORIGIN= Bruker BioSpin GmbH
$$ ##OWNER= she
$$ F:/spectra/data/she/nmr/H-F/1/pdata/1/auditp.txt
$$ ##AUDIT TRAIL=  $$ (NUMBER, WHEN, WHO, WHERE, WHAT)
(   1,<2023-07-13 14:04:28.65 +0400>,<she>,<DPX200>,
      <created by zg, POWCHK disabled, PULCHK disabled
       configuration hash MD5:
       00 E9 B6 7A A2 85 ED C7 34 08 36 98 17 FE 4E 26
       data hash MD5: 16K
       B5 BF D6 D4 EC 98 54 21 04 3A 8A EB 4F 11 AB 86>)
(   2,<2023-07-13 14:04:31.64 +0400>,<she>,<DPX200>,
      <Start of raw data processing
       efp BC_mod = 2 LB = 0.24 FT_mod = 6 PKNL = 1 PHC0 = -20994.77 PHC1 = 11.45272 SI = 16K 
       data hash MD5: 16K
       DF 56 72 ED D0 ED 42 FF 12 2C 79 B0 82 F5 E2 83>)
(   3,<2023-07-13 14:04:48.67 +0400>,<she>,<DPX200>,
      <pk PHC0 = 3.680161 PHC1 = 0.2 
       data hash MD5: 16K
       D9 8B 6D 00 4C 81 81 89 3A C5 ED 84 0A B2 BD F6>)
(   4,<2023-07-13 14:04:51.84 +0400>,<she>,<DPX200>,
      <abs ABSG = 5 
       data hash MD5: 16K
       8E 95 76 08 3A 8F B3 1A AE 79 8C F0 B7 30 B0 74>)
$$ ##END=
$$ 
$$ hash MD5
$$ D2 D1 01 B1 63 82 0F DE C8 AB 88 00 27 09 D8 6E
##$RELAX= 
##$RELAX= 
##$RELAX= 
##$RELAX= 
##$RELAX= 
##$RELAX= 
$$ Bruker specific parameters
$$ --------------------------
##$DU= <F:/spectra>
##$EXPNO= 1
##$NAME= <H-F>
##$PROCNO= 1
##$TYPE= <nmr>
##$USER= <she>
##$AMP= (0..31)
100 100 100 100 100 100 100 100 100 100 100 100 100 100 100 100 100 100 
100 100 100 100 100 100 100 100 100 100 100 100 100 100 
##$AQSEQ= 0
##$AQ_mod= 1
##$AUNM= <au_zg>
##$AUTOPOS= <>
##$BF1= 200.13
##$BF2= 200.13
##$BF3= 200.13
##$BF4= 200.13
##$BF5= 200.13
##$BF6= 200.13
##$BF7= 200.13
##$BF8= 200.13
##$BYTORDA= 1
##$CFDGTYP= 0
##$CFRGTYP= 5
##$CHEMSTR= <none>
##$CNST= (0..31)
1 1 145 1 1 1 1 1 1 1 1 1 1 1 1 1 1 1 1 1 1 1 1 1 1 1 1 1 1 1 1 1 
##$CPDPRG= <>
##$CPDPRG1= <>
##$CPDPRG2= <>
##$CPDPRG3= <>
##$CPDPRG4= <mlev>
##$CPDPRG5= <mlev>
##$CPDPRG6= <mlev>
##$CPDPRG7= <mlev>
##$CPDPRG8= <mlev>
##$CPDPRGB= <>
##$CPDPRGT= <>
##$D= (0..31)
0 1.2 0 0 0 0 0 0 0 0.06 0 0.03 0 0 0 0 0.0002 0 0 0 0 0 0 0 0 0 0 0 0 
0 0 0 
##$DATE= 1689242668
##$DBL= (0..7)
120 120 120 120 120 120 120 120 
##$DBP= (0..7)
150 150 150 150 150 150 150 150 
##$DBP07= 0
##$DBPNAM0= <>
##$DBPNAM1= <>
##$DBPNAM2= <>
##$DBPNAM3= <>
##$DBPNAM4= <>
$$ [...]
##$SUBNAM3= <"">
##$SUBNAM4= <"">
##$SUBNAM5= <"">
##$SUBNAM6= <"">
##$SUBNAM7= <"">
##$SUBNAM8= <"">
##$SUBNAM9= <"">
##$SW= 18.05172834244
##$SWIBOX= (0..15)
0 0 2 0 0 0 0 0 0 0 0 0 0 0 0 0 
##$SW_h= 3612.71676300578
##$TD= 16384
##$TD0= 1
##$TE= 0
##$TE2= 300
##$TE3= 300
##$TEG= 300
##$TL= (0..7)
0 120 120 120 120 120 120 120 
##$TP= (0..7)
150 150 150 150 150 150 150 150 
##$TP07= 0
##$TPNAME0= <>
##$TPNAME1= <>
##$TPNAME2= <>
##$TPNAME3= <>
##$TPNAME4= <>
##$TPNAME5= <>
##$TPNAME6= <>
##$TPNAME7= <>
##$TPOAL= (0..7)
0.5 0.5 0.5 0.5 0.5 0.5 0.5 0.5 
##$TPOFFS= (0..7)
0 0 0 0 0 0 0 0 
##$TUNHIN= 0
##$TUNHOUT= 0
##$TUNXOUT= 0
##$USERA1= <user>
##$USERA2= <user>
##$USERA3= <user>
##$USERA4= <user>
##$USERA5= <user>
##$V9= 5
##$VALIST= <valist>
##$VCLIST= <CCCCCCCCCCCCCCC>
##$VD= 0
##$VDLIST= <DDDDDDDDDDDDDDD>
##$VPLIST= <PPPPPPPPPPPPPPP>
##$VTLIST= <TTTTTTTTTTTTTTT>
##$WBST= 1024
##$WBSW= 4
##$XGAIN= (0..3)
0 0 0 0 
##$XL= 0
##$YL= 0
##$YMAX_a= 272744
##$YMIN_a= -367077
##$ZGOPTNS= <>
##$ZL1= 120
##$ZL2= 120
##$ZL3= 120
##$ZL4= 120
##$ABSF1= 15.7524
##$ABSF2= -2.299449
##$ABSG= 5
##$ABSL= 3
##$ALPHA= 0
##$AQORDER= 0
##$ASSFAC= 0
##$ASSFACI= 0
##$ASSFACX= 0
##$ASSWID= 0
##$AUNMP= <proc_1d>
##$AZFE= 0.1
##$AZFW= 0.1
##$BCFW= 0
##$BC_mod= 2
##$BYTORDP= 0
##$COROFFS= 0
##$CY= -3
##$DATMOD= 1
##$DC= 0
##$DFILT= <>
##$DTYPP= 0
##$F1P= 0
##$F2P= 0
##$FCOR= 1
##$FTSIZE= 16384
##$FT_mod= 6
##$GAMMA= 0
##$GB= 0
##$INTBC= 1
##$INTSCL= 3.70164e-10
##$ISEN= 128
##$LB= 0.24
##$LEV0= 0
##$LPBIN= 0
##$MAXI= 10000
##$MC2= 0
##$MEAN= 0
##$ME_mod= 0
##$MI= 1.114404
##$NCOEF= 0
##$NC_proc= -6
##$NLEV= 6
##$NOISF1= 3.799351
##$NOISF2= 2.8
##$NSP= 0
##$NTH_PI= 0
##$NZP= 0
##$OFFSET= 15.75019
##$PC= 1
##$PHC0= -20991.09
##$PHC1= 11.65272
##$PH_mod= 1
##$PKNL= yes
##$PPARMOD= 0
##$PSCAL= 0
##$PSIGN= 0
##$REVERSE= no
##$SF= 200.130004271628
##$SI= 16384
##$SIGF1= 3
##$SIGF2= 2
##$SINO= 5.538805
##$SIOLD= 16384
##$SREGLST= <1H.CDCl3>
##$SSB= 0
##$STSI= 16384
##$STSR= 0
##$SW_p= 3612.71676300578
##$SYMM= 0
##$S_DEV= 0
##$TDeff= 16384
##$TDoff= 0
##$TI= <>
##$TILT= no
##$TM1= 0
##$TM2= 0
##$TOPLEV= 0
##$USERP1= <user>
##$USERP2= <user>
##$USERP3= <user>
##$USERP4= <user>
##$USERP5= <user>
##$WDW= 1
##$XDIM= 16384
##$YMAX_p= 451382855
##$YMIN_p= -641354
$$ End of Bruker specific parameters
$$ ---------------------------------
##NTUPLES= NMR SPECTRUM
##VAR_NAME=  FREQUENCY,     SPECTRUM/REAL,   SPECTRUM/IMAG
##SYMBOL=    X,             R,               I
##VAR_TYPE=  INDEPENDENT,   DEPENDENT,       DEPENDENT
##VAR_FORM=  AFFN,          ASDF,            ASDF
##VAR_DIM=   16384,         16384,           16384
##UNITS=     HZ,            ARBITRARY UNITS, ARBITRARY UNITS
##FACTOR=    0.220516191357247, 1,           1
##FIRST=     3152.0855481883, 0,             0
##LAST=      -460.631214817481, 0,           0
##MIN=       -460.631214817481, -641354,     0
##MAX=       3152.0855481883, 451382855,     0
$$ Real data points
##PAGE= N=1
##DATA TABLE= (X++(R..R)), XYDATA
$$ [...]
9281 2449635 2438828 2398557 2365187 2467535 2516322 2453855 2462748 2507487 2477899 2430976 2397155
9270 2397155 2423573 2466468 2399163 2314224 2347898 2231079 2212476 2186781 2256091 2328671 2247343
9259 2247343 2214781 2190484 2182710 2180737 2126543 2059230 2070079 2116774 2115310 2169181 2147440 2132429
9247 2132429 2044289 2125846 2188732 2263495 2254695 2238625 2235454 2246605 2245830 2255479 2375346 2322511
9235 2322511 2392287 2220557 2205266 2330204 2299159 2210213 2214286 2178147 2161966 2062960 1999639
9224 1999639 2015346 2092420 2016660 2116922 2160591 2050353 2070666 2071101 2055522 2061369 2087049 2101858
9212 2101858 2077707 2183173 2190341 2208971 2354660 2299855 2262837 2370256 2359733 2315205 2303701
9201 2303701 2334062 2395753 2513384 2488419 2467752 2578958 2629980 2643674 2586919 2562314 2544707
9190 2544707 2607953 2655117 2666240 2656269 2674273 2678138 2782196 2757388 2860154 2876995 2906760
9179 2906760 3116913 3247250 3283946 3360769 3481290 3427426 3382780 3459847 3573115 3471959
9169 3471959 3538399 3575460 3622332 3662066 3719307 3811040 3817700 3854982 4034819 4031347 4011067 4072288
9157 4072288 4058982 4195165 4332372 4339269 4273588 4332942 4475584 4605285 4669237 4724551 4979517
9146 4979517 5059853 5122959 5370089 5519138 5594273 5640232 5741218 5799193 5809905 5951481 6088084
9135 6088084 6187451 6281595 6497058 6562562 6689556 6762712 6822088 6986569 7158343 7271695
9125 7271695 7433466 7701686 7972734 8177494 8279179 8461179 8829960 9186574 9508007 9825716
9115 9825716 10110078 10329903 10608758 10996110 11434189 11742742 12079658 12401622 12755586 13075961
9105 13075961 13377012 13801493 14175470 14636819 15064402 15677765 16283851 16708102 17191042
9096 17191042 17851160 18490480 19344811 20292475 21301394 22293395 23426602 24848313 26487466
9087 26487466 28556359 31464589 34922718 38870149 42389069 45754422 49974073 55820033
9079 55820033 63111412 69004898 70403156 69557030 70125112 73341107 80080915 86456553
9071 86456553 87441942 83816965 75688278 66360558 58754108 53225965 50083651 48601302
9063 48601302 48158396 47344003 45229734 42497036 40099787 38354813 37311584 36965748 36940774
9054 36940774 37386937 38375668 39788947 41666648 44321890 48213945 53371915 58892731
9046 58892731 63724946 68777081 73792481 77158115 79260723 82813072 89289104 98184282
9038 98184282 103727223 104752596 105152250 104973510 104285774 101380019 91956988 79364508
9030 79364508 67485848 57598605 50210734 44710758 40652785 37644994 35460070 33903112
9022 33903112 32493674 30260742 27820535 25522249 23644439 22051834 20881982 19943015
9014 19943015 19099838 18004442 17102262 16474462 16013127 15848019 15786255 15636918 15449799
9005 15449799 15399950 15469883 15473887 15238301 15204448 15422495 15866938 15941561 15833514 15736201 15632327
8994 15632327 15501957 15213525 14435918 13451433 12512567 11650218 10792593 10307945 9866500
8985 9866500 9451493 9321955 9255910 9171477 8910399 8601793 8387602 8121384 7818194 7532419
8975 7532419 7134229 6734051 6400292 6071677 5907690 5902508 5668832 5492825 5373406 5343635
8965 5343635 5126524 5101626 4994406 4897933 4914837 4842402 4696535 4693704 4794511 4575518 4594699
8954 4594699 4489110 4428278 4423059 4449388 4269672 4313452 4325829 4328327 4279748 4409113 4376532
8943 4376532 4370800 4428726 4397054 4406584 4306737 4375786 4385801 4497754 4513184 4488713 4507896 4513202
8931 4513202 4552077 4562902 4530774 4666318 4722301 4773690 4712557 4753316 4879629 4955890 5060266
8920 5060266 4983581 4965334 5076658 5127605 5313127 5430254 5517232 5603532 5754779 5898712
8910 5898712 5929407 6032110 6150968 6196269 6384554 6342255 6453096 6578691 6657755 6766790
8900 6766790 6942684 7086505 7186700 7332071 7466125 7550284 7621032 7756758 7875031 8104211
8890 8104211 8310122 8487465 8716243 8800414 8996062 9301866 9573197 9785674 10131059 10374316
8880 10374316 10492774 10824106 11193902 11596935 11847216 12220630 12648285 13102185 13515605
8871 13515605 13878638 14462902 15041679 15479087 15897099 16513121 17034846 17659566 18207467
8862 18207467 18746322 19652223 20679170 21995403 23631005 25597689 28127800 30651610
8854 30651610 32596913 34508714 37042228 40822473 45708734 50026166 52928589 55683443
8846 55683443 58669107 60140152 58019001 53040061 47774701 43858491 41777380 41027666
8838 41027666 41609183 42739342 42904103 41852332 40405515 39147006 38388526 37848989 37233260
8829 37233260 37023157 37390137 38258602 39847287 42160837 44846078 47151451 48995198 51166741
8820 51166741 54518766 59235948 65188959 72294534 80688484 89148500 96494775 102939294
8812 102939294 106159447 104562423 97960060 88759682 80619183 75618993 73866408 73029048
8804 73029048 69315425 63443155 57724497 53293168 50218297 47578211 45001029 42433509
8796 42433509 40221161 38542742 37085225 36114529 35695147 35388174 35270690 35372784 35931352
8787 35931352 37025133 38942334 41748968 45329526 48140627 49276203 49824911 51407636
8779 51407636 54814572 58967311 63362896 67051352 67288429 64558145 58982150 51533659
8771 51533659 44419646 38730186 34681206 31840637 29947769 28904426 28420263 27569169
8763 27569169 26284516 24750407 23319131 21909408 20519378 19377077 18224758 17383529
8755 17383529 16713713 16219419 15657626 15318289 15005358 14549292 14081698 13730362 13490329
8746 13490329 13236208 13037303 12896537 12864158 12851407 12833597 12693462 12662828 12518487 12498601
8736 12498601 12512128 12476739 12458195 12607151 12703194 12841309 13073543 13293178 13500906 13649325
8726 13649325 13837888 14180061 14622015 14986490 15243105 15441609 15813346 16109754 16378758
8717 16378758 16881625 17397868 18010358 18491869 19176779 20120737 21334972 22540879 23937644
8708 23937644 25732441 28246903 31272452 35223360 40235942 47962092 57279935 63479642
8700 63479642 62376831 59378824 60886139 63657488 62848019 58880921 55144626 52911952
8692 52911952 53187240 55239715 55882828 52871091 48339433 44535611 42609960 41748897 39842454
8683 39842454 36307608 32477813 29352758 27137613 25691548 24621243 23628586 22871729
8675 22871729 22421528 22268986 22286971 22649285 23194338 24179349 25397648 27322030 29712078
8666 29712078 31571472 32181285 32551481 33466843 35613421 39252271 44103349 49310920 53256474
8657 53256474 55231140 54775449 51126674 45357613 39284242 34456558 31017455 28735053
8649 28735053 27351581 26537776 25801695 24211427 22112557 20208226 18768448 17725247
8641 17725247 16738038 15973671 15364043 14782197 14476935 14350941 14255531 14312994 14534093 15223657
8631 15223657 16365713 17568984 18473593 18658002 18600439 18996550 20178686 21486624 21438523
8622 21438523 19872985 18078083 16880629 16253615 15724402 14693117 13105207 11620750
8614 11620750 10470560 9668125 8994455 8371664 7835300 7366115 7062252 6737854 6326766
8605 6326766 6000186 5661945 5395998 5220545 5062323 4856183 4735390 4432968 4238808 4213909
8595 4213909 4016040 3675939 3606692 3522176 3415310 3300173 3245839 3231358 3054206 2990040
8585 2990040 2904447 2833241 2852883 2818762 2841167 2577123 2588785 2651224 2556938 2428794 2298869
8574 2298869 2347267 2446150 2465074 2288540 2239055 2132870 2084595 2128157 2079109 1965306 1917299
8563 1917299 1840749 1865635 1859704 1779930 1787109 1743327 1794426 1708767 1772440 1784145 1893229 1797026
8551 1797026 1843124 1903306 1812451 1896474 1998026 2113045 2124395 1966193 1944051 1968438 1917909
8540 1917909 1801179 1868449 1919931 1813796 1850928 1725184 1617458 1521994 1393132 1318480
8530 1318480 1317463 1352467 1338833 1316639 1295842 1221138 1185948 1012950 958568 1037713 1136278
8519 1136278 1023363 1085559 1033353 952201 975523 921796 836387 758553 788809 796332 764580
8508 764580 775241 817566 833127 765088 865370 756605 775432 782578 777991 794881 762723 731035
8496 731035 741886 784351 732816 652518 660466 642087 538995 489266 583457 623876 562061 587263
8484 587263 608268 734976 676587 768727 759865 694505 639475 645034 734985 696307 757532 713927
8472 713927 606060 501818 571677 544245 472942 457866 414080 407360 382836 476997 401499
8461 401499 456061 496703 472203 474082 573067 483133 416200 469686 576816 603147 655831 653249
8449 653249 616069 607803 629923 579770 586074 684649 661635 653781 651906 636162 495053 527155
8437 527155 650035 717460 600643 484241 517329 471355 447577 400069 316609 355060 431102
8426 431102 354306 358503 435808 290602 328850 255480 330638 283875 327077 337687 261538 246062
8414 246062 198216 171356 144040 245610 262273 339389 333827 339185 316625 261198 216468 189869
8402 189869 281317 312316 308309 266443 229526 204155 250372 148229 139032 132635 122149 96897
8390 96897 8433 90496 51219 102093 104011 149146 161270 144049 63373 24600 26077 -15386
8378 -15386 57204 96902 85464 121062 74386 96665 130093 64639 171006 184622 164129 51594
8366 51594 71965 69803 43957 97005 57113 -34 117036 131655 52677 21675 32524 80378
8354 80378 112636 69024 132578 150538 68964 80957 21895 43693 -66665 -98857 -15791 53444
8342 53444 13752 -18353 -44219 -56791 -96184 9920 13776 20665 22816 54336 35547 -23976
8330 -23976 10493 110668 36573 101939 167080 158770 55479 55637 102601 -23243 16732 69992
8318 69992 93516 86864 65040 46361 100694 101718 110066 70540 37547 -42000 -59119 -23285
8306 -23285 61388 79535 -16790 11831 150324 146115 62536 130298 150732 86454 85250 208134
8294 208134 260113 261227 268857 270239 210058 121148 94073 25086 133997 161472 154831 146955
8282 146955 97016 9920 52362 117251 19114 22955 25261 -27716 -16664 -34723 -55581 -89466
8270 -89466 -100157 -6073 -62163 -13671 44937 82553 159106 91623 107375 -4647 -51464 -44121
8258 -44121 22898 -10476 84008 45282 43083 74563 1404 73503 -51670 81032 138579 -70741
8246 -70741 -72631 67972 31764 36469 22275 59918 67142 44811 -45988 -66103 -127032 -50502
8234 -50502 -1200 -90318 -41757 16047 22676 71066 -15328 17602 55641 138514 152602 172303
8222 172303 90069 8145 27362 59014 166466 85510 87165 81215 12021 -40461 42309 -45390
8210 -45390 39435 -14566 -94858 87926 68277 -23004 -79927 -126203 -99974 -145418 -102449 -171922
8198 -171922 -170131 -194299 -169391 -265151 -428692 -641354 595159 854722 270897 362182 224118
8187 224118 163857 -76368 84034 49975 -17891 -21517 14193 -18335 -50191 15759 -37605
8176 -37605 -54797 -62789 4675 15097 -94868 -103895 -96249 -84125 -136159 -7535 -77155 69277
8164 69277 104249 16448 -95592 -65397 -30883 20730 60440 -20941 -84343 -163564 -4806
8153 -4806 -25501 -106726 -112689 -145024 -56693 -20505 -190256 -246502 -148441 -67524 -39196 -48559
8141 -48559 -178080 -151377 -108817 -160062 -167946 -79302 51105 92082 -13965 -88361 -4065
8130 -4065 -34624 -77788 -63389 -14359 -93567 -33963 72797 -67549 -100491 -42414 -84353 -153507
8118 -153507 -233713 -257381 -136090 -109259 11116 -8457 -76521 -68043 -81533 -100154 -74029
8107 -74029 -146240 -47344 27282 -42987 -49115 -155803 -138519 -180321 -55516 -497 -75773 -77845
8095 -77845 12019 -45862 -157723 -166835 -122258 -82435 -101258 -60845 -6084 -96268 -65959 -43388
8083 -43388 -60383 -121206 -139642 -65697 -19656 -140273 -115566 -44301 -113300 -169636 -257476 -232061
8071 -232061 -140302 -143925 -120551 -183263 -240731 -169074 -287095 -227289 -32064 -8833 -151007
8060 -151007 -137715 -173958 -67122 132630 20309 -50773 -46321 -146043 -103255 -11581 -93804
8049 -93804 -159685 -124713 -106614 -173800 -180784 -63026 -1842 -134910 -96847 -134121 -117664 -58937
8037 -58937 -47669 -13206 -106534 -94867 57324 -36966 -8362 70123 -1674 -77486 -102851 -130210
8025 -130210 -77915 -15707 -141022 -80442 -168956 -105921 -164078 -159056 -106476 -161011 -159670 -79653
8013 -79653 -130631 -156910 -84244 -125417 -138915 6698 42397 -45451 -90598 -68533 -59244 -59715
8001 -59715 -79735 -21830 -33253 -82229 29610 -6619 -65733 -80729 -76284 35658 34552 -28531
7989 -28531 -50015 -39922 -67029 -52223 -43008 -64990 -29003 20797 -11789 5971 -46201 -91370
7977 -91370 16147 -50574 -139867 -82258 13048 22287 -22116 -27776 -49975 -156995 -104490 -91696
7965 -91696 -136647 -111191 -139868 -175689 -226603 -228021 -165376 -28154 -55435 -104502 -92350 -162317
7953 -162317 -100788 -131184 -113551 -102530 -58694 -122972 -151022 -83234 -221429 -187894 -64375
7942 -64375 -58964 17109 47731 18836 -94244 -146861 -43050 -128889 -157856 -79277 -131314 -64516
7930 -64516 -179282 -87808 -105600 -165718 -137838 -125563 -58990 -76826 -166195 -120348 -82898 -64167
7918 -64167 12938 -16576 -11320 35245 -6594 -29173 -47210 18243 54780 -58782 5673 3313
7906 3313 -62146 -178344 -161884 -110430 -112061 -175164 -95408 -4162 -63147 -130889 -123421 -85340
7894 -85340 -111215 -155995 -67954 -58713 -69025 6167 -43605 -114715 -42630 -52331 -6572 -63148
7882 -63148 -149926 -194739 -122819 -135484 -223410 -151506 -102747 -60236 -58304 -109683 -160428 -99483
7870 -99483 -42662 -58031 -29492 23499 -19990 52120 9770 -34404 -22344 -31439 -74400 -88932
7858 -88932 -139264 -143586 -102186 -26832 -17160 -112127 -106895 -131034 -61929 -82374 -15959 112169
7846 112169 40480 -21564 20275 6480 -102869 -50269 -34174 -23955 -160461 -158856 -72078
7835 -72078 -109922 -88880 -24219 42848 58631 19602 -62078 -102043 -167389 -134217 -101763 -72443
7823 -72443 -75749 -70175 -61698 -118452 -141216 -161020 -61405 -29361 -148453 -101554 -79576 -25325
7811 -25325 -24381 -1978 -12036 -63396 22344 68387 -12280 -330744 -235977 -65801 -96097 -39310
7799 -39310 -20447 -114803 -116826 -117788 -89927 -67044 -152677 -104771 49807 2367 -42857 6118
7787 6118 -43809 -105431 -67644 -27273 -110983 -38767 -96596 -101409 -13661 6831 -68692 -111040
7775 -111040 -33178 -33719 -27941 -63376 -36372 -112004 -279696 -147848 -107341 -108763 -138171 -30011
7763 -30011 4408 75981 -791 -90897 -205747 -227140 -188669 -161118 -122173 -130175 -117654 -25063
7751 -25063 70940 54516 -135111 -82506 70562 85429 -34485 -135287 12558 -135925 -120865
7740 -120865 -28546 54292 53401 21401 42120 62348 -31244 59905 70386 -4565 71095 156057
7728 156057 156141 218171 337386 389123 490040 336004 228607 153622 74052 128336 9756
7717 9756 99749 54498 23316 -91777 -32378 4005 29726 -5395 -17461 12203 -5675 -37787
7705 -37787 -45961 -68363 -130564 -130320 -45637 -13054 -39715 -108266 -154302 -115992 -112254 -20426 -135073
7692 -135073 -57372 -68656 -22028 -45461 -95356 -2176 25337 -27010 -17786 -54851 -37729 65812
7680 65812 71453 28309 -12197 74481 81063 -41848 -48140 -44014 29916 24193 -62554 -72551 -79081
7667 -79081 -61043 -130928 -103308 -33762 -110543 -92229 -79639 -182699 -72140 8714 46301
7656 46301 46542 -17712 -51803 -47479 -74647 -1725 18123 -62153 -39843 -36014 -58845 -105566 -29949
7643 -29949 61588 92599 33645 -37904 -60074 -1664 -29184 5458 -21119 -39379 -141834 -68264
7631 -68264 -35227 -12292 2763 -28497 13276 48799 23630 1552 -12608 -128917 -150677 20699
7619 20699 -3109 -29266 -62529 -100057 -60569 23868 47699 26202 51152 -18135 -156680 -92740
7607 -92740 -16580 35345 36754 38882 28287 22316 131850 5754 54638 23512 107922 90214
7595 90214 -41917 -45004 -78234 -49291 44147 -36672 -81883 -33523 -55862 -83118 -44311 -80725
7583 -80725 73540 37219 32676 24257 80195 64942 -17756 -46232 -72917 -111541 -62163 -26931
7571 -26931 16038 30803 41586 1675 -27237 -21975 29802 41538 -11813 17776 -16184 -21794
7559 -21794 -41501 43199 79728 126268 148110 103328 136587 69520 75382 54265 66040 51861
7547 51861 -40047 19011 39553 20704 -712 -62063 -90397 -39480 -2233 102037 225038
7536 225038 190144 140665 97985 63429 196651 136290 108022 21390 69692 76015 104315 191370
7524 191370 23655 -5425 83047 213800 124372 46510 80476 76408 192207 268217 227345
7513 227345 1353 45255 121182 288270 302603 268721 410007 481054 466160 555092 732726
7502 732726 756964 707079 631539 582047 526993 430014 323058 297565 233846 268627 308431
7491 308431 261116 198638 232625 217990 125516 71419 61730 175231 187236 193619 163016 175338
7479 175338 242784 201276 214306 295301 296359 168116 144390 189617 236899 320913 202498
7468 202498 252559 153858 142758 106236 178149 201751 146169 126465 121899 210555 208981 187465
7456 187465 133384 118829 30363 46755 127770 136244 171846 108709 64348 115303 -4951 38457
7444 38457 95065 193010 191341 174613 151901 51047 121508 77522 67851 57677 103595 201232
7432 201232 103264 78269 85737 233322 211461 224563 166937 145910 155900 153257 254872 161251
7420 161251 63850 85822 45679 161010 157587 134133 137274 84674 180518 101627 82395 120441
7408 120441 151788 96366 68998 152451 132597 170058 173893 145080 141887 159768 112974 134112
7396 134112 102652 115356 100271 102725 170765 173814 127930 147004 125625 -13134 134269 209561
7384 209561 197210 193161 146944 230971 214278 184406 221354 205597 117261 136995 153237 124982
7372 124982 145275 173602 210451 191188 158729 163156 152957 180520 193046 252709 238977 133214
7360 133214 146554 253240 209274 179820 104346 97234 229598 332613 338736 297291 208725
7349 208725 154384 231141 288785 350422 209115 174665 312130 279679 147644 182211 183835
7338 183835 126125 161471 326737 272410 263865 258242 233895 198123 329897 266972 251120 247839
7326 247839 211626 188294 177679 281399 270005 222912 220542 173916 205623 267749 184547 142098
7314 142098 185657 361865 379380 308678 306969 376210 375637 312611 365444 342074 454793 441850
7302 441850 293429 369526 407601 296526 346664 350710 237727 250132 267754 304432 324075
7291 324075 297752 275897 292881 244862 288990 252151 286393 325711 382755 338400 322281 282991
7279 282991 290502 398277 365337 402917 420633 360195 427178 372629 346459 394665 415961 479070
7267 479070 444748 431006 524011 472692 372859 420965 497224 490340 494241 508996 489182 521878
7255 521878 594255 662547 537121 560443 694884 593126 541522 519764 565297 597863 712928
7244 712928 733274 646005 524664 459743 604665 671512 706580 766159 796284 671304 692441
7233 692441 700152 884234 858543 792381 800240 780660 781454 819183 775506 852824 958483 984779
7221 984779 997468 1062045 1068119 1030048 1094183 1164215 1199016 1170270 1178233 1214294 1219893 1165392
7209 1165392 1166615 1117433 1211913 1377706 1340104 1336972 1470843 1464632 1448082 1534585 1655328
7198 1655328 1629633 1586124 1636840 1800991 1868577 2039572 2037481 2079134 2144333 2151392 2256115
7187 2256115 2372695 2443625 2504884 2508680 2568626 2526384 2596448 2624588 2566178 2612009 2661945
7176 2661945 2708056 2741373 2973759 3055265 3106461 3323838 3434994 3466854 3563012 3572540 3738548
7165 3738548 3789771 3858645 3952597 3985835 3933532 4063768 4102120 4105339 4261412 4320325 4419653
7154 4419653 4574612 4751718 4881746 5015366 5221946 5408837 5600195 5726258 5929342 6210909
7144 6210909 6381584 6635849 6809905 7109788 7387389 7788864 8077331 8360161 8710854 8987082
7134 8987082 9359647 9691104 10052718 10446197 10777775 11218225 11712302 12155461 12661228 13177349
7124 13177349 13617017 14236551 14946759 15885746 17108346 18353099 19910948 21765481 23877746
7115 23877746 26228586 28930473 32126969 36187202 41276622 47663850 56038943 67356585
7107 67356585 82205045 99969645 116795445 126980729 126908462 115785490 97661485 78424275
7099 78424275 62001920 49661041 40904286 34611309 30093121 26613655 23898330 21828393
7091 21828393 19969921 18421645 17057071 15942673 14834584 13963956 13238492 12529454 11933200
7082 11933200 11615108 11381765 11331425 11547535 11798331 12127302 12394627 12742538 13033260 13343701
7072 13343701 13604797 13497965 13057280 12354783 11487422 10547746 9696792 8872347 8192292
7063 8192292 7607372 7030721 6721153 6459249 6374341 6221509 5946238 5709873 5555743 5206760
7053 5206760 4805376 4555971 4300541 4114938 3863471 3680108 3604469 3383186 3277307 3187100
7043 3187100 2996074 2979522 2808657 2706485 2677868 2588930 2498693 2524526 2496632 2384036 2247549
7032 2247549 2285043 2229970 2213127 2075639 2060922 1997532 1824276 1820845 1845535 1827116 1876533
7021 1876533 1791910 1791397 1800830 1821732 1867475 1829757 1956762 2010493 2013842 2159356 2370033 2364868
7009 2364868 2442416 2626555 2775464 2781605 2759397 2701192 2556624 2382559 2208768 1955447
6999 1955447 1838002 1685249 1510607 1470875 1305665 1306924 1231849 1203089 1182172 1128793 1159312
6988 1159312 1165757 1064270 995407 963119 978518 1011276 908831 899449 859342 795764 705096
6977 705096 758753 746190 916975 927002 827488 740241 732989 722053 628190 641333 573310 554455
6965 554455 575728 545714 523222 533669 585922 571101 533928 468851 474814 646634 708472 622350
6953 622350 642450 557895 524875 514983 559004 644053 651624 556669 565601 541084 514485 544670
6941 544670 523287 550625 534256 494878 462893 380933 420971 500292 419591 555132 503218
6930 503218 506585 505106 479839 579206 572097 535921 489206 545865 429237 320957 345106 271304
6918 271304 230499 387560 382817 343023 321074 356885 358039 291448 312216 308751 272789 258296
6906 258296 240814 284254 335870 292677 314192 356980 237542 292969 288197 280054 355554 421327
6894 421327 329904 317782 266259 244238 319908 265518 311409 209147 178857 135107 197354
6883 197354 158483 183679 282910 324238 214999 200394 190883 241456 238998 188399 75382 113617
6871 113617 204805 101972 55658 82997 184306 265300 174789 174243 229268 166142 83824 236212
6859 236212 280750 193290 191031 196234 252695 225768 267883 228527 119027 99622 183605 268365
6847 268365 360876 298704 103769 124764 217536 238475 206174 337785 305872 267546 310892
6836 310892 258883 278444 385202 307635 278219 299800 204939 251154 212257 208656 228596 325877
6824 325877 296027 306693 282601 123780 84549 159465 209732 215742 155443 122351 160967 202582
6812 202582 200580 163111 153776 133296 114255 77065 115659 150339 155086 69924 3367 -24862
6800 -24862 -5293 -36154 -22279 136352 135677 123767 176967 193073 138169 61585 117005 151297
6788 151297 121479 170338 108722 85321 207018 156956 174034 82685 43098 141980 91024
6777 91024 130180 110570 81274 102382 203257 175453 169817 219077 140660 249524 367117
6766 367117 276527 289476 286201 236084 197896 274769 211093 166475 226712 115905 23513 64448
6754 64448 91666 -27797 -43570 -82758 66612 211818 165104 93523 -11658 57964 119466
6743 119466 185103 160928 59436 152545 102118 112428 122919 83431 112032 105960 295979
6732 295979 325313 267408 215923 160830 230702 313629 295466 168459 61230 143749 172659
6721 172659 103388 156390 180343 264348 191781 135958 172953 117250 135813 213293 283945 222589
6709 222589 248650 411305 551633 647816 698483 780497 791673 811530 747309 521961 451869
6698 451869 343263 258613 276792 247846 209223 288758 295236 273375 224165 254335 172377 67973
6686 67973 33328 57261 176081 286587 212399 169037 142589 162850 207285 116674 83559
6675 83559 113120 122802 116633 157019 128165 135741 118605 105088 145024 127932 112980 120254 146081
6662 146081 186809 184914 77851 94713 48098 84984 169822 87643 41315 69282 91083 76220
6650 76220 94654 138924 57300 -25145 12963 115500 110451 19629 82090 2475 -13744 27371
6638 27371 85699 101895 193166 89862 -53662 -24124 31725 142193 178674 31951 19750
6627 19750 -4301 75517 106406 114894 116525 36394 24162 67755 17239 40890 64739 152247
6615 152247 177172 87452 75744 51238 35639 -30727 63253 98034 72168 150942 160535 137604
6603 137604 89931 86485 82570 -19344 -17658 68906 117752 154381 110805 77395 -14939 76607
6591 76607 109431 9785 -64537 66827 182644 137389 111319 165559 200717 166371 308723
6580 308723 240007 63895 55114 102355 146482 54488 39012 39165 54382 110601 81936 146319
6568 146319 101494 85640 60324 40854 100736 55825 100686 73053 132455 128244 125115 135375
6556 135375 147063 171964 169229 132156 251666 279811 215394 277182 219795 296364 299155 313820
6544 313820 245695 156884 118798 249598 178345 205939 154987 141421 147877 206251 212769 267538
6532 267538 300705 319611 314089 270909 277828 242115 256464 376799 425736 423064 436920 367933
6520 367933 252039 267996 306794 348521 238233 218300 97363 125937 134418 133019 276249
6509 276249 215495 168330 127184 157335 104441 172853 243037 186611 188260 169417 167785 192803
6497 192803 207827 230754 226189 239030 122634 189147 175368 166958 178457 75820 25099 102757
6485 102757 231775 217483 141724 200018 157743 135661 104825 131699 157167 189408 224196
6474 224196 253612 240059 180976 85407 129681 218238 246543 213347 148535 111888 130355 123707
6462 123707 131395 206083 200335 354573 320475 269345 102264 12745 -1449 32101 76383 144450
6450 144450 160976 173461 209623 261643 212891 53299 141035 231924 219492 237929 231782 201845
6438 201845 240622 246317 232714 127661 80022 137044 82990 -42313 43381 48294 99320 159022
6426 159022 152321 192517 324648 229164 205156 240804 213818 234459 146899 233377 320895 246657
6414 246657 253377 172095 195857 244968 234054 241938 277450 328283 238844 175091 241788 284507
6402 284507 232051 340732 360370 281323 306461 291187 207514 218730 313580 336158 230708
6391 230708 287838 430637 410760 480117 412562 319338 275229 263048 270447 263093 246155 249727
6379 249727 324090 329772 300289 274210 321636 304371 287392 209000 157397 171924 207140 260361
6367 260361 231044 254000 176566 181586 188504 226953 163893 228046 314264 274449 291598 386346
6355 386346 400339 338092 333993 368098 411078 373280 423491 354593 262872 264384 339537 378584
6343 378584 354053 312545 319187 398598 348716 353047 461370 516131 450588 449536 372165 392457
6331 392457 315948 282256 265530 299701 335834 308988 408928 304929 343434 344136 452974 417695
6319 417695 473523 388510 256031 224241 229157 374461 411493 322809 321689 275279 212732 234454
6307 234454 242664 300814 437564 401552 396328 409311 369606 348133 306002 348462 326513 282667
6295 282667 310935 401966 431131 360330 429314 445573 415422 431988 403612 455444 600943
6284 600943 524399 520065 491286 506297 481507 378062 322583 445495 473492 426673 365236
6273 365236 407985 380015 395415 334166 414274 444199 541017 598793 447574 467077 514373
6262 514373 547980 512702 489851 449286 539742 542095 557601 585254 531135 608554 668038 727310
6250 727310 721312 697409 743386 647651 667898 617381 664114 655026 652173 528697 606079 681006
6238 681006 721843 705918 701269 556611 516780 540728 632223 629636 600646 554055 582208 575341
6226 575341 590612 661310 690887 625307 645745 625971 669680 700666 600965 642658 673992 685039
6214 685039 757785 785397 834873 779728 765956 816461 778113 920732 897080 829047 725189
6203 725189 705179 778033 760543 730255 773433 762627 801176 885291 829085 804518 833816 830020
6191 830020 808100 833261 878925 935835 898643 909418 878456 887415 1049055 1063887 1029604 956921
6179 956921 926478 945599 1041276 1083722 1072715 1101821 996951 930276 1076962 1167998 1181105
6168 1181105 1145180 1096054 1031323 1164025 1264679 1259622 1267030 1312739 1426865 1378596 1316839
6157 1316839 1325487 1368435 1368620 1430346 1550679 1535559 1540124 1568492 1610816 1645701 1682133 1755532
6145 1755532 1732934 1752325 1795438 1809689 1886958 1888361 1987565 2046200 2182190 2294654 2225518
6134 2225518 2219467 2349994 2477499 2468522 2399474 2303934 2372282 2596351 2616098 2652326 2708563
6123 2708563 2616485 2660887 2778649 2781229 2871112 2966533 3049307 3093587 3208160 3369155 3450965
6112 3450965 3606387 3655661 3668223 3883837 3984923 4126645 4198206 4276045 4415529 4594808
6102 4594808 4790049 4914044 5107035 5220379 5329724 5529744 5688816 5978495 6173124 6311363
6092 6311363 6648992 6794730 7031052 7303456 7729283 8190259 8592777 9186208 9753969 10390945
6082 10390945 11256239 12341456 13377773 14626419 16403589 18551111 21433274 25253763
6074 25253763 30110289 34992112 37688470 36631137 32977859 28923098 25839837 24070426
6066 24070426 23302581 23641703 24910469 27379776 31038716 35342182 37947325 36979781 32902485
6057 32902485 27597967 22970658 19618887 17356046 15593879 14224165 13288749 12581431
6049 12581431 12054641 11781331 11463899 11167820 11034658 10803491 10862194 10849134 10778475 10924786
6039 10924786 11016372 11163538 11349897 11692086 11997224 12595120 13275731 13937037 14940947
6030 14940947 16069872 17244115 18859385 20890228 23379820 26547449 30901405 36773299
6022 36773299 43487245 48534275 49452231 45911489 40209742 35282878 32021180 30367453
6014 30367453 30153949 31163752 33310933 37240967 42551905 47230178 48134616 44090651
6006 44090651 37218610 30221351 24710513 20764399 17798410 15612329 13901224 12499044
5998 12499044 11430976 10555581 9874736 9171544 8634506 8026150 7590101 7316110 6935203
5989 6935203 6614692 6295310 6035198 5826528 5532250 5380011 5175569 5078510 4861436 4688840
5979 4688840 4645406 4464290 4448812 4407597 4211449 4188432 4219825 4186067 4182811 3988617 3962477
5968 3962477 3996470 3941566 3927138 3950387 3883971 3717368 3531358 3409870 3426964 3324187 3319771
5957 3319771 3279575 3159171 3144470 3149717 3129054 3161659 3189174 3083075 2913678 2963657 2947929
5946 2947929 2943785 2967230 2947717 2922939 2921891 2957291 2850686 2854063 2839345 2849372 2876511 2894888
5934 2894888 2964210 3012294 3058730 2995849 2886496 2850846 2800086 2902214 2905363 2916727 2920837
5923 2920837 2937675 2924215 2869103 2804878 2811607 2700108 2712067 2790069 2804399 2810222 2826100 2942858
5911 2942858 2997239 2945661 2933510 2998642 3020250 3045799 3124025 3258783 3312574 3451138 3461656
5900 3461656 3465752 3492052 3483472 3581524 3624053 3612186 3646547 3716798 3790471 3976352 3996472 4105900
5888 4105900 4214112 4340682 4460668 4474501 4505800 4743742 4900535 4987496 5073746 5089302
5878 5089302 5086130 4979836 4961054 5083586 5191845 5325655 5304365 5372945 5323409 5245388 5343129
5867 5343129 5431988 5410581 5274352 5187977 5244145 5406537 5461170 5497945 5619954 5769056 5916790
5856 5916790 5925823 5871107 5990709 6258478 6658458 6886739 7096873 7296718 7557803 7600134
5846 7600134 7808244 8041821 8206865 8388543 8597820 8917865 9059931 9167595 9343512 9534647
5836 9534647 9503141 9652933 9934475 10259274 10514634 10729883 11130251 11468728 11719077 11832498
5826 11832498 11990996 12297794 12631066 12855625 13080704 13142109 13096258 12911518 12594467 12265730
5816 12265730 11765375 11331513 10905440 10589973 10532843 10638204 10922254 11329375 11824231 12261455
5806 12261455 12577474 12832054 13068092 13136486 12981701 12649036 12181783 11584584 11139943 10619051
5796 10619051 10097836 9565248 9100218 8527819 8320418 8070357 7869221 7672168 7635879 7682812
5786 7682812 7609739 7526501 7466822 7454089 7525797 7628997 7767536 7967845 7970947 8144871 8353217
5775 8353217 8563346 8880678 9196246 9345025 9366853 9440219 9429722 9276262 9145355 9113202
5765 9113202 9240085 9365263 9700420 9935142 10227192 10530809 10884047 11451936 12118787 12872222
5755 12872222 13799005 14906962 16162862 17646201 19481504 22020020 25352654 29073243
5747 29073243 33157246 37375211 40832386 41904557 40239801 36879577 32853314 28818565
5739 28818565 25286312 22409643 20354851 18861620 17899547 17152106 16778495 16645997 16667159
5730 16667159 16934274 17397392 18026227 18822450 20006935 21475304 23322466 25806472 29122497
5721 29122497 33121984 37238097 41275992 44118302 43983090 41111985 36906421 32368827
5713 32368827 28061346 24509196 21918598 20043415 18680385 17631360 16896170 16437152
5705 16437152 16098685 16069300 16288530 16671665 17292003 18007664 19291905 21079512 23369026
5696 23369026 26065258 28847304 31495037 33082147 32570013 30262449 27195044 24079064
5688 24079064 21207095 18804592 16986993 15651267 14732023 13950742 13576402 13359619 13130629
5679 13130629 13081552 13350925 13794881 14214675 14839028 15669398 16858414 18387579 20468674
5670 20468674 23318241 26479401 29572487 32150436 33263707 31923298 28936216 25304063
5662 25304063 21636270 18467729 15962736 14145444 12724003 11462888 10649529 9880463
5654 9880463 9252767 8668517 8175976 7866108 7653099 7307076 7164850 7136230 7025589 6969037
5644 6969037 6892280 6720265 6660596 6554315 6295832 6200986 6078901 5940994 5909379 5869053
5634 5869053 5698127 5693538 5565298 5391806 5232658 5190672 5144085 5140289 5133819 5240759 5371122
5623 5371122 5268291 5221688 5095987 5064797 4971582 4977902 4897109 4863089 4743119 4839761 4854139
5612 4854139 4810571 4716403 4659176 4594049 4470444 4386315 4320171 4321976 4275755 4314211 4229005
5601 4229005 4313926 4332571 4379343 4316130 4284941 4139047 4045152 4009906 3899830 3794535 3742515
5590 3742515 3726805 3805160 3894359 3933964 3982110 4050550 4073963 4231250 4265214 4173269 4115622
5579 4115622 4103629 4151591 4059114 3914777 3736589 3559635 3464348 3430381 3335379 3271861 3220726
5568 3220726 3139908 3086425 2990243 3007677 2990643 2918759 2960143 2920517 2978184 3092769 3145976
5557 3145976 3223505 3250507 3268102 3282845 3574498 3662372 3602538 3664131 3597140 3452638 3305508
5546 3305508 3242060 3049185 2943628 2901207 2912052 2890849 2814705 2850773 2814738 2855117 2880886
5535 2880886 2936451 2958339 2982506 3143387 3224235 3311328 3462618 3382973 3258651 3113351 2993214
5524 2993214 2947963 2869419 2934429 2924726 2775959 2819285 2766322 2828022 2986382 2981286 2958018
5513 2958018 2911656 2828528 2834271 2923070 2871271 2941652 3073063 3091925 3128807 3317956 3451973
5502 3451973 3467953 3591345 3562778 3618154 3636866 3681907 3591439 3545418 3482769 3313839 3223454
5491 3223454 3128122 3019109 3025806 3031715 3050546 3117477 3099328 3174823 3209400 3315501 3277091
5480 3277091 3232937 3031638 2926083 2887576 2824966 2706432 2666514 2603582 2655122 2618760 2663203
5469 2663203 2586564 2687627 2797860 2725889 2707661 2790433 2840065 2794805 2811772 2827243 2839800
5458 2839800 2831565 2934814 2906838 2784972 2852459 2968106 3022540 3032183 2996345 3044395 3116131
5447 3116131 3100898 3223973 3382601 3498328 3427687 3350430 3300108 3180358 3108312 3018635 2907381
5436 2907381 2927236 3042519 3217558 3375637 3520972 3759408 3768379 3711863 3604625 3494743
5426 3494743 3234781 3075038 3189557 3234933 3071895 2965699 2975296 2953238 3028472 3162145
5416 3162145 3097516 3104485 3172814 3232392 3241259 3317129 3309232 3453357 3463323 3577161 3671878 3762882
5404 3762882 3866870 3954205 4077024 4199901 4270477 4214503 4194403 4136893 4117430 4172741 4330895
5393 4330895 4386374 4381407 4464923 4567023 4581264 4672457 4741329 5007265 5186486 5318622 5547968
5382 5547968 5821478 6058037 6297477 6322452 6413281 6329283 6102476 5894313 5862027 5782542
5372 5782542 5563383 5527856 5575152 5558689 5445682 5397832 5478643 5470432 5431489 5520456 5616048
5361 5616048 5796012 5814456 5908492 5913842 5893079 5737771 5662827 5527637 5275596 5218904 5209665
5350 5209665 5019249 4876684 4919177 4988416 4919668 4893143 4988321 5018499 5209922 5312529 5408282
5339 5408282 5495842 5557199 5859706 6039466 6132049 6125159 6013304 5783573 5565858 5290388
5329 5290388 5136673 5138627 5120349 5029794 5058373 5174973 5222850 5336608 5529453 5519057 5613465
5318 5613465 5791245 5778500 5719492 5588232 5543114 5594526 5742181 5952666 6207353 6315820
5308 6315820 6501353 6597985 6653158 6667457 6688224 6490884 6219996 5902471 5754176 5801292
5298 5801292 5827507 5912372 5985476 6171025 6426029 6659986 6909600 7232846 7372425 7402408
5288 7402408 7178045 6922342 6603803 6413538 6231658 6151218 6103626 5935319 6150735 6177627
5278 6177627 6231300 6415928 6630341 6853562 6934234 6919370 6908216 6895485 6832951 6846808 6995347
5267 6995347 7155394 7233031 7270323 7136431 6925433 6649057 6397273 6327174 6112035 5944350
5257 5944350 5752023 5603223 5490262 5310282 5254087 5236922 5275252 5313790 5274298 5302773 5372369
5246 5372369 5334232 5399886 5542056 5553388 5667241 5757700 5787650 5909219 6033737 5973328 5784590
5235 5784590 5615342 5482698 5406581 5285866 5033562 4985756 4871270 4872457 4875355 4777672 4758785
5224 4758785 4823999 4983067 4961666 4987504 5050872 5114990 5208223 5260968 5362828 5465982 5599033
5213 5599033 5787941 5851300 5852787 5784696 5808230 5693380 5719102 5692192 5741459 5628627 5664555
5202 5664555 5744052 5691980 5671672 5688538 5707665 5816628 6063486 6277500 6377318 6429797 6610042
5191 6610042 6819420 7056410 7118964 7199693 7305257 7340775 7471427 7672571 7799246 7872239
5181 7872239 7855840 7944286 8045909 8347772 8472246 8562841 8779365 8997371 9240048 9429669
5171 9429669 9653701 9880955 10157454 10510930 10943062 11306712 11743479 12362909 13020552 13699453
5161 13699453 14499251 15483454 16582945 17940208 19363176 20847280 21681441 21730059 21441940
5152 21441940 21218403 21009110 21274255 22064625 23305706 24991455 27336045 30156613 32839503
5143 32839503 34816993 35174821 34475614 33683789 33548757 34252724 35458801 36652724 37397788
5134 37397788 38135969 39409350 41181432 43316472 45240274 47212896 48791770 50463358
5126 50463358 52349943 54492292 56099981 55822904 54273840 52371212 50980490 50492917
5118 50492917 51023677 51964323 52098908 51260672 49934109 48922727 48230399 47530174 46714662
5109 46714662 45460395 43829421 42610339 42064307 42065087 42275190 42223844 42231644 42689990 43807465
5099 43807465 45250978 46379596 46068736 43935460 41121911 38212984 35802657 34050730
5091 34050730 32680552 31965159 31701888 31851545 32340912 32861636 32864723 32104688 31218509 30577026
5081 30577026 30444854 30576026 31033957 31328229 31371591 31420219 31583343 31575083 30877515 29982374
5071 29982374 29250547 28795449 28547817 28504561 28522305 28376721 28358030 28607527 28985064 29403180
5061 29403180 30064185 30833218 31907605 33636505 35967891 38557549 41577953 45151732
5053 45151732 47930155 49096239 49515120 49839143 49487353 47996871 46026428 44582841 43835735
5044 43835735 43818221 44279067 44442767 43704011 42703591 41983407 41963333 43153720 45336855
5035 45336855 48125957 51452134 54237663 56670766 59545613 63565618 68371378 72701879
5027 72701879 75419903 77002459 79369357 81373846 81506674 81858803 82482288 82219469 82357222
5018 82357222 81738928 78375144 74535334 70035688 64785410 60117272 55858147 50797726
5010 50797726 45956862 42143126 39531093 38258768 38081967 38894764 40569468 42383561
5002 42383561 43622910 43481501 41906300 39868364 37193301 34875531 33464453 32786268
4994 32786268 32635794 32584662 31717412 30150079 28907055 28144845 27783816 27452361 26287401
4985 26287401 24563420 22777353 21212759 20233982 19939868 19772616 20393403 21053603 21903340
4976 21903340 22179065 21242498 19528671 17710390 16236658 15221259 14343658 13683411 13207080
4967 13207080 12854153 12448239 12125476 11866247 11617642 11440479 11244797 11137108 11001544
4958 11001544 10815690 10663554 10539349 10507244 10453525 10335690 10261627 10349677 10291317 10154485
4948 10154485 10221376 10310971 10337501 10176001 10174842 10340424 10352538 10196807 10151472 10191702 10133331
4937 10133331 10068038 10092921 10117566 10318879 10373985 10442179 10579501 10617074 10794627 10905707
4927 10905707 11030654 11199542 11285510 11513173 11696569 11934483 12298571 12766787 13151049 13738972
4917 13738972 14423054 15252674 16343313 17599071 19347386 21631994 24480577 27035091
4909 27035091 28914369 31211636 34393673 36962096 37060346 34975896 30959337 26741846
4901 26741846 23268282 20629082 18710517 17385443 16407471 15647006 15149865 14765185 14573578
4892 14573578 14469033 14501043 14478155 14684890 14881990 15009669 15276533 15694498 16283996 16990390
4882 16990390 18072632 19579949 21141153 22075710 22067203 21808226 21927808 22500332 23489389
4873 23489389 25307544 27783386 30129001 31918143 33548537 36390757 41151965 47270141
4865 47270141 49521877 46038264 41162049 36429989 33108789 30990492 29442058 28366168
4857 28366168 28203682 28930222 30361940 32321980 35578057 40649337 45695378 46281474 42325489
4848 42325489 37559624 33361005 30440788 28209500 26084746 24199979 22667979 21506097
4840 21506097 20766599 20380951 20342908 20076101 19521244 18859769 18233281 17622295 17221125 16982954
4830 16982954 16817710 16603650 16388505 16339280 16350561 16392693 16635771 16929483 17346641 17684837
4820 17684837 18066875 18537294 19110116 19880543 20889858 21969904 23411289 25345154 27675908
4811 27675908 29741584 30798008 31374830 31601754 32138698 33059090 34554453 36825376 39644050
4802 39644050 42585214 43908665 43639392 43062712 43031444 43357674 43457770 42856947 41334321
4793 41334321 39742130 38803486 38824439 39806242 41543690 44189858 47101789 49656497 52181345
4784 52181345 54598168 57356260 60802917 64659773 67331051 66513117 63581281 60306082
4776 60306082 57889396 56604387 55559169 54775812 54491774 54312268 54046144 54087610 54720749
4767 54720749 56093979 57579500 59223843 61555243 64824682 68566050 72674357 77638478
4759 77638478 83682873 89960225 97451534 107104579 118831945 132934857 145359762 150373061
4751 150373061 148647033 137984597 120883893 103260325 87522321 74657689 64864760
4744 64864760 57950770 53027317 49500117 46853137 44918641 43312756 42494995 42114671
4736 42114671 42168078 42517563 43657227 45569899 48397791 51989442 55867336 59293158 60140623
4727 60140623 57608074 53612082 49453612 45975455 43598080 42264505 41662220 41576233 42146950
4718 42146950 43185976 44653866 46670123 49511755 53270062 58330114 64467337 71623321
4710 71623321 79281571 84994923 88234477 89468913 87136658 81385008 74968257 69534316
4702 69534316 65712273 63861655 63972833 65694692 69148410 74602782 82486978 93598864
4694 93598864 108141332 125788897 145108435 159139201 165655185 166643779 158501892 140748737
4686 140748737 118881237 97893110 80229834 67004248 57377238 50092770 44472720
4679 44472720 39985706 36443036 33331902 30704447 28656277 26915774 25372539 24123102
4671 24123102 22885786 21660061 20592304 19751352 18947889 18258357 17596100 17156983 16802970
4662 16802970 16306707 15924212 15718416 15463634 15199636 14794681 14550162 14292393 13952393
4653 13952393 13706101 13564895 13395582 13126327 12937276 12672851 12628851 12510477 12304737 12153961
4643 12153961 12065212 11934732 11917271 11863483 11781891 11655540 11459660 11359526 11180651 11063362
4633 11063362 10967498 11009427 11102358 11110987 11201387 11199576 11364921 11399476 11272663 11426349 11575632
4622 11575632 11525364 11571885 11631499 11763772 11871744 11984254 11934242 11770587 11396396 11173999
4612 11173999 10974038 10825542 10770817 10801707 10904786 11046021 11192888 11297476 11347977 11576464
4602 11576464 11855590 12083793 12303669 12612645 12910835 13117191 13334840 13543236 13769587
4593 13769587 13789132 13648937 13628846 13738935 13867984 14031782 14208543 14462688 14852764 15408441
4583 15408441 16171412 16889157 17746989 18708694 19747667 20806018 22145732 23831207 25731768
4574 25731768 27860053 30473165 33821072 37979718 43222952 48813021 53293194 54928177
4566 54928177 53139323 49053625 45076221 42146094 40702413 41026898 42876114 46107343
4558 46107343 50342181 55002046 58465797 58979617 56234968 51549152 46919099 43721197
4550 43721197 42336373 42746518 44592213 47172403 49135142 49082137 46544615 42571379 38640481
4541 38640481 35623486 33953186 33495357 34288195 35991719 38480516 41132055 42939302
4533 42939302 42446434 39460848 35000045 30371332 26371227 23338350 21183903 19489493
4525 19489493 18096242 16995797 16152023 15268052 14521620 14057621 13628891 13287222 12924324
4516 12924324 12653883 12472026 12269301 12111957 11994442 11926156 11795094 11760392 11772959 11808441
4506 11808441 11873440 11916286 11915568 11877302 11851713 11899854 11986321 11987650 12071589 12014986 12102809 12420429
4494 12420429 12506049 12624286 12882980 13190710 13538049 13950196 14401113 15007478 15804744 16438981
4484 16438981 17156617 18000365 19165838 20586706 22356762 24494685 27234510 30721937
4476 30721937 35234210 40875188 46602788 50572407 51210070 48405149 44170028 40799948
4468 40799948 39205090 39804947 42465335 46660996 51550688 53782009 50864445 45220384
4460 45220384 39291839 35085648 32799962 31932935 32094580 33451040 36108341 39617115
4452 39617115 42957637 44880728 44820868 43246586 41379621 39637891 38582316 38580178 39959597
4443 39959597 41930158 43362707 42848967 39205577 34035567 29075315 25184092 22711647
4435 22711647 20955038 19493764 18063301 16765810 15534340 14451664 13487436 12574104
4427 12574104 11833262 11287840 10753715 10256080 9982256 9888776 9768981 9576041 9450911 9356337
4417 9356337 9218392 8854316 8757109 8759688 8703988 8759388 8720922 8541047 8365253 8116907 7887802
4406 7887802 7699549 7485916 7337901 7268540 7268173 7421410 7465892 7498546 7361967 7177599 7075099
4395 7075099 6812684 6604018 6437018 6341317 6385199 6253234 6157968 5918698 5682292 5499592
4385 5499592 5401539 5297919 5223279 5083783 5112787 5300674 5419894 5730255 5805906 5629533
4375 5629533 5538988 5193086 4952945 4709285 4441147 4286784 4053944 3866182 3763153 3742873
4365 3742873 3593111 3359588 3373291 3403074 3337631 3377944 3382291 3448869 3439813 3286861 3202300
4354 3202300 3174082 3258466 3173988 3111884 3054274 3033600 3054862 2938616 2900931 3023898 3004750
4343 3004750 3010288 3010145 3001907 3035902 3023277 3085314 3049931 3102895 3073128 3131892 3183816 3114599
4331 3114599 3059065 3103761 2987812 3126797 3156486 3096676 3168618 3172901 3203844 3257947 3196963
4320 3196963 3162052 3173351 3172591 3100449 3134173 3231892 3350226 3441140 3427583 3279266 3101609
4309 3101609 3023595 3252235 3220024 3344260 3449756 3421417 3420728 3415551 3489296 3389672 3326487
4298 3326487 3307952 3364693 3372744 3314947 3269185 3239267 3338774 3466135 3511666 3461374 3566815
4287 3566815 3573116 3638494 3713021 3726297 3704103 3658193 3713663 3810440 3848870 3863282 3972416
4276 3972416 4112961 4097891 4124274 4221963 4275909 4142717 4241625 4302264 4405303 4488824 4410501
4265 4410501 4508667 4542417 4483863 4537735 4568644 4556214 4640834 4776386 4866123 4939177 5045604
4254 5045604 5069010 5162504 5320332 5269711 5374998 5531353 5656969 5826929 6075533 6351957
4244 6351957 6716901 7031783 7159071 7356068 7432110 7542179 7686274 7972897 8106728 8122292
4234 8122292 8255946 8396154 8469124 8722361 8856401 8958833 9081993 9238903 9250106 9459495
4224 9459495 9614776 9831898 10012944 10196038 10344625 10625048 10842278 11090555 11331428 11692694
4214 11692694 11888416 12226086 12694152 13086333 13332890 13528666 13764975 13996996 14132255
4205 14132255 14143438 14179909 14380743 14579636 14878283 15207422 15567947 16052263 16620993 17184955
4195 17184955 17758740 18254463 18868814 19443029 20036155 20687684 21346587 21980052 22920825
4186 22920825 23830130 24698040 25602668 26507226 27454715 28471554 29600076 30770069 31978851
4177 31978851 33210350 34379077 35705152 36949154 38405620 39802496 41243734 42927372
4169 42927372 44722358 46625062 48677970 50857514 53383141 56411993 60361808 65080067
4161 65080067 70352159 76253479 82774742 90359009 99649797 111123738 124977665 141563489
4153 141563489 162322594 189165873 225586457 275796516 342075363 410548610 451382855
4146 451382855 445904670 394584931 325234768 261110249 211161695 174463723 147294570
4139 147294570 127294460 111975586 99772623 89907333 81691915 74439096 68007294 62442712
4131 62442712 57702423 53356994 49298822 45464198 42162132 39222086 36839074 34924729
4123 34924729 33260083 31555042 30112860 28747668 27464209 26293715 25276915 24366070
4115 24366070 23422349 22538564 21743210 21030639 20415040 19604705 18803405 18003589 17407408
4106 17407408 16921694 16541830 16336540 16112537 15675234 15260809 14791755 14374026 14136252
4097 14136252 13870871 13669153 13440445 13189909 12969072 12642527 12400876 12091318 11746925
4088 11746925 11282364 10937043 10670272 10406832 10018450 9807147 9509719 9388013 9297840 9193026
4078 9193026 9165695 9180388 9079028 9164173 9228151 9279178 9263494 9342059 9596333 9893038 10172881
4067 10172881 10481826 10498313 10272948 9737738 9014794 8458851 7950763 7532062 7065491 6822291
4057 6822291 6618113 6524000 6352274 6287395 6184880 6227555 6290544 6212734 6065657 5970296 5920651
4046 5920651 5700330 5646967 5568301 5568268 5551223 5538344 5459357 5264400 5140133 5044603 5050170 5028686
4034 5028686 5057933 5183263 5072965 5015443 5055841 5145592 5185314 5222695 5235736 5289174 5304163
4023 5304163 5370172 5459007 5614367 5695311 5717637 5737293 5813597 5768665 5761337 5836125 5831858 5889995
4011 5889995 5953930 6076909 6070311 6095358 6189422 6216274 6146538 5990801 5916910 6019040 6056481
4000 6056481 6030071 6043345 6038235 6146623 6281050 6380063 6448141 6384750 6380097 6453073 6561577
3989 6561577 6545749 6520418 6772865 6887833 6958781 7066918 7037165 7184198 7251947 7075936
3979 7075936 6630827 6441156 6208286 6161820 6120511 6087820 6084547 6038699 6089440 6252922 6363037
3968 6363037 6417092 6542520 6546535 6539161 6535655 6419189 6435678 6482478 6372413 6227666 6057333
3957 6057333 5823654 5510977 5326927 5161791 5113395 4984328 4841104 4721804 4596929 4635013
3947 4635013 4590910 4586726 4742064 4753236 4754020 4703954 4723742 4727438 4696346 4754886 4845040 4967952
3935 4967952 5041850 5271756 5417245 5552272 5881422 6086179 5934298 5780496 5641251 5514766
3925 5514766 5532934 5576336 5427156 5451142 5584206 5576380 5600874 5576407 5696487 5729072 5729631
3914 5729631 5841936 5803554 5773050 5546030 5245907 4908017 4832597 4733558 4560642 4442523
3904 4442523 4359111 4202475 4146959 4079731 3998411 3998004 3917966 3861256 3881679 3948934 3869608 3794858
3892 3794858 3632760 3633664 3479338 3409539 3281296 3262613 3124935 3110793 2967080 2942282 2943334
3881 2943334 2827243 2789557 2785487 2709078 2586573 2613853 2670079 2758968 2723093 2700087 2771492
3870 2771492 2863338 2874440 2959613 3131181 3194065 3133564 3310202 3291427 3286631 3411031 3581277
3859 3581277 3880351 4180629 4515918 4695433 4523519 4163712 3839721 3696720 3527885 3575035
3849 3575035 3607675 3678064 3656168 3423232 3176189 2953243 2790002 2597752 2489382 2450112
3839 2450112 2310316 2241161 2138659 1958921 1935022 1933174 1816020 1725306 1757388 1687304 1465152
3828 1465152 1404009 1401747 1437739 1416430 1231120 1326651 1401102 1358978 1290780 1232073 1221053
3817 1221053 1066420 1084470 1221236 1174165 1154015 1226967 1157156 1087853 1182178 1138915 1071071
3806 1071071 1022444 996898 1006784 1080139 1025518 1140112 1134108 1050381 1156246 1094286 1097693 1080764
3794 1080764 1120747 1144069 1095739 1015964 1050417 1109669 984756 993121 1014472 1126790 1033188
3783 1033188 987226 997287 957507 1079488 1049434 947622 962382 1006869 1077177 951566 1028315
3772 1028315 1059118 953379 895028 886851 939494 879674 892218 908105 929077 873505 889433
3761 889433 853338 857705 935817 861619 888912 931338 840238 760921 812209 816491 827974 916654
3749 916654 911987 923543 845270 864529 970101 942234 852537 800149 740379 760548 859429 860605
3737 860605 874058 876163 811987 876936 927107 756342 705219 886945 808621 708132 735604
3726 735604 721171 689599 700627 852130 836407 762287 755306 722111 756568 671201 693969 682319
3714 682319 597391 705655 759287 833645 888308 890128 821836 713564 690899 650320 614025
3703 614025 643270 748881 669711 669388 706343 823314 767496 701510 685237 719350 883134
3692 883134 857939 807748 765808 715463 716283 717737 746702 693752 669711 831761 844803 772905
3680 772905 795069 769856 836012 844579 843750 787507 736979 733880 701845 686322 680790 779804 703548
3667 703548 811908 882321 861384 846540 784408 761367 848491 918286 941823 829593 850754
3656 850754 724774 750177 807306 810719 710606 702149 788687 706840 743096 737856 897453 782853
3644 782853 650216 725599 781460 761609 829363 811681 896131 962919 845594 799668 883963
3633 883963 904436 938580 871497 867438 980325 905414 883649 777895 827689 907456 935824
3622 935824 861689 904046 825134 836338 927661 874371 967264 925508 894503 871084 796902 798475
3610 798475 917674 933308 861324 801260 817661 842738 800352 803522 853163 859617 901500 888810
3598 888810 830075 889437 881216 801821 754689 693684 797056 816608 762697 801785 804936 749757
3586 749757 850613 858938 781459 679516 609723 702383 847132 795183 867334 867482 822438 764094
3574 764094 733509 858964 863614 819050 757793 737363 743599 781610 793680 737734 769509 728260
3562 728260 682801 803609 774247 788031 777548 799724 887502 849384 871206 980160 946426
3551 946426 904390 859669 884069 886084 887961 814667 799874 848574 867294 760503 751884 748751
3539 748751 800165 834122 798589 776109 804848 826698 860298 962304 898389 846918 847428 722378
3527 722378 680444 767207 768763 846590 803898 852440 872490 840709 873194 972057 869259 845840
3515 845840 896989 752286 900205 891040 870221 813218 843649 864701 1026661 1072478 969900
3504 969900 996630 1005179 1027518 988109 848335 871001 987108 982807 952225 1041881 1160539
3493 1160539 987279 970587 1051088 1071617 1002490 1083273 1174425 1090691 1058804 1109147 1203406
3482 1203406 1279606 1223495 1154542 1070030 1058661 1083369 1080137 1162549 1096750 1041998 1091115 1120412
3470 1120412 1111269 1016488 915046 896260 921001 871970 938902 975055 928825 998860 975950
3459 975950 877614 908399 927580 997766 1048247 977088 989672 985946 1097005 1150668 1055528 1085389
3447 1085389 1065299 1016227 1113405 1096535 1166666 1242387 1267168 1226065 1255989 1326555 1217493
3436 1217493 1227291 1274661 1268186 1293217 1273731 1361888 1386482 1252015 1241201 1274254 1448412
3425 1448412 1435929 1444806 1452047 1613621 1720637 1904948 2049139 2032107 1865938 1824095 1789029
3414 1789029 1730378 1679415 1673743 1625940 1574615 1540078 1437364 1413400 1432467 1529548 1624072
3403 1624072 1626432 1632153 1692704 1707921 1783311 1690074 1732458 1752514 1921118 1989341 2123149
3392 2123149 2251909 2312315 2566822 2794972 3120268 3285841 3317099 3179994 2937254 2842921
3382 2842921 2758315 2797654 2871213 2742033 2496032 2496247 2365506 2152328 2139307 2118288 2110184
3371 2110184 2026880 2098495 2203769 2198704 2174004 2252105 2223753 2190171 2311836 2442684 2379817
3360 2379817 2431695 2378270 2541521 2728461 2792769 2973337 3017660 3065289 2929739 2967634 2972956
3349 2972956 2853574 2826439 2946833 2913327 3014712 3159850 3283159 3338380 3303737 3374094
3339 3374094 3501094 3670274 3797435 3824560 3722968 3717969 3890019 4250021 4481280 4740666
3329 4740666 5296446 5805857 5685302 5277598 4892663 4541514 4442451 4321542 4272440 4107768
3319 4107768 4074038 4076121 4003454 4002121 4046621 4047243 4064035 4216309 4368425 4511448 4557672 4557817
3307 4557817 4673463 4897050 5107038 5156689 5390813 5572454 5918189 6359472 6804684 7549302
3297 7549302 8522778 9422929 9678859 8967687 7926704 7151269 6681859 6517081 6445244 6357570
3287 6357570 6264377 5978702 5872684 5889066 5788398 5753130 5868054 5960008 6045822 6044634 6064232
3276 6064232 6145570 6247192 6426913 6385782 6516281 6607192 6765020 6851922 7163299 7494708
3266 7494708 7935139 8528811 9198960 9478531 9409669 9095846 8805006 8582555 8441232 8401025
3256 8401025 8308876 8346318 8271815 8320349 8365955 8502884 8654469 8787365 8802037 8990795 9304840
3245 9304840 9582114 9801361 10093237 10608355 11083813 11495639 11872832 12150969 12476297 12918651
3235 12918651 13298833 13778954 14314886 14793549 15333657 15724207 15989013 16049326 15589234 14653351
3225 14653351 13568228 12544325 11800084 11198422 10623951 10243242 9941262 9656466 9278290
3216 9278290 8962124 8746484 8560697 8445711 8448028 8527783 8719902 8877209 9050578 9016229
3206 9016229 8798421 8646075 8529915 8454428 8458090 8715585 8916503 8991093 9068462 9468073
3196 9468073 9858071 9550465 8735389 7919780 7326571 6964600 6600269 6341284 6244730 5999639
3186 5999639 5960953 5924057 5988055 6053050 6132767 6347093 6729982 7219404 7756378 8297440
3176 8297440 8407474 8245895 7856698 7211746 6812732 6605506 6475496 6269859 6209009 6079541
3166 6079541 6040736 6152276 6206185 6027026 5650748 5437723 5204725 5084285 4871968 4658624
3156 4658624 4400926 4230203 4209287 4128560 4195277 4286806 4333052 4399452 4414104 4478878 4577755
3145 4577755 4729845 4799388 4533994 4265700 4031019 3812853 3578230 3341245 3117692 3049503
3135 3049503 3072292 2846465 2788116 2763998 2678231 2579340 2549169 2599946 2595218 2707332 2685270
3124 2685270 2458256 2342686 2234256 2247098 2216317 2225242 2115858 2093562 2074837 2062546 2044796
3113 2044796 2010334 1870378 1842397 1801605 1817016 1868963 1838765 1725935 1697235 1705783 1630454
3102 1630454 1656587 1620156 1587809 1494941 1484340 1438415 1539963 1568650 1553687 1491908 1454526
3091 1454526 1492123 1367263 1358816 1451941 1404399 1275501 1302767 1324027 1376684 1336320 1332035
3080 1332035 1315578 1252125 1241537 1274732 1302955 1178659 1200565 1195307 1233769 1292342 1289827 1290709
3068 1290709 1197342 1191860 1228931 1163394 1220002 1248357 1137960 1145141 1202716 1214167 1191923 1135689
3056 1135689 1218273 1241992 1207396 1176225 1128129 1105106 1139469 1072604 992555 1013025 1069310
3045 1069310 1050845 1056469 1087990 1220544 1149296 977112 1132502 1106397 1154927 1146657 1107958
3034 1107958 1089224 1136234 1204529 1059241 963559 966443 993345 977042 1023273 1111687 1122482
3023 1122482 1009225 971572 979866 976064 971299 869123 958134 975565 929945 887782 977026 1012783
3011 1012783 996556 929929 964100 1037921 1035856 1083741 1064069 1086676 1083072 1016009 1042215 1174834
2999 1174834 1154790 1202951 1185337 1209160 1168999 1232939 1171472 1172234 1293475 1335407 1350450 1308303
2987 1308303 1301092 1261800 1313965 1295695 1387663 1398493 1411828 1417637 1266789 1313727 1293985 1272409
2975 1272409 1318936 1271157 1209853 1313369 1357381 1373136 1405214 1471534 1551199 1538990 1533661
2964 1533661 1572502 1610153 1696469 1567379 1561833 1551078 1666515 1736165 1769841 1713718 1714147 1697597
2952 1697597 1719562 1713788 1730904 1707866 1699625 1750283 1704610 1820069 1774230 1787096 1770637 1861416
2940 1861416 1863341 1894585 1999466 2034336 2025092 2096184 2091809 2082366 2247383 2231235 2181702 2357222
2928 2357222 2393403 2422735 2571339 2838415 2963583 3039344 3015988 3079500 3195044 3301800
2918 3301800 3395995 3387719 3384041 3303292 3291194 3211180 3230999 3319891 3310282 3402720 3402429 3542245
2906 3542245 3570412 3557018 3563384 3450674 3443824 3513053 3627043 3733938 3977132 4057424 4174278
2895 4174278 4365877 4496080 4783391 5026475 5352765 5520122 5684706 5721483 5386488 5063805
2885 5063805 4796859 4605084 4429331 4262876 4100922 3901071 3873995 3850289 3818755 3790091
2875 3790091 3747996 3638576 3649879 3787770 3840198 3732215 3739554 3806050 3796308 3904575 4054750
2864 4054750 4004662 4007847 3963885 3906823 3978188 3982937 3854168 3751904 3722182 3508511 3359725
2853 3359725 3197926 3102817 3063405 2949562 2887178 2836915 2811861 2797288 2631120 2645040 2618458
2842 2618458 2690107 2672840 2588534 2576789 2501169 2335501 2244309 2168307 2085480 2099848 2096986
2831 2096986 2056340 1926756 1901807 1841162 1752897 1662261 1658002 1783593 1592531 1528166 1562808
2820 1562808 1462472 1408908 1426606 1432315 1323772 1390071 1408890 1356983 1381982 1349412 1330754
2809 1330754 1175385 1076933 1072538 1084956 969676 975894 1106024 1062668 1011425 900129 1001409
2798 1001409 972297 909608 862067 915388 865671 852108 855975 734118 702297 663246 696502
2787 696502 764572 713435 666602 725063 725878 652660 634751 738822 762165 686843 703577 736874
2775 736874 777825 765589 643943 610302 662537 622400 592850 583376 553330 505641 550470 620604
2763 620604 568506 552212 508490 602651 629874 580201 465292 432936 404550 356184 459385
2752 459385 528552 488062 457750 410448 423669 346510 336517 363117 380927 415416 387217 313626
2740 313626 142486 173946 295901 349424 364005 290370 352630 325521 321278 190755 285409
2729 285409 329280 281714 194498 206927 257783 215308 285631 305455 308916 296828 294346 310471
2717 310471 323810 257943 194134 276774 366982 378502 278004 192434 205577 187145 213900
2706 213900 225918 275009 219048 219422 209377 209943 181573 154241 134734 172208 210770 159034
2694 159034 124597 234564 271072 280495 129293 26946 84555 80220 126385 339134 263709
2683 263709 169919 165824 119587 -19631 18922 47518 37786 86314 121738 161632 151350 183283
2671 183283 170430 73542 100105 136233 122901 97975 181252 115783 118898 52573 68903 225263
2659 225263 230469 209271 175412 212419 147177 171558 178898 178333 52397 44510 99370 33576
2647 33576 -72275 78953 75023 15189 130177 67737 77554 153710 159676 160541 161119 151629 83980
2634 83980 70080 36131 129186 139031 198734 137499 123928 141350 79382 49160 37644 76241
2622 76241 118666 120291 100482 223420 157631 123056 172601 103974 59288 98786 90974 38802
2610 38802 45215 150659 216075 60790 21292 144107 208501 186418 125805 -4845 1520
2599 1520 141445 151661 105488 -4210 32642 130218 189228 56440 36325 67258 12566
2588 12566 46421 77835 160507 222298 230436 135099 93667 316813 223700 153814 57669 106686
2576 106686 91555 65649 45133 46666 155154 68315 55450 75535 179890 214152 132318
2565 132318 174600 137083 111162 82490 67002 64447 50261 84329 62033 15956 -8918 99395
2553 99395 62177 124792 154122 158688 38854 52131 -11268 31022 60151 45821 -466 103186
2541 103186 182099 134291 159608 151594 157809 104382 -6037 24802 45201 37052 87854 33787
2529 33787 95690 167276 151256 134891 148487 108731 90714 124870 74936 -26356 -90120 63959
2517 63959 16037 42410 48491 66043 163133 110407 112400 47347 -88663 11165 -31026 -29293
2505 -29293 -5933 -105999 -71673 4032 35588 47819 -35604 -37863 94243 14546 37727 126090
2493 126090 96342 54726 49882 -4533 14826 -39408 28629 62461 16782 -50014 13195 -67546
2481 -67546 -17856 -88303 -93252 -33253 2641 -46172 -41164 -65986 15413 33776 70260 74075
2469 74075 -33100 -86601 -112380 -119912 -155381 -61281 -63121 -7959 18579 -9629 -56205 106227
2457 106227 74215 -34286 36297 -59804 -96994 -50950 36668 39033 -76955 -61228 -41364
2446 -41364 -5729 2278 36659 36612 -9950 -69583 -5899 -15027 93940 124014 -18929 19787
2434 19787 -29131 13405 75346 -69064 -108174 -136159 -111008 -175350 -53351 -22311 -40312
2423 -40312 31467 86134 31935 -540 -36706 -92587 1919 10463 48750 -71189 -57983 -8635
2411 -8635 18845 19399 39605 54800 63037 144163 87056 48348 16323 41494 66962 75004 37202
2398 37202 -79783 -19560 6871 22092 -12651 38599 49236 150020 51774 -13512 -4391 -29954
2386 -29954 1298 36811 31191 149305 117107 23344 46061 16192 10040 621 20722 -40127
2374 -40127 -73327 -44583 -75157 -49991 102752 71245 181207 185799 24355 87311 225159
2363 225159 165331 162427 98916 -14127 17703 150751 136830 121252 109195 109936 24067 -535
2351 -535 67853 189636 167173 40079 82521 153348 159655 101089 125626 159613 112136 4908
2339 4908 136217 76717 29242 51809 41262 74468 27966 -22890 -16318 -86951 -33238 -62539
2327 -62539 -23867 34848 239 138193 47061 -20240 -9329 16055 45388 60631 22291 31549
2315 31549 -22166 4201 97498 71727 72479 66892 48109 111453 77378 85555 130780 115311 118325
2302 118325 58190 60061 12662 36437 71328 16939 -14474 95257 101670 65933 29045 -10708
2290 -10708 102431 71113 58581 52035 75744 9601 77367 100663 144561 128205 118221 156844
2278 156844 105511 29299 2856 -18374 -21184 545 97113 131218 -6495 2700 -15361 -52841
2266 -52841 42988 71045 82466 137609 92916 3236 -5775 49441 15531 9032 38606 89109
2254 89109 -14002 -51427 -25351 -131667 -160713 -111557 -24406 -4993 26060 86450 31629
2243 31629 22757 16358 62613 120459 74159 29632 68334 38611 -10190 -30682 2735 16555
2231 16555 127198 37357 79998 175190 98106 90100 5664 132000 141525 101346 29132 -7934
2219 -7934 -21982 67819 79713 10405 73656 19627 15428 101880 176964 180223 212059 245739
2207 245739 239569 205430 163630 274969 240154 184041 210233 133294 146943 230796 195648 257250
2195 257250 272553 238238 220457 263790 277941 168263 213155 246532 305702 308885 301877 262749
2183 262749 353740 390672 412829 469016 490191 419447 407719 307509 379772 392760 362602
2172 362602 348628 347351 454753 517520 451872 457719 532554 526307 496857 521239 510335 622103
2160 622103 589891 512862 514463 543532 614095 682425 803876 731623 766539 769958 743310 707484
2148 707484 741928 784655 799575 789793 767646 890056 874241 892760 946431 1025300 965919 930704
2136 930704 1086639 1151484 1004745 1118497 1208045 1190457 1287518 1357905 1394803 1520528 1550861
2125 1550861 1562618 1762205 1859641 1837749 1835523 1903585 2030685 2177340 2315414 2516666 2630572
2114 2630572 2724060 2862331 3013805 3185840 3357608 3625711 3833004 3980477 4540950 5001918
2104 5001918 5253682 5464586 5663482 6042346 6644555 7261589 8104450 9135067 10632626
2095 10632626 12443162 14761339 18039625 22924740 29861450 37138658 36154172 30707502
2087 30707502 25174564 19211140 15075893 12296717 10163038 8469407 7351904 6394332
2079 6394332 5739031 5213409 4987488 4781107 4651599 4464055 3979075 3539368 3159322 2819559
2069 2819559 2606418 2381166 2260158 2152228 2116029 1954823 1866175 1719609 1719591 1677640 1750122
2058 1750122 1652282 1532119 1432118 1363872 1281467 1198911 1045306 1024914 944725 1050271 1087430
2047 1087430 971430 935650 957044 928761 858233 846851 942174 847076 838307 760434 802523
2036 802523 799987 761718 762413 680050 593261 722976 687700 514095 466277 474113 560290 509839
2024 509839 442117 432772 459866 406482 361695 420332 449990 488734 417026 455038 498322 438767
2012 438767 371542 333320 242905 239828 277867 328450 325358 297898 238228 211489 137243 206975
2000 206975 228386 186845 240410 159107 266733 254653 142721 149661 153756 185592 308266
1989 308266 250339 225681 225081 211575 157140 190651 226132 164238 115772 216215 241653 219102
1977 219102 216193 253252 266410 238456 188912 222377 249829 272534 191253 154394 113496 -41747
1965 -41747 -46617 98252 94007 117121 130102 118498 78858 118870 168089 98552 53368 90604
1953 90604 41788 85675 230670 153485 130574 115558 128831 125419 79293 113481 116462 120249
1941 120249 -20808 -32006 26924 23243 -88236 -15504 94572 108040 75065 -807 112855
1930 112855 137681 96578 -1489 90737 150159 60998 10670 50616 93808 41578 135300 80003
1918 80003 105106 131784 70361 6685 96449 182360 149071 136399 38352 51933 100120 114525
1906 114525 126311 154428 112281 75306 12175 63168 -5070 18429 152044 121777 21631
1895 21631 36361 65184 -23995 -49728 -67824 -87727 27311 84308 2324 98845 158727 110527
1883 110527 87361 15494 -91437 -105012 -44989 95405 102809 6908 -37481 -18794 95425
1872 95425 2142 -42518 -16998 -93305 -100111 -97584 9562 39240 68094 28750 22263 58846
1860 58846 55142 -6867 -2134 -7987 23509 -4365 3810 115054 84988 136166 147195 58136
1848 58136 -29350 17307 66755 64482 -4239 108001 102077 30721 -10969 44278 19442 -23329
1836 -23329 7731 75337 103035 168273 166709 84619 17623 106031 113141 152507 50371 82040
1824 82040 113591 88322 90482 129562 196015 178611 189843 153051 234187 158212 67986 75775
1812 75775 105092 39649 48474 6497 29318 153085 124123 82594 36209 -69061 -5791 46026
1800 46026 3335 -26333 -42949 100095 2760 -123919 -21241 -82556 -44582 8274 29944
1789 29944 3747 48921 -553 17694 -45496 -13438 -3085 -12326 -17036 -32238 -58394 -64980
1777 -64980 12869 34444 68779 40248 -18737 -67212 -124130 -142299 -46 -5598 62578 82046
1765 82046 -27491 -142050 -155358 -47898 -53156 -63598 28830 24354 -4918 -106268 -125804
1754 -125804 -30424 1441 4481 -6426 26919 -36785 -62641 -108977 -140732 -168503 -91068 10442
1742 10442 -60336 -104009 -147899 -29813 39301 -22868 -54503 -37881 -34785 -40099 40115 156241
1730 156241 56011 18303 -3380 -53612 -126651 -139947 -157685 -207314 -83747 -45957 -11757
1719 -11757 -13020 -19288 -43883 -60954 -52154 -81130 -96448 29 36687 2877 -52558 -28641
1707 -28641 -42886 -97229 -135209 -5095 14881 -57216 -29355 -15387 81091 32846 116 54100
1695 54100 -24558 81779 132410 -12498 -82810 -80146 -35518 -16750 -90841 11657 -30591
1684 -30591 -62862 -44845 -47319 37104 60965 -48154 -60158 -194903 -223358 -103585 -73727
1673 -73727 -58321 -98321 -67386 113 -30516 -37903 -66444 -66369 -27742 -34148 3191 -25007 -55092
1660 -55092 -158388 -71505 33211 47011 -129204 -59030 -6321 64342 23917 22972 57615 61533
1648 61533 84540 42499 -32451 -21027 -108350 11612 -6413 -23492 -72236 -121231 -63298 -18764
1636 -18764 -25291 -10726 -79503 -37160 -2219 53086 -44587 -43494 -20185 -11221 -37535 -100259
1624 -100259 -67792 -47625 -91333 -116313 -50602 -138687 -40411 -51922 -62347 -68349 -3506 -66206
1612 -66206 -98411 -165879 -23807 -36019 33766 -60523 -155702 -81531 -40222 -41354 -40032 -23531
1600 -23531 -779 -116465 -12472 30921 29062 97010 88005 24210 -29931 -10525 70305 29396
1588 29396 77329 146999 113593 62776 110089 72351 -29212 -11592 -94941 -40362 29010 5328
1576 5328 -36318 20869 23664 -152561 -113564 -103351 -61455 -32663 -88451 -58965 -41772 -45690
1564 -45690 31664 27784 13079 62111 -3535 100430 72159 -15853 -6635 29335 11987 77042
1552 77042 58667 23955 -20270 -21201 -36727 -19491 -20722 -86735 -39009 77045 59043 4739
1540 4739 18721 109394 114635 68662 14143 -62375 37690 62483 -82845 -139499 -92163 22440
1528 22440 61014 -68637 -104348 -40542 -103423 -26225 -85172 -76032 57934 29137 47882 74001
1516 74001 34023 47911 -10779 51900 -23628 -117754 21126 26343 -4758 -52710 75207 16554
1504 16554 -33914 -30575 -63531 -77237 -88929 -76373 -101063 -33760 26179 -38305 -82413 -7530
1492 -7530 201 -30977 -20315 -45369 -69582 20035 -5805 -70956 -103147 -3480 112457 132631
1480 132631 75748 30419 -57083 -104573 6573 46909 -58085 -63433 -100773 -194673 -93684
1469 -93684 -122166 -83052 -51257 16105 31425 -52988 -32549 21821 -201560 -187210 -103193 -66409
1457 -66409 -46704 -47349 64356 -47270 29783 -66774 -11303 7396 16943 3649 -51627 -129260
1445 -129260 -192342 -172360 -69407 -55019 -77663 -69699 -55045 -28816 19210 -34630 -30335 63712
1433 63712 46389 11333 3576 11089 -52548 -94458 18328 -49237 -159148 -55877 -14782 -31809
1421 -31809 -33928 -20672 -80597 -49396 -79686 -595 -70382 -53729 -48073 -83281 -92678 -2612
1409 -2612 20084 42308 -27899 -27499 2831 22191 19851 -45889 -154563 -118732 -66580 91645
1397 91645 44160 1367 61100 74901 -7898 -9004 -8795 1114 -20459 -82199 -146334 -121411 -93850
1384 -93850 -42687 -44426 -13649 70103 12969 21260 -12389 -52160 -53272 -17952 -9820 -36536 15448
1371 15448 54704 -15574 680 -63604 -2030 -59198 -17500 -12041 85488 180277 55277 -41623
1359 -41623 -27123 66304 108676 -5430 67658 87832 -39055 -18327 64918 57504 41408 6646
1347 6646 -44794 -91017 -8015 -109889 -110710 -165865 -51395 24055 1482 -60859 33093 -38671
1335 -38671 -93066 24922 41260 63724 5179 -44818 -45846 -10307 -35153 -58405 -13597 33968
1323 33968 72463 -11962 -19402 163124 41209 48092 8694 -39778 -48162 -110710 -82178 -30089
1311 -30089 -17572 -33019 -57548 -51302 -66876 -115647 -78622 -82057 -109175 -102740 -51313 21029
1299 21029 -56198 52410 8048 -120844 -64173 -70295 -70428 -88689 -2449 711 341 63592 -4268
1286 -4268 35891 60601 -37245 687 53279 -10458 10933 31837 -6015 -20826 40772 103460
1274 103460 107293 74340 52062 44405 77850 9834 46562 50369 128390 53767 1726 6163
1262 6163 -43802 -19426 -62984 -85775 -29156 22594 40870 47539 38023 -2648 -11607 -38987 18967
1249 18967 -30690 -77409 -81560 -49647 -61505 -39878 -47047 -83479 -33989 27319 3423 -12503
1237 -12503 -9743 2611 30933 -5826 33730 103289 11741 -16737 33459 -31346 -66252 -86973
1225 -86973 -53620 -95358 -21393 -17824 -63575 -80823 -7414 18797 77998 -12062 -58279 -81500
1213 -81500 -101115 -148598 -65805 -59306 -100712 -53028 25240 80277 37017 59556 8474 -27566
1201 -27566 38509 9993 66879 -4069 -28738 -62646 -40208 88166 74704 55104 107762 64980
1189 64980 -62769 -93505 -47954 46660 39436 56038 16310 -10085 -11966 -61957 -12466 136338
1177 136338 61863 -18737 -27491 40020 64753 -4067 -3974 26770 -24572 -20314 -55167 44839
1165 44839 61343 22013 95256 -19126 51481 100373 57407 19135 -73132 -117898 -70344 -34084
1153 -34084 60043 -53850 -45220 -27287 -26701 -24241 49651 -37350 -83713 3260 -82705 -16646
1141 -16646 71854 51729 -8598 -43749 -6197 25525 -15068 64176 -7154 2134 34946 75948
1129 75948 30083 -53810 -21795 14496 -66299 13723 -85682 -69224 -54088 60610 -17085 -54027
1117 -54027 32481 -19045 62110 -47780 -125691 -127111 -109868 -73648 -5194 46266 -47622 -49244
1105 -49244 -39018 -88751 -170175 -91283 -10023 -28698 -154366 -55672 -4738 -74558 -107323 -48929
1093 -48929 -52324 -67670 -13407 -84669 -62244 -38533 -10221 -23805 33050 19293 -18268 -52854
1081 -52854 -91117 -55697 -47980 -75652 -111636 -111394 -68803 -112563 -50164 42593 92704 80756
1069 80756 44986 -79799 -49991 51028 86221 4299 8496 -75153 -42565 -63445 -63320 -45935
1057 -45935 24799 74307 -63899 -108316 -23438 -18659 50683 -240 -27513 -36 -2819 -66257
1045 -66257 24778 -15982 11101 28497 -17155 -51094 67746 10235 -58822 -46141 2275 65584
1033 65584 -4770 12856 -27990 -20068 -44072 -11130 -96125 43324 126938 113231 22916 -11730
1021 -11730 20925 11710 -73228 -77644 -81812 67510 -84811 -54804 -19564 -18053 16425 5839
1009 5839 -25560 26275 55694 -8208 22458 -52211 -65735 -82701 -126720 -106859 8242 -89826
997 -89826 -29154 38216 -14329 -3578 -54480 -58676 -138967 -114364 -92071 -75075 9995 6550
985 6550 62151 28452 62675 78967 57780 28293 14310 -15260 -31551 8986 14671 -39644
973 -39644 -86408 -41433 -64347 53929 108511 42627 -25686 -92745 -65274 -107897 -2315 46439
961 46439 37579 50112 83215 129431 129368 -13731 -91907 -29536 -7194 8453 -2768 69994 -27322
948 -27322 -47959 -8628 -19696 50010 70688 -42755 -90240 -12571 1877 -64638 -25438 -23619
936 -23619 -66618 -77716 45685 14431 11372 -99857 -122262 -43552 -73186 -52377 -49079 -59584
924 -59584 -32055 1272 -20260 -1568 -10067 -112536 -51767 -60597 -139465 -33900 39146 -13399
912 -13399 -76944 -74076 -44201 46838 -21991 -14322 43990 122597 24208 -46961 -23979 -73763
900 -73763 -3793 35202 91323 47950 -61721 -99813 -83812 30761 -49260 -35163 -63337 12485
888 12485 -9316 35640 79201 72284 62550 -1116 16857 -62022 -8015 -11962 4037 2343 15509
875 15509 88231 70382 63651 122593 150205 62501 20970 -19599 46623 40556 8376 -71013
863 -71013 -76135 -110188 -25609 -22511 -143080 6504 -24578 -66061 -53997 -127676 -84190 -66042
851 -66042 8714 89347 8645 12707 -33176 -19368 40959 -9580 -53044 -41592 7955 -17117
839 -17117 8742 -1918 -33684 5942 45709 30262 -16510 -63860 -71689 -29036 -23508 30900
827 30900 53979 84206 28701 19720 61870 6532 -43126 20260 -31097 -96729 -76754 -69282
815 -69282 -36236 57998 13486 28698 56947 121354 7457 -156965 -56039 -11089 8934
804 8934 -108161 -209294 -13009 23211 -80668 -125411 -75292 -126499 -53198 11147 -132279
793 -132279 -64571 -4185 -16402 -17399 17393 -8440 53060 30280 -77928 -65371 -132833 -82616
781 -82616 -88268 9418 122248 -13777 65627 45783 -84925 -152368 -53302 80821 68087
770 68087 -1788 -52153 -23041 -14864 -89148 -75312 -18689 -94317 -76233 38180 167853 56291
758 56291 48630 23831 33399 17146 -16593 29882 9663 107570 54245 35871 -54224 -14649
746 -14649 106130 -65995 -61819 -17157 -131271 -131315 -17479 -49766 -112900 13630 85901 16309
734 16309 9956 93360 98105 10515 1541 28941 3433 -24774 -104168 -51106 20743 3023 -7483
721 -7483 -4711 -61357 -135632 -97281 7709 -7895 48875 -34215 -88798 -77316 -77006 -6047 57206
708 57206 45460 67648 13447 6765 32197 21986 -76462 -90013 -17518 40176 53966 62698
696 62698 22925 10231 97288 35715 -33942 -1658 27537 72291 51143 -36032 -24425 25724
684 25724 63405 -37867 -19625 16296 -21991 795 -29460 -103772 -36161 -20605 15636 1728
672 1728 70292 36038 -44794 -73472 -127117 40650 80085 33187 66412 43700 32679 -69542
660 -69542 -11786 81050 32742 -71124 -153217 583 79928 64921 150666 89068 34329 30846
648 30846 95619 171056 112714 -67654 -66070 33157 98612 66390 129942 107588 31040 105160
636 105160 120338 40764 94747 4327 -11976 131899 103777 109394 73127 53267 72368 104650
624 104650 30252 24609 18753 15785 10756 -8276 -23599 -8442 -108758 50578 110654 93118
612 93118 38101 -141451 -123872 -36187 15384 138041 19184 -117442 -33964 -102975 -88902
601 -88902 39304 43464 75658 72884 94093 75903 70134 33291 24941 56938 42540 28146 -34345
588 -34345 30712 33618 5853 145514 17109 -31130 42206 -45503 -52028 -73220 -131686 -99168
576 -99168 -28787 -22833 -25807 -118446 -89987 -9665 -88471 -74595 46594 2761 -82872 63049
564 63049 74817 72552 57443 55973 3099 -50084 46219 54278 42686 -32844 -51335 -54310 104803
551 104803 -5184 23035 11999 14851 55089 62351 60681 111212 28733 29705 33299 6316 22056
538 22056 -80259 -59144 -64859 -929 81882 -41410 -19146 23842 -75001 -75241 -3821 36090
526 36090 -5564 27579 57560 58585 113128 33138 -77375 -98221 -74314 -86771 -107837 -31689
514 -31689 -65887 -3393 84089 58165 -24898 11227 58060 -49436 -72939 -44526 19445 44445
502 44445 140991 156559 126427 91757 43566 -13483 28850 14214 -163219 -131960 -86955 -40749
490 -40749 40084 31804 -25175 -5211 -15957 -22053 -105033 -8929 -40853 -45696 -4961 45937 81378
477 81378 69617 -82359 -28690 4311 -61148 -118182 -188560 -82287 -10015 -25515 26893 81311
465 81311 17127 -28440 78836 1950 14719 116305 123822 127290 4792 -40905 -29308 49810
453 49810 -1598 -54821 -44599 -51130 45200 -62430 -137155 -36875 -34261 -115476 -58924 -51963
441 -51963 -7081 -1325 -20345 -90946 -63092 130541 60416 77850 63373 75592 53553 -13452
429 -13452 -16591 -3515 50533 73609 34591 84977 47473 97431 41442 5933 2413 -13052
417 -13052 -73650 32967 55154 -11614 -8697 -81440 -59159 -103322 -68731 -22046 -33040 -45233
405 -45233 -123279 -152091 -126664 -157124 -22859 -39862 -124154 -101787 -86430 -62870 -39850 -45207
393 -45207 -22504 -94337 -100823 -79679 -39249 -126551 -149275 -50995 -78645 -107170 -130239 -105105
381 -105105 -59087 -56014 -40851 -83805 -74233 -55657 -47818 116496 -29479 -116380 -139032 -106703
369 -106703 -118344 -135979 -176087 -90426 -99966 -80186 -71004 -125263 -123721 -88627 -110134 -136729
357 -136729 28644 -68937 -14356 53100 -60359 -48398 -120317 -82113 -59725 -92146 -161503
346 -161503 -114606 -85412 -45932 -39621 -51994 -73075 -79298 -72797 -60173 -65903 -73864 -67323 30867
333 30867 64761 27753 42240 -15149 23104 -10598 8414 72569 46060 -35927 -192577 -39017
321 -39017 34630 -97556 -104913 -164212 -207078 -155483 -115143 -130061 6742 -48061 -97190 -84990
309 -84990 -74101 -64197 -157954 -160863 -156328 -130872 -140600 -133257 -89104 -164634 -53437 -70308 -138664
296 -138664 -128018 -103387 -57531 -79816 -112625 -58555 -142608 -48368 -30430 -48493 -14576 -231
284 -231 -135234 -122608 -31074 45235 30572 95171 84218 -118180 -59859 -31555 -32050 -5718
272 -5718 -794 -50980 -106982 -99375 -164333 -91368 -62021 -3292 -39533 -113072 -41853 -25092 -175301
259 -175301 -161235 -81919 1316 -2060 -47267 -80406 -74580 -64151 -145765 -102821 -117620 -168206
247 -168206 -84728 -63718 -118351 -102805 -97138 -47103 -178612 -104759 -46706 -45696 1581 7980
235 7980 -31537 -121512 -141763 -77101 -59467 -30334 -68415 -97076 -45648 -115236 -126913 -69272
223 -69272 -163074 -102900 -73639 -142688 -71071 -30361 -88798 -70764 -25426 -70361 -91314 -82467
211 -82467 -70946 -64354 -62142 -35268 18888 -12530 -74481 -82306 -124105 -38433 -14473 -98017 -115604
198 -115604 -44605 -130256 -106796 -99216 -182196 -245833 -191536 -219504 -114661 -111310 -167328 -189662
186 -189662 -109603 -63106 -57848 -24781 -15892 -122700 -139559 -108022 -84145 -65015 -49724 -51126
174 -51126 -79720 -123936 -119968 -37203 -41061 15213 -33303 -30046 6478 42097 -11440 -22185 -42745
161 -42745 -85796 -49867 -57747 -95756 -120966 -51268 -18496 -18616 -124140 -10669 58733 -10571
149 -10571 -74599 -108370 -12729 -56801 -69320 -152388 -70823 -71478 -20448 -41922 -68185 5642
137 5642 -3723 7010 12328 -11828 51147 -33629 -42223 -46248 -62516 -36815 14419 -59520 -30305
124 -30305 20834 15450 -49517 -34471 15391 -46995 -98258 -69170 -11152 -27432 -3137 14464
112 14464 5081 14250 -1550 -73653 -70296 -77989 -37541 -68629 -135835 -101779 -70248 -83712 -82997
99 -82997 -143712 -111246 -83762 -71400 -69508 -109183 -123558 -151094 -101969 31615 12323 -2016
87 -2016 -32526 -121071 -186296 -144215 -92250 -175734 -140257 -74233 -24892 4048 -28572 -29819 -38778
74 -38778 -147247 -118516 -111365 -151285 -162900 -116342 -93281 -125857 -42041 -51450 -109791 -90768
62 -90768 -89029 -91603 -113071 -90072 -36444 -81228 -129876 -112906 -74689 -83404 -170809 -127274 -130081
49 -130081 -64154 -58436 -68405 -66007 -72798 -40066 -48059 -56272 26871 49343 7595 -35517 -19377
36 -19377 -37656 -74692 -64541 -92463 -18884 -24664 -37579 -41499 -34861 -61956 -4540 -75221 -79851
23 -79851 4816 4851 -63637 -70003 -97895 -60197 -32417 -96978 -82487 -133959 -103897 -92409 -77580
10 -77580 -91280 -79276 -16726 -95436 -97916 -27476 -15014 8208 -33811 -13910
0 -13910
$$ Imaginary data points
##PAGE= N=2
##DATA TABLE= (X++(I..I)), XYDATA
16383 -953620 -952046 -957153 -799166 -768631 -767143 -752446 -785893 -785733 -692083 -662294 -739194 -740013 -713919
16370 -713919 -714203 -624652 -567108 -556137 -512292 -492404 -518370 -511950 -454508 -420875 -442541 -452475
16358 -452475 -428031 -368016 -365896 -382122 -345347 -307146 -289580 -182937 -119531 -200413 -220005
16347 -220005 -230838 -142635 -127372 -135650 -215203 -199556 -61018 -396 -52465 -47952 -50947 -61402
16335 -61402 -79917 -36651 46841 48469 74400 87667 128730 190148 129972 82841 160260 185471
16323 185471 234933 259745 288578 284510 261249 316038 342088 317185 297438 429612 393281
16312 393281 387671 420744 379164 345175 466111 484794 497381 499257 548386 592919 564954 553719
16300 553719 568714 528877 582655 600550 617239 577201 689617 815805 703178 732482 751726
16289 751726 842536 911679 889212 894490 969571 928794 872502 883388 784520 954297 1040186
16278 1040186 1023432 957829 907059 923246 866575 1032545 1038674 1074339 1064123 1094290 1059412
16267 1059412 1089093 1091401 1041998 1097681 1181867 1206978 1152263 1151799 1236480 1175542 1178159 1215939
16255 1215939 1246982 1306360 1295731 1311718 1402871 1326532 1307595 1301863 1305427 1347195 1331519 1406935
16243 1406935 1363235 1269993 1396109 1494317 1515354 1470801 1390243 1479641 1496094 1498478 1491205
16232 1491205 1448797 1448160 1484453 1547499 1588413 1599274 1648775 1691190 1724351 1740792 1778760 1761909
16220 1761909 1710114 1651975 1720788 1693140 1640739 1664118 1763868 1759530 1779314 1775630 1721651 1700471
16208 1700471 1809562 1716396 1586345 1621062 1655677 1711013 1664347 1648668 1705255 1701658 1750331
16197 1750331 1751632 1839119 1790345 1828460 1903832 1842003 1826015 1728273 1749876 1784028 1850002
16186 1850002 1918630 1977470 1881258 1925320 1937235 1887073 1976744 2009595 1935790 1919753 1943829
16175 1943829 1935650 1885815 1952573 1932867 1962514 1961536 2004978 1963257 1936610 1953442 1994190 1943493
16163 1943493 1919616 1984955 2020188 2085443 2110731 2103734 2091623 2038833 2066474 2077439 2109924
16152 2109924 2068099 1966415 1974511 2011457 2028304 2060073 2014636 2025544 2111107 2151966 2119696
16141 2119696 2069789 2130326 2186997 2132322 2103693 2058694 2058466 2100602 2145760 2168369 2159470 2096519
16129 2096519 2093945 2129024 2045781 2054423 2141747 2175933 2167839 2066689 2022084 2069354 2144266 2173292
16117 2173292 2176415 2250722 2217229 2225029 2179577 2218158 2193848 2168960 2187702 2345157 2307482
16106 2307482 2259793 2144418 2056397 2145901 2187167 2152016 2178279 2097511 2194529 2196551 2097474
16095 2097474 2175634 2075230 2084648 2089066 2187387 2120130 2090927 2232096 2172354 2138506 2086217
16084 2086217 2123195 2260824 2253870 2195388 2296819 2225507 2104356 2136607 2133595 2244611 2221339
16073 2221339 2132962 2196335 2229029 2236138 2208437 2230321 2289560 2380986 2333078 2278257 2293610
16062 2293610 2347226 2340362 2261087 2295687 2315688 2244733 2295752 2302028 2251439 2227209 2207254 2163991
16050 2163991 2281350 2312130 2314153 2221874 2137732 2198894 2213119 2298663 2251961 2193867 2171323
16039 2171323 2129625 2168947 2231480 2203155 2219685 2286999 2267963 2295363 2170554 2147514 2242893
16028 2242893 2293523 2262007 2105908 2247189 2208313 2221717 2225679 2168631 2216023 2321923 2306606
16017 2306606 2260922 2270962 2205212 2220155 2220159 2322038 2355738 2367344 2348647 2334120 2410902 2332858
16005 2332858 2209043 2226127 2222770 2155035 2250396 2190257 2222411 2261122 2184521 2247490 2314757
15994 2314757 2395581 2449218 2311641 2267013 2278670 2215608 2241686 2221313 2345080 2391354 2250691
15983 2250691 2220197 2319073 2369283 2344353 2341738 2347838 2256016 2133567 2253913 2233390 2282144
15972 2282144 2263753 2317503 2294442 2206471 2152773 2259975 2310148 2271040 2329740 2372925 2302160
15961 2302160 2267064 2161294 2164105 2229496 2257250 2269987 2275654 2352075 2351882 2323243 2271920 2254400
15949 2254400 2281766 2260550 2168832 2203209 2166476 2171591 2191186 2291377 2233346 2219359 2214811
15938 2214811 2222129 2316514 2282926 2230073 2282444 2241514 2273666 2252098 2320384 2337587 2261695
15927 2261695 2211834 2229395 2202244 2226693 2199712 2082879 2179668 2291101 2348559 2318378 2379122
15916 2379122 2315037 2276088 2262869 2270984 2298089 2378906 2384543 2307418 2343903 2368561 2358706 2325059
15904 2325059 2382264 2408620 2399609 2376157 2333991 2358804 2333253 2353154 2217777 2272329 2332145
15893 2332145 2324441 2284087 2225483 2306625 2271488 2223726 2306733 2343946 2414427 2375320 2250267
15882 2250267 2171684 2214071 2254342 2256978 2356827 2297746 2395092 2336022 2262865 2225447 2283553
15871 2283553 2287236 2286121 2321962 2308219 2299816 2399648 2342158 2374703 2343726 2313218 2266025 2262727
15859 2262727 2223633 2242138 2349390 2303325 2360222 2314210 2264356 2313064 2163533 2174369 2251403
15848 2251403 2236055 2331817 2261302 2189679 2263525 2313911 2254706 2266237 2212752 2195135 2212552
15837 2212552 2250185 2214780 2185245 2253505 2306115 2350344 2374481 2359340 2429916 2366338 2222540
15826 2222540 2258231 2251628 2185793 2146863 2203400 2269512 2216128 2273542 2357354 2261139 2281081
15815 2281081 2175569 2189225 2314329 2289612 2368975 2327625 2220382 2263321 2348311 2330572 2343929
15804 2343929 2320376 2335802 2377944 2345596 2313999 2314141 2250875 2277700 2344935 2414809 2260040
15793 2260040 2371182 2266750 2215798 2348148 2298055 2283402 2325018 2418207 2405192 2396008 2239067
15782 2239067 2235570 2368356 2348793 2269025 2229184 2268788 2331608 2205622 2202931 2309924 2290311
15771 2290311 2305291 2407653 2383587 2319880 2309654 2307562 2261123 2381786 2364712 2301217 2324569
15760 2324569 2282081 2319012 2405842 2429465 2308602 2310171 2334192 2370790 2414188 2329996 2279956
15749 2279956 2393867 2345570 2332403 2339690 2392580 2419771 2406375 2335709 2351296 2364784 2357135
15738 2357135 2373832 2344648 2305857 2266182 2340882 2294011 2346623 2241866 2254600 2325792 2413061
15727 2413061 2393885 2354907 2323063 2354512 2424042 2329316 2399327 2447277 2354820 2370202 2352775
15716 2352775 2408041 2415632 2348611 2351615 2366363 2412925 2286795 2216507 2206058 2253639 2326250
15705 2326250 2307055 2230295 2255879 2206032 2280984 2371767 2378891 2390854 2362557 2380080 2315200
15694 2315200 2249748 2348794 2375198 2390006 2299605 2217758 2275333 2343337 2312437 2212319 2133055
15683 2133055 2181346 2348954 2443737 2308441 2273522 2335459 2310394 2264046 2338948 2324895 2292938
15672 2292938 2423547 2447002 2444535 2369902 2392505 2375768 2315091 2247299 2260146 2235042 2186433
15661 2186433 2272029 2286400 2358275 2307862 2304649 2429427 2398230 2378809 2310505 2313338 2251806
15650 2251806 2389427 2384655 2335633 2449908 2349020 2357611 2366771 2304046 2353119 2306671 2339923
15639 2339923 2343697 2308098 2297494 2364996 2314920 2307343 2356770 2364711 2316696 2252482 2256703 2265435
15627 2265435 2296950 2327323 2346669 2337254 2450707 2418655 2394071 2358582 2388577 2428323 2454838
15616 2454838 2493196 2340053 2387687 2350976 2322024 2349576 2299020 2279353 2317467 2234087 2336649
15605 2336649 2345636 2295607 2365390 2450790 2419607 2436936 2373257 2401522 2474619 2382579 2362138
15594 2362138 2309250 2383553 2271590 2252937 2298424 2333912 2384569 2387405 2373811 2495060 2440055
15583 2440055 2401552 2321189 2340024 2358833 2455817 2406895 2304229 2254283 2308557 2364097 2372627
15572 2372627 2494540 2510154 2402914 2395438 2368192 2436924 2495380 2422750 2322137 2358756 2342934
15561 2342934 2383481 2357759 2337881 2391670 2383343 2380258 2391717 2371072 2306466 2357582 2405559 2388390
15549 2388390 2385606 2377646 2344908 2434109 2434619 2399028 2408211 2399016 2394197 2465050 2443675 2470723 2442844
15536 2442844 2420473 2321255 2284553 2375711 2434771 2369773 2366463 2440159 2360871 2369253 2328932 2291596
15524 2291596 2331301 2249427 2226169 2309173 2410216 2334045 2441512 2404204 2461909 2378606 2452498
15513 2452498 2437342 2322862 2366342 2368759 2344394 2402007 2464960 2463293 2403630 2440688 2490953
15502 2490953 2372641 2364796 2422606 2439284 2288590 2295534 2309965 2284797 2413410 2358859 2422584
15491 2422584 2396983 2370545 2395433 2297178 2240291 2278028 2404919 2379111 2380905 2357428 2437027
15480 2437027 2317123 2308401 2360121 2350034 2219781 2313026 2392895 2366906 2394822 2377562 2329722
15469 2329722 2411129 2360941 2372561 2385768 2416521 2418824 2450380 2538686 2371235 2264931 2387373
15458 2387373 2463064 2473024 2453427 2360854 2432596 2459312 2341600 2309086 2307291 2355765 2230727
15447 2230727 2272166 2397544 2364209 2457770 2440130 2283513 2249955 2362885 2389001 2330090 2280781
15436 2280781 2343193 2369944 2331799 2460951 2513931 2382667 2371794 2367760 2402825 2494118 2501518
15425 2501518 2486375 2418454 2442309 2505717 2474659 2437339 2364435 2333952 2440377 2396373 2363702
15414 2363702 2340206 2374617 2446604 2479668 2504434 2427608 2412734 2294465 2365741 2500602 2564215
15403 2564215 2419064 2320719 2361558 2286707 2378708 2486927 2413084 2388134 2429468 2465051 2434578
15392 2434578 2443469 2422053 2403090 2499099 2461653 2359381 2447064 2415013 2407119 2429792 2468462
15381 2468462 2495876 2524036 2566772 2533380 2392477 2372665 2373993 2359610 2414836 2392616 2364873
15370 2364873 2325229 2340793 2394366 2447414 2435064 2418556 2456784 2497210 2565421 2522113 2499407
15359 2499407 2514764 2493359 2410529 2338372 2352176 2401634 2371694 2376014 2438963 2405282 2325050
15348 2325050 2379775 2451747 2480926 2517472 2508415 2440507 2419648 2382817 2384525 2462462 2471128 2416807
15336 2416807 2435684 2421489 2420303 2408848 2442130 2521907 2574015 2536015 2514627 2523611 2461516 2523418
15324 2523418 2524715 2396346 2350148 2421092 2406687 2341106 2298675 2322558 2384388 2313543 2389591
15313 2389591 2425864 2439458 2490554 2436935 2476873 2388350 2421034 2423470 2476855 2426688 2346813
15302 2346813 2321821 2343670 2331012 2411840 2450271 2335223 2418640 2618564 2462096 2351555
15292 2351555 2514158 2496314 2527939 2455124 2358989 2415132 2445232 2367060 2352934 2363439 2334601
15281 2334601 2453917 2464722 2474375 2488431 2527526 2529588 2549389 2486789 2445281 2431156 2408417
15270 2408417 2472715 2508715 2452804 2347486 2408366 2487551 2451568 2405833 2438677 2563056 2519029
15259 2519029 2529290 2433400 2374958 2380498 2379108 2478753 2435639 2430920 2423756 2431178 2494726 2557334
15247 2557334 2630273 2600886 2592264 2536294 2486029 2509652 2457630 2394943 2492636 2475704 2461666
15236 2461666 2481800 2519237 2483836 2407204 2457683 2478364 2480618 2516152 2504975 2409403 2471348
15225 2471348 2422509 2458933 2498301 2505567 2509089 2476285 2470738 2428724 2361682 2415307 2495857 2390307
15213 2390307 2427750 2442551 2357968 2425874 2311352 2306994 2279591 2386649 2428991 2387800 2434669
15202 2434669 2420871 2329441 2420249 2480349 2419609 2469953 2537119 2517601 2488121 2473234 2492349
15191 2492349 2523366 2477842 2494509 2569608 2513630 2396917 2483422 2478473 2542347 2575911 2551010
15180 2551010 2529694 2489497 2502086 2617533 2616292 2652142 2587851 2441720 2431354 2456139 2461938
15169 2461938 2439043 2490541 2497412 2543116 2468246 2483070 2565874 2546215 2459684 2514945 2579890
15158 2579890 2510985 2494363 2444595 2486979 2407558 2452975 2522037 2462055 2552541 2537192 2549936
15147 2549936 2646253 2550133 2473385 2466036 2462408 2550702 2508432 2584839 2562959 2561932 2514559 2426235
15135 2426235 2415397 2436605 2454334 2360069 2512231 2507659 2512870 2562471 2439377 2451488 2437488
15124 2437488 2456503 2368917 2390300 2413021 2471200 2461510 2502363 2495997 2517081 2329038 2479858
15113 2479858 2521767 2418352 2496846 2517580 2591383 2442444 2471255 2419756 2368507 2426204 2512691
15102 2512691 2579010 2587362 2538311 2547079 2551081 2590727 2502919 2469872 2499406 2427967 2441582 2444341
15090 2444341 2477228 2475441 2462467 2447689 2409083 2498772 2566088 2521769 2478361 2522599 2526867 2597775
15078 2597775 2542423 2520217 2570793 2548375 2467578 2564210 2524131 2470887 2500581 2505222 2465541
15067 2465541 2581355 2533510 2533058 2518593 2492780 2492277 2547589 2571402 2567572 2574026 2603285 2558404
15055 2558404 2517929 2567212 2457075 2408057 2475902 2505495 2508845 2456822 2517091 2552090 2517080
15044 2517080 2598878 2535642 2514999 2463965 2488945 2494065 2458719 2444785 2554028 2470804 2342059
15033 2342059 2415595 2480812 2521314 2577207 2606426 2513491 2475716 2534755 2515634 2591379 2633558
15022 2633558 2542269 2630673 2601873 2587704 2552016 2550598 2542316 2464639 2525362 2536605 2504998 2518962
15010 2518962 2481333 2498491 2518055 2518406 2540924 2609302 2548055 2560976 2566552 2481952 2404437 2366144
14998 2366144 2397274 2542119 2569737 2464239 2477817 2424796 2560333 2592484 2565543 2594835 2603952
14987 2603952 2642017 2469535 2424057 2471375 2419164 2458848 2441989 2471794 2466418 2498633 2450717
14976 2450717 2451752 2540747 2595335 2518381 2509789 2615820 2484382 2540144 2553022 2467035 2540771
14965 2540771 2447119 2502801 2512144 2552664 2648020 2635445 2624046 2626303 2561829 2563496 2557640 2542607
14953 2542607 2494163 2512266 2545673 2523187 2551059 2573491 2562707 2621432 2628710 2582391 2498153
14942 2498153 2488677 2587588 2681545 2699176 2668261 2517916 2524491 2612465 2656018 2523705 2466701
14931 2466701 2407897 2491045 2444885 2350306 2417439 2478856 2544086 2591993 2629437 2583760 2539816
14920 2539816 2515431 2605467 2609193 2546803 2566925 2568672 2547714 2540980 2613747 2563645 2511504 2609916
14908 2609916 2561013 2585985 2542570 2599407 2617499 2495068 2514096 2600954 2597678 2580402 2569051
$$ [...]
##END NTUPLES=NMR SPECTRUM
##END=
