##TITLE=1H_TG-2340-XII
 CDCl3
 8 sc, 
 15.6.2023
##JCAMPDX= 6.0         $$ Bruker NMR JCAMP-DX V2.0
##DATA TYPE= NMR SPECTRUM
##DATA CLASS= NTUPLES
##ORIGIN= UXNMR, Bruker Analytische Messtechnik GmbH
##OWNER= root
$$ XWIN-NMR		Version 3.5
$$ Thu Jun 15 14:02:14 2023 Russian Standard Time (UT+4h)  she@DPX200
##.OBSERVE FREQUENCY= 200.13135
##.OBSERVE NUCLEUS= ^1H
##.ACQUISITION MODE= SIMULTANEOUS
##.ACQUISITION SCHEME= undefined
##.AVERAGES= 8
##.DIGITISER RES= 18
##SPECTROMETER/DATA SYSTEM= spect
##.PULSE SEQUENCE= zg30
##.SOLVENT NAME= Acetone
##.SHIFT REFERENCE= (INTERNAL, Acetone, 0, 15.7722)
##AUDIT TRAIL= $$ (NUMBER, WHEN, WHO, WHERE, WHAT)
$$ ##TITLE= Audit trail, XWIN-NMR		Version 3.5
$$ ##JCAMPDX= 5.01
$$ ##ORIGIN= Bruker BioSpin GmbH
$$ ##OWNER= she
$$ F:/spectra/data/she/nmr/H-F/1/pdata/1/auditp.txt
$$ ##AUDIT TRAIL=  $$ (NUMBER, WHEN, WHO, WHERE, WHAT)
(   1,<2023-06-15 14:00:49.87 +0400>,<she>,<DPX200>,
      <created by zg, POWCHK disabled, PULCHK disabled
       configuration hash MD5:
       00 E9 B6 7A A2 85 ED C7 34 08 36 98 17 FE 4E 26
       data hash MD5: 16K
       5D 03 24 72 39 2F A1 B7 16 1B 94 5E B2 C4 AD 93>)
(   2,<2023-06-15 14:00:52.70 +0400>,<she>,<DPX200>,
      <Start of raw data processing
       efp BC_mod = 2 LB = 0.24 FT_mod = 6 PKNL = 1 PHC0 = -20789.48 PHC1 = 20.05272 SI = 16K 
       data hash MD5: 16K
       29 E1 FB 00 A9 BD AB A1 45 D9 54 BD 08 9A 55 E7>)
(   3,<2023-06-15 14:01:16.60 +0400>,<she>,<DPX200>,
      <pk PHC0 = 7.535193 PHC1 = -10.2 
       data hash MD5: 16K
       65 AD 4C DB 3B D2 81 94 2D 28 69 CF EB 0F A6 F1>)
(   4,<2023-06-15 14:01:20.04 +0400>,<she>,<DPX200>,
      <abs ABSG = 5 
       data hash MD5: 16K
       65 4E 1D 4F F5 0D 7A CC 4B D8 43 8D 8B 83 2C 09>)
(   5,<2023-06-15 14:01:36.42 +0400>,<she>,<DPX200>,
      <abs ABSG = 5 
       data hash MD5: 16K
       C0 0F EE A7 33 83 21 B6 BA 13 6F B6 30 D0 5F 5D>)
$$ ##END=
$$ 
$$ hash MD5
$$ E5 D2 C1 38 9C 02 07 FA A4 34 F6 56 71 69 AD 4C
##$RELAX= 
##$RELAX= 
##$RELAX= 
##$RELAX= 
##$RELAX= 
##$RELAX= 
$$ Bruker specific parameters
$$ --------------------------
##$DU= <F:/spectra>
##$EXPNO= 1
##$NAME= <H-F>
##$PROCNO= 1
##$TYPE= <nmr>
##$USER= <she>
##$AMP= (0..31)
100 100 100 100 100 100 100 100 100 100 100 100 100 100 100 100 100 100 
100 100 100 100 100 100 100 100 100 100 100 100 100 100 
##$AQSEQ= 0
##$AQ_mod= 1
##$AUNM= <au_zg>
##$AUTOPOS= <>
##$BF1= 200.13
##$BF2= 200.13
##$BF3= 200.13
##$BF4= 200.13
##$BF5= 200.13
##$BF6= 200.13
##$BF7= 200.13
##$BF8= 200.13
##$BYTORDA= 1
##$CFDGTYP= 0
##$CFRGTYP= 5
##$CHEMSTR= <none>
##$CNST= (0..31)
1 1 145 1 1 1 1 1 1 1 1 1 1 1 1 1 1 1 1 1 1 1 1 1 1 1 1 1 1 1 1 1 
##$CPDPRG= <>
##$CPDPRG1= <>
##$CPDPRG2= <>
##$CPDPRG3= <>
##$CPDPRG4= <mlev>
##$CPDPRG5= <mlev>
##$CPDPRG6= <mlev>
##$CPDPRG7= <mlev>
##$CPDPRG8= <mlev>
##$CPDPRGB= <>
##$CPDPRGT= <>
##$D= (0..31)
0 1.2 0 0 0 0 0 0 0 0.06 0 0.03 0 0 0 0 0.0002 0 0 0 0 0 0 0 0 0 0 0 0 
0 0 0 
##$DATE= 1686823249
##$DBL= (0..7)
$$ [...]
##$SUBNAM3= <"">
##$SUBNAM4= <"">
##$SUBNAM5= <"">
##$SUBNAM6= <"">
##$SUBNAM7= <"">
##$SUBNAM8= <"">
##$SUBNAM9= <"">
##$SW= 18.05172834244
##$SWIBOX= (0..15)
0 0 2 0 0 0 0 0 0 0 0 0 0 0 0 0 
##$SW_h= 3612.71676300578
##$TD= 16384
##$TD0= 1
##$TE= 0
##$TE2= 300
##$TE3= 300
##$TEG= 300
##$TL= (0..7)
0 120 120 120 120 120 120 120 
##$TP= (0..7)
150 150 150 150 150 150 150 150 
##$TP07= 0
##$TPNAME0= <>
##$TPNAME1= <>
##$TPNAME2= <>
##$TPNAME3= <>
##$TPNAME4= <>
##$TPNAME5= <>
##$TPNAME6= <>
##$TPNAME7= <>
##$TPOAL= (0..7)
0.5 0.5 0.5 0.5 0.5 0.5 0.5 0.5 
##$TPOFFS= (0..7)
0 0 0 0 0 0 0 0 
##$TUNHIN= 0
##$TUNHOUT= 0
##$TUNXOUT= 0
##$USERA1= <user>
##$USERA2= <user>
##$USERA3= <user>
##$USERA4= <user>
##$USERA5= <user>
##$V9= 5
##$VALIST= <valist>
##$VCLIST= <CCCCCCCCCCCCCCC>
##$VD= 0
##$VDLIST= <DDDDDDDDDDDDDDD>
##$VPLIST= <PPPPPPPPPPPPPPP>
##$VTLIST= <TTTTTTTTTTTTTTT>
##$WBST= 1024
##$WBSW= 4
##$XGAIN= (0..3)
0 0 0 0 
##$XL= 0
##$YL= 0
##$YMAX_a= 438242
##$YMIN_a= -364244
##$ZGOPTNS= <>
##$ZL1= 120
##$ZL2= 120
##$ZL3= 120
##$ZL4= 120
##$ABSF1= 15.77223
##$ABSF2= -2.279619
##$ABSG= 5
##$ABSL= 3
##$ALPHA= 0
##$AQORDER= 0
##$ASSFAC= 0
##$ASSFACI= 0
##$ASSFACX= 0
##$ASSWID= 0
##$AUNMP= <proc_1d>
##$AZFE= 0.1
##$AZFW= 0.1
##$BCFW= 0
##$BC_mod= 2
##$BYTORDP= 0
##$COROFFS= 0
##$CY= -3
##$DATMOD= 1
##$DC= 0
##$DFILT= <>
##$DTYPP= 0
##$F1P= 0
##$F2P= 0
##$FCOR= 1
##$FTSIZE= 16384
##$FT_mod= 6
##$GAMMA= 0
##$GB= 0
##$INTBC= 1
##$INTSCL= 3.70164e-10
##$ISEN= 128
##$LB= 0.24
##$LEV0= 0
##$LPBIN= 0
##$MAXI= 10000
##$MC2= 0
##$MEAN= 0
##$ME_mod= 0
##$MI= 1.114404
##$NCOEF= 0
##$NC_proc= -6
##$NLEV= 6
##$NOISF1= 3.799351
##$NOISF2= 2.8
##$NSP= 0
##$NTH_PI= 0
##$NZP= 0
##$OFFSET= 15.77223
##$PC= 1
##$PHC0= -20781.95
##$PHC1= 9.852719
##$PH_mod= 1
##$PKNL= yes
##$PPARMOD= 0
##$PSCAL= 0
##$PSIGN= 0
##$REVERSE= no
##$SF= 200.129999862463
##$SI= 16384
##$SIGF1= 3
##$SIGF2= 2
##$SINO= 5.538805
##$SIOLD= 16384
##$SREGLST= <1H.CDCl3>
##$SSB= 0
##$STSI= 16384
##$STSR= 0
##$SW_p= 3612.71676300578
##$SYMM= 0
##$S_DEV= 0
##$TDeff= 16384
##$TDoff= 0
##$TI= <>
##$TILT= no
##$TM1= 0
##$TM2= 0
##$TOPLEV= 0
##$USERP1= <user>
##$USERP2= <user>
##$USERP3= <user>
##$USERP4= <user>
##$USERP5= <user>
##$WDW= 1
##$XDIM= 16384
##$YMAX_p= 325200380
##$YMIN_p= -251083
$$ End of Bruker specific parameters
$$ ---------------------------------
##NTUPLES= NMR SPECTRUM
##VAR_NAME=  FREQUENCY,     SPECTRUM/REAL,   SPECTRUM/IMAG
##SYMBOL=    X,             R,               I
##VAR_TYPE=  INDEPENDENT,   DEPENDENT,       DEPENDENT
##VAR_FORM=  AFFN,          ASDF,            ASDF
##VAR_DIM=   16384,         16384,           16384
##UNITS=     HZ,            ARBITRARY UNITS, ARBITRARY UNITS
##FACTOR=    0.220516191357247, 1,           1
##FIRST=     3156.4964174131, 0,             0
##LAST=      -456.220345592679, 0,           0
##MIN=       -456.220345592679, -251083,     0
##MAX=       3156.4964174131, 325200380,     0
$$ Real data points
##PAGE= N=1
##DATA TABLE= (X++(R..R)), XYDATA
$$ [...]
9205 9447832 8429425 7593020 7040653 6619704 6243767 6074552 5892674 5689130 5562982
9196 5562982 5310246 5175122 4993264 4874353 4713656 4528869 4404111 4373912 4259461 4160814
9186 4160814 4047268 3983466 3936383 3907357 3867884 3763701 3722676 3682823 3723527 3770740 3804840
9175 3804840 3840886 3903404 3929088 3837130 3778189 3734553 3714838 3623444 3595062 3578701 3594501
9164 3594501 3570702 3473387 3510725 3507166 3551616 3560531 3641761 3675383 3748773 3803832 3844087 3868283
9152 3868283 3881106 3859791 3887424 3894897 3953328 4039261 4094309 4103828 4125916 4130175 4198924 4222279
9140 4222279 4278943 4351904 4430990 4487816 4525313 4635624 4711265 4771807 4734805 4845499 4936450
9129 4936450 4983573 5061029 5161700 5256140 5316494 5328374 5381328 5466758 5595292 5723514 5864240
9118 5864240 6003799 6086455 6208996 6300020 6457682 6573514 6672703 6764814 6804795 6933841
9108 6933841 7081494 7271737 7408646 7574659 7693952 7900420 8127315 8347796 8516847 8794382
9098 8794382 9132495 9361048 9716561 10127272 10548026 11083098 11576283 12158141 12874882 13519389
9088 13519389 14188462 14945758 15736469 16386102 16941485 17432491 17974381 18517202 18897132
9079 18897132 19144960 19249254 19113092 18766686 18441863 18305783 18182610 18210628 18316340 18510623
9069 18510623 18852835 19283536 19703525 20212147 20891578 21709962 22688801 23972484 25434478
9060 25434478 27256215 29475903 31938547 34933485 38324925 42064112 46127021 50301272
9052 50301272 54573884 59224354 63166793 65652925 67743045 70030830 72662371 75741781
9044 75741781 77797465 77500316 74875689 69951164 64071681 58292988 53562408 49991045
9036 49991045 47415268 45668041 43989620 42222852 40480733 39036054 37910856 37313714
9028 37313714 37191874 37585647 38418615 39625762 41358625 43696294 46719868 50429198 54529430
9019 54529430 58619004 62359567 66099235 69945344 73694676 77184601 80351856 84011376
9011 84011376 88040510 90453974 91644348 91850705 90666598 88539860 84826124 78702802
9003 78702802 71314710 63835507 57091433 51517257 47383197 44649545 42738668 41272469
8995 41272469 39712387 37936374 35786590 33709975 31875443 30425034 29337538 28500990
8987 28500990 27926636 27387011 26831237 26348044 25966998 25849421 25878678 25848250 25659555 25362927
8977 25362927 25003677 24598606 24013120 23154735 22233040 21479478 20881147 20546474 20298657
8968 20298657 20180297 20138648 20234080 20466952 20848176 21187332 21241582 21118570 20860429 20300254
8958 20300254 19619303 18536806 17146538 15598476 14040929 12836997 11927166 11151467 10568833
8949 10568833 10168805 9817125 9529824 9214109 8925143 8691591 8429900 8143248 7903441
8940 7903441 7706309 7471976 7313469 7282433 7100954 6940677 6829716 6798999 6745905 6711648
8930 6711648 6585894 6504235 6452903 6392969 6254359 6200886 6165251 6119891 6111751 6103298 6049914
8919 6049914 5996000 5970384 5875369 5889019 5866714 5924047 5953166 5908119 5940041 6009184 6019598
8908 6019598 6060957 6069850 6025357 6103557 6157875 6220708 6278570 6329254 6392467 6514879 6557010
8897 6557010 6613203 6728556 6778402 6911022 7048254 7082350 7168048 7317471 7467523 7515260
8887 7515260 7593756 7725599 7809396 7905887 7954424 8102390 8298390 8458471 8632734 8820065
8877 8820065 9035735 9300256 9528209 9742282 10062966 10325235 10566078 10829601 11048842 11239097
8867 11239097 11394491 11542550 11648045 11781884 11864306 12007691 12223703 12477022 12738441 12936420
8857 12936420 13140542 13371747 13700275 14034858 14386062 14727884 15140077 15556313 15977960
8848 15977960 16400762 16853485 17436961 18086420 18747817 19505244 20346667 21157246 22015343
8839 22015343 22918797 23870372 24696547 25519448 26426143 27485515 28673617 30025051 31336895
8830 31336895 32836901 34526553 36266548 38033922 39913787 42012431 44427489 47291921
8822 47291921 50074110 52312429 54155735 55448400 55875620 55095786 53394635 51580114
8814 51580114 49989535 48878991 48319374 48374175 48675421 48830961 48631190 48432868 48330986
8805 48330986 48403897 48885563 49911547 51454283 53136951 54888388 56727649 58581649 60438955
8796 60438955 62079486 63824600 66085032 68906270 72543743 76723396 81440089 86759520
8788 86759520 91782555 95714429 98787501 100155629 99523317 97278855 94039417 90551402
8780 90551402 87182189 84691110 82507892 79647023 76387105 73104015 69955907 67155795
8772 67155795 64743835 63083980 62028794 61404462 61114491 61123602 61329908 61801280 62359505
8763 62359505 62992997 63700941 64725357 66068763 67539860 69182275 70895707 72441419
8755 72441419 73659246 74757808 76089618 77541971 78934984 79908096 80327193 79339412 77275366
8746 77275366 74130728 70002454 65981020 62147738 58979181 56099957 53686070 51843494
8738 51843494 50194084 48605138 46928333 45334120 43996489 42857689 42080775 41573895
8730 41573895 41262804 41056024 40877065 40546348 40075658 39529715 38882494 38220010 37641284
8721 37641284 37191740 36638283 36160760 35751571 35262160 34795082 34413011 34231890 34295875 34706729
8711 34706729 35404589 36272398 37386734 38676032 40440973 42655784 45699204 50130294
8703 50130294 57386210 68615031 84053977 93258989 84622107 68199484 55342448 46786342
8695 46786342 40736666 36459831 33166160 30632294 28715352 27432429 26483112 25673680
8687 25673680 25005311 24284083 23593898 22959600 22445598 22191551 22100337 22107237 22280469 22573753
8677 22573753 22991878 23601453 24465367 25703740 27174835 28648005 30249952 32135009 34063400
8668 34063400 35648265 37127803 38321888 39545047 40639928 40933350 40240820 39147490
8660 39147490 37813264 36534382 35231135 33765480 32225926 30915842 29643629 28535278
8652 28535278 27565956 27032334 26865863 26827076 26942613 27155080 27474814 27945186 28672574 29483454
8642 29483454 30395648 31444011 32537689 33322837 33985206 34958611 36251781 37834072 39822239
8633 39822239 42130987 44120244 45374006 45872978 45177258 43195791 40452043 37554855
8625 37554855 34887631 32757919 31210780 30285077 29898606 29670522 29403679 29091867 28884534
8616 28884534 28546144 28214330 27948349 27750875 27607527 27519339 27267195 26943828 26595391 26253503
8606 26253503 25922370 25504622 25047456 24674704 24367442 24088004 23793606 23515670 23384445
8597 23384445 23337368 22990717 22320450 21648940 20980742 20444709 19894797 19327741 18865494 18552100
8587 18552100 18234661 18022012 17906436 17908644 18009271 18215501 18396362 18457617 18427087 18310988
8577 18310988 18035854 17402884 16637407 15819442 14723858 13650453 12732542 11931809 11112492
8568 11112492 10358514 9742945 9284850 8850443 8467834 8141173 7863635 7618865 7617429 7588401
8558 7588401 7499724 7516093 7564765 7660916 7742797 7878554 7944883 7889394 7843478 7779366 7647834
8547 7647834 7540752 7436217 7369964 7217176 6945745 6645242 6373789 6059109 5672979 5292153
8537 5292153 4967298 4655592 4324050 4060406 3917243 3748340 3617738 3556331 3424142 3415659
8527 3415659 3370694 3297789 3308429 3307180 3258222 3256721 3205693 3097798 3062955 3030377 2950829 2874370
8515 2874370 2737034 2643121 2572143 2425643 2346453 2208370 2125159 2039182 1967901 1924338 1855430
8504 1855430 1712454 1695078 1664510 1567256 1574213 1506587 1414015 1374502 1364738 1332329 1303426 1331084
8492 1331084 1318546 1205335 1176726 1143162 1138216 1062952 1046157 1031907 1020402 1006444 956644
8481 956644 990570 980409 904106 914127 938133 947894 932312 887272 874396 884723 956427 901598
8469 901598 968738 965169 860484 847597 885389 866732 840407 854514 911097 835323 845963 887299
8457 887299 980703 946761 898512 901593 881234 846194 814639 811196 771985 834929 891689 832220
8445 832220 779880 744269 760596 753593 681397 655699 607916 614263 666124 621222 632001 643722
8433 643722 676069 681495 673696 640794 684461 796558 813172 772960 744981 785517 752519 762616
8421 762616 744998 857519 844000 845901 861437 808986 731851 713483 788673 775344 736873 751096
8409 751096 738629 665357 711197 702033 611455 648716 628490 649113 617138 569231 578038 561726
8397 561726 569717 586493 559327 536194 540773 574490 561836 505696 470501 486681 508394 476292
8385 476292 486814 572777 560432 514437 521122 522161 502524 462041 409384 393662 478718 517625
8373 517625 519748 445135 438015 494978 431175 393318 329999 342543 274826 290978 356007 258767
8361 258767 313385 285798 255104 197674 259621 305977 240091 252395 298845 272674 273222 298262
8349 298262 264927 249317 239663 293801 236074 213026 137021 98775 149487 174416 233099 156174
8337 156174 219229 259526 185205 187718 119512 193693 202818 187820 111940 74829 100011 129700
8325 129700 76992 163561 186872 130274 134376 131960 145575 89812 49902 74823 87615 75679
8313 75679 137341 173896 148027 57564 95960 132861 103365 102636 188915 150272 178609 167918
8301 167918 148107 145535 186167 186991 117687 188136 294647 208234 149435 92047 142037 154417
8289 154417 113972 104170 163672 191139 200567 218588 151554 144693 112103 97204 156081 162660
8277 162660 131680 118027 167270 146632 153465 179329 186135 263140 222627 278269 282022 231744
8265 231744 271476 330803 319720 223204 238577 292782 227805 159557 143757 209418 188197 120451
8253 120451 172290 211496 116633 111648 142842 198091 142427 152001 184417 122324 123103 81488
8241 81488 147162 166913 158303 216192 128349 143491 173614 148292 235512 143146 153839 130795
8229 130795 50974 138940 143545 154932 193929 313067 393468 473385 463430 439832 318035 265509
8217 265509 242141 135401 57767 11697 109425 96624 125733 128064 107806 26655 7605 32936
8205 32936 49440 98428 97199 92225 99232 23202 22619 34789 88243 116425 54014 59587 143460
8192 143460 318547 -42903 -119174 66372 24002 72495 28318 -26907 -31422 -7188 46563
8181 46563 949 -49464 -15094 12334 23956 33735 105092 77312 13305 55446 862 -23392
8169 -23392 35104 3835 7555 -6025 -67120 -140581 -104654 -80758 -30579 -59236 -49906 -56334
8157 -56334 -84026 -49306 -128084 -107942 -10210 -63818 -61045 -15932 -45557 -61916 -135891 -94989
8145 -94989 -35679 -33943 -24905 18437 -97155 -162825 -187395 -57152 -54505 -140230 -124309 -167643
8133 -167643 -152540 -101949 5176 -78923 -138336 -79892 -28569 -48511 -63691 -2659 -14673
8122 -14673 -20536 -26299 -93167 -60860 -66167 -32954 -14600 -52969 -78519 -59988 -43914 -78349
8110 -78349 -62146 -67060 -94701 -85764 -63600 -95782 -101897 -124712 -146977 -184837 -176399 -134099 -99173
8097 -99173 -135099 -195632 -95000 -38667 -76012 -33464 -47206 -80418 -136168 -84984 -147986 -144984
8085 -144984 -88932 -108627 -96178 -111452 -119109 -98142 -55133 -81343 -90374 -72993 -88815 -73976
8073 -73976 -113016 -80055 -32758 -34937 -8273 -64983 -16582 -30612 -15436 -67348 -100668 -121948
8061 -121948 -86295 -95920 -53569 -90596 -117809 -142018 -148528 -87147 -9431 -87823 -149285 -100336
8049 -100336 -9942 -85703 -171161 -180003 -151514 -131180 -132728 -94942 -140301 -162045 -142822 -60041
8037 -60041 -39266 -41435 -14402 -49261 -105778 -144491 -74354 -63869 -116118 -96816 -125950 -93000
8025 -93000 -105413 -45978 -64484 -134681 -142855 -148696 -95437 -139989 -130067 -129273 -101850 -35153 -58904
8012 -58904 -79376 -114353 -138929 -167795 -112413 -87349 -40989 -44516 -17148 -115810 -184351 -117240
8000 -117240 -123084 -121985 -189168 -234969 -188365 -166553 -70136 -70778 -20443 -80242 -122578 -152163
7988 -152163 -153761 -128355 -162727 -91452 2691 -103208 -133979 -72561 -74617 -143632 -159161 -150093
7976 -150093 -93542 -73822 -100101 -29230 -55333 -91478 -130795 -125206 -157971 -133305 -87350 -135902
7964 -135902 -132324 -59347 -139249 -181987 -151546 -135829 -39934 -105956 -118534 -86089 -90122 -72465
7952 -72465 -86638 -159319 -116149 -86936 -121869 -188543 -205356 -153987 -159308 -107004 -118593 -113318
7940 -113318 -115951 -114611 -150011 -124891 -170508 -227875 -179263 -150709 -126394 -121667 -211922 -188749
7928 -188749 -160226 -131071 -161338 -183901 -125458 -101773 -109958 -137017 -123158 -85016 -92580 -45653
7916 -45653 -140248 -174358 -168438 -120589 -107147 -95412 -85117 -120582 -99919 -88585 -105906 -156370
7904 -156370 -193242 -227131 -157057 -147893 -116229 -107121 -95073 -78332 -60976 -77993 -71823 -82753
7892 -82753 -100082 -143779 -188626 -177365 -75987 -63953 -113413 -114253 -125294 -75055 -41488 -75891
7880 -75891 -85670 -155181 -133054 -106978 -155788 -155736 -199615 -179802 -63449 -35444 -102885 -98157 -85852
7867 -85852 -133770 -162641 -125691 -77653 -94587 -115129 -76059 -50218 44843 3982 -24931 14281
7855 14281 -70820 -62637 -66895 -58062 -7147 -76172 -90996 -82330 -163156 -136539 -21275 -90091
7843 -90091 -122139 -144582 -182774 -130510 -108913 -186832 -158881 -88128 -66706 -85116 -106579 -160854
7831 -160854 -196698 -146309 -124532 -176005 -119429 -115932 -119199 -227737 -170776 -41801 -64485 -115310
7819 -115310 -197989 -181697 -251083 -171000 -88036 -88180 -126530 -119669 -132281 -191199 -76594 -76166
7807 -76166 -119243 -178832 -104838 -87602 -132997 -68542 -88055 -54163 -115357 -130266 -123052 -116776
7795 -116776 -68439 -67357 -106906 -72803 -83450 -163707 -129282 -123050 -111135 -105944 -153253 -127902
7783 -127902 -143144 -143452 -75122 -41740 -102148 -112019 -100917 -118108 -168771 -147650 -159006 -117677
7771 -117677 -70583 -157141 -147238 -87749 -77558 -87753 -80516 -101899 -143519 -69869 -138714 -109008
7759 -109008 -132146 -66399 -62908 -94168 -32548 -57109 -121005 -114065 -80520 -29379 -55201 -83920
7747 -83920 -89207 -161910 -194136 -197657 -155877 -83566 -132190 -83532 -40075 -17605 -61424 -104729
7735 -104729 -76119 -52466 -66253 -116418 -51542 -114481 -87122 -74607 -57999 -108525 -141302 -71651
7723 -71651 -79644 -134294 -123624 -94294 -115413 -112415 -64132 -45710 -48683 -53895 -18821 -4147 18741
7710 18741 9764 -17136 50030 54035 26218 115134 132384 74103 -7645 61371 1278 -10689
7698 -10689 24202 49462 -11096 -6720 -51497 -2965 3501 -45874 -71200 -95883 -102723 -161960
7686 -161960 -107607 -55204 -72163 -34993 -6288 -54452 -61185 -14883 -70194 -67034 -42389 -98047
7674 -98047 -85694 -67737 -10017 -85615 -128868 -97946 -104819 -51980 4917 -32751 -81181 -71974
7662 -71974 -49068 -123142 -104785 -99756 -41884 -52045 -28319 -59615 -116399 -100404 -40761 -50841
7650 -50841 -109153 -142798 -129001 -95480 -132205 -72604 -67512 -108156 -132547 -111037 -5243 -31618
7638 -31618 -92602 -97904 -69910 -37776 -86121 -114301 -161262 -198483 -131475 -54246 -35723 -67127
7626 -67127 -74310 -90245 -86507 -152943 -155473 -20235 -39193 -37733 -49686 -49039 -61354 -138206 -167945
7613 -167945 -83397 -33261 32521 -6855 -85377 -105898 -120659 -107369 -98520 -60510 -49700 -34204
7601 -34204 -10844 -8030 -71246 -93886 -90127 -157576 -120384 -78150 -56394 -118994 -162074 -155573
7589 -155573 -128802 -63351 -81523 -88469 -172603 -186553 -45058 -79385 -111362 -37029 -57764 -57393
7577 -57393 -17380 -66195 -93840 -83037 -77323 -61560 -118007 -120933 -83235 -29184 -65824 -655
7565 -655 -9497 -80448 -65350 -129251 -154348 -133491 -140321 -129344 -76260 -91400 -148241 -150555 -156287
7552 -156287 -147273 -96151 -3403 5634 -18606 -53917 -32105 -47400 -43627 -58943 -10251 14217
7540 14217 -75291 32006 67710 47746 -30291 -90336 -35129 13731 -11421 -74064 -63465 -66541
7528 -66541 -128063 -113255 -23074 14838 29109 18199 47153 61876 -33091 -78988 -47658 -29429
7516 -29429 -32225 -64402 -11641 -12286 -2850 142509 46041 10129 23515 22484 22483 14839 17456 52375
7502 52375 76246 40270 29581 14657 37282 8663 25328 24563 37649 74447 94308 56373
7490 56373 89198 118839 88378 60467 31371 51060 139402 110246 162727 235489 235615 200053
7478 200053 242163 284806 333962 361405 412347 395542 414830 411266 390954 373780 258958 280871
7466 280871 267409 167905 105650 88576 111787 100064 98346 82355 95733 116441 45077 85206
7454 85206 73470 29462 43210 78272 -2578 11676 92825 163993 73677 14451 61805 75119
7442 75119 73348 75178 40706 12591 -16017 88049 140954 144897 148302 93945 82311 67131
7430 67131 80150 120811 130537 146004 129829 95240 77570 46216 43948 98243 101813 105650 61921
7417 61921 64753 53028 120080 157022 105244 53964 19131 77312 107028 115024 168390 121553
7405 121553 119888 140589 150541 160646 165596 208837 193621 110251 136038 109572 113568 101408
7393 101408 89692 94951 88566 72581 114281 175700 173851 147387 133210 100752 119345 146351
7381 146351 120045 173888 170598 167905 186257 203981 135349 161188 185900 291831 281243 180952
7369 180952 161654 283770 298868 220521 209225 202493 266868 330761 282623 267932 216808 156284
7357 156284 141535 138843 215220 242589 211910 242147 228219 218787 201009 114013 89900 175515
7345 175515 181522 162895 130626 174091 186939 169236 184755 172719 201684 260574 231377 196054
7333 196054 168911 209224 180081 198399 175571 82988 70431 109864 140051 72628 56549 63432
7321 63432 89889 116804 109160 126948 118710 133758 183714 179062 153727 239374 227254 196586
7309 196586 212678 211771 272998 278496 232058 231657 278748 248533 209096 202258 282440 319481 304903
7296 304903 328667 337078 331761 317547 313529 321141 335509 362185 314378 268616 274128 270535 305294
7283 305294 352803 323934 274831 277889 341388 353495 343809 380658 407332 403493 400187 447767
7271 447767 401926 372898 389290 463183 466085 512478 507797 528740 545076 512053 486177 479498
7259 479498 546055 496393 435823 418310 437792 479107 480398 438660 417626 386589 468207 428110
7247 428110 336677 380837 345407 315774 382683 357475 385207 459425 416787 381044 403558 452504
7235 452504 486032 475603 451953 418222 506322 527850 579128 627330 622403 575382 545966 573356
7223 573356 581801 539637 574636 555229 576858 610669 667520 639674 673855 590822 573838 542369
7211 542369 576833 618166 629771 702129 746468 797227 809931 824435 808821 827923 762375 717670
7199 717670 778345 833368 875592 823389 857638 895179 922421 941931 955934 977555 999605 1047202
7187 1047202 1044749 1051159 1033819 1049342 1122054 1202899 1188449 1202218 1258589 1337378 1363005 1376491
7175 1376491 1435718 1450932 1412150 1436637 1490614 1598261 1632213 1686761 1705104 1765063 1768941
7164 1768941 1800504 1887544 1879976 1855927 1848446 1874991 2034534 2090617 2101763 2052968 2108515 2161883
7152 2161883 2157854 2233726 2284223 2364020 2351738 2400454 2512453 2553248 2597363 2678988 2691170
7141 2691170 2713714 2813056 2841879 2871727 2920507 3007710 3151524 3233052 3293552 3373404 3365364
7130 3365364 3388772 3401201 3452640 3628850 3774141 3873604 3958463 4070142 4206774 4359679
7120 4359679 4522825 4664543 4911920 5084061 5257326 5524099 5745492 5932067 6179662 6386167
7110 6386167 6665665 6928698 7168258 7410817 7672013 7829642 8104985 8418534 8673715 8934173
7100 8934173 9169252 9572486 9932365 10284822 10803507 11323381 11886997 12516257 13373903 14336048
7090 14336048 15528166 16941995 18506842 20285896 22463937 25003197 28033799 31737867
7082 31737867 36457100 42424589 49761585 58170589 67218838 76103055 83561658 87759301
7074 87759301 87893890 83702164 75855916 66399866 56276506 46982442 39038484 32826546
7066 32826546 27997401 24438415 21696234 19567761 17956732 16607405 15511622 14620861
7058 14620861 13847924 13189353 12501317 11820412 11329641 10886383 10397870 10093810 9778281
7049 9778281 9535775 9419378 9229102 9104791 9172181 9325780 9658755 10062721 10609731 11246528
7039 11246528 12001516 12764179 13506546 14248455 14707766 14998034 14896008 14493585 13919594
7030 13919594 13014229 11996714 10957956 9992633 9107830 8302521 7533077 7136925 6754726
7021 6754726 6339281 6087357 5956826 5813622 5736229 5727112 5641551 5707731 5804956 5925101 6064440
7010 6064440 6382120 6724269 7134900 7487341 7883870 8281593 8614116 8861004 9088546 9120973
7000 9120973 9002632 8862411 8483465 8153986 7632864 7083985 6616316 6114087 5704948 5361911
6990 5361911 5061855 4785730 4645711 4527374 4503544 4425173 4505784 4666925 4874899 5069992
6980 5069992 5336577 5636840 6071023 6668571 7465613 8367645 9307890 10285987 11346104
6971 11346104 12370078 13134351 13580082 13409255 12906476 12040235 10911237 9728720 8445283
6962 8445283 7269163 6237569 5382361 4740748 4231933 3792054 3494816 3308276 3042912
6953 3042912 2832381 2624610 2458999 2308947 2180201 2121495 1978551 1878002 1708517 1594974
6943 1594974 1611328 1557228 1492868 1377507 1348154 1286295 1224845 1130823 974623 943004 969713
6932 969713 966216 942004 903636 903293 864806 830124 763573 833800 894998 775641 689722 671674
6920 671674 665746 668333 709000 745418 713848 658498 585144 600237 568267 453566 498625 432377
6908 432377 470266 491641 483239 493074 506882 530513 478297 479024 495387 512533 520362 450955 422046
6895 422046 418985 409492 360388 325140 326096 335386 269670 231182 259852 226451 226694 266304 280832
6882 280832 250263 283554 289723 255612 259219 204962 190785 264182 305825 245099 240602 255197
6870 255197 264712 247953 308002 299103 297482 214675 241339 251673 173472 213326 201977 256701
6858 256701 269661 186399 193834 222060 219607 186586 161655 234040 160966 152710 99277 108105
6846 108105 191187 261766 248426 210363 229891 220874 227193 205237 277822 346626 340366 370340
6834 370340 432895 442128 442986 420006 376276 396933 438449 405765 342159 321656 341186 348777
6822 348777 342139 326823 374146 345669 278882 339433 330283 326585 344082 332020 372450 484757
6810 484757 521016 506234 519642 538188 517416 499765 480570 464329 468839 421549 394495 349429
6798 349429 298490 278149 292381 299483 240744 268196 285027 312510 243448 157979 119621 150268
6786 150268 237244 225875 171902 149204 89481 113327 135855 106229 94055 76005 86846 84851
6774 84851 56095 21228 33545 87135 80253 188084 133746 123306 104457 85143 145580 173165
6762 173165 129113 153305 180953 128494 95490 122154 97923 112079 80595 45157 123078 195357
6750 195357 214356 152540 98287 38247 98867 112051 118718 129045 107014 101011 157614 197369
6738 197369 133703 202999 208768 174170 151951 137225 179254 143026 158958 76606 95014 66062
6726 66062 50168 35902 78347 142095 128897 104689 91695 86596 108782 2173 41773 31099
6714 31099 66285 116242 135503 111766 174874 249554 140199 135790 149530 197655 205401 178994
6702 178994 180029 148748 139910 123211 148970 149667 209417 247982 169591 173108 174677 222392 205425
6689 205425 186063 265500 321607 286649 164888 215580 287754 274950 244357 307379 307029 369702
6677 369702 415175 414072 505149 544159 594165 533260 476912 391805 338706 324349 283319 287034
6665 287034 223598 137502 106146 181974 186013 108197 169983 167527 170767 180563 94465 42328
6653 42328 108090 168567 203434 189014 140326 122796 91524 90776 100821 107287 87068 50236
6641 50236 96720 50779 -11149 25748 113557 140554 90231 88385 95289 101552 107994 113809 121623
6628 121623 165929 169849 131853 144013 128575 171329 166751 181955 164926 178164 158463 98729
6616 98729 154245 129671 7946 90845 207525 223731 181009 167207 165907 124190 121783 101458
6604 101458 105539 181778 204420 162766 113165 99998 138733 217072 198004 158623 152447 201583
6592 201583 214805 167141 227204 213414 248485 261018 277187 244613 226704 252926 224947 259229
6580 259229 305286 306290 234935 208139 198720 223448 264066 301796 315421 311382 309243 339064
6568 339064 363321 326592 401817 344676 320633 400694 389111 358250 308140 354953 369963 368065
6556 368065 318272 345008 419366 351128 265865 292481 318674 365692 424912 416935 400628 370488
6544 370488 387884 449232 431025 413643 418092 434743 435802 427595 440462 449455 360162 391560
6532 391560 434916 419314 484862 461889 448876 491663 446836 394199 456601 510735 546368 479408
6520 479408 492338 551008 586286 621551 621642 643122 622376 589403 661764 687765 709657 678958
6508 678958 703672 733921 733157 682006 701117 717304 719324 700750 639335 738145 811250 808297
6496 808297 865572 842890 759665 788580 843902 820822 845145 892667 847019 841536 872086 943897
6484 943897 977322 897432 892187 861577 920275 946452 970829 1004743 914207 937246 955899 954249
6472 954249 991749 1031067 982203 930264 969158 912403 941625 961789 1032196 1041047 1060978 1097373
6460 1097373 1094417 1137685 1134486 1148340 1163222 1168833 1122326 1157897 1224529 1181767 1177406 1187838
6448 1187838 1169783 1159990 1153538 1187169 1181476 1168554 1092427 1155708 1142045 1118324 1113233 1101986
6436 1101986 1136473 1110001 1165491 1220501 1136598 1218197 1223808 1219180 1186825 1157566 1142108 1116273
6424 1116273 1147004 1171269 1174682 1254259 1216080 1175736 1220996 1217207 1134018 1121875 1180740 1290270
6412 1290270 1285918 1199436 1225132 1218777 1290822 1231827 1205990 1179506 1183887 1233592 1212233 1172691
6400 1172691 1200788 1191690 1162528 1238819 1272175 1306236 1231175 1191120 1225636 1259430 1207627 1199099
6388 1199099 1281067 1229023 1227557 1227611 1192676 1233212 1266657 1301738 1311025 1302354 1305394 1318165 1308241
6375 1308241 1335526 1389268 1406297 1444055 1394431 1411562 1418312 1330953 1323373 1382901 1338359 1339873
6363 1339873 1358156 1417801 1396789 1403458 1387672 1349995 1326367 1360545 1356502 1337333 1397481 1398100
6351 1398100 1367195 1338690 1369413 1426110 1390578 1368348 1403504 1408038 1393706 1411601 1471773 1480727
6339 1480727 1474812 1511879 1470114 1524811 1599834 1607972 1593787 1557066 1519681 1537050 1588052 1656946
6327 1656946 1625192 1675033 1760736 1768470 1779118 1746801 1776001 1804021 1780173 1812935 1835712 1857129
6315 1857129 1861765 1783314 1834556 1865627 1849716 1874218 1977764 1983142 1978303 1936086 1917088 2009146
6303 2009146 1993979 1961822 1983442 1993419 2022607 2001352 1956696 2022748 2014258 1996152 2021573 1949931
6291 1949931 1964082 1930649 1966817 1944813 1870794 1867035 1890997 1957007 1943516 1849066 1891019 1880657
6279 1880657 1954954 1978556 1969011 1954752 1959616 2024019 2068922 2046901 2033145 2004463 1988542 2023082
6267 2023082 1992945 1977416 1951114 2002328 2061656 2038716 1969546 1891784 1873451 1855302 1823911
6256 1823911 1826702 1822430 1790006 1849132 1979587 1991393 1922203 1903116 1907741 1903764 1979786 1981507
6244 1981507 1990998 1988894 1965856 1931313 1876343 1825293 1855899 1822940 1787097 1825386 1836253 1837979
6232 1837979 1838364 1863411 1885751 1889422 1829588 1821159 1878419 1920628 1877766 1936658 1878720 1833992
6220 1833992 1867251 1923644 1885467 1821653 1921120 1942811 1863799 1800786 1800375 1832918 1859038 1857181
6208 1857181 1865315 1787239 1765797 1745438 1838378 1877286 1812212 1732834 1761106 1820689 1846782 1847293
6196 1847293 1842444 1807439 1769724 1719311 1668089 1677297 1710607 1726431 1768953 1802963 1875185 1834103
6184 1834103 1831973 1803904 1779738 1796337 1885358 1943249 1935164 1913622 1951554 1894474 1889526 1894854
6172 1894854 1913656 1961184 1928432 1929934 1930344 1965265 1919541 1939999 1967461 1978236 1985357 2010233
6160 2010233 2025063 2005909 2131071 2189238 2137329 2123463 2139567 2135566 2146279 2243196 2146937
6149 2146937 2163254 2254389 2253273 2285442 2330212 2326551 2287824 2324842 2366812 2381373 2427466 2401743
6137 2401743 2388071 2447768 2555754 2595874 2646732 2680346 2796248 2751743 2731529 2758231 2828597
6126 2828597 2835191 2913342 2961212 2953623 2960271 2986811 3030675 3021053 3152940 3171743 3180006 3256352
6114 3256352 3326774 3405327 3438414 3475433 3483730 3451246 3516920 3500872 3485400 3519214 3551823 3634668
6102 3634668 3605695 3659220 3794356 3771307 3793100 3811083 3906616 3913008 3918558 3969517 4072716
6091 4072716 4104401 4106595 4108066 4132059 4229653 4264876 4389308 4529844 4643891 4717855 4822214
6080 4822214 4909572 4991215 5083931 5208006 5339073 5463621 5529295 5697776 5787973 5915745
6070 5915745 6009415 6113067 6284083 6422228 6587568 6757490 6979313 7105508 7367757 7620857
6060 7620857 7861616 8194753 8518784 8933886 9434552 10038114 10745550 11494301 12443361 13672882
6050 13672882 15131945 17006385 19144122 21336783 23536102 25666159 27225294 27797882
6042 27797882 27404809 26332782 25226142 24198108 23452197 23444403 24102723 25197352 26405042
6033 26405042 27609194 28249790 27768212 26347987 24324074 22095541 19783534 17643844
6025 17643844 15842699 14526243 13561501 12763710 12131151 11602457 11221817 10986586 10846337
6016 10846337 10719112 10604297 10548004 10603508 10671818 10707796 10832524 11009161 11316326 11641532
6006 11641532 12081651 12548262 13056783 13774840 14722080 15734940 16961513 18696451 20810303
5997 20810303 23339148 26146749 28985221 31727131 34099381 35502063 35511695 34456992 32979916
5988 32979916 31360697 30121449 29603302 29873119 30887836 32319014 33815348 34934539
5980 34934539 34940398 33673818 31324604 28375241 25175769 21990712 19208135 16959261 15257940
5971 15257940 13785154 12699283 11919247 11177987 10579254 10140061 9676413 9281186 9002589
5962 9002589 8752492 8503157 8311211 8056525 7896077 7773147 7657964 7541430 7426780 7365837
5952 7365837 7348998 7320939 7328272 7254990 7216037 7237498 7228623 7312900 7227155 7201890 7236438 7226510
5940 7226510 7207073 7176294 7183259 7255456 7360031 7354543 7323017 7409246 7495369 7586643 7615860 7641376
5928 7641376 7734088 7699611 7755910 7755914 7842830 7984839 8043628 8013810 8063514 8114898 8126481 8134175
5916 8134175 8130973 8174001 8230652 8297071 8402055 8490117 8525206 8606348 8704808 8768084 8863047
5905 8863047 8900477 9016356 9113378 9142252 9267064 9356713 9435996 9394200 9470814 9481744 9607607
5894 9607607 9678590 9814763 9887651 9948466 10026306 10172169 10288529 10378957 10463266 10561376 10669886
5883 10669886 10818367 10927885 11171749 11358974 11527915 11719461 11873957 12045178 12212012
5874 12212012 12368551 12501157 12714059 12721655 12767005 12870116 12949892 13044446 13131962 13215563 13367139
5863 13367139 13535078 13708930 13820131 13994479 14111226 14219564 14318215 14423166 14607544 14725852
5853 14725852 14870304 15162352 15369775 15641861 15893526 16157335 16472491 16808179 17248557
5844 17248557 17592988 18011240 18468748 19007488 19500447 20070977 20630239 21095625 21510064
5835 21510064 21819558 22096006 22337234 22662380 22922004 23145625 23399422 23681301 23897737
5826 23897737 23980870 24042844 24115514 24095076 24074396 23952817 23696790 23517588 23357486 23166477
5816 23166477 23053205 22958437 22995775 23172439 23539900 24159867 24841164 25632123 26569216 27448675
5806 27448675 28292513 29135456 29957013 30527912 30815825 30907136 30679642 30162231 29564055 28879178
5796 28879178 28187730 27669422 27225941 26866811 26734183 26807280 27017285 27394365 27732978 28069913
5786 28069913 28328328 28445324 28472679 28398461 28145641 27953639 27590089 27223104 26891339 26411241
5776 26411241 25924535 25442126 25010027 24539082 24105554 23739673 23488864 23321198 23282252 23205380
5766 23205380 23116456 23034440 22954864 22771987 22324348 21648616 20957083 20132429 19428771 18669182
5756 18669182 17870122 17163168 16610877 16086586 15550527 15065380 14635506 14286972 13817748
5747 13817748 13423644 13133919 12772731 12524801 12390496 12159538 11922862 11672654 11510236
5738 11510236 11382055 11175893 11009881 10868546 10683186 10503534 10371447 10192877 10086611
5729 10086611 10031129 9970979 10078498 10041163 10110155 10237797 10320146 10423586 10615050 10867946
5719 10867946 11044517 11301674 11672397 12006127 12442415 12892042 13328141 13884292 14494965
5710 14494965 15202585 16048100 17094034 18395433 19974562 21750570 23406955 25072678
5702 25072678 26726756 28086773 28889294 29042335 28396208 27218221 26028588 24748486 23299519
5693 23299519 21683290 19995520 18439174 17352357 16607996 16186928 15849538 15768182 15871671
5684 15871671 16151752 16668478 17397315 18468045 19745532 21284790 22974949 24645883 26383187
5675 26383187 28071984 29290233 29960359 29980892 29041590 27520455 26162126 24794481 23180710
5666 23180710 21376094 19516168 17861517 16650692 15790889 15296889 15058366 14984316 15212706
5657 15212706 15569737 16122380 16927920 18029312 19129559 20038923 21020091 21965653 22603439
5648 22603439 22940602 22588338 21563978 20450191 19438208 18341067 17056002 15761139
5640 15761139 14397434 13314875 12555815 12096936 11774072 11559893 11497007 11587000 11975291
5631 11975291 12422580 13047085 13903963 14926960 16214417 17389405 18647884 19860942 20886939
5622 20886939 21627401 21945041 21562665 20425179 19222358 18101851 16846668 15468991 13886436
5613 13886436 12351145 11081796 10083085 9328180 8724240 8237375 7778639 7416072 7105869
5604 7105869 6867938 6624372 6426905 6230536 5985965 5832718 5697638 5505181 5448303 5345706
5594 5345706 5279271 5197562 5172323 5155541 5142251 5169072 5180770 5190966 5181497 5226367 5282652 5201776
5582 5201776 5156163 5121649 4975442 4901558 4787625 4705364 4640096 4501052 4483748 4503729 4441661
5571 4441661 4328314 4314593 4327900 4393178 4433966 4475432 4540267 4620024 4745482 4767396 4788286
5560 4788286 4822704 4854455 4824933 4874029 4873945 4919059 4917898 4931239 5024533 5143589 5304860 5479298
5548 5479298 5629402 5775685 5857238 5815771 5741120 5617312 5492110 5273319 5108898 4971180
5538 4971180 4896329 4885131 4911910 4922577 4958951 5057435 5094654 5151491 5074388 4983648 4923589
5527 4923589 4728357 4519010 4351867 4192947 4075065 4058502 3997678 3991982 3911312 3853514 3818970
5516 3818970 3746600 3669652 3573434 3522098 3445140 3418621 3372115 3311262 3241087 3230252 3216807
5505 3216807 3190873 3124754 3192459 3211936 3238692 3267959 3337626 3400377 3375477 3434045 3492327
5494 3492327 3614977 3591066 3562844 3518784 3424187 3444235 3504277 3548455 3566506 3607500 3691856
5483 3691856 3833500 3988464 4182486 4401069 4617804 4907847 5259327 5552436 5906677 6243223
5473 6243223 6437080 6517584 6524294 6485907 6283324 6098192 5931664 5900035 5886775 5852839 5911825
5462 5911825 6101730 6175347 6273431 6327482 6304025 6187983 6066364 5837527 5482705 5141295
5452 5141295 4717144 4414509 4243194 4082423 3879323 3780486 3762774 3682989 3699777 3602948
5442 3602948 3492818 3486727 3452275 3384318 3353927 3372773 3328901 3259360 3239841 3242974 3217030 3247471
5430 3247471 3175509 3177291 3251194 3342971 3352089 3312003 3368630 3517532 3616619 3721324 3763335
5419 3763335 3813739 3873417 3818872 3767266 3734519 3677028 3599228 3516092 3482188 3455222 3510625
5408 3510625 3494172 3580757 3610904 3649401 3676587 3679578 3672369 3616068 3548421 3507324 3530421 3569603
5396 3569603 3554606 3559715 3565676 3504012 3465962 3462696 3485737 3491862 3540772 3494290 3491272 3515635
5384 3515635 3506365 3540102 3546401 3622952 3597839 3610559 3695431 3709570 3690473 3748980 3827660 3902507
5372 3902507 3943271 3950981 3990919 4014427 4035299 4030620 4024447 4039704 4057741 4087971 4266988 4260932
5360 4260932 4349029 4475009 4585594 4753464 4850260 4887303 5023865 5139036 5289650 5512122
5350 5512122 5751277 5900874 6057137 6264588 6496274 6663907 6809658 7015649 7195795 7508776
5340 7508776 7819021 8078671 8345419 8593540 8774429 8905273 8997709 9023285 9043287 8969776
5330 8969776 8898800 8897655 8896857 8891450 8890015 8838653 8827551 8888610 8978445 9062572 9073807 9108313
5318 9108313 9155527 9080255 8968649 8771567 8527738 8278141 8104115 8025498 7951046 7836948
5308 7836948 7761890 7725580 7744282 7802085 7778396 7857725 7874481 8065662 8239168 8485627 8793357
5297 8793357 9125936 9526714 9807957 9921140 9822295 9542932 9261447 9018654 8638084 8242746
5287 8242746 7907145 7582323 7297131 7058434 6953928 6853878 6769615 6743095 6800376 6870120
5277 6870120 6986852 7136171 7384767 7623065 7890347 8073063 8201683 8430638 8536137 8688051
5267 8688051 8752771 8808604 8926797 8989699 8994945 8879110 8712989 8558826 8355322 8103013
5257 8103013 7822189 7644447 7444683 7271208 7163873 7091051 6961318 6854108 6801023 6781529
5247 6781529 6722846 6707951 6618779 6576371 6613464 6656037 6583174 6465699 6456308 6481255 6455817
5236 6455817 6447532 6427197 6475300 6531453 6572657 6628739 6691854 6758502 6787602 6796619 6881603 6952906
5224 6952906 6953113 7066124 7185651 7217857 7271040 7185275 7048191 6978788 6798700 6638974 6515791
5213 6515791 6395441 6309683 6233755 6125555 6058345 6016771 6028078 6112431 6195291 6288683 6348962
5202 6348962 6372820 6476615 6419219 6480877 6562886 6648399 6781983 6905853 6976703 7017752 7024305
5191 7024305 6954986 6860163 6745501 6568657 6457062 6300037 6125391 5972336 5850677 5802780
5181 5802780 5739788 5756047 5771051 5710330 5773763 5780578 5894064 5936667 5935680 5982014 5955910 5933777
5169 5933777 5890719 5861326 5833138 5882744 5779323 5804352 5749330 5788640 5842482 5886124 5954923
5158 5954923 6046499 6167074 6276653 6353923 6436196 6553278 6707639 6813483 6926699 7046043
5148 7046043 7095419 7215841 7333455 7420769 7434132 7488279 7518935 7648278 7808214 7945852
5138 7945852 8023583 8175862 8279659 8406220 8767644 9074759 9359691 9659559 10037641 10478004
5128 10478004 10896030 11452614 12128935 12929553 13701009 14406134 15219575 15977643 16623513
5119 16623513 17194159 17419338 17673969 18093606 18527755 19129031 19941712 20823129 21800815
5110 21800815 22962320 24192114 25311659 26205767 26598849 26990205 27425956 27820574 28350181
5101 28350181 28860768 29442392 29966977 30728986 31648461 32611681 33603814 34329560 35075696
5092 35075696 35834291 36449602 37110934 37701652 38159005 38443383 38928310 39689234 40728464
5083 40728464 41880247 42937324 44160700 45155002 45711929 46031308 45990261 45378651 44120882
5074 44120882 42916551 41735818 40189393 38785816 37486807 36356049 35442434 34810689
5066 34810689 34483809 34187530 34245109 34480176 34630029 34456461 33945671 33670086 33406569 33010864
5056 33010864 32658210 32271540 31893686 31590051 31290443 30915513 30486557 29680399 28597729
5047 28597729 27496239 26356505 25360864 24390121 23601896 22997916 22559664 22373762 22420807
5038 22420807 22686885 23069438 23546252 23989014 24373329 24811574 25290100 25599177 25887073
5029 25887073 25898315 25925040 25962355 25873392 25688497 25544076 25419686 25370135 25445298 25701106
5019 25701106 26114285 26687995 27535364 28789857 30136348 31675680 33579934 35770883 37792868
5010 37792868 39659975 41310539 42438685 43278467 43920841 43984504 43420923 42712436 42118797
5001 42118797 41615965 41341042 41410791 41582394 42046497 42557837 42882936 43630875 44150557 44371123
4991 44371123 44956462 45470329 46462509 48177280 49824678 51783070 54072693 56592927 58712325
4982 58712325 59750378 60717758 60353554 59838936 59481012 58358321 56391846 54020590 51091507
4973 51091507 48016871 45604861 43651823 41638695 39750534 38058089 36308248 34749828
4965 34749828 33162548 32186268 31376072 30756536 30192436 29786037 29721043 29985724 29810709
4956 29810709 29634903 29381361 28777286 28195491 27561340 26593617 25432171 24326366 23048423
4947 23048423 22155871 21454353 20722183 20150319 19655413 19120288 18610750 17669423 16845944
4938 16845944 16074238 15238849 14490287 13777107 13165898 12672769 12244258 11994331 11854690
4929 11854690 11658545 11481420 11304159 11084244 11001757 10823252 10787218 10737806 10592129 10490486
4919 10490486 10409802 10330201 10307571 10297182 10343087 10334421 10344869 10373270 10328038 10328070 10399723 10453104
4907 10453104 10497959 10490164 10497892 10599413 10781742 10959617 11204985 11561680 11826927 12190828
4897 12190828 12625120 13279899 14065431 14913591 15894557 17133167 18745956 20712096 23173479
4888 23173479 26082279 28832366 30949200 32376900 32569796 30856871 27812743 24427360
4880 24427360 21425420 18851815 17042885 15707352 14683835 13961729 13375406 13079493 12809794
4871 12809794 12586508 12473300 12403557 12426515 12444363 12427956 12428857 12611887 12812172 13009222 13370428
4860 13370428 13787978 14218665 14781126 15543139 16429480 17430821 18459307 19438798 20457671
4851 20457671 21862626 23906538 26597590 29507029 32700467 35991375 37294264 36210009
4843 36210009 33795615 30937166 28151664 25913874 24466232 23729994 23669406 24347522 25777785
4834 25777785 28126605 30590427 32764448 34478869 34198776 31764272 28407930 25106140
4826 25106140 22339733 20272810 18836671 17683600 16578397 15474677 14577319 13820657
4818 13820657 13286863 12858402 12596041 12324067 12110376 11977634 11839109 11846865 11773211 11720490
4808 11720490 11768123 11784350 11885398 11960868 12154161 12434927 12587142 12803598 13107518 13523879
4798 13523879 13936209 14484948 15238787 16159088 17184838 18310633 19303731 19692757 19528672
4789 19528672 18894797 18142230 17343890 16774474 16462031 16254790 16223860 16349229 16578634 16819479
4779 16819479 17156287 17581228 18151383 18822880 19564857 20444094 21439227 22737459 24247744
4770 24247744 25755202 27240815 29068327 30728473 32369415 33422773 33751493 34468452
4762 34468452 34981376 35375722 35295261 34580449 34310932 34449656 34792926 35310002 35990803 37082490
4752 37082490 38590862 40585455 42868404 44827563 46469780 48287867 50127461 51672505
4744 51672505 52501687 52270905 51788706 51697758 51337834 50827106 49724326 48780778 48056732
4735 48056732 47715253 47696121 47913739 48395238 49050386 49948160 51114618 52069121 53278989
4726 53278989 54211629 55068066 55979885 56877864 57466407 58118833 59357585 61124749 63297035
4717 63297035 66257181 70145664 75392448 82193575 90980344 102026186 115386769 129150013
4709 129150013 144225136 159391810 173314940 184373812 194294561 196597880 192177614
4702 192177614 186325466 175011120 164235952 153302477 141274405 128098937 115414410
4695 115414410 104057606 95748555 89632359 85032939 80880491 76456004 72644359 69539151
4687 69539151 66686807 64072301 61714414 59825282 58548121 57963638 58126202 58886240 60374794
4678 60374794 62538163 65050287 68066222 71506436 74689900 77535356 79766394 80617060
4670 80617060 80806834 80266956 78181515 75803003 73738216 71879430 70439759 69660651 69876835
4661 69876835 71367511 74244409 78517189 84228779 91826509 101446671 113284798 127544213
4653 127544213 142947400 158716666 175961872 191118214 201565030 209425613 208843314
4646 208843314 203815073 196508990 180227196 161831240 144090735 126077004 109429920
4639 109429920 93793582 80448221 70232539 62317424 56132486 51206478 47134149 43783318
4631 43783318 41055503 38715711 36701177 34804119 33136770 31602561 30116028 28761194
4623 28761194 27477722 26300865 25207540 24242281 23373908 22449360 21671597 21015999 20388933
4614 20388933 19731279 19211788 18696645 18177871 17790206 17403548 17053242 16683883 16303777
4605 16303777 16030697 15768080 15627533 15408578 15302223 15116752 15050863 14988060 14950278 14827222
4595 14827222 14762276 14717799 14679892 14608725 14548838 14503622 14432803 14337914 14316752 14299183 14251040
4584 14251040 14252616 14234995 14106863 13937570 13846614 13749348 13751369 13775601 13789324 13854027 13988134
4573 13988134 14083905 14177268 14322555 14474660 14605104 14651166 14694599 14755273 14706541 14732847 14662347
4562 14662347 14654012 14722241 14775831 14735002 14690857 14682268 14726725 14873478 15009490 15206040 15396231
4551 15396231 15653006 15919568 16293599 16712598 17124127 17601773 18181288 18807400 19681942
4542 19681942 20591101 21721314 23088844 24758071 26977756 29455151 31895297 34403558
4534 34403558 37027066 39414910 41185182 42027859 41883539 41453383 41153690 40955861 40836139
4525 40836139 40925727 41384701 42143386 43294630 44439108 45264203 45246889 44494880 43677574
4516 43677574 43080577 42536274 41961148 41381953 41147572 41140118 41133632 40641073 39627254 38571674
4506 38571674 37678365 37033119 36497851 36126969 36054720 36175910 36571151 36928451 36788456 35829177
4496 35829177 34188277 32321337 30395900 28422410 26406077 24364887 22628526 21259947
4488 21259947 20231830 19488777 18889734 18373698 17996999 17672414 17388687 17156131 16862176
4479 16862176 16552147 16293365 15971941 15648686 15386782 15175316 15110071 14970848 14962474 15160097
4469 15160097 15278571 15426754 15675746 15917891 16191297 16387439 16605228 16804446 16802059 16824924
4459 16824924 16921094 16920596 17028951 17181402 17275855 17475277 17809647 18329236 18975378 19851056
4449 19851056 20938483 22368696 24219014 26431581 28817072 31185574 33498446 35895447
4441 35895447 37625417 38078981 37658156 37158528 36999634 36860417 36758995 36537648 37004766
4432 37004766 37738727 38278661 37530919 35718853 34444995 33050723 31789432 30705214 30181635
4423 30181635 30378805 31123895 32149500 33217178 33982975 34189503 33944690 33540710 33119454
4414 33119454 32803786 32378620 32056861 32015737 32068584 31704112 30227765 28379182 26635582
4405 26635582 24790195 22654534 20431877 18591959 17072246 15800679 14904473 14043889
4397 14043889 13357438 12788116 12328143 12038496 11787406 11496590 11382109 11206660 10986803
4388 10986803 10768823 10546192 10393464 10221476 9994612 9770568 9628763 9466096 9284444
4379 9284444 9153171 9009526 8745894 8545735 8406930 8241087 8163721 8130829 8055323 8083421
4369 8083421 8114888 8056658 8025055 7895301 7814507 7755496 7702711 7566023 7489290 7555373 7563487
4358 7563487 7530743 7426600 7412299 7374673 7349223 7445947 7581018 7618202 7700623 7841687 7935820
4347 7935820 8058748 8186096 8220607 8270842 8309531 8288069 8263467 8269042 8313477 8384274 8518575
4336 8518575 8559343 8685876 8758667 8824395 8785496 8653975 8572431 8434512 8144005 7995932
4326 7995932 7759765 7571958 7347702 7139232 7011333 6885050 6711192 6578597 6488552 6411385
4316 6411385 6324835 6197893 6120134 6100514 6071971 5960869 5929148 5926645 5935128 5900966 5898382 5883522
4304 5883522 5888290 5887177 5844290 5890091 5932493 5853082 5889995 5907597 5935310 5955886 6065116 6118073
4292 6118073 6214127 6305974 6463503 6515500 6577656 6693703 6853281 6982178 7127206 7290854
4282 7290854 7434777 7558654 7699205 7785019 7875135 7979349 8037640 8122306 8243766 8450364
4272 8450364 8649569 8764254 8988559 9235314 9365918 9479637 9610363 9669202 9792289 9912788
4262 9912788 9954834 10045649 10063311 10127309 10068834 10065822 10083306 10033648 10091699 10115649 10123500 10164474
4250 10164474 10200597 10203101 10220574 10187164 10170050 10168765 10151233 10075310 10054150 9971764 10025790 10011365
4238 10011365 9929003 9981827 9971573 9917585 10038777 10183134 10260541 10345568 10444301 10521888 10519782
4227 10519782 10590624 10654170 10650349 10663395 10770828 10842335 10896968 10960750 11049474 11182695 11341142
4216 11341142 11434599 11603460 11844742 12201595 12516616 12794032 13208462 13586190 13943670 14289504
4206 14289504 14510006 14678162 14750015 14739245 14736076 14756121 14771220 14876428 15000161 15147829
4196 15147829 15366761 15610432 15896234 16152725 16491200 16888883 17261461 17702838 18203942
4187 18203942 18814232 19316944 19900965 20487132 21075260 21427470 21759933 22094683 22381628
4178 22381628 22568180 22750294 22980822 23355211 23819820 24312398 24821373 25361794 25822725
4169 25822725 26223529 26677876 27187777 27627776 28061902 28388451 28916130 29445197 30044342
4160 30044342 30626333 31196410 31912914 32667560 33531333 34539582 35670057 36977151 38387140
4151 38387140 40025026 41736844 43554742 45405695 47426844 49622233 52214326 54841403
4143 54841403 57628457 60743441 63843765 66764618 69126856 70838579 72534421 74159047
4135 74159047 75592235 76607907 77988667 80088788 82999491 86836894 91785637 98328524
4127 98328524 106550182 116706784 129360120 145691947 166878063 193272171 222822571
4120 222822571 254270115 285371720 311756074 325200380 323772070 306851748 281336547
4113 281336547 250675581 218730072 189889208 166056835 148022421 134460495 124797574
4106 124797574 117729300 112597509 108043945 103035650 96802403 89647242 82039951 74640114
4098 74640114 67712082 61648627 56425724 51986032 48109676 44923921 42016826 39440207
4090 39440207 37189627 35156868 33223551 31617052 30161755 28884827 27738574 26739835
4082 26739835 25743999 24930964 24046823 23249320 22374953 21750785 21044619 20505459 19886226
4073 19886226 19329359 18929972 18429572 17996048 17611051 17158047 16811842 16422401 16055517
4064 16055517 15668326 15402458 15083573 14909624 14708883 14574517 14480239 14413778 14296294 14206453
4054 14206453 14050416 13926847 13772158 13751813 13729227 13565197 13399580 13377517 13387596 13482209
4044 13482209 13592230 13829622 14166163 14492023 14866664 15216295 15779203 16531449 17488871
4035 17488871 18591204 20090135 21953595 24310410 27130708 30094817 32926952 35702672
4027 35702672 37982535 39071003 38316654 36245727 33663263 30646814 27419153 24315665
4019 24315665 21657680 19424789 17657965 16292052 15218913 14388342 13707655 13010374 12457824
4010 12457824 12077971 11639680 11323098 10970712 10672428 10574187 10405854 10070995 9871461 9735513
4000 9735513 9610798 9525878 9368372 9212871 8911371 8741003 8586622 8327974 8188744 8051580
3990 8051580 8010458 7914828 7809185 7711914 7611467 7536265 7653492 7660022 7692254 7705849 7684602
3979 7684602 7537177 7429453 7342676 7146202 7042121 7081046 6980745 6982091 6952019 6939047 6961077
3968 6961077 6951136 7015396 7017117 7003177 7076423 7143212 7161334 7203077 7292529 7307319 7348768 7322551
3956 7322551 7213854 7273906 7403354 7609006 7757071 7941559 8239806 8604948 9036687 9534214
3946 9534214 10314462 11234932 12250400 13331156 14338600 15368029 16282193 16872240 17158256
3937 17158256 16775493 15722877 14770544 13756486 12654541 11449784 10095636 8902761
3929 8902761 7937501 7246503 6689685 6269148 5828804 5466057 5119039 4837842 4652461 4495760
3919 4495760 4337041 4142569 4007979 3907982 3776171 3690067 3635700 3532046 3420368 3330998
3909 3330998 3260061 3170258 3214581 3119469 3081969 3090823 3005193 2969928 2982080 2975861 3051583 3039272
3897 3039272 3029616 3003251 3006949 2933691 2875847 2795345 2782581 2755232 2745795 2697754 2628397 2680355
3885 2680355 2649959 2644653 2634782 2620625 2656560 2656144 2687248 2735098 2724943 2762224 2817073 2887004
3873 2887004 2921587 3037465 3080260 3082606 3037695 2901931 2916278 2955649 2968987 3053912 3095529
3862 3095529 3120621 3103442 3074155 3148940 3160734 3145980 3132269 3167749 3250128 3282401 3363595
3851 3363595 3436676 3526993 3560193 3648590 3790638 3907270 4026451 4157729 4205122 4276522 4419342
3840 4419342 4458720 4564874 4669808 4677274 4818643 4875406 5024771 5176712 5354833 5627937
3830 5627937 5925731 6242979 6499575 6680703 6816376 6862933 6841238 6900945 6938234 6989400
3820 6989400 7104665 7291744 7577788 7904692 8349461 8877714 9388399 10028062 10764920 11703921
3810 11703921 12929008 14438616 16244789 18594141 21219525 23524507 25834121 28402922
3802 28402922 30868070 32204430 32860372 33337456 31704099 29860000 28492913 27118097
3794 27118097 25496220 23209976 20493614 17902275 15776291 14129954 12827640 11766367
3786 11766367 10908381 10117250 9357610 8682296 8281181 7863929 7612789 7407841 7239585
3777 7239585 7053935 6976702 6973249 7020124 7067855 7019534 6907300 6844573 6627895 6410254 6154701
3766 6154701 5911116 5766650 5600334 5453657 5361451 5335310 5360245 5334579 5362546 5533694
3756 5533694 5656331 5764968 5854100 5859223 5959870 5980949 6076876 5956692 5726660 5536892
3746 5536892 5360184 5160770 4984802 4826894 4714500 4656252 4698024 4733880 4784785 4881932
3736 4881932 4972839 5037751 4971917 4911414 4962004 5018219 4899697 4732930 4574823 4365786 4134403
3725 4134403 3959285 3831804 3653100 3425292 3231321 3040970 2907388 2853683 2778065 2709426
3715 2709426 2624513 2573627 2499744 2339652 2291036 2206834 2114765 2086837 1998770 1986926 1959082
3704 1959082 1906017 1909493 1954738 1963351 2070819 2061919 2071876 2118056 2154378 2178533 2110729 2046044
3692 2046044 1951482 1858472 1759680 1634480 1455517 1421005 1350568 1247753 1144038 1115747 1097597
3681 1097597 1012988 1024287 1006626 926542 956573 907586 847442 822623 842616 827815 816791
3670 816791 765528 728137 754930 763595 766261 772837 687990 680537 689711 679483 685155 675782 653659
3657 653659 689351 738119 775357 702095 692445 748853 762503 766176 707066 657252 728241 789788
3645 789788 803525 757713 747273 728759 748846 760117 747207 774900 751480 761207 778666 798701
3633 798701 834977 884999 965268 1018357 1004491 1103264 1128221 1135649 1149849 1270256 1380013
3622 1380013 1501263 1644613 1736315 1788043 1846845 1906775 1918337 1856018 1768708 1787248 1709448
3611 1709448 1541590 1520242 1477978 1431696 1363642 1299111 1289708 1304068 1400563 1507705 1624427
3600 1624427 1653176 1714787 1740553 1742043 1814521 1724174 1663107 1624971 1586370 1503871 1397376
3589 1397376 1309459 1314649 1376063 1435373 1535233 1566877 1684113 1693136 1739335 1753805 1738026 1681278
3577 1681278 1558679 1445923 1391337 1303323 1166087 1144445 1129693 1091439 1076478 1125543 1195796
3566 1195796 1334221 1348434 1330311 1335726 1422232 1389103 1425459 1307254 1210866 1197557 1030626
3555 1030626 997511 934964 883727 821595 685775 616122 582457 523589 503488 497651 510834
3544 510834 477171 462289 464633 448499 425923 449607 438361 487805 462435 458001 471504 431077
3532 431077 409652 385893 340647 347731 375262 388500 334898 331689 368325 332545 278925 312589
3520 312589 391932 418270 373647 287399 278864 328049 292131 281898 335837 320644 338815 336832
3508 336832 372839 353099 332017 266204 283632 332186 311659 301714 278759 245625 288604 284182
3496 284182 312098 364326 219765 211056 294238 297297 254084 279867 247778 234628 221812 208574
3484 208574 247202 266931 220319 262752 277496 240397 240002 246043 244691 251275 235006 149064 165610
3471 165610 196684 239620 175614 145581 254423 241676 266011 303227 241872 220602 218810 271277
3459 271277 213335 254533 222954 212897 201361 178185 166260 164795 207686 280543 240560 261974
3447 261974 238546 163536 216276 210234 201356 206306 217489 194334 215391 288728 223735 219399
3435 219399 196591 258026 315462 233413 179199 189379 224958 258623 251655 267265 257716 225409
3423 225409 190436 182068 195446 173112 180539 181059 254099 326094 315518 224761 226107 300707 367632
3410 367632 289048 321620 268361 239871 294387 289415 265749 306402 322822 301552 232662 274574
3398 274574 299897 333463 351966 367553 327826 375530 435351 399281 406643 405351 407001 443176
3386 443176 457386 402344 366429 311644 269916 339549 383667 378089 353547 369185 374175 384370
3374 384370 395665 406694 422955 485382 478948 520758 574311 592975 536772 543796 606915 675583
3362 675583 748736 806614 890277 965075 1008657 1065627 1092209 1023103 992501 898140 762238
3351 762238 736668 673268 592827 581200 532270 572697 494624 499271 504380 514297 501430 477735
3339 477735 482233 500618 529600 520379 481360 543364 590724 597106 590627 528570 504107 587450
3327 587450 576114 581117 599678 599741 599798 607123 654976 660602 643243 655828 615267 579425 626849
3314 626849 652849 665559 634399 603052 625416 587527 649519 598754 582640 653834 629911 634394
3302 634394 652156 618925 732960 724338 782714 797205 798236 830615 849460 892112 888218 881555
3290 881555 928774 900118 909297 969177 943285 951173 959978 1071816 1082449 1035350 985560 1075756
3278 1075756 1136852 1146149 1164903 1188356 1233172 1210502 1199202 1215684 1260190 1282134 1307608 1435922
3266 1435922 1450094 1492629 1512515 1564488 1501286 1590565 1705715 1684176 1752383 1775902 1811908
3255 1811908 1893758 1963991 2035090 2078816 2068331 2093166 2169419 2130255 2165080 2198259 2263570
3244 2263570 2350220 2454603 2473745 2524918 2590365 2586238 2609948 2679911 2761380 2847543 2930730
3233 2930730 2981661 2996321 3071842 3176431 3277485 3322788 3425950 3533935 3698833 3879376
3223 3879376 4094043 4317444 4462524 4629324 4784511 4962834 5073426 5180917 5222484 5303090
3213 5303090 5306073 5277586 5244625 5168614 5183833 5095597 4984318 4931033 4951194 4987727 4963460
3202 4963460 4960115 4932180 4905073 4741153 4514477 4217800 3895552 3636778 3442278 3200908
3192 3200908 3007050 2907177 2786165 2707335 2702421 2688885 2618233 2552404 2623034 2695174 2848057
3181 2848057 2931871 3024145 3128090 3306976 3534156 3695968 3914058 4249917 4537157 4806662
3171 4806662 5052665 5328505 5638545 5608722 5180652 4801823 4396287 3856797 3357000 3003432
3161 3003432 2793640 2582753 2415487 2370138 2302905 2281119 2292845 2273877 2245348 2318002 2381208
3150 2381208 2490750 2659663 2862535 3041837 3243380 3482161 3687006 3921523 4134132 4211024
3140 4211024 4228197 4275775 4237323 4192369 3957397 3704424 3317747 2970731 2641454 2286517
3130 2286517 2057253 1922293 1760113 1594758 1541507 1533970 1548189 1581887 1547437 1520199 1510671
3119 1510671 1563817 1550165 1496036 1544618 1675058 1774711 1797970 1862941 1974971 1981083 1896728
3108 1896728 1814358 1676743 1558464 1469722 1339347 1254065 1136624 1071322 987877 938117 912320
3097 912320 852334 793618 766124 697117 724693 677931 672375 663692 573672 538670 473768 493725
3085 493725 527449 537671 446332 443423 447812 427112 392075 377464 384063 385472 328173 361465
3073 361465 358683 305317 266823 263161 334029 319312 290378 265286 310683 265258 277040 331375
3061 331375 304584 228639 269978 227890 189328 233816 260019 308358 237324 183749 200429 261166
3049 261166 292845 242929 274246 211100 170429 186536 211111 189218 92532 181019 166427 199423
3037 199423 156477 142491 189739 170503 152385 204172 239698 285154 226377 186361 187165 216405
3025 216405 203166 187753 236486 224073 253109 190739 148936 146797 78944 106335 136223 171215
3013 171215 161256 164015 143443 127400 182115 199818 197257 167886 80478 86179 184743 224677
3001 224677 214617 180330 141556 153111 143780 91181 124215 105838 136605 158838 216842 295056
2989 295056 150984 140490 199556 130300 83439 103387 174002 184910 183981 208248 163734 133286
2977 133286 124765 145944 206248 176269 133556 166611 156249 124468 153893 208503 271402 228089
2965 228089 242172 261092 170925 128181 220050 245925 215933 254383 270702 219368 173640 195661
2953 195661 228467 192627 251730 243913 251414 273570 243652 217206 259168 244512 237582 258086
2941 258086 277886 350604 376217 392841 349593 306497 313612 358276 379293 441035 445005 372819
2929 372819 314601 349737 424303 453242 498335 488803 453864 389240 404103 456072 462198 443745
2917 443745 489281 545161 538426 581379 588329 584598 628736 706148 733420 733475 725961 822212 875683
2904 875683 921886 911608 970706 1015355 1074167 1156527 1267989 1289120 1284948 1310514 1334864 1354227
2892 1354227 1321784 1290195 1295553 1354335 1376268 1387186 1389731 1395845 1365727 1324098 1382133 1433875
2880 1433875 1434107 1458163 1511882 1567453 1561021 1620371 1706509 1888576 1965805 2031109 2296158 2497567
2868 2497567 2536844 2479252 2392042 2324567 2168858 1958644 1734666 1636913 1517965 1461257 1419687
2857 1419687 1422079 1416283 1385345 1283467 1254176 1253090 1264542 1206639 1112332 1143213 1168081 1106448
2845 1106448 1140733 1274312 1289064 1300455 1251833 1275111 1212656 1168465 1152568 1123647 1101884
2834 1101884 1001599 945280 938613 850418 812515 739243 670599 726686 707005 651845 594028
2823 594028 514530 506828 510223 469277 516616 494291 425990 385740 431445 447335 433891 432032
2811 432032 334576 238947 235805 226632 263289 254395 250128 202338 177435 144453 163312 198941
2799 198941 133109 115202 127267 149014 140258 190843 206023 177863 125200 123568 179709 142210
2787 142210 171845 195733 169925 154292 121720 134442 155260 159966 139534 186071 92827 92970
2775 92970 89629 167936 169940 69649 110309 119969 61028 48691 44840 94151 44469 -9498
2763 -9498 20719 17327 221 39496 75870 84300 63199 44329 9003 2418 -26163 1895 -7751
2750 -7751 1572 461 -18084 37847 100191 36400 33736 -31503 -53586 -77629 -89302 -25796 -89971
2737 -89971 -32237 -50498 -31895 -19337 10222 -3792 -48560 9911 62594 -2787 18476 17791
2725 17791 -30590 -48340 -57134 -66401 -84128 -31470 -33194 -20048 -85736 -94918 -70873 -81648 -69047
2712 -69047 -42620 94 -65081 -114924 -35346 -22148 -24879 -9921 -66607 -51310 -1570 28315
2700 28315 -34154 -69699 -45957 22278 46903 -13281 -55910 -52477 -22387 -12439 -34543 -18028
2688 -18028 -50308 -46634 -14665 -708 -10478 385 12734 -41281 -74693 -75033 -100944 -80423 -56726
2675 -56726 -28868 -33349 -40336 -129854 -160927 -126082 -35372 -50734 24927 52396 -8358 -76015
2663 -76015 -25336 -25817 -59150 -97099 -94861 -106278 -132599 -127770 -106696 -43215 -42887 20203 -26199
2650 -26199 -96171 -112331 -95013 -48659 -147906 -141406 -54700 -35189 -65134 -45400 -11148 -27506
2638 -27506 -11146 -45996 -77975 -50455 -39519 -97736 -110855 -94193 -96976 -82648 -89836 -47783
2626 -47783 7335 -24328 74624 96295 41685 23542 -7166 -8399 -58826 -40920 -31670 -30712 25162
2613 25162 -62480 -66097 -75049 -44975 -67882 -11322 -64411 -19520 -847 -96860 -64231 -72318
2601 -72318 -189537 -127138 -84040 -136768 -102147 -9321 -21857 -46742 26704 -4388 -82228 -71870
2589 -71870 -72782 -129863 -127336 -31655 -67242 -67787 -42653 -24331 11309 -29069 -52961 -75218 -65079
2576 -65079 -109291 -59883 -18806 -21867 -42076 -34615 1984 -19961 -6416 -12833 -4145 5602 46393
2563 46393 4326 -34574 -69858 -69195 -96827 -60676 -26926 -43386 -62155 -99000 -72190 -85289
2551 -85289 -65136 -51755 -31175 -93169 -41765 -31788 15125 -39167 -43082 20196 4476 -27580
2539 -27580 34349 48429 -8180 -7568 -15003 -69297 -87911 -52496 39040 26800 -66595 -87338
2527 -87338 -98652 33425 -5325 -19924 -16825 -79827 -154109 -137956 -77940 -34354 14693 34427
2515 34427 13547 -59046 -36227 -38607 -62838 -17098 -29354 -159612 -125292 -68022 -57241 -31103
2503 -31103 -73706 -84397 -65445 -80335 -99127 -66977 24731 -23796 -39295 30336 -11838 -54755
2491 -54755 -91771 -129278 -108595 -103198 -111064 2526 55383 4975 -17340 -58292 -102509 -88994
2479 -88994 -130543 -79401 -43815 -35954 -66252 -105931 -77678 -97557 -68244 -2665 -12568 -54909
2467 -54909 -37380 -84826 -23692 16536 -16464 -84346 -75565 29996 -13702 -47577 -58639 -119800
2455 -119800 -53075 -12512 -93007 -164998 -128913 -119892 -113429 -132179 -106998 -65025 -102226 -51074
2443 -51074 -55947 -103575 -116196 -110709 -50552 -30182 23426 -3867 -17531 -71309 -171871 -115222
2431 -115222 -15858 64602 29728 15238 -8266 -44083 -68934 -32876 -63138 -122387 -82503 -118074
2419 -118074 -20983 -29730 -79552 -31386 -65401 -98720 -15763 -9966 356 -49909 -100834 -74827
2407 -74827 -51124 -55257 -113322 -114248 -38839 -9863 -74032 -61719 -39877 -37326 1438 9190 -73322
2394 -73322 -77015 -77691 -45588 -54148 -57655 -32639 -35978 -48245 -36307 23227 74226 29936 -11042
2381 -11042 -14982 -12227 -31086 15509 21047 1780 20383 21437 25269 34363 -1839 -79363 -49447
2368 -49447 -7305 -36923 -22233 6227 67258 38954 -13277 -70886 -35954 -50088 -22340 -16431
2356 -16431 -59664 -53398 -46826 5651 -24744 -16346 6067 -90594 -121563 -44406 -39931 -17628 -25464
2343 -25464 -17338 -22548 84956 84151 18348 21884 79473 94158 80595 32781 -4572 31242 -5870
2330 -5870 2209 -7675 -21460 -31487 -81931 -149638 -68968 -65269 -144508 -137236 -54117 1034 28713
2317 28713 30924 15674 -37906 -40339 -9289 9573 7574 12376 -20815 -18126 -17682 -104342 -124539
2304 -124539 -111904 -125036 -93970 -24567 39404 -33420 -69973 -49043 -45732 -29307 -2896 -25520
2292 -25520 -56308 -10982 4028 6632 -49400 -37833 16945 -20904 20988 -9658 -43330 -39936
2280 -39936 -45573 -19714 -75826 -54450 -96187 -26819 -4450 72816 70789 31370 40595 36654 27881
2267 27881 -1873 -37297 -15980 -11275 76688 85639 43645 16635 49597 99281 45920 60273
2255 60273 59264 39525 -15902 -18268 -54973 -25310 -25941 -49820 -8397 -5408 2602 52694 74265
2242 74265 31346 12842 5661 -71128 -41829 -19636 -42510 -16699 1789 -37320 -58385 11435
2230 11435 58531 31208 27739 57215 39531 41692 18522 58677 -36214 -45753 43998 25574
2218 25574 -32028 -19460 -28672 5040 62974 27598 -11396 -55832 -53355 -25035 12371 53358
2206 53358 28160 30005 -22436 -6548 33707 115818 139322 121755 107257 48268 62249 23248
2194 23248 57474 -1694 -22003 6119 55619 116626 165349 159683 90194 132962 174941 136522
2182 136522 129374 115041 105010 78481 118628 137571 153104 150113 135317 162606 154866 146695
2170 146695 194504 204161 188423 230099 250820 203325 170958 167284 235304 262109 240314 323238
2158 323238 297423 311117 316575 313615 326150 342946 330695 289334 367391 376178 345777 319813
2146 319813 312732 286077 331732 426513 463758 448984 456709 406386 403628 402540 456021 469610
2134 469610 424981 487365 489395 463652 483381 521393 539616 533390 544328 502585 586984 566285
2122 566285 529973 590204 665290 715738 686134 699543 727416 726385 760571 828988 891976 926875
2110 926875 957399 1037935 1110930 1164018 1181647 1270906 1349786 1365110 1366142 1445451 1477676 1460836
2098 1460836 1521288 1556068 1657071 1748261 1803817 1871027 1912800 2032134 2135376 2309112 2565569
2087 2565569 2800315 3006132 3275326 3475589 3696784 3947713 4323205 4793632 5304527 5920942
2077 5920942 6711855 7649116 9030740 11102511 13883547 16445131 19225395 21927376 21704094
2068 21704094 18854633 15248392 12109074 9592927 7795955 6496920 5494738 4711528
2060 4711528 4075666 3689397 3362940 3137275 2956228 2842099 2758153 2548188 2348323 2222349
2050 2222349 1977739 1844472 1779989 1599576 1437769 1354413 1265302 1193836 1131866 1084433 1022173
2039 1022173 896098 770472 832269 831468 803373 769469 689046 625328 601864 622988 581231
2028 581231 587379 546312 520182 547118 542906 523692 493217 474528 486543 464424 426229 385798
2016 385798 331203 352259 347176 326870 318907 253345 220549 235943 217763 248001 234886 216704
2004 216704 254743 259037 176332 157901 178391 224567 244484 167720 182165 154557 178180 202250
1992 202250 217120 198724 106934 48334 146420 158313 138213 170336 109194 111238 45497 44973
1980 44973 86702 136929 79422 31587 40316 100736 173363 154573 65396 14051 24002 21698
1968 21698 16156 162 49756 66235 137671 126044 100702 27497 31413 10606 55743 75702
1956 75702 -34073 19799 15713 10803 2727 71062 67671 28681 56675 19053 8422 4366 37760
1943 37760 43470 78239 60842 -3331 -28365 32600 58692 51300 44786 24997 40119 36848 -3087
1930 -3087 2176 -35238 -41886 20044 23139 65387 80275 88731 34806 57422 83009 5876 -15300
1917 -15300 33338 74766 72782 7704 53032 27673 243 44380 44458 -24362 -22687 75600 85081
1904 85081 -47760 -10746 30145 28399 107070 58826 98955 38520 16560 -11485 -44461 -37250
1892 -37250 -67785 -43149 -67132 -68614 -51971 -65949 -80017 -22433 -44193 -105447 -107946 -66132
1880 -66132 -56143 -67577 8894 -74225 -21727 11041 1698 -52826 -42983 -39369 -59676 10304 31052
1867 31052 -1390 -40765 -47506 -58988 -14507 -17887 -34839 41479 74493 22456 33479 -49813
1855 -49813 -99332 -86393 -90871 -48988 -48786 -116105 -168657 -133238 -18361 67742 -4119 -48166
1843 -48166 -16478 -61065 -70659 -55019 -56931 6784 11305 -6949 -18810 -32423 15211 7706 -17980
1830 -17980 37898 60668 -42045 -72436 -48830 -37913 -49662 -83147 -14935 -16107 -34919 -13570
1818 -13570 11086 17837 105256 65928 72440 45512 14074 43257 29912 19855 3212 71218
1806 71218 4369 -8632 42932 48010 42529 91073 64479 19003 39323 38246 26018 19226 -25775
1793 -25775 -29895 -27359 -8758 -9132 -6156 -13280 30684 41716 66688 84793 16603 -1591 11406
1780 11406 -32903 -66426 24860 -14145 -84664 3513 -39144 -21274 -8093 -7204 27197 -81051
1768 -81051 -77650 -19002 3258 17441 11538 1685 -9643 -50475 -149435 -64183 -22545 33322
1756 33322 69052 -52902 -108744 -55912 -61761 -44767 -38980 -55733 -39049 -19999 -52032 3815
1744 3815 17440 -13533 -20814 -23840 -37031 -75688 -78676 -69307 -106103 -97446 -45314 -55515 -84579
1731 -84579 -80233 -94057 -104089 -43716 -7244 -28281 -111438 -107626 24872 9928 -43563 -58546
1719 -58546 -72944 -29138 -34411 -21413 -31142 -13947 -9101 40336 -12495 -26075 -71606 -56571
1707 -56571 -20301 -15031 -24226 -27074 17741 3894 -22583 -13011 -86199 -73313 7912 13523 15761
1694 15761 -53209 -75492 -117784 -109341 -90005 -18898 -26669 20777 86913 38287 48995 21436
1682 21436 -43745 -98775 -113534 -83737 -29425 -68704 -42411 -11984 -11152 -90941 -61159 -61404 -63170
1669 -63170 -42453 -11848 -84313 -22127 -77853 -45187 8062 -82728 -65053 -44090 -92363 -78042
1657 -78042 -46070 -80785 -71272 -72795 -30118 -49862 14682 52751 -7370 -34319 -91585 -90172
1645 -90172 -27335 16478 -41090 -78289 -104673 -79643 -26527 -43985 -18127 -41101 -67399 -50432
1633 -50432 -28073 20502 36637 43556 970 -53693 22975 80412 -27460 8550 2363 11825
1621 11825 89738 24794 -62038 -56550 1123 -49499 -4810 12069 -4687 -54599 -41999 21845
1609 21845 22103 -27538 -29658 -58240 9414 -35171 -19680 8679 17392 7829 3969 -16239 2124
1596 2124 72284 31661 -65170 -57172 -81577 -41097 -75497 -83754 -10362 -30053 -4218 -25405
1584 -25405 -18545 -27215 -78132 -109494 -49055 15794 -12905 -29273 -112824 -11223 42052 41146
1572 41146 -52225 -108016 -59584 -36299 -52512 -26265 -7013 -23978 -67304 -54834 14990 473
1560 473 -54650 -35046 -13264 10975 45171 14798 -48240 -99510 2151 9592 -36294 -30360
1548 -30360 -77566 -146244 -123824 -106380 -104158 -82955 -65608 -113460 -68681 -48070 -40160 -9006
1536 -9006 -43824 -44468 -93481 -47955 -42677 -87336 -26404 -22581 -2754 -22926 -118340 -67227 -6940
1523 -6940 -26606 -81819 -56427 -15824 -36569 -913 20696 -15687 -65738 -20999 -82716 -105769
1511 -105769 -111531 -15126 -56970 -2603 -29959 -103052 -59525 -44078 -52536 -19506 -444 -64791
1499 -64791 -72430 825 15004 -70168 -134407 -68428 -25575 -30302 -76188 -64648 -39585 -20741
1487 -20741 -91556 -77312 -7041 -29798 -41669 36293 101961 41422 -9491 -8069 57109 16449
1475 16449 -13839 -34875 -36568 47352 46015 -47969 -101266 -119051 -139302 -50735 61836 824
1463 824 -24241 26104 51004 2741 -91606 -70748 14721 11593 -77447 -62486 11658 -2490
1451 -2490 -28888 -23457 -7954 -28301 -5168 -4816 -62411 -17656 -3391 -36654 -24360 -91078 -143587
1438 -143587 -90285 -45845 -63378 -58792 -60626 -2920 -9489 -77074 -42551 13953 -17078 -62971
1426 -62971 -17215 -48675 -87683 -92664 -95115 -74776 -56289 -3761 -3865 10805 -48230 -61525 -61869
1413 -61869 -43769 12447 57907 62885 32863 15287 -21423 -59499 39267 13060 -26798 -35629
1401 -35629 604 -3038 -90120 -36901 43270 24883 -44298 21176 29945 7453 -10037 -82357
1389 -82357 -65225 -61631 -46725 -43881 -1857 24343 59489 -5035 -57771 -51710 33138 47861
1377 47861 -59235 -9075 -53093 -121117 -110714 -37080 -35732 -27065 -40261 -46760 49114 96776
1365 96776 74272 97030 76973 -21969 -46656 -67555 -34456 -42840 -3648 32331 13812 44182
1353 44182 17153 19050 -237 51284 8281 -98135 -65872 480 21278 11080 14934 5226
1341 5226 -59037 -37140 3723 -89924 -114264 -21576 -13247 5897 6490 2082 -13709 -15254 -36450
1328 -36450 -87455 -51709 -35634 13481 47513 -12580 -68749 2540 3552 7033 60902 50468
1316 50468 -75846 -65009 51042 62246 36258 568 -37809 -25871 -6736 -17588 -33829
1305 -33829 -55945 -74437 -40115 -5532 900 -40826 -50468 -57644 -82914 -73221 -55761 -16902 -9373
1292 -9373 -5489 -27317 1406 -22064 -53454 -80022 -69446 -21384 -43215 -76487 15112 -4533
1280 -4533 -77894 -92602 -71778 -102722 -55738 -44860 -69214 -40678 -13930 -14619 -8731 -27020 -18319
1267 -18319 45850 -4307 -8022 -2101 -18784 -22030 -25967 -35359 -21197 -9462 27061 24263 42955
1254 42955 64759 -21607 -59500 -58578 -67693 -43098 -36683 -121472 -33945 -26956 -99116 -50512 -7996
1241 -7996 -4040 20614 -40329 -106320 -30376 -119770 -59086 -10075 -6644 -41267 -47393 1236 -57141
1228 -57141 -12715 -5186 -43603 -84398 -25349 -30224 18156 27027 11352 -12286 -25040 -54596
1216 -54596 -6667 44842 -36859 -72503 -13220 -14469 10560 32228 -1826 28675 -5622 -3112
1204 -3112 13280 -35585 -91196 -79622 -39530 -45391 -20165 -45534 -100633 -100702 -56857 3255 -53818
1191 -53818 -61120 -24531 39 -7670 -39751 4894 24187 4007 15706 -26995 39132 59374
1179 59374 12488 2732 360 -7237 -7578 -3471 46479 31610 34685 -15906 -3096 22549 51831
1166 51831 45624 78226 44064 -9456 -38445 -40407 -13403 32963 13706 -5916 -13901 39687
1154 39687 11747 18885 27548 13750 16730 -36663 -50364 -28120 -8569 184 35351 39947 23493
1141 23493 -42400 1377 52852 -42394 -49528 2080 5012 14217 18730 -24293 -30108 25460 -1366
1128 -1366 -69918 -86877 -55956 31738 49527 19854 6597 14800 37589 13975 -1732 -20163
1116 -20163 23121 -6080 -25390 -21219 -23833 -46027 -5502 14826 68296 -7422 -6892 1282 13610
1103 13610 -31025 5432 28515 -54632 -62178 -35854 -18133 3419 34382 63834 -12654 -57062
1091 -57062 -46042 -18441 24883 63889 -25213 -5386 -62475 -368 12291 -45561 20684 -11222
1079 -11222 12935 -119595 -87692 65417 51332 -34656 -17403 -9231 -28764 15341 42013 60572
1067 60572 64619 36824 14023 -15690 -62123 -40904 32135 -17270 -27568 -19129 -7553 16319
1055 16319 -25008 25308 22226 45399 10884 -42339 -78708 -147515 -86554 -36051 -42071 -55711
1043 -55711 -27220 -65281 -9362 1460 -5091 -40210 42873 17208 -18021 -13177 6744 32925
1031 32925 -19228 18515 36343 66829 106934 105661 3576 -6857 -40784 -10780 -4017 -35789
1019 -35789 14744 -23228 -4168 22891 50698 10956 41934 -3356 43256 32725 -2914 8921
1007 8921 -34750 41155 5544 31254 82802 37086 37315 27076 64022 83846 66787 -1801
995 -1801 41154 20145 -27245 -20084 -45027 -7527 29277 84582 39176 5362 -19376 -11153 -4168
982 -4168 3210 -11510 60993 57063 19584 17013 133060 69779 -16161 20901 -39956 -39116 -33158
969 -33158 -53570 -50094 -31070 26296 37108 -1476 -17953 -16920 2474 -46196 33535 127061
957 127061 97768 66019 -60032 -79886 -25435 -10317 -42667 -75719 -75247 -5101 -14153 -11514
945 -11514 28280 -28896 10554 19036 12122 7169 425 -6681 24844 49187 38345 9406 -3896
932 -3896 5102 25029 -11287 -32853 -29233 13080 -5514 4709 -18832 16425 54455 16737 73372
919 73372 9747 -32385 57412 66421 69256 86347 55001 4631 11759 26211 54618 9015 34117
906 34117 79392 56646 26434 61224 13655 17925 91623 79353 28800 20124 26583 -111956
894 -111956 -3587 -34161 -69631 -22271 -36429 -45298 27976 85753 64846 95434 73658 87891
882 87891 134295 65078 9961 18008 12444 4113 -15415 7290 21254 67960 20696 9555 -9097
869 -9097 -38060 22395 14588 -24014 -31716 15860 59338 50874 -24703 -20072 -8301 62978 49828
856 49828 19366 22019 62916 63368 -13576 -45261 -3917 44616 52382 39446 16088 51384 41992
843 41992 64368 71510 15414 -11060 17531 72627 2054 13117 85257 83958 -54825 -57891
831 -57891 42007 52317 20407 53316 100264 30893 -73684 -49908 -53522 -10562 12686 -17140
819 -17140 17312 39005 -15514 -6288 29542 19371 5787 -59087 4362 71627 99527 83887
807 83887 83551 39508 -7092 -12447 36872 15105 21065 54035 78542 25302 51837 39902 74063
794 74063 11864 8145 3009 7894 11255 95771 63606 29412 140802 39177 19106 57697
782 57697 115997 63423 29729 -2648 -21465 14112 31003 -34823 1893 45660 -4304 42044
770 42044 5885 9007 19497 -34235 -61033 -88790 -37504 -8411 -17895 -27676 24302 74376 70515
757 70515 49741 27506 26723 26971 42481 45970 47690 51474 24506 25405 -19412 -27952 -11041 -21378
743 -21378 -5863 -35951 -21787 41829 19041 -26247 5972 -37563 -47430 -40636 35624 3737
731 3737 -24620 -27612 -12379 34673 -588 24533 -26744 22873 -17254 33004 61368 72957
719 72957 78143 54787 82827 56142 41130 82904 76425 26932 -4815 -23106 -56709 -47303 -60966
706 -60966 -50453 -39354 7071 127976 36852 -50865 55264 89870 28948 -10279 12376 37900
694 37900 77955 66163 21668 10951 8511 39480 3446 679 10940 27380 965 -41966
682 -41966 -1392 71534 48678 31669 27008 -18042 -31964 -1799 -61908 -81580 11758 65734
670 65734 40434 41543 -12104 25756 50245 11561 2082 33165 7122 -23847 -25852 -41240 -58887
657 -58887 -74272 -3753 15591 30523 -22803 -48409 20699 8695 69600 59431 16733 91007
645 91007 44737 92929 88192 36307 21366 27967 42374 27273 51398 54426 79111 81282 23838
632 23838 41601 71648 -15342 -102252 -58912 -47647 -84844 -32127 6505 -3421 44740 81923
620 81923 70531 26997 53922 79693 37274 -8155 41140 72887 -51662 -78878 -33950 47840
608 47840 93244 68112 13732 -268 53421 26847 -23469 -14116 56953 75221 62949 139402
596 139402 115722 17333 -2403 -31295 32444 42930 2190 21670 53386 56573 30217 50940
584 50940 36784 54613 51673 79454 91382 8933 40841 59724 61057 24950 -1308 7034 22515
571 22515 4052 -613 54246 80374 48793 5829 44950 44748 49277 29268 43513 29604 13831
558 13831 17645 51115 28114 -22039 -25443 -97230 18826 44226 916 5124 -53096 -28894
546 -28894 54265 12696 -15660 8957 52066 42989 38415 59858 68296 65325 27261 4756 -25530
533 -25530 37506 -25695 -31417 -4943 6558 18209 13010 24599 40097 42008 12609 -58019 23082
520 23082 57098 26858 10079 27758 60621 37006 8849 -52557 22557 17581 30499 133023
508 133023 135030 86409 89641 74205 -52769 15848 13324 8109 30592 -27594 -47516 11028
496 11028 69692 72584 13128 -15034 -49265 -36983 27016 31010 36923 8166 39587 -4356 6972
483 6972 -13771 19418 15517 752 -35338 -21287 76044 94654 100590 113453 72316 79973 95907
470 95907 11501 -2541 47185 44959 48319 51212 86801 24435 28782 83493 15867 7919 50014
457 50014 49452 13636 47197 48835 50558 63968 43067 15586 -37391 -780 53238 93302 72235
444 72235 92786 -4919 -29304 5219 9047 77233 95887 74321 54433 49795 8379 38460
432 38460 56503 49885 21028 47038 33171 70623 134340 89244 13602 41005 -198 23386
420 23386 26351 29829 -1709 -25116 75629 87181 106066 120233 111377 25957 -5802 28633
408 28633 99753 85084 35469 44566 30950 80229 58019 -17683 34154 59737 44120 43032
396 43032 46815 100860 78798 72388 -6785 3027 -26753 -11295 -58215 -83182 -24098 26895 -1544
383 -1544 -30217 11627 25363 95831 78360 143372 89247 61674 12746 6852 30697 58423
371 58423 53615 48588 99792 106483 80503 86275 70668 70515 52753 34159 79666 -820 -55200
358 -55200 -45389 3215 75786 62348 24150 4190 47872 66248 54375 52333 1781 12901
346 12901 92511 85697 98328 94804 73528 68191 84609 14158 42643 68784 82767 60945 47489
333 47489 49599 65551 88562 35670 21375 14320 58627 39865 87422 91510 91354 61047 82146
320 82146 58005 13251 701 -33997 -37352 33752 88231 70867 62073 94904 95520 77609 44796
307 44796 42209 72650 48574 -1984 4123 -49228 49535 101479 74928 10422 -31594 51056
295 51056 38887 57741 39336 23645 -27320 -22730 61015 42654 16312 95277 89688 49035
283 49035 35182 48375 79919 23329 20474 30968 32008 37118 92742 76321 63017 59068 21693
270 21693 19640 45378 92187 49019 54916 66602 65439 71333 6549 -70651 -49534 -24919 21971
257 21971 19404 16633 73497 -11276 422 7538 39589 77945 78332 125088 105293 57783 5761
244 5761 -4638 -7800 14700 49747 104235 68946 74993 48917 9552 39044 83416 51058 97255
231 97255 26717 26521 30194 -9302 38589 3757 7379 -13126 43208 79470 103703 81645 83091
218 83091 92873 62950 42575 80263 85339 104466 87085 25823 90847 107872 92766 57894
206 57894 85307 56662 16210 26097 47523 58327 43169 1997 -17087 -9065 17666 26157 32490
193 32490 35580 -13060 47750 96510 59582 68243 115374 118013 110314 110942 44359 57230 60596
180 60596 62286 42101 19999 49218 21794 107217 46873 -10799 45839 30222 64663 87476
168 87476 78196 37627 4673 -23614 -52933 26657 88903 145913 116185 125826 79224 114610
156 114610 90195 123324 122931 99316 124566 85618 94143 53809 26348 9141 64196 24009
144 24009 38209 66560 51357 26372 68814 92641 57201 38320 30272 39392 44162 39932 69701
131 69701 107158 63959 -16875 12119 15865 22956 86735 35652 5032 -12248 19420 27032 -10992
118 -10992 49500 34089 31767 5668 17953 68169 90805 116117 116345 79602 17657 49178 123365
105 123365 101350 48134 45759 72134 63850 66778 69480 17634 36076 21996 69026 61188 3914
92 3914 28280 35993 48224 71228 59661 60015 21701 -21690 107 46242 45020 -10128 9208
79 9208 8491 42717 51715 55202 24694 95844 137239 90267 63338 112672 129237 1516 27307
66 27307 116725 89941 28243 70070 40068 51389 71279 77615 71504 57317 40257 -2604 24845
53 24845 68129 30570 6016 48746 71141 19793 13218 26348 63948 58166 82649 102556 123870
40 123870 98743 45611 64386 71839 46288 35579 72187 93830 106688 97165 107049 117831 92224
27 92224 60425 44607 -12870 45589 107769 56809 63509 80516 70233 96902 54898 -12052
15 -12052 27891 33673 94350 95082 69213 47934 45934 43155 24568 46856 81835 79571 28536
2 28536 40509 20143
0 20143
$$ Imaginary data points
##PAGE= N=2
##DATA TABLE= (X++(I..I)), XYDATA
16383 -942312 -921823 -915562 -896013 -934294 -884851 -857973 -858280 -810372 -775096 -744187 -732152 -712183
16371 -712183 -700489 -697544 -663486 -648027 -590090 -572240 -581022 -554192 -507222 -506385 -486360 -475861
16359 -475861 -497067 -420329 -361859 -339056 -322606 -298420 -301034 -266319 -221823 -188961 -209299 -167820
16347 -167820 -151719 -126362 -83050 -80002 -121668 -76418 -39983 -80586 -56362 24109 35891 64972
16335 64972 95411 100166 114955 123756 127131 163648 185127 248512 292586 290252 292333 328240 313326
16322 313326 330497 331087 346375 362063 388264 417473 426861 431921 453417 474333 492118 496870
16310 496870 534931 573588 617912 612013 623863 705664 687880 697246 748711 778618 798886 790417
16298 790417 837103 849798 837949 872770 868943 913605 917122 920187 944075 940979 963925 981564
16286 981564 984957 1005385 1043671 1088749 1096821 1106711 1127054 1153285 1174055 1147207 1165963 1202205
16274 1202205 1218497 1200283 1173051 1259383 1287873 1272275 1231662 1245488 1290975 1346097 1354695
16263 1354695 1374365 1377853 1394168 1388625 1408302 1437810 1462722 1488843 1482370 1495584 1518598 1513529
16251 1513529 1524133 1592947 1550979 1574401 1589130 1622955 1636139 1588175 1594047 1637415 1628278 1630437
16239 1630437 1639187 1630176 1744431 1771929 1789530 1768194 1815319 1832890 1786401 1764100 1764099 1852184
16227 1852184 1893886 1858140 1883639 1859691 1850015 1855970 1883733 1869740 1878289 1891595 1916795 1932585
16215 1932585 1978960 1989299 1962904 1963902 1986466 1992380 1984391 2024982 1999955 2016169 2036057 2047315
16203 2047315 2031621 2043945 2072822 2122859 2113242 2107956 2094712 2134832 2124376 2123950 2129177 2113534
16191 2113534 2124702 2185252 2215737 2207391 2258930 2270645 2223694 2174113 2184838 2219363 2284868
16180 2284868 2271868 2255761 2269082 2208315 2151844 2135782 2230478 2302081 2346118 2336914 2272094
16169 2272094 2345699 2403413 2352864 2301771 2310371 2341492 2389036 2429238 2355486 2329106 2333952 2313594
16157 2313594 2340203 2329876 2322534 2398822 2409627 2395172 2464621 2508553 2431498 2373456 2392721
16146 2392721 2405701 2365459 2330947 2452378 2542796 2477508 2424542 2454143 2492967 2467225 2483156
16135 2483156 2516425 2485343 2440134 2484656 2495177 2498449 2559915 2512449 2487710 2538062 2545769 2554419
16123 2554419 2559044 2550006 2528181 2536847 2579593 2493455 2474485 2536801 2551711 2534181 2480143 2459219
16111 2459219 2517967 2485468 2429427 2464989 2527174 2483783 2453446 2503912 2528473 2557560 2498287
16100 2498287 2534264 2560748 2549693 2603695 2560513 2513967 2492438 2540133 2587291 2588573 2549862
16089 2549862 2465792 2555542 2557767 2536115 2624515 2591791 2564014 2561747 2542830 2623809 2636366 2635697
16077 2635697 2634133 2623948 2605432 2578920 2652503 2635902 2613762 2602119 2602964 2635913 2578150 2605581
16065 2605581 2650720 2644983 2629271 2600811 2568109 2597535 2574156 2619259 2710187 2680823 2685418 2673092
16053 2673092 2668755 2702369 2649419 2590795 2581562 2570924 2578489 2608768 2667160 2591143 2614661 2692370
16041 2692370 2622021 2520513 2546443 2548538 2612174 2607410 2614977 2645585 2682513 2653993 2647151 2653930
16029 2653930 2649916 2610912 2602538 2585363 2626514 2665952 2660584 2699978 2657073 2624042 2595302 2642260
16017 2642260 2640354 2674656 2666211 2633992 2607582 2648776 2644251 2634773 2612229 2580218 2554374 2587790
16005 2587790 2654684 2633283 2615870 2566874 2534909 2559545 2580813 2651756 2585689 2557333 2579627
15994 2579627 2565918 2621952 2617585 2581957 2615397 2638557 2616982 2570934 2648146 2677745 2682230 2648952
15982 2648952 2647596 2660526 2607341 2629664 2653355 2683791 2618868 2636255 2639698 2659130 2657799 2649723
15970 2649723 2666047 2657542 2686969 2661553 2676831 2684086 2644188 2631812 2628561 2617510 2626039 2597036
15958 2597036 2620485 2595781 2620244 2679820 2642421 2614503 2548048 2589869 2594068 2614601 2626332
15947 2626332 2604750 2638183 2601788 2616750 2657733 2666267 2635436 2639586 2642919 2604535 2608729 2674349
15935 2674349 2683713 2616128 2656498 2630513 2665153 2648505 2618965 2656698 2674863 2658335 2596488
15924 2596488 2623463 2599856 2615301 2687332 2684838 2719031 2721588 2606849 2626119 2694678 2707006
15913 2707006 2683534 2648651 2660962 2649258 2663730 2683031 2707025 2725578 2740912 2659054 2656094
15902 2656094 2635848 2607547 2588944 2576244 2644975 2630394 2575015 2573022 2593713 2584918 2570400 2615963
15890 2615963 2605774 2654671 2639779 2655724 2673549 2588960 2571877 2661766 2697438 2641270 2663194
15879 2663194 2720080 2713277 2655602 2679228 2680841 2681556 2658866 2611429 2589103 2656848 2666978 2721152
15867 2721152 2692474 2691515 2685611 2647393 2624290 2600428 2617860 2596522 2599172 2626049 2619231 2641002
15855 2641002 2658469 2696533 2643918 2616287 2627184 2645680 2602819 2588241 2599389 2654536 2704234
15844 2704234 2765185 2742877 2677418 2692705 2813980 2799863 2736026 2705062 2673801 2685120 2631963
15833 2631963 2706582 2696776 2765503 2741200 2703704 2727309 2662072 2622046 2612185 2648134 2689436 2738209
15821 2738209 2712311 2664343 2663913 2638975 2699007 2667006 2624678 2630190 2652354 2667071 2694549 2708589
15809 2708589 2681623 2647920 2700588 2688479 2641372 2639798 2559174 2579949 2614688 2636172 2696846
15798 2696846 2764941 2753438 2749743 2668348 2698253 2703198 2697704 2739235 2750386 2684660 2604185 2620710
15786 2620710 2600810 2639335 2670243 2654612 2597615 2640539 2632833 2653781 2708603 2711928 2680584 2698494
15774 2698494 2695527 2767821 2722837 2683665 2700552 2655347 2662783 2676452 2673814 2730345 2729037 2685080
15762 2685080 2702053 2691223 2664778 2713172 2667012 2651393 2756627 2766255 2731673 2728129 2693259
15751 2693259 2676523 2687381 2740129 2767275 2755298 2713677 2713541 2736476 2719650 2665284 2648937 2667473
15739 2667473 2711697 2727881 2665621 2662971 2671993 2722400 2642729 2640549 2757430 2740738 2707466 2705552
15727 2705552 2735631 2686995 2685024 2774430 2778046 2761588 2667038 2701783 2740232 2761115 2684446 2688047
15715 2688047 2709586 2727575 2677407 2702006 2682131 2672522 2742176 2750568 2670392 2679137 2671852 2668218
15703 2668218 2657805 2651702 2684691 2710782 2706036 2681714 2756832 2687501 2698444 2656635 2701854 2745544
15691 2745544 2728065 2741045 2757912 2661886 2694294 2762854 2737644 2782578 2767995 2755644 2725010
15680 2725010 2673069 2724469 2723022 2703416 2713140 2722902 2761975 2735329 2721408 2774912 2755104 2714126
15668 2714126 2702201 2719411 2728073 2705193 2757282 2727707 2667881 2759663 2804508 2802740 2834872 2805745
15656 2805745 2720228 2764971 2729028 2732410 2742666 2691251 2734904 2750999 2775282 2789133 2799655
15645 2799655 2776476 2793844 2694047 2703398 2724368 2726061 2775289 2763295 2769671 2818764 2774620 2789029
15633 2789029 2758695 2676855 2651526 2644200 2642438 2632161 2703686 2736191 2759531 2759743 2687398 2735859
15621 2735859 2779952 2769491 2748070 2775066 2749875 2698583 2775978 2732999 2694338 2730229 2711603
15610 2711603 2675795 2767280 2708319 2705607 2726371 2729454 2738091 2788240 2813494 2766594 2698867 2694863
15598 2694863 2697953 2709092 2749635 2775170 2731613 2754120 2846002 2843014 2813407 2768914 2727115 2711820
15586 2711820 2728701 2731785 2725584 2694097 2697058 2742059 2789327 2718439 2705844 2711445 2728688 2718631
15574 2718631 2714795 2739902 2772903 2785049 2749461 2753852 2820625 2808442 2824787 2837090 2821807 2788129
15562 2788129 2832420 2824763 2783243 2769975 2729472 2692659 2722111 2808127 2784847 2788742 2832179 2805850
15550 2805850 2730418 2747977 2760996 2756905 2767986 2753553 2779945 2720255 2765359 2812581 2796903
15539 2796903 2790223 2813888 2788547 2810646 2848602 2744793 2774476 2742226 2791069 2794066 2827450
15528 2827450 2827616 2732505 2779155 2808669 2777476 2801689 2782252 2786772 2767920 2771722 2758714 2766970
15516 2766970 2811987 2840955 2750667 2719746 2807008 2774959 2769779 2776740 2798983 2806898 2771699 2689997
15504 2689997 2710651 2742888 2801752 2828202 2804647 2776026 2719865 2697283 2708592 2700282 2746114
15493 2746114 2840529 2738877 2720291 2763612 2818896 2759883 2755477 2747450 2758853 2764530 2724013 2737075
15481 2737075 2723095 2701807 2719878 2745953 2742282 2769357 2762227 2773871 2713104 2813164 2835602
15470 2835602 2803540 2819977 2775522 2831619 2830492 2848223 2866316 2855003 2857764 2816606 2784359 2745348
15458 2745348 2769199 2786350 2780878 2810636 2811777 2860132 2893808 2836736 2750882 2734313 2772748 2816642
15446 2816642 2828157 2772978 2785396 2811388 2828426 2780345 2826400 2842733 2829214 2831295 2806792
15435 2806792 2838755 2812091 2783819 2826871 2746636 2704181 2766544 2817650 2756809 2767296 2759074
15424 2759074 2783773 2816179 2874829 2785604 2726734 2814950 2795717 2773021 2814886 2884639 2823887
15413 2823887 2783362 2832055 2844485 2832382 2874657 2813993 2833397 2786760 2820583 2837900 2802227
15402 2802227 2806583 2851524 2831308 2819242 2778544 2752115 2806319 2814776 2848493 2902191 2899346 2826677
15390 2826677 2827995 2829835 2824530 2787655 2800884 2809465 2792178 2858920 2825984 2752262 2754066 2782303
15378 2782303 2831157 2774491 2780977 2844328 2797786 2828964 2854057 2801753 2761933 2777903 2829460
15367 2829460 2765240 2746632 2742924 2795873 2793991 2836263 2868071 2945604 2928795 2879542 2831932 2832150
15355 2832150 2861584 2846393 2848663 2821690 2795858 2780233 2842845 2835444 2840536 2825879 2847354 2802219
15343 2802219 2783744 2777402 2802256 2749586 2774104 2730010 2765294 2896903 2839244 2836682 2875629
15332 2875629 2842013 2777127 2789840 2904140 2860114 2825375 2814206 2842152 2921126 2934468 2887627
15321 2887627 2856648 2856663 2834294 2864761 2870698 2837308 2821058 2832633 2902437 2916294 2933655 2892479
15309 2892479 2818468 2809531 2774940 2817182 2784155 2814393 2830792 2843896 2853441 2833167 2802234 2865684
15297 2865684 2864710 2824037 2847599 2845166 2847865 2814714 2815834 2780588 2847735 2876923 2836902 2819904
15285 2819904 2871028 2872717 2839466 2835302 2844375 2854855 2813306 2888055 2924280 2917098 2889215 2912633
15273 2912633 2916262 2853953 2891153 2948511 2879485 2873798 2934336 2924459 2915366 2855617 2861988 2832434
15261 2832434 2844718 2905101 2956727 2913569 2875449 2867910 2894993 2872322 2870244 2899441 2925853 2883716
15249 2883716 2869235 2918629 2890312 2879457 2852766 2869565 2816787 2780818 2798007 2846857 2884236
15238 2884236 2897190 2826171 2813280 2814812 2810911 2785890 2799215 2871208 2852006 2813102 2872802 2832608
15226 2832608 2846642 2839678 2825508 2840503 2810069 2799509 2885639 2858735 2865595 2880650 2950389 2958096
15214 2958096 2924002 2920107 2887602 2877117 2840935 2920217 2890670 2894421 2853707 2881644 2858553 2885755
15202 2885755 2923656 2901906 2851928 2843054 2837874 2764963 2765561 2874025 2865183 2870183 2954934 2972214
15190 2972214 2930681 2842263 2841040 2841950 2836472 2908267 2925901 2908318 2917639 2897343 2943206 2953433
15178 2953433 2903278 2879207 2878444 2878272 2867563 2854862 2894311 2930748 2943602 2902975 2905347 2901855
15166 2901855 2917796 2852825 2867560 2846986 2872094 2927526 2909401 2921229 2894680 2895857 2871612
15155 2871612 2821608 2855626 2853646 2861237 2874848 2853291 2896635 2932229 2887620 2854843 2880530 2815682
15143 2815682 2842313 2887760 2828446 2826372 2856338 2799001 2863559 2947781 2953604 2965559 2933054 2890908
15131 2890908 2918520 2914411 2944923 2979628 2933278 2904628 2846299 2864923 2870581 2847547 2886421 2872655
15119 2872655 2905954 2858289 2791983 2808746 2881733 2958563 2938944 2899350 2890630 2844242 2842829 2887351
15107 2887351 2940797 2909712 2964616 2964256 2980018 2943857 2896055 2839258 2890385 2927695 2939540 2931153
15095 2931153 2922066 2916033 2860200 2877323 2900710 2899545 2923699 2918141 2955210 2993890 2989032 2911939
15083 2911939 2874686 2885855 2971797 2985860 2837081 2850991 2858513 2925840 2982369 3020803 2893766
15072 2893766 2911814 2920332 2963314 2887908 2925298 2854158 2818317 2928573 2897903 2958335 2910509
15061 2910509 2914172 2959308 2953591 2952085 2946234 2915891 2946071 2938451 2884345 2888292 2843669 2921061
15049 2921061 2919247 2904698 2919043 2918249 2889024 2894604 2893472 2871806 2914452 2898815 2878029 2889893
15037 2889893 2887598 2915621 2962075 2941161 2967094 2961041 2954970 2915777 2909805 2955864 2985134 2958993
15025 2958993 2932974 2917511 2936191 2986709 2922844 2862036 2937946 2914331 2909268 2851173 2874329
15014 2874329 2906326 2901875 2882707 2897352 2924679 2887508 2894137 2924896 2985250 2983262 2943146 2948288
15002 2948288 2971088 2989928 2929706 2951876 3024999 3019611 3001185 3019664 3015772 2987734 3013122 2981438
14990 2981438 2976766 3008582 3005360 2920859 2895279 2968892 2990204 2933668 2910999 2914213 2891308 2934464
14978 2934464 2959637 2989004 2993969 2975461 2964728 2931595 2956185 2944925 2978384 2942724 2892350
14967 2892350 2926153 2963754 2935987 2963468 3061913 3057548 3042815 2989526 2934241 2920482 2943004
14956 2943004 2973292 2977013 2947532 2892492 2917450 2964031 2999018 2994625 3025450 2945586 2905635 2999329
14944 2999329 3054481 3090534 3022344 2996018 3007315 3010682 3092085 3059490 3001587 2995580 3023885 3039319
14932 3039319 3018154 2999272 3031183 2963563 2901999 2945137 2972419 2972731 3076259 3009921 2978108
14921 2978108 2976336 2976038 2957023 2967442 3032696 3033638 3023717 2936473 2946695 2999787 2976059 2988543
14909 2988543 2963652 2986449 3021534 3002375 3017188 3006734 2973368 2963697 3020620 2991417 3015442
14898 3015442 3029878 2971621 2944284 2992685 2980655 2978892 3058161 3051844 2962513 2961476 2900344 2940625
14886 2940625 2912093 2914250 2935036 2925300 2991591 3044332 3033922 2937850 2860051 2871590 2906928 2899912
14874 2899912 2908371 2990334 3043967 3047778 3028728 3032230 3006793 3018108 3027705 3048880 2986379 2989224
14862 2989224 2914657 2968122 2977941 2985088 2974451 2981818 3042267 3040815 2976366 2941750 2967500 2904881
14850 2904881 2981019 3025680 3035261 3056827 3058314 2965801 3065871 3091344 3057786 3093660 3040490
14839 3040490 3051209 3012916 3059203 3019773 2993653 3051645 3071170 3006653 3001404 3018255 2976258
14828 2976258 3031642 3033891 3074387 3058790 2994336 3014185 2943834 2849051 2957552 2968772 3000796
14817 3000796 2991725 2991595 3009225 3041385 3039370 2974519 2972835 3059450 3084959 3029905 3067459 3079652
$$ [...]
##END NTUPLES=NMR SPECTRUM
##END=
