##TITLE=1H_TG-2340-XII-a
 CDCl3
 8 sc, 
 16.6.2023
##JCAMPDX= 6.0         $$ Bruker NMR JCAMP-DX V2.0
##DATA TYPE= NMR SPECTRUM
##DATA CLASS= NTUPLES
##ORIGIN= UXNMR, Bruker Analytische Messtechnik GmbH
##OWNER= root
$$ XWIN-NMR		Version 3.5
$$ Fri Jun 16 14:48:11 2023 Russian Standard Time (UT+4h)  she@DPX200
##.OBSERVE FREQUENCY= 200.13135
##.OBSERVE NUCLEUS= ^1H
##.ACQUISITION MODE= SIMULTANEOUS
##.ACQUISITION SCHEME= undefined
##.AVERAGES= 8
##.DIGITISER RES= 18
##SPECTROMETER/DATA SYSTEM= spect
##.PULSE SEQUENCE= zg30
##.SOLVENT NAME= CDCl3
##.SHIFT REFERENCE= (INTERNAL, CDCl3, 0, 15.7502)
##AUDIT TRAIL= $$ (NUMBER, WHEN, WHO, WHERE, WHAT)
$$ ##TITLE= Audit trail, XWIN-NMR		Version 3.5
$$ ##JCAMPDX= 5.01
$$ ##ORIGIN= Bruker BioSpin GmbH
$$ ##OWNER= she
$$ F:/spectra/data/she/nmr/H-F/1/pdata/1/auditp.txt
$$ ##AUDIT TRAIL=  $$ (NUMBER, WHEN, WHO, WHERE, WHAT)
(   1,<2023-06-16 14:46:21.39 +0400>,<she>,<DPX200>,
      <created by zg, POWCHK disabled, PULCHK disabled
       configuration hash MD5:
       00 E9 B6 7A A2 85 ED C7 34 08 36 98 17 FE 4E 26
       data hash MD5: 16K
       2D 5C A4 B5 C5 36 8C 2D B4 F4 0F 8F ED 60 6E 28>)
(   2,<2023-06-16 14:46:23.71 +0400>,<she>,<DPX200>,
      <Start of raw data processing
       efp BC_mod = 2 LB = 0.24 FT_mod = 6 PKNL = 1 PHC0 = -20623.39 PHC1 = 7.45272 SI = 16K 
       data hash MD5: 16K
       92 04 E6 FD 6B 44 EC 9D 0B 68 D3 FA C7 A7 5C 0A>)
(   3,<2023-06-16 14:46:40.09 +0400>,<she>,<DPX200>,
      <abs ABSG = 5 
       data hash MD5: 16K
       B7 47 6C 47 A7 39 D4 3D 3B 4A 0F 64 88 B1 F2 2D>)
(   4,<2023-06-16 14:47:01.12 +0400>,<she>,<DPX200>,
      <pk PHC0 = 0.9836708 PHC1 = -1.6 
       data hash MD5: 16K
       9E 23 77 86 7F 38 0F BD D6 03 6D AD D1 5D E4 C5>)
(   5,<2023-06-16 14:47:04.73 +0400>,<she>,<DPX200>,
      <abs ABSG = 5 
       data hash MD5: 16K
       2C 71 AA 07 FB 3D 84 3F 5E 99 42 14 3B 0F 27 54>)
$$ ##END=
$$ 
$$ hash MD5
$$ 52 CF E7 78 77 74 AF CA 01 7F 31 1D 20 2C 1F BB
##$RELAX= 
##$RELAX= 
##$RELAX= 
##$RELAX= 
##$RELAX= 
##$RELAX= 
$$ Bruker specific parameters
$$ --------------------------
##$DU= <F:/spectra>
##$EXPNO= 1
##$NAME= <H-F>
##$PROCNO= 1
##$TYPE= <nmr>
##$USER= <she>
##$AMP= (0..31)
100 100 100 100 100 100 100 100 100 100 100 100 100 100 100 100 100 100 
100 100 100 100 100 100 100 100 100 100 100 100 100 100 
##$AQSEQ= 0
##$AQ_mod= 1
##$AUNM= <au_zg>
##$AUTOPOS= <>
##$BF1= 200.13
##$BF2= 200.13
##$BF3= 200.13
##$BF4= 200.13
##$BF5= 200.13
##$BF6= 200.13
##$BF7= 200.13
##$BF8= 200.13
##$BYTORDA= 1
##$CFDGTYP= 0
##$CFRGTYP= 5
##$CHEMSTR= <none>
##$CNST= (0..31)
1 1 145 1 1 1 1 1 1 1 1 1 1 1 1 1 1 1 1 1 1 1 1 1 1 1 1 1 1 1 1 1 
##$CPDPRG= <>
##$CPDPRG1= <>
##$CPDPRG2= <>
##$CPDPRG3= <>
##$CPDPRG4= <mlev>
##$CPDPRG5= <mlev>
##$CPDPRG6= <mlev>
##$CPDPRG7= <mlev>
##$CPDPRG8= <mlev>
##$CPDPRGB= <>
##$CPDPRGT= <>
##$D= (0..31)
0 1.2 0 0 0 0 0 0 0 0.06 0 0.03 0 0 0 0 0.0002 0 0 0 0 0 0 0 0 0 0 0 0 
0 0 0 
##$DATE= 1686912380
##$DBL= (0..7)
$$ [...]
##$SUBNAM3= <"">
##$SUBNAM4= <"">
##$SUBNAM5= <"">
##$SUBNAM6= <"">
##$SUBNAM7= <"">
##$SUBNAM8= <"">
##$SUBNAM9= <"">
##$SW= 18.05172834244
##$SWIBOX= (0..15)
0 0 2 0 0 0 0 0 0 0 0 0 0 0 0 0 
##$SW_h= 3612.71676300578
##$TD= 16384
##$TD0= 1
##$TE= 0
##$TE2= 300
##$TE3= 300
##$TEG= 300
##$TL= (0..7)
0 120 120 120 120 120 120 120 
##$TP= (0..7)
150 150 150 150 150 150 150 150 
##$TP07= 0
##$TPNAME0= <>
##$TPNAME1= <>
##$TPNAME2= <>
##$TPNAME3= <>
##$TPNAME4= <>
##$TPNAME5= <>
##$TPNAME6= <>
##$TPNAME7= <>
##$TPOAL= (0..7)
0.5 0.5 0.5 0.5 0.5 0.5 0.5 0.5 
##$TPOFFS= (0..7)
0 0 0 0 0 0 0 0 
##$TUNHIN= 0
##$TUNHOUT= 0
##$TUNXOUT= 0
##$USERA1= <user>
##$USERA2= <user>
##$USERA3= <user>
##$USERA4= <user>
##$USERA5= <user>
##$V9= 5
##$VALIST= <valist>
##$VCLIST= <CCCCCCCCCCCCCCC>
##$VD= 0
##$VDLIST= <DDDDDDDDDDDDDDD>
##$VPLIST= <PPPPPPPPPPPPPPP>
##$VTLIST= <TTTTTTTTTTTTTTT>
##$WBST= 1024
##$WBSW= 4
##$XGAIN= (0..3)
0 0 0 0 
##$XL= 0
##$YL= 0
##$YMAX_a= 378786
##$YMIN_a= -470468
##$ZGOPTNS= <>
##$ZL1= 120
##$ZL2= 120
##$ZL3= 120
##$ZL4= 120
##$ABSF1= 15.76122
##$ABSF2= -2.290629
##$ABSG= 5
##$ABSL= 3
##$ALPHA= 0
##$AQORDER= 0
##$ASSFAC= 0
##$ASSFACI= 0
##$ASSFACX= 0
##$ASSWID= 0
##$AUNMP= <proc_1d>
##$AZFE= 0.1
##$AZFW= 0.1
##$BCFW= 0
##$BC_mod= 2
##$BYTORDP= 0
##$COROFFS= 0
##$CY= -3
##$DATMOD= 1
##$DC= 0
##$DFILT= <>
##$DTYPP= 0
##$F1P= 0
##$F2P= 0
##$FCOR= 1
##$FTSIZE= 16384
##$FT_mod= 6
##$GAMMA= 0
##$GB= 0
##$INTBC= 1
##$INTSCL= 3.70164e-10
##$ISEN= 128
##$LB= 0.24
##$LEV0= 0
##$LPBIN= 0
##$MAXI= 10000
##$MC2= 0
##$MEAN= 0
##$ME_mod= 0
##$MI= 1.114404
##$NCOEF= 0
##$NC_proc= -5
##$NLEV= 6
##$NOISF1= 3.799351
##$NOISF2= 2.8
##$NSP= 0
##$NTH_PI= 0
##$NZP= 0
##$OFFSET= 15.75019
##$PC= 1
##$PHC0= -20622.41
##$PHC1= 5.85272
##$PH_mod= 1
##$PKNL= yes
##$PPARMOD= 0
##$PSCAL= 0
##$PSIGN= 0
##$REVERSE= no
##$SF= 200.130004272837
##$SI= 16384
##$SIGF1= 3
##$SIGF2= 2
##$SINO= 5.538805
##$SIOLD= 16384
##$SREGLST= <1H.CDCl3>
##$SSB= 0
##$STSI= 16384
##$STSR= 0
##$SW_p= 3612.71676300578
##$SYMM= 0
##$S_DEV= 0
##$TDeff= 16384
##$TDoff= 0
##$TI= <>
##$TILT= no
##$TM1= 0
##$TM2= 0
##$TOPLEV= 0
##$USERP1= <user>
##$USERP2= <user>
##$USERP3= <user>
##$USERP4= <user>
##$USERP5= <user>
##$WDW= 1
##$XDIM= 16384
##$YMAX_p= 339589410
##$YMIN_p= -182352
$$ End of Bruker specific parameters
$$ ---------------------------------
##NTUPLES= NMR SPECTRUM
##VAR_NAME=  FREQUENCY,     SPECTRUM/REAL,   SPECTRUM/IMAG
##SYMBOL=    X,             R,               I
##VAR_TYPE=  INDEPENDENT,   DEPENDENT,       DEPENDENT
##VAR_FORM=  AFFN,          ASDF,            ASDF
##VAR_DIM=   16384,         16384,           16384
##UNITS=     HZ,            ARBITRARY UNITS, ARBITRARY UNITS
##FACTOR=    0.220516191357247, 1,           1
##FIRST=     3152.08554820734, 0,            0
##LAST=      -460.631214798439, 0,           0
##MIN=       -460.631214798439, -182352,     0
##MAX=       3152.08554820734, 339589410,    0
$$ Real data points
##PAGE= N=1
##DATA TABLE= (X++(R..R)), XYDATA
$$ [...]
7130D871394J30462J58083J67696K35060K14888K23198J92062K45245K49694K25246
7120F913028K58391L36886L89104L76005M41343M41377M49063N23478O11923Q08836
7110A1549434Q92674J022480J223850J384632J585684J802519K076265K490721
7102B4028259L119907L912057N095213O994919R663427J2387615J3814239J1502014
7094I0517650N167515k823753r821675j3357500j2726955j0603504q154229o102708
7086C2094841m584746l494863k816134k266071j756132j449348j228155j142986
7078A3356406r31063p91621p15430n90837n41135m95475m72781m46387l31754
7069H039923l31664l64258k83493k69477k76601k32565j83546k08224j31662j36117
$$ plain form
7130 4871394 5001856 5159939 5327635 5562695 5777583 6000781 6192843 6438088 6687782 6913028
7120 6913028 7171419 7508305 7897409 8273414 8714757 9156134 9605197 10128675 10740598 11549434
7110 11549434 12442108 13464588 14688438 16073070 17658754 19461273 21537538 24028259
7102 24028259 27148166 31060223 36155436 43150355 52813782 65201397 79015636 90517650
7094 90517650 95685165 92861412 83039737 69682237 56955282 46351778 38197549 32094841
7086 32094841 27510095 24015232 21199098 18933027 17176895 15727547 14499392 13356406
7078 13356406 12425343 11633722 10918292 10327455 9786320 9290845 8818064 8371677 8039923
7069 8039923 7708259 7344001 7060508 6791031 6514430 6281865 6098319 5890095 5758433 5622316
7059E622316j11276j83972j17522r4207r6449n2198N7934J5484J31203J36144
7049E307457J33680J37017J43783K71255L50934N23662O99848P69378R30835R49770
7039A0217619Q64572Q07426N10704j16453p23818j176848j348464j263036j050397
7030F721305q11283o62347m95001m14101l38534k58392l09451k00258j69315j39477
7020B923146j33331j46388j42656j2846L6507r7140j09623l8820J3512k8448n4492
7009B209421n5931n9185k7000m1559l4679n3606p8466l2538N1342k1117o3835
6998A792847N9853m1607l8687L100K9762J7713J6615N3818r545M0939P2212M3305
6986B040325o977L1750J52457J37064J31769J86713J90131K48705K65151M19059
$$ plain form
7059 5622316 5511040 5327068 5209546 5115339 5018890 4966692 5024626 5040110 5171313 5307457
7049 5307457 5441137 5578154 5721937 5993192 6344126 6867788 7567636 8337014 9267849 10217619
7039 10217619 11082191 11889617 12400321 12283868 11560050 10383202 9034738 7771702 6721305
7030 6721305 5910022 5247675 4752674 4338573 4000039 3741647 3432196 3231938 3062623 2923146
7020 2923146 2789815 2643427 2500771 2487925 2524432 2427292 2317669 2278849 2292361 2263913 2209421
7009 2209421 2153490 2094305 2067305 2025746 1991067 1937461 1858995 1826457 1877799 1856682 1792847
6998 1792847 1852700 1811093 1772406 1775506 1805268 1822981 1839596 1893414 1883869 1924808 1997020 2040325
6986 2040325 2033348 2065098 2217555 2354619 2486388 2673101 2863232 3111937 3377088 3796147
6976C796147N21502O72763J005449J125598J226200R63834L29409n05228j001172
6967H134502j197119j196078r21358p16196n87030m23025l62052k43224k32947
6958B255473j97491j16337j27691q6601j06758q9221p7514j02869o6285n5706
6948A229000k1228l6438n4429o6295p4969k9418O25o993j3260p9554m7135J533
6936H01439o2198k5886j7703l9864j9245m1627l153n2390O676o970m2921J5261
6924E11419J361n99p6974k9216L3096K5847j0544j0797K819o9375j2617m3901
6912C20519l4847n0649J2891L8485K4376K3027o7633K8161J6859m5129L0974J3804
6900C10838k2173l259K0460J695k6326K5740m093P254j4838L5333l4756m1597
$$ plain form
6976 3796147 4317649 4990412 5995861 7121459 8347659 9311493 9640902 9135674 8134502
6967 8134502 6937383 5741305 4819947 4103751 3516721 3093696 2731644 2488420 2255473
6958 2255473 2057982 1941645 1813954 1727353 1620595 1531374 1453860 1350991 1284706 1229000
6948 1229000 1207772 1171334 1116905 1050610 975641 946223 946848 939855 926595 847041 799906 801439
6936 801439 739241 713355 695652 655788 636543 594916 591763 539373 546049 539079 496158 511419
6924 511419 512780 512181 435207 405991 439087 464934 454390 443593 446412 377037 364420 320519
6912 320519 285672 235023 247914 286399 310775 333802 266169 294330 311189 266060 297034 310838
6900 310838 288665 285406 305866 307561 281235 306975 302882 310136 295298 330631 295875 254278
6888B54278Q830q432m3701L59j2599j2564n554j8996L5547l5507n0013M973N5791
6875A72412L2598n3203o3373k9041k3635O3074P5600n6217n046M0354J8846k6103
6863A46266J8106N078O9547l8012p9839n134K4173L216j1828k047K4332m572k2233
6850A27053m2472R040K5646K9585J0862j7439j5240r352m6548l748M788l4322
6838C7853M3338M5425K1934k4337J3076m8277n4524J1554N8212j3766K2500l0322
6826H2666J2123k746J7884j176j7593P2992O56m4201m4050p087R47M325M0870
6813A15610j2572m9294j3488K3689L2528j6958L242J3631l4802L0957P4062o8640
6801I7965n311j917k9894j4489J4183K5825l9837L9398K2751j1252o8716O041
$$ plain form
6888 254278 263108 254676 210975 211334 198735 186171 180617 161621 197168 161661 111648 116621 172412
6875 172412 205010 151807 88434 59393 35758 98832 174432 118215 113169 153523 172369 146266
6863 146266 164372 169450 238997 200985 121146 116012 140185 143401 131573 129526 153858 149286 127053
6850 127053 84581 93621 119267 148852 159714 142275 127035 117683 71135 67387 72175 37853
6838 37853 81191 126616 148550 124213 137289 89012 34488 46042 104254 90488 112988 82666
6826 82666 94789 92043 109927 108751 91158 164150 164806 120605 76555 69468 70415 74740 115610
6813 115610 103038 53744 40256 63945 96473 79515 82757 96388 61586 92543 166605 97965
6801 97965 92654 90737 60843 46354 60537 86362 46525 85923 108674 97422 28706 34747
6789C4747j015Q40o217M1795j4759L9251K9862l6649j4003n2693o2142K6932P7566
6776F3515o894j852r088L4651L4647M613j3831l7891r258l1033j5117J6097J8615
6763D7174j2199L4918N687Q304L406P797j5996j8719j3904L3631j3078k518K6858
6750I1361N287k6230j6498K6186j8054R34n4022J1761j159o961M0640L4350K0770
6737A08365J8418q7921J7732p3814K408J412J082K4703K3151r444R574J010K638
6724C9314K6673m1744k0770j1888M0057Q1282k1602k444L419l5512O950j5099
6712D8636q870R201J2848o044K9632N558K6401l0537K6735J1209j7472K726O0729
6699A70752K2367K6633N3250M7338Q8556N9812M7881K8702o9730m5082n7673q3963
$$ plain form
6789 34747 33732 34572 28355 70150 55391 94642 124504 87855 73852 21159 -40983 -14051 63515
6776 63515 56621 54769 45681 80332 114979 119592 105761 67870 58612 27579 12462 28559 47174
6763 47174 34975 69893 75580 83884 87290 95087 79091 60372 46468 80099 67021 64503 91361
6750 91361 96648 70418 53920 80106 62052 62986 8964 20725 19566 12605 53245 87595 108365
6737 108365 126783 38862 56594 -17220 -14812 -13400 -12318 12385 35536 26092 35666 36676 39314
6724 39314 65987 24243 3473 -8415 31642 112924 91322 88878 92297 56785 63735 48636
6712 48636 39766 48967 61815 55771 85403 90961 117362 86825 113560 124769 107297 110023 170752
6699 170752 193119 219752 273002 320340 408896 468708 516589 545291 475561 430479 372806 288843
6687B88843q7566n0010J2240j7596l8562o629R96m119m423n6891O7491m0510n0092
6674A3172L7900L4260n4966k5382N1687M6583k8592j089L5092q571n8947m6426
6662e279J5332L7250m0048K1724M787P873q474k9955J5360p186k289J4287M631
6649B8013l4101K0930M6011K6983n2910n2448M0202j5417J4918K7968L4361l1415
6637E3095j7767M9533p002M7898k4535j7032j4999J4567m2693j048K2553k5631
6625C6939r679J8965j0701m3315J3730R042k6214J349L5958J9647q2159J742k1698
6612e6394N8659N0430J1037j3307j8729j2306l4718k395R778L4865N3620k4986
6600E5554o3800j6497N469M282k7138m521K3457K1295l1756m1565j535J0479L8631
$$ plain form
6687 288843 201277 151267 163507 145911 107349 100720 101716 97597 93174 36283 103774 63264 13172
6674 13172 51072 85332 30366 4984 56671 103254 74662 73573 108665 100094 41147 -5279
6662 -5279 10053 47303 7255 28979 33766 41639 33165 3210 18570 11384 9095 23382 28013
6649 28013 -6088 14842 60853 87836 34926 -17522 22680 7263 22181 50149 84510 53095
6637 53095 35328 84861 77859 125757 101222 84190 69191 83758 41065 40017 62570 36939
6625 36939 27260 46225 35524 -7791 5939 14981 -11233 -9884 26074 45721 -36438 -34696 -56394
6612 -56394 2265 52695 63732 50425 31696 19390 -15328 -17723 -7945 26920 80540 55554
6600 55554 -8246 -24743 -19274 -14992 -42130 -46651 -23194 -1899 -33655 -75220 -76755 -66276 -27645
6587b7645M2563K7370m0762J3452R366K1197j1791J7077k6116l2229M1639K2701
6575E6822n6465l8913L0759K44q929N4279j5027N3713j7977m6624J9996o060k712
6562B3106m42J0414J5697l975l1648R572o474L1815p641K3653m3556j9880J947
6549B588J00923l5847l5188l555O904O246N532J72k6076r447O0463J8445n0515
6536D0645q54j4173N1702N2209n5717K8020l46m3514J2441l7244q984M0812m4036
6523B0961j6281M5962m7873Q683J5391M4875k1276k9776K7513n407L073l9644
6511F201J7362q535J9096J3730O314j6990J5683r990K1785j2717P3385m3932n4971
6498B6421Q367k4314l4782M8983M1196L8891k080k3802J8681M208q44m5463M5916
$$ plain form
6587 -27645 14918 42288 1526 14978 24344 45541 33750 50827 24711 -7518 34121 56822
6575 56822 357 -38556 -7797 -7553 -16482 37797 22770 76483 58506 11882 31878 25818 23106
6562 23106 22664 33078 48775 44800 13152 22724 16250 48065 40424 64077 20521 641 2588
6549 2588 103511 67664 32476 28921 35825 42071 47603 47775 21699 12252 72715 91160 40645
6536 40645 39791 25618 77320 129529 73812 101832 101486 57972 70413 33169 24185 64997 20961
6523 20961 4680 50642 2769 11452 26843 71718 50442 20666 48179 42772 45845 6201
6511 6201 23563 15028 34124 47854 54168 37178 52861 42871 64656 51939 125324 81392 26421
6498 26421 34788 10474 -24308 24675 65871 104762 102682 78880 97561 101769 100925 55462 101378
6485A01378o3676l2089R730O931K6274j4009r965L6238J3465k4904N3229k8297
6473G4305k2680q130k1038J8719L2969J1267m2569n528N3105j6737p6020P1380
6461F9043M6361J2045o356k2454p030k0718j683K5715m5629K0917L907k2554m627
6448D6937N9991m6559l6802R210m367m840m997L5306q012J438K6663j4556N0342
6435A09754j0749K418J3010k3588L0081m3866k4091q91L7335N7720p1153M1337
6423A17317O046j0015k0691K672n004K6546m2097L5829N0030Q33k0128r740k3019
6410A08579k287J9228K0766L9823j1580j3244p514p302j4792J7118J812M180l737
6397A51050R104J6728j8711L3731K8484K8042N588l7959N6836J3584j0456m4512
$$ plain form
6485 101378 37702 5613 15343 22274 48548 34539 24574 60812 74277 49373 102602 74305
6473 74305 51625 43495 22457 41176 74145 85412 42843 37315 90420 73683 -2337 69043
6461 69043 115404 127449 121093 98639 91609 70891 69208 94923 49294 70211 74118 51564 46937
6448 46937 106928 60369 23567 32777 28410 23570 18573 53879 45867 47305 73968 59412 109754
6435 109754 99005 101423 114433 90845 120926 77060 52969 52078 89413 147133 75980 117317
6423 117317 123363 113348 92657 95329 90325 116871 74774 110603 160633 161466 141338 131598 108579
6410 108579 106292 125520 146286 186109 174529 161285 153771 146469 131677 148795 150607 154787 151050
6397 151050 160154 176882 158171 191902 220386 248428 254016 216057 272893 286477 276021 231509
6385B31509l601j52m4139l4668L4994Q5151l794J4278P514m9778L4213q433j7448
6372B45646m0720J0543k6018K8979l1678l0375j3017J3341Q9278j7450k098O766
6360B33197p7642l1424O8224K4718j5933J2741k5954k9327j0875N5568O6212l7162
6348B32343n1228l046L4405J7161j340J870j8579K5731k2006M0107J3052J9757
6336B88227O166O590O156k429l3910j2155L3339j8124J0836O4853J6381l6455
6324C29475l3069O0654o622m6071n8029M5342L1583k9726j3212k3964K4883M5552
6312C26796q032m9916M841l0942J5661J1520L0017J433j3407O143j6630M8290
6300C25774O299p3695N1834K5562k4549j1281j9291J5847l1596N9123Q146O538
$$ plain form
6385 231509 227908 227756 183617 148949 183943 269094 265300 279578 287092 237314 271527 263094 245646
6372 245646 204926 215469 189451 218430 186752 156377 143360 156701 245979 228529 226431 233197
6360 233197 155555 124131 192355 217073 201140 213881 187927 158600 147725 203293 269505 232343
6348 232343 181115 178069 212474 229635 228295 230165 211586 237317 215311 255418 268470 288227
6336 288227 294393 300983 307139 304710 270800 258645 291984 273860 284696 349549 365930 329475
6324 329475 296406 357060 350438 304367 246338 291680 323263 293537 280325 256361 281244 326796
6312 326796 318764 268848 273689 242747 258408 269928 299945 301378 287971 294114 277484 325774
6300 325774 332073 258378 310212 335774 311225 299944 280653 296500 264904 324027 332173 338711
6288C38711N220j5662J8537j9022n026r834l1777k0437L6255K9930L4694k2898
6276C38691P288m3577k3488m920K1760j815K3466K2007j854M101j0740K0113j1306
6263C39726K1188k2948o017N9202l1716j4736j5491N1578R660J9093k8507k6242
6251C54790L5406k472J2927Q4923l7591k5175L3622L0245j4195K4819R749K831
6239E09879O849j0894L6365O508N5544J8587m5025L6198j7959k1193n5667L2665
6227E51857L3878l2634O712j1602Q603J640L3645K2413K5656k3784M291j9074
6215F01601l2194j7692L0075K2487p478l5111j6457N5585k4713r480L9496O290
6203F12409P3648P504n4557k3759P3166L7555K3314k7169j672P4428Q682m7283
$$ plain form
6288 338711 343931 328269 346806 327784 322758 312924 281147 260710 296965 326895 361589 338691
6276 338691 345979 302402 278914 273994 295754 293939 317405 339412 337558 341659 330919 351032 339726
6263 339726 360914 337966 331949 391151 359435 344699 329208 380786 390446 409539 381032 354790
6251 354790 390196 387724 400651 485574 447983 422808 456430 486675 472480 497299 507048 509879
6239 509879 516728 505834 542199 548707 604251 622838 577813 614011 596052 574859 519192 551857
6227 551857 585735 553101 559813 548211 556814 558454 592099 614512 640168 616384 620675 601601
6215 601601 569407 551715 581790 604277 596799 561688 545231 600816 576103 566623 606119 612409
6203 612409 686057 693561 639004 615245 688411 725966 749280 722111 720439 794867 803549 756266
6191G56266J4026J3564K6600j2397N7554j2900M282Q206K1574M0844L6329l8614
6179I15334j8852J1972l2146R47N1733K9008k5930K5853M7016k362K066N3961
6167A058600p1169K6374K7760L4370j451M9541N1560k633K2531R5440k8087n4198
6155A208638J2320Q8372J4322M0880L1420L766J5007l46N0136L7529L7464M9499
6143A589007L1860J4405Q8479L9258M9711O7963N1728K2962J16741P8428Q6858
6132B237400K3330R9621O8558J40852Q4970L6750J03533R2516J09549M6310K5304
6121C068693j852N6206n0646J6383j0065o7338j4883N5563L7801O3534L0242K5421
6109C209059P9861O3929J16119J49899J28129J32219O9709R2426J58912Q0991
$$ plain form
6191 756266 770292 783856 810456 798059 855613 842713 846995 855201 876775 917619 953948 915334
6179 915334 896482 908454 876308 877255 928988 957996 932066 957919 1004935 1002573 1004639 1058600
6167 1058600 987431 1013805 1041565 1075935 1074484 1124025 1175585 1172952 1195483 1290923 1262836 1208638
6155 1208638 1220958 1309330 1323652 1364532 1395952 1399718 1414725 1414379 1464515 1502044 1539508 1589007
6143 1589007 1620867 1635272 1723751 1763009 1812720 1880683 1932411 1955373 2072114 2150542 2237400
6132 2237400 2260730 2360351 2428909 2569761 2654731 2691481 2795014 2887530 2997079 3043389 3068693
6121 3068693 3066841 3123047 3072401 3088784 3078719 3011381 2996498 3052061 3089862 3153396 3183638 3209059
6109 3209059 3288920 3352849 3468968 3618867 3746996 3879215 3948924 4041350 4200262 4281253
6099D281253L0899l0390J9999Q2495J8348p1349l6483J4146Q6852j1743K4966
6088D408993L5425Q038J18587J15734Q6237Q6761J18576J57297J38080J60593
6078E434321J83491J87103K56329K75261L17048L52889M06261M63842N95436O79935
6068I151916Q01280R93904J254705J619576K183040L021190L880728L714375J759094
6059B8379808r47879k597943k672915k001259j167819m65199K58172J014019J995051
6050B1794036K992928L093103J337968j455937l350725l690743l012923k289469
6042A5418238j720030j259191j002455p84074o67042n26655l63851k41738k00123
6033H653079j55227j12535j5462K2284J4055L4089M7656P2108K41816K97933K06469
$$ plain form
6099 4281253 4312152 4281762 4301761 4384256 4402604 4331255 4294772 4308918 4395770 4384027 4408993
6088 4408993 4444418 4452456 4571043 4686777 4773014 4859775 4978351 5135648 5273728 5434321
6078 5434321 5617812 5804915 6061244 6336505 6653553 7006442 7412703 7876545 8471981 9151916
6068 9151916 9953196 10947100 12201805 13821381 16004421 19025611 22906339 26620714 28379808
6059 28379808 27431929 24833986 22161071 20159812 18991993 18526794 18784966 19798985 21794036
6050 21794036 24786964 27880067 29218035 27762098 24411373 20720630 17707707 15418238
6042 15418238 13698208 12439017 11436562 10652488 9985446 9458791 9094940 8853202 8653079
6033 8653079 8497852 8385317 8369855 8392139 8406194 8440283 8487939 8560047 8801863 9099796 9306265
6022I306265L73598L81709N37944O61737P29706R35661J135814J416290J804295
6013A7283019K454290L421654M602112N166450L758841L99833k743435l824232
6005C0518532l184511k195186j212169j58396O75616J846114L268342M216159
5997C3774501L054880j98114l566023m967262m608590l677062k766744k146583
5989A4899003j700240j376862j039224q83711o98403n91373n17704l91719l08411
5980G391356l10319k62235j97818k12894k34847j72563j17087j90288j05188j45491
5970E442626j15900o1271k0768j06368r5857J4014j1496J3059j3489m5936L7495
5959E036109L9442N9319J23358O8659J21789J28936J11585J21239Q0197K7419
$$ plain form
6022 9306265 9679863 10061572 10599516 11261253 11990959 12926620 14062434 15478724 17283019
6013 17283019 19737309 23158963 27761075 32927525 36686366 37086199 34342764 30518532
6005 30518532 27334021 25138835 23926666 23768270 24443886 26290000 29558342 33774501
5997 33774501 36829381 36631267 33065244 28097982 23489392 19812330 17045586 14899003
5989 14899003 13198763 11821901 10782677 9898966 9200563 8609190 8091486 7699767 7391356
5980 7391356 7081037 6818802 6620984 6408090 6173243 6000680 5883593 5693305 5588117 5442626
5970 5442626 5326726 5265455 5244687 5138319 5042462 5056476 5044980 5058039 5044550 4998614 5036109
5959 5036109 5075551 5134870 5258228 5326887 5448676 5577612 5689197 5810436 5890633 5918052
5949E918052l2692q3708j10076r5492o0914j04948n2486p7661q1402l1511p3300
5938E113862m4196N2255N8016M4246K6885R2947P8857J18108J68857K35669J65113
5927F110619J26282R7177L2194n0888j04473j08028q3800r7159j23501j08331
5917E690092j59935j27862q9263r4004j32870o0700k0107j17085r7810m3652K750
5906D749554k1940K095k18L1162N5173j1420o011K7364P1689M8251L776N745k869
5893D952351j2216M3894L2626k2859n7909q1090m2755L750M337m6218n2963K9737
5881D750685R3577O2680J67q82P5193P3787j3147l7742r2749k3534P9651M6183
5869E013869M744P0391J07773j559Q528J02990Q4226M0429O3964j753N4627K22
$$ plain form
5949 5918052 5885360 5801652 5691576 5596084 5535170 5430222 5377736 5300075 5218673 5187162 5113862
5938 5113862 5069666 5121921 5179937 5224183 5251068 5344015 5422872 5540980 5709837 5945506 6110619
5927 6110619 6236901 6334078 6366272 6315384 6210911 6102883 6019083 5921924 5798423 5690092
5917 5690092 5530157 5402295 5313032 5219028 5086158 5025458 5005351 4888266 4790456 4746804 4749554
5906 4749554 4727614 4729709 4729491 4760653 4815826 4804406 4798395 4825759 4897448 4945699 4949475 4955220 4952351
5893 4952351 4940135 4984029 5016655 4993796 4935887 4854797 4812042 4815792 4820129 4773911 4720948 4750685
5881 4750685 4844262 4906942 4907109 4906227 4981420 5055207 5042060 5004318 4911569 4888035 4967686 5013869
5869 5013869 5018613 5089004 5196777 5195218 5203746 5306736 5390962 5431391 5495355 5493602 5548229 5548451
5857E548451J8416R8520J83707J86637Q0468J21914P5398J65610K37328J59472
5847F875921K79794K72418J99732J59932K16980J78599J67605J68396K7790O239
5837H553406o3634j03569r9953m42q4179J8677K5924K5563O7765R4030J13911
5826H547499J26825R8054L6442K18J0513O9912J09941J53080K28025J63559K01198
5815I745266K16281L01486L43498M62026N27335N51160O68471O64130P05713P11057
5805A4896423P71750P49025P24044Q06236P68325Q80999N90121K51182j04257
5796B0333848o00905p99914p90276o13161n19321k64579p8126J96401M11141L73853
5786A7648961J36869k20736n30982o98798o14926m45809l32603j84706j28873
$$ plain form
5857 5548451 5566867 5665387 5849094 6035731 6116199 6238113 6313511 6479121 6716449 6875921
5847 6875921 7155715 7428133 7627865 7787797 8004777 8183376 8350981 8519377 8547167 8553406
5837 8553406 8489772 8386203 8286250 8285808 8201629 8220306 8246230 8271793 8339558 8433588 8547499
5826 8547499 8674324 8772378 8808820 8809038 8819551 8889463 8999404 9152484 9380509 9544068 9745266
5815 9745266 9961547 10263033 10606531 11068557 11595892 12147052 12815523 13479653 14185366 14896423
5805 14896423 15668173 16417198 17141242 17947478 18715803 19596802 20186923 20438105 20333848
5796 20333848 19732943 18933029 18142753 17529592 17010271 16745692 16667566 16863967 17275108 17648961
5786 17648961 17785830 17565094 17034112 16335314 15720388 15274579 14941976 14757270 14628397
5777A4628397k8283j63879j43160j29672j24434j78006j70125o6503q0735K8443
5767A3572043K03242L84846O74784Q57191P93497K55422o52593j208843j283659
5758A3595930j092371q92429o48843n26936l99440k94989j98384j45889j35725
5749I260924q9849M1386Q8759P5879J61528J74406K60846K93563K08380L54547
5739A0830369L60514M44905N62069O54370P59171R26838J096751J283111J629463
5730A8547561K143173L025223M152389M834686L518018N6726l228849m391976
5722B8656951l901969l015020k252346j560605j139302r27367o16916m09357k89892
5713A4544177j65392k6038K02495L27340M53744O07682Q17625R20697J167043
$$ plain form
5777 14628397 14600114 14436235 14293075 14163403 14038969 13860963 13690838 13624335 13543600 13572043
5767 13572043 13775285 14160131 14834915 15692106 16485603 16741025 16088432 14879589 13595930
5758 13595930 12503559 11611130 10962287 10435351 10035911 9740922 9542538 9396649 9260924
5749 9260924 9171075 9212461 9301220 9377099 9538627 9713033 9973879 10267442 10475822 10830369
5739 10830369 11190883 11635788 12197857 12852227 13611398 14538236 15634987 16918098 18547561
5730 18547561 20690734 23715957 27868346 32703032 36221050 36277776 33048927 28656951
5722 28656951 24754982 21739962 19487616 17927011 16787709 15860342 15243426 14834069 14544177
5713 14544177 14378785 14352747 14555242 14882582 15336326 15944008 16761633 17682330 18849373
5704A8849373J585243K185177L225844M515793M918538L013930q46582m068909
5696C3378407m925306m183656l261027k412555j775348j334472j083092p43610
5688A3659341n50232m41799k52388o8563P5271J40085L60659N69864Q10213J127060
5678A5429511J660333K555985L355737L204872J405441j430701l188001l273356
5670A9719821k660315k008519j471024j130062q63084o16209m94983l51503k68851
5661I855271j69245o1082J9006J96081K72500L78472O05495P57667J008316J356085
5651A4218566K058281L000893L784594L463168R96529k036616l819871l658389
5643A8007155k840626k117399j640908j296135j000244q26345o64001n17286n22760
$$ plain form
5704 18849373 20434616 22619793 25845637 30361430 35279968 38293898 37447316 33378407
5696 33378407 28453101 24269445 21008418 18595863 16820515 15486043 14402951 13659341
5688 13659341 13109109 12667310 12414922 12346359 12421630 12561715 12922374 13492238 14302451 15429511
5678 15429511 17089844 19645829 23001566 26206438 27611879 26181178 22993177 19719821
5670 19719821 17059506 15050987 13579963 12449901 11586817 10970608 10475625 10124122 9855271
5661 9855271 9686026 9624944 9643950 9840031 10112531 10491003 11096498 11854165 12862481 14218566
5651 14218566 16276847 19277740 23062334 26525502 27522031 25485415 21665544 18007155
5643 18007155 15166529 13049130 11408222 10112087 9111843 8285498 7621497 7104211 6581451
5634F581451l93709l07118k93578k68261k34088j71373j36679j68343j39932j15833
5624D352537j08403j05268q3876k3575j29063k0063p0635o4238O410l5080p9165
5613C639581J8039M4239L1585L6687J2396J4679p4088j39828m4538n9830r8072
5602C380850o7949p7941R443p6219l2850j0995q6130N5054J2403M7382N9532J7441
5590C230021J21627J42861J18190L6247R0402R4410Q9315k9136j8759l4031j26151
5579C714996m6794j14879j22317o5207J6029k1614N4328R1935J34946R6360J0149
5568C747932l484Q610j3884q0312n653N1836L9204k4840J5802m195r3941p0070
5556C567005p7679j11140j25669q7871p5765q0017q4557q368j7909J9074M749
$$ plain form
5634 6581451 6187742 5880624 5587046 5318785 5084697 4913324 4776645 4608302 4468370 4352537
5624 4352537 4244134 4138866 4054990 4031415 3902352 3882289 3811654 3747416 3753826 3718746 3639581
5613 3639581 3657620 3701859 3733444 3770131 3782527 3797206 3723118 3583290 3538752 3478922 3380850
5602 3380850 3312901 3234960 3244403 3168184 3135334 3124339 3038209 3093263 3105666 3153048 3212580 3230021
5590 3230021 3351648 3494509 3612699 3648946 3739348 3833758 3923073 3893937 3875178 3841147 3714996
5579 3714996 3668202 3553323 3431006 3365799 3381828 3360214 3414542 3506477 3641423 3737783 3747932
5568 3747932 3744448 3753058 3739174 3658862 3653209 3705045 3744249 3719409 3735211 3731016 3637075 3567005
5556 3567005 3489326 3378186 3252517 3164646 3088881 3008864 2924307 2915939 2898030 2917104 2921853
5545B921853J26803J19670Q4083J75591L4282L275L8401N6934l501p1505r5270
5534C390616p6463j25999r8984j9111j8821l9596q290j7966q394j4472N0558N3228
5522C066306M6176O1442P7749K3984o974J2753o5107j18224r3564o7185k2546
5511B914810m7729p2592r5088j5128K2384L353k3148J3428P731k4318M842K5467
5499B714012k3007M1218N2930k5850K3773O2524R1889Q5699O0997K8320o41m7478
5487C064386j36751j83113j47934p0025q3010j60345M730N431k3299j4942K310
5476B257438P9679N668l3686J2710p9200j13038j08602n5876l5480o2914l0740
5465A835959m6369n1828J7988l6281n848J9914N842L8450M3237m2664J2601M8678
$$ plain form
5545 2921853 3048656 3168326 3252409 3428000 3462282 3465557 3503958 3560892 3557391 3485886 3390616
5534 3390616 3314153 3188154 3089170 3070059 3051238 3011642 3003352 2985386 2976992 2962520 3013078 3066306
5522 3066306 3112482 3173924 3251673 3275657 3268683 3281436 3216329 3098105 3004541 2937356 2914810
5511 2914810 2867081 2794489 2699401 2684273 2706657 2710010 2686862 2700290 2708021 2683703 2688545 2714012
5499 2714012 2691005 2732223 2785153 2759303 2783076 2845600 2937489 3023188 3084185 3112505 3111864 3064386
5487 3064386 2927635 2744522 2596588 2526563 2443553 2283208 2287938 2293369 2270070 2255128 2257438
5476 2257438 2337117 2342785 2309099 2321809 2242609 2129571 2020969 1965093 1929613 1866699 1835959
5465 1835959 1789590 1737762 1755750 1719469 1713621 1733535 1739377 1777827 1821064 1778400 1791001 1839679
5453A839679M5518K1481Q1660J1822J5720p144r977k1739n665J5491K3115K6758
5441B036719K9850L4415J6591Q8787o811n4484p4990o9961k0479j1246K3730N1682
5429B043803P4457J03399Q4980Q0008J24351P1058p4616o5008q3953j04777m8265
5418B205437l0431m6504l6543o0990j8376J5017m0144p5272P4691K7211N3811
5407B067907j7745O984L1616O3764N9778O2784J7557j5952k8189j1641j5697r692
5395B211474K8042j3243N007L2206L4718J8380J590n7005m6449m4987j4153O7655
5383B223235J9943J2825O3990L4053m0627K4866J03049k846J140M7503M4504N860
5371B537495O0798Q2167R7323Q8666J57522J53733K10083J72495K0628j0327J1139
$$ plain form
5453 1839679 1885197 1906678 1988338 2000160 2015880 2008736 1998759 1977020 1971355 1986846 2009961 2036719
5441 2036719 2066569 2100984 2117575 2206362 2199551 2145067 2070077 2000116 1979637 1968391 1992121 2043803
5429 2043803 2118260 2221659 2306639 2386647 2510998 2582056 2507440 2442432 2358479 2253702 2205437
5418 2205437 2175006 2128502 2091959 2030969 2012593 2027610 1987466 1912194 1986885 2014096 2067907
5407 2067907 2050162 2057146 2088762 2152526 2212304 2275088 2292645 2276693 2248504 2236863 2221166 2211474
5395 2211474 2239516 2226273 2231280 2263486 2298204 2316584 2318174 2261169 2214720 2169733 2155580 2223235
5383 2223235 2243178 2256003 2319993 2354046 2313419 2338285 2441334 2438488 2439628 2487131 2531635 2537495
5371 2537495 2598293 2680460 2777783 2866449 3023971 3177704 3387787 3560282 3580910 3570583 3581722
5360C581722l7656P5773J5083r341R9236J23269J15933J73687L10443K77702K34474
5349D960325K46854L82334M45465M87494L37109K28990K4501j68368k88567j38440
5339F517697k09710k18913k00619r7674j5156O4647M8308P183N6570K2244P4224
5328F048801P9260N7983m254k6216j33696j41985j03699n61m7701N2779K8941
5317E809652L8683k0686p7086k37884l38947k88320k04456j36801r8937k28094
5307D217124k34379j55863j01215j00018l1502n4349m5789r430N2116J94191K14666
5296C945552K25773O7295p1523n7196j4655m2729o9781p2746r5351r1802l9882
5285C682955n1806J7162J8571n131q3876n5428J4515l1068m6043L1799J20606
$$ plain form
5360 3581722 3544066 3619839 3634922 3625581 3724817 3848086 3964019 4137706 4448149 4725851 4960325
5349 4960325 5207179 5589513 6034978 6522472 6859581 7088571 7113072 6944704 6656137 6517697
5339 6517697 6307987 6089074 5888455 5790781 5775625 5840272 5888580 5895763 5952333 5974577 6048801
5328 6048801 6128061 6186044 6181790 6155574 6021878 5879893 5776194 5775633 5727932 5780711 5809652
5317 5809652 5848335 5827649 5750563 5512679 5173732 4885412 4680956 4544155 4445218 4217124
5307 4217124 3982745 3826882 3725667 3625649 3594147 3539798 3494009 3484579 3536695 3730886 3945552
5296 3945552 4171325 4238620 4167097 4109901 4095246 4052517 3982736 3909990 3814639 3722837 3682955
5285 3682955 3631149 3648311 3666882 3661751 3577875 3522447 3536962 3505894 3459851 3491650 3612256
5274C612256J17087R6390R6328L0551j3895j09242j14485q4746J5860Q2443R811
5263C738358k6466K1963L2098M6637J14043j1039m4278L8095J8473L0116k6554
5252C931446n954Q4380P4533O2366P788q1956j20351j34356j30698o5645q8750
5241C532803j36761k3623j4426q0307L5188K3033P0703Q0286J5137J00409Q6940
5230C689382N5382J31011N0336K4168Q5428j4680k9002l5487q9503o0847k7159
5219C779029j8280n1916k5119P562J522L1613r672L6885J5101O8316L7877K8624
5207C901542P6096O5461J28914Q3820J63936J00284M8613L5075J5603m052n2141
5196D563151p3907o1421l5777j6027p2618K4095J22948m550J0036L4701M9465
$$ plain form
5274 3612256 3729343 3825733 3922061 3952612 3938717 3829475 3714990 3630244 3646104 3728547 3738358
5263 3738358 3711892 3733855 3765953 3812590 3926633 3915594 3871316 3909411 3927884 3958000 3931446
5252 3931446 3925492 4009872 4084405 4146771 4154559 4072603 3952252 3817896 3687198 3621553 3532803
5241 3532803 3396042 3372419 3357993 3277686 3312874 3335907 3406610 3486896 3502033 3602442 3689382
5230 3689382 3744764 3875775 3926111 3950279 4035707 4021027 3992025 3956538 3867035 3806188 3779029
5219 3779029 3760749 3708833 3683714 3691276 3692798 3724411 3714739 3751624 3766725 3835041 3872918 3901542
5207 3901542 3977638 4043099 4172013 4255833 4419769 4520053 4568666 4603741 4619344 4615292 4563151
5196 4563151 4489244 4427823 4392046 4376019 4303401 4327496 4450444 4445894 4455930 4490631 4540096
5185D540096N3266K5356Q8893Q9045N9818J13432J12364O9997J22400J41851Q0984
5174E497502J09123N1031m5090q3301l5776N8003p113K5493J10002L1671N6589
5163E768134O0922J04577O6740Q3519K32431J78449J52469K03128K08229K68223
5153G326821K26928K19764K92369K92213L47699M64992N04596N36072O29688Q45781
5143A1686923J081172J364248J011397J75112m44444m07927j79719J03201M28554
5134A4818517O47228J039730J532667K145220K418610J812809K56395r65087q96961
5125B2809128k71489M53488R93998Q62281J88539m1299M56687J070267J282280
5116B7803880R08679O52564N20634M16917P62315J290741P60538q34185j837136
$$ plain form
5185 4540096 4593362 4618718 4707611 4796656 4856474 4969906 5082270 5152267 5274667 5416518 5497502
5174 5497502 5606625 5657656 5612566 5529265 5493489 5551492 5544379 5569872 5679874 5711545 5768134
5163 5768134 5829056 5933633 6000373 6083892 6316323 6494772 6647241 6850369 7058598 7326821
5153 7326821 7553749 7773513 8065882 8358095 8705794 9170786 9675382 10211454 10841142 11686923
5143 11686923 12768095 14132343 15143740 15318852 14874408 14466481 14286762 14389963 14818517
5134 14818517 15465745 16505475 18038142 20183362 22601972 24414781 24671176 23706089 22809128
5125 22809128 22537639 22991127 23985125 24847406 25035945 24994646 25451333 26521600 27803880
5116 27803880 28712559 29365123 29885757 30302674 31064989 32355730 33116268 32282083 30444947
5107C0444947j536452p49760K16613J222034J795561J262180P4704k68530R4613
5098C2555910L27598r6258l04215n36607j162488j085412l57929L91241N47254
5089C0279094L41271M15635J118311K069840K858946K712913Q91826k065964l856191
5080C4765681l857864l143929k298608j551290r14180l43603K03768O03609P26288
5071B4189872K01701o56328j019341q22303l44910J68353R00762J464023J574184
5062B5656013J108217N01513J95905M6012m07565j051670j298588j156360r51346
5053B2642131o63708l79985l37579m79262n20628l43639j38772n9342p1611J77914
5043A9825519M94480Q05351J171216J678245K407716K885915K330828R23173M05868
$$ plain form
5107 30444947 28908495 28158735 28375348 29597382 31392943 32655123 32729827 32461297 32555910
5098 32555910 32883508 32787250 32483035 31946428 30783940 29698528 29340599 29731840 30279094
5089 30279094 30620365 31036000 32154311 34224151 37083097 39796010 40687836 38621872 34765681
5080 34765681 30907817 27763888 25465280 23913990 22999810 22656207 22859975 23463584 24189872
5071 24189872 24391573 23735245 22715904 21893601 21548691 21717044 22617806 24081829 25656013
5062 25656013 26764230 27265743 27461648 27507660 27100095 26048425 24749837 23593477 22642131
5053 22642131 21978423 21598438 21260859 20781597 20260969 19917330 19778558 19719216 19647605 19825519
5043 19825519 20319999 21125350 22296566 23974811 26382527 29268442 31599270 32522443 32928311
5034C2928311R27259J194768N86340j99385n17134q76457j124348r28047j042152
5025C0949155r07762l05098M84219J220660J392070Q42173N95876J319793J502774
5016C7093860R97327K92276n11812l94054Q52289K676804M877520N904146L858658
5007E5647014m41878k977625k680495o00370J200083J235918o63745l628630n741467
4998D1348805n396236l998446k858240j875022r86262j17052N44030O75276P0964
4989B7407817j014494j753119j458534p81117L1882P25662Q50275J69031o38219
4980B3539184j099862j020128n44217j16113j09264n43197j277934j662786j343660
4971A5822023j057294p33869l72966K868K42838N82419N71964j81469j036955
$$ plain form
5034 32928311 33855570 35050338 35636678 35437293 34920159 34043702 32919354 31991307 30949155
5025 30949155 30041393 29736295 30220514 31441174 32833244 33675417 34271293 35591086 37093860
5016 37093860 38091187 38383463 37871651 37477597 38329886 41006690 45884210 51788356 55647014
5007 55647014 55205136 52227511 49547016 48946646 50146729 51382647 50718902 47090272 41348805
4998 41348805 35952569 31954123 29095883 27220861 26234599 26117547 26661577 27336853 27407817
4989 27407817 26393323 24640204 23181670 22400553 22432435 23158097 24008372 24177403 23539184
4980 23539184 22439322 21419194 20874977 20758864 20649600 20106403 18828469 17165683 15822023
4971 15822023 14764729 14030860 13657894 13660762 13903600 14486019 15057983 14876514 13839559
4962A3839559j158319r51757p58314n73972m32947k41972k04256j70742k38932
4953I108348k21704j80862j10773j53585j69828k30517j95464j44563j13968j40291
4943G446793j59235n3423p2175L774k5926K9954N9540j758r4390N6204M1397J5714
4931G246469l5368j16071p9427q6854r621K4714P2263K4099P0152L4609Q4863
4920G229828N1492R7254N2056J31312R2403J43160K18429J41202K49249K56867
4910H663252L58136L89824N24328O16765P82234J085074J392627J838666K061039
4901A7711945J876338J856636J984254J073430q31509k435724k932892k519861
4893A5782617j903962j428430r65180p59981n96857m60601k83797k09816k07512
$$ plain form
4962 13839559 12681240 11729483 10971169 10397197 9964250 9722278 9518022 9347280 9108348
4953 9108348 8886644 8705782 8595009 8441424 8271596 8041079 7845615 7701052 7587084 7446793
4943 7446793 7287558 7234135 7161960 7165734 7139808 7169762 7229302 7227544 7133154 7189358 7230755 7246469
4931 7246469 7211101 7095030 7015603 6928749 6919128 6943842 7016105 7040204 7110356 7144965 7229828
4920 7229828 7281320 7378574 7430630 7561942 7654345 7797505 8015934 8157136 8406385 8663252
4910 8663252 9021388 9411212 9935540 10552305 11334539 12419613 13812240 15650906 17711945
4901 17711945 19588283 21444919 23429173 24502603 23671094 21235370 18302478 15782617
4893 15782617 13878655 12450225 11485045 10725064 10128207 9667606 9383809 9173993 8966481
4884H966481j23392k2721k0490M2730K6117J04250O9930J09343K02124K60175
4874I614547L10848L89920P46816R35254Q29464M48628O7641M8051L79495O66528
4864A4437192J083864J628343K360842L356183L808626L029239K02148k917437
4856B6989000l620636k609540j703351q76453l39758j95337q5853O2225L24566
4847A7944863R66854K101212L111651K939879N12210k379329l332952k970741
4839A8893647k378341j695779j260434q75460n11258l39765l46088n05831o68886
4830A0311805n73813n05564l35460k39444j85473p8480j11447j30413o764m113
4820H140834J9732l5659L0458n421O8680R9725J33669J39329J58540K99276L76444
$$ plain form
4884 8966481 8843089 8820368 8799878 8842608 8868725 8972975 9042905 9152248 9354372 9614547
4874 9614547 9925395 10315315 11062131 11997385 12826849 13275477 13343118 13391169 13770664 14437192
4864 14437192 15521056 17149399 19510241 22866424 26675050 29704289 29906437 26989000
4856 26989000 23368364 20758824 19055473 18179020 17839262 17643925 17558072 17620297 17944863
4847 17944863 18911717 21012929 24124580 27064459 27576669 25197340 21864388 18893647
4839 18893647 16515306 14819527 13559093 12683633 12172375 11832610 11486522 10980691 10311805
4830 10311805 9737992 9232428 8896968 8657524 8472051 8393571 8282124 8151711 8144947 8140834
4820 8140834 8160566 8124907 8155365 8149944 8218624 8318349 8452018 8591347 8749887 9049163 9425607
4809I425607L85136O46586Q71574J184896J212127N98521j49093l89710m77934
4800A3307710m76430l74948k20763n916J82883L86247N38125Q21741J149257J640928
4790A6948834K291162K456974J311835l39001n72535K14142Q49477M67403p63936
4781B2864355j485683j364614p41808k75892K43606P69401J432661J895749J886185
4772B5223960J287539Q71681R58810K027953L144822K401521l91224k614036k392200
4763C0518826j253453n80313o48101q43099q33471j190735j248353p39424K1983
4754B3203860N46838P22835K82585J28200N14617L93006J31731N67354Q63962
4745B7354988k12022j696936j900276j283467p46875l46533N1376L45187P17600
$$ plain form
4809 9425607 9810743 10457329 11328903 12513799 13725926 14324447 14175354 13785644 13307710
4800 13307710 12831280 12456332 12235569 12229653 12412536 12798783 13336908 14158649 15307906 16948834
4790 16948834 19239996 21696970 23008805 22669804 22097269 22311411 23160888 23628291 22864355
4781 22864355 21378672 20014058 19272250 18996358 19239964 20009365 21442026 23337775 25223960
4772 25223960 26511499 27383180 28341990 30369943 33514765 35916286 35525062 32911026 30518826
4763 30518826 29265373 28685060 28036959 27193860 26360389 25169654 23921301 23181877 23203860
4754 23203860 23750698 24473533 24756118 24884318 25398935 25791941 25923672 26491026 27354988
4745 27354988 27142966 25446030 23545754 22262287 21515412 21168879 21220255 21565442 22283042
4736B2283042J090915J532315K248925L233682M846562O416239O228558L666109
4728E1546347J8412l531602n845228n645633m233940k893180j816315j013550
4720B6585311l92098K11900R28184J845614L162837M252303L640801K76498l155794
4711C7355556m087169l366494k477202j675788j061330o38702k11781K18612M57014
4702B4512716P85968J272515J723808K433584L428960M840907O251739O333502
4694E1583699M694784K764176R98935k722257o316901o681899n352234l955438
4686C5012865k717200j784035r54616l34571K12796R07233J575354K314833L523582
4677C7756241N365007P888609R681605Q841885M963646q22635p180997j0684417
$$ plain form
4736 22283042 23373957 24906272 27155197 30388879 35235441 41651680 47880238 51546347
4728 51546347 51564759 48033157 42187929 36542296 32308356 29415176 27598861 26585311
4720 26585311 26193213 26405113 27333297 29178911 32341748 36594051 40234852 40511350 37355556
4711 37355556 33268387 29901893 27424691 25748903 24687573 24048871 23837090 24055702 24512716
4702 24512716 25298684 26571199 28295007 30728591 34157551 38998458 45250197 51583699
4694 51583699 56278483 59042659 60041594 57319337 51002436 44320537 38968303 35012865
4686 35012865 32295665 30511630 29557014 29222443 29435239 30342472 31917826 34232659 37756241
4677 37756241 43121248 51009857 60691462 69533347 74496993 73674358 66493361 55808944
4669E5808944r982608p700203n821511m444767l317346k617224k233625j777136
4661A7914524j442599j148158r58227q42293p25663o09288n33902m44264l74233
4652A0835897l77034l21149k80075k68506k85726j52158j89608k05768j10277
4643H645596j01384j01893j41267o6205l5482o0769k17603j46530q1211q8348
4633G604904M5647L1029q6686j30384j30774j32030j04289j58176l5106J7573
4623F921708k5255N7476Q7808O4121Q6183P1427J33592J27194J62338Q1450p558
4612G760484o1808N428L9170J0487m5595m7414L6195J2131n1248r2590j78817
4601G386423n3573j1651L9957J02742J72061P7669J23210O7556Q8281J19266J14130
$$ plain form
4669 55808944 45826336 38126133 32304622 27859855 24542509 21925285 19691660 17914524
4661 17914524 16471925 15323767 14365540 13523247 12797584 12188296 11654394 11210130 10835897
4652 10835897 10458863 10137714 9857639 9589133 9303407 9151249 8961641 8755873 8645596
4643 8645596 8544212 8442319 8301052 8234847 8199365 8138596 7920993 7774463 7693252 7604904
4633 7604904 7650551 7681580 7594894 7464510 7333736 7201706 7097417 6939241 6904135 6921708
4623 6921708 6896453 6953929 7041737 7105858 7192041 7263468 7397060 7524254 7686592 7768042 7760484
4612 7760484 7698676 7704104 7743274 7753761 7708166 7660752 7696947 7709078 7657830 7565240 7386423
4601 7386423 7332850 7321199 7361156 7463898 7635959 7713628 7836838 7904394 7992675 8111941 8226071
4590H226071N6639K7822Q7408J53582K60802J94606J11527J85859J44360J5221
4580I463897o1875k1758N5515R8867K74934K82776K64011K02384K19889K17016
4570A0995656K81231K86137L25175L80058N50718O37798P48744Q71862Q18041
4561A5895420R19653J139510J580097J992122K776603L831207N098100N565567
4553C8798279L837612L53360k749687l675014l013517j890941q56314R1980J110811
4544C2006569K390276L726151M249105K599196p86420l557543m016503l074989
4536C3535842j780545l89211J010316K432110K986748J744145q05561k991885
4528C5741959l461966k829734j876164r21797k65106M92266J365071K361997K685010
$$ plain form
4590 8226071 8282710 8310532 8397940 8551522 8812324 9006930 9118457 9304316 9448676 9463897
4580 9463897 9402022 9380264 9435779 9534646 9809580 10092356 10356367 10558751 10778640 10995656
4570 10995656 11276887 11563024 11888199 12268257 12818975 13456773 14205517 15077379 15895420
4561 15895420 16815073 17954583 19534680 21526802 24303405 28134612 33232712 38798279
4553 38798279 42635891 42989251 40239564 36564550 33551033 31660092 30803778 30895758 32006569
4544 32006569 34396845 38122996 42372101 44971297 44184877 40627334 36610831 33535842
4536 33535842 31755297 31366086 32376402 34808512 37795260 39539405 38733844 35741959
4528 35741959 32279993 29450259 27574095 26652298 26387192 26879458 28244529 30606526 33291536
4519C3291536J229088j501943l545487l935156l322042k513856j977317j539540
4511A6185283j218080j052124p75149o69853o06995m35629m00690l30391k97596
4502A0398776k47700l09841l01387k51060k03161k50710j85831j07144m3918m1913
4492H456111q7459l5201r0372j64071o1618j4656R850l318l3412N1250R6014M7615
4480H170733J36987J34879J62265K56988K45198K83113L01850L79541M50018N81228
4470A1102800O37247P92651R34651J158374J459528J904956K797958L746266L839468
4461B8373899K222880m73863k441545k586732j554199o78473M13224J802238L093764
4452B8171193L553293J180234k562901l947215l091543k118158j210673n44311
$$ plain form
4519 33291536 34520624 33018681 29473194 25538038 22215996 19702140 17724823 16185283
4511 16185283 14967203 13915079 13139930 12470077 11863082 11427453 11026763 10696372 10398776
4502 10398776 10151076 9841235 9539848 9288788 9085627 8834917 8649086 8541942 8498024 8456111
4492 8456111 8368652 8333451 8243079 8079008 8017390 8002734 8012584 8009266 7975854 8027104 8123118 8170733
4480 8170733 8307720 8442599 8604864 8861852 9107050 9390163 9692013 10071554 10521572 11102800
4470 11102800 11740047 12532698 13467349 14625723 16085251 17990207 20788165 24534431 28373899
4461 28373899 30596779 30122916 27681371 25094639 23540440 22861967 23275191 25077429 28171193
4452 28171193 31724486 32904720 30341819 26394604 23303061 21184903 19974230 19429919
4444A9429919J12049P90988J768020K418024K264106J007832m32190j275601j623364
4435B4459783j471232p87673L66045J452350K309660J746841l87969k635666l365730
4426B1686409k929892k375023j784602j312481j098839j001482r01554p17230
4418I565306m91509m58916l52547k48099k53688j58723r2655j03207k06223k41837
4408F957902k18243j13052j05346j19990R522J35689R5068L3956j24740j75429
4398F375337k91221l02920k59559j44891r2178j9394O1167J75905J03617P1046
4388E676909r7306k30615k44772j94546j89161j16440l7962L3879l3312j04685
4378D461989q5511j98583j84848p7228o6787m1123L2594l9419Q1224J30454N2291
$$ plain form
4444 19429919 19541968 20332956 22100976 24519000 26783106 27790938 27358748 26083147 24459783
4435 24459783 22988551 22200878 22566923 24019273 26328933 28075774 27687805 25052139 21686409
4426 21686409 18756517 16381494 14596892 13284411 12185572 11184090 10282536 9565306
4418 9565306 9073797 8614881 8262334 8014235 7760547 7601824 7509169 7405962 7199739 6957902
4408 6957902 6739659 6626607 6521261 6401271 6410793 6546482 6641550 6675506 6550766 6375337
4398 6375337 6084116 5781196 5521637 5376746 5284568 5265174 5326341 5502246 5605863 5676909
4388 5676909 5579603 5348988 5104216 4909670 4720509 4604069 4566107 4599986 4566674 4461989
4378 4461989 4376478 4177895 3993047 3915819 3849032 3807909 3840503 3801084 3882308 4012762 4065053
4367D065053J4076n8516q7436r1576k0782J6129Q220J07238N6788l2769j14084
4356C862341o6036k3411n7090m9850l6575J00m6539p0666p9289m0914j193J7752
4344C408630K507J4264n0990K4260J7199K957n9518k8408k9157n7423k4205k9094
4332C191022L1545k3825K6910n1558o3444j0494L7862R480L0800N120m4843M8582
4320C187157l2569n2757q441n8116J9880L7557J02788j3256k1300k8725j2489
4309C119729j9768L0779m2302l559K0370p40p617J0068L6389Q1482L6450k2391
4297C238890K2616K3136P3422J13480R3366J26042O4531O2231K3778p8849j03498
4286C659145j8877l8896n4481l4934m175M4319N1895J8366J0158J3941O5813O2104
$$ plain form
4367 4065053 4079129 4020613 3933177 3841601 3820819 3836948 3845168 3952406 4009194 3976425 3862341
4356 3862341 3796305 3772894 3715804 3665954 3629379 3629479 3582940 3512274 3432985 3392071 3390878 3408630
4344 3408630 3411137 3425401 3374411 3398671 3415870 3418827 3359309 3330901 3301744 3244321 3220116 3191022
4332 3191022 3222567 3198742 3225652 3174094 3110650 3100156 3138018 3147498 3178298 3183418 3138575 3187157
4320 3187157 3154588 3101831 3093390 3035274 3055154 3092711 3195499 3182243 3160943 3132218 3119729
4309 3119729 3099961 3130740 3088438 3084879 3105249 3104509 3096892 3106960 3143349 3224831 3261281 3238890
4297 3238890 3261506 3284642 3358064 3471544 3564910 3690952 3755483 3817714 3841492 3762643 3659145
4286 3659145 3640268 3601372 3546891 3511957 3507782 3552101 3603996 3622362 3632520 3646461 3712274 3774378
4274C774378K1669R0582N5010O1446P5498P0565Q0561M9576K2573J0374M8887
4263D361119L6662L1959j4332k2191J5224m8294M4829R4643L0620j0161j3773
4252D506305J1582M8839Q2273P9847J03682P8301J47033P7808R8780J71141R3954
4241E499545P5121K00423K00549J29015J43258J31460J25833J22563J35106J59529
4231F922402J64539J34458K56135J12027M6179M2708q733J5560M9706P9543R7273
4220G911797J19087J38815J72486J75225J40196J15254J53937J08575J01517R9973
4210I236862P2436J57191J13305R6234J15696K44170J01361J10590K01843J46304
4200A0595992J70498K42780K40545K78833K88411K02435J52992J90658J73925
$$ plain form
4274 3774378 3796047 3886629 3941639 4003085 4078583 4149148 4229709 4279285 4301858 4312232 4361119
4263 4361119 4397781 4429740 4415408 4393217 4408441 4360147 4404976 4499619 4530239 4520078 4506305
4252 4506305 4517887 4566726 4648999 4728846 4832528 4910829 5057862 5135670 5234450 5405591 5499545
4241 5499545 5574666 5775089 5975638 6104653 6247911 6379371 6505204 6627767 6762873 6922402
4231 6922402 7086941 7221399 7477534 7589561 7635740 7678448 7669715 7685275 7734981 7814524 7911797
4220 7911797 8030884 8169699 8342185 8517410 8657606 8772860 8926797 9035372 9136889 9236862
4210 9236862 9309298 9466489 9579794 9676028 9791724 10035894 10137255 10247845 10449688 10595992
4200 10595992 10766490 11009270 11249815 11528648 11817059 12019494 12172486 12363144 12537069
4191A2537069K06075K08653K82052K95690L40439M17373N10336N27181O43688
4182A5968556N91696O38836N85286O51778O94144O59818O85572O62659O33618
4173B1771963P33825Q22644P93642Q27091Q99888R46469J026935J099490J225859
4164C0147806J352557J420838J520411J662045J773698K076507K406221K840219
4156D5200302L266302L538770L805182M361268N088392O117529P204649Q588703
4148H7171097J0355913J2781891J5807147K0770103K8867320M0442088N0993319
4141B67188878M7953409K4447123p816542l2382501m0983221l7718518l3340352
4134A87348276k7883151k2141052j6962574j2790154r167138o021894l722361
$$ plain form
4191 12537069 12743144 12951797 13233849 13529539 13869978 14287351 14797687 15324868 15968556
4182 15968556 16560252 17199088 17784374 18436152 19130296 19790114 20475686 21138345 21771963
4173 21771963 22505788 23328432 24122074 24949165 25849053 26795522 27822457 28921947 30147806
4164 30147806 31500363 32921201 34441612 36103657 37877355 39953862 42360083 45200302
4156 45200302 48466604 52005374 55810556 60171824 65260216 71377745 78582394 87171097
4148 87171097 97527010 110308901 126116048 146886151 175753471 216195559 267188878
4141 267188878 315142287 339589410 331772868 299390367 258407146 220688628 187348276
4134 187348276 159465125 137324073 120361499 107571345 98404207 92382313 88659952
4127H8659952l197329m364703o148589p087779o788500n867541m970712m089251
4119D6145548l482243k930879k549179k190819j905430j732607j540518j497201
4111B8316672j389390j260023j112859r93582q46710p79151q27599q20319p39385
4102A9547654n37570m37701n33923o13185n30309m73059m42722l66063k69387
4093A5343735k10907k36995k06474j78138k71553j37512j58754k14455j86285
4084A3542662j57040j21154k00304q8956p6241p7852j57840l12045m03706l95534
4074A1551990l85274l34460m18452l25379l41396k76396k63848j76474p3002q9600
4064H867709m1599j24838l2629O8044J2734K0334M9198J43813J8191M6624m1308
$$ plain form
4127 88659952 85462623 81097920 74949331 67861552 61073052 55205511 50234799 46145548
4119 46145548 42663305 39732426 37183247 34992428 33086998 31354391 29813873 28316672
4111 28316672 26927282 25667259 24554400 23560818 22714108 21934957 21107358 20287039 19547654
4102 19547654 19010084 18572383 18038460 17425275 16894966 16421907 15979185 15613122 15343735
4093 15343735 15132828 14895833 14689359 14511221 14239668 14102156 13943402 13728947 13542662
4084 13542662 13385622 13264468 13064164 12975208 12898967 12821115 12663275 12351230 11947524 11551990
4074 11551990 11166716 10832256 10413804 10088425 9747029 9470633 9206785 9030311 8957309 8867709
4064 8867709 8826110 8701272 8668643 8736687 8749421 8769755 8818953 8962766 8980957 9027581 8986273
4053H986273J32566K52981M07449O02377Q55016J276424J767157J829232J045199
4044A7154674n54552j758463j947301j616909j288220r91070p77427p77394o23637
4035F819701m73263m51041l59905k38224j81244k22660j99505j19352j88114j59576
4025D226817j30238o0691r261m4946J3588k538j24695j38606j79157j93072j10266
4014C246935r5939q9083p1515q3583o5723j17528q6453l8016n4507q0618k0798
4003B443172p419o2680K741j3951k9055j3369J4511O294J8529j7403l0123l7963
3991B273284q3150p7741l2064J1295J0823l872j0153o3868m5694p6682n1271m0406
3979A810501p4215n3563k9388n7630Q912n0773j08693r058K2381o417K7042k0415
$$ plain form
4053 8986273 9118839 9371820 9779269 10381646 11236662 12513086 14280243 16109475 17154674
4044 17154674 16600122 14841659 12894358 11277449 9989229 8998159 8220732 7443338 6819701
4035 6819701 6346438 5895397 5535492 5297268 5116024 4893364 4693859 4574507 4386393 4226817
4025 4226817 4096579 4035888 4026627 3981681 3995269 3992731 3868036 3729430 3550273 3357201 3246935
4014 3246935 3150996 3061913 2990398 2906815 2841092 2723564 2637111 2599095 2544588 2463970 2443172
4003 2443172 2435753 2373073 2375814 2361863 2332808 2319439 2333950 2340244 2358773 2341370 2311247 2273284
3991 2273284 2190134 2112393 2080329 2091624 2102447 2098575 2088422 2024554 1978860 1902178 1850907 1810501
3979 1810501 1736286 1682723 1653335 1595705 1604617 1553844 1445151 1436093 1458474 1452057 1479099 1458684
3967A458684r2872K2373p518j2863j1432n2569p0494j604q6444o6254k8550k991
3955A047466J6512R1327K6992N5971J861K3606M6115O5337M5312P4751R4086J10785
3943A700121J58967J35719J56148J64316K67558L47134K58633r376l11014l73383
3933B494823l04027k53162k33793j56970p8840o8534m6315m9750q2127m1217M9388
3922A229476q2997l4033J5050Q32L7453m3140l2519n6782m2032k7914J0138J8283
3910I91815l8825j287J9683K1609l3746j20602J542K5979k3540N349l6538j882
3898H09557r071k9512q190M7505k2678m4665k8307M2234m7268l7623N0174J2487
3886G34643O6997k5344n8479K2866L4103m9743L025K8026J2297Q997J02889k6264
$$ plain form
3967 1458684 1365812 1388185 1380667 1367804 1356372 1303803 1233309 1231705 1145261 1079007 1050457 1047466
3955 1047466 1063978 1155305 1182297 1238268 1240129 1263735 1309850 1375187 1420499 1495250 1589336 1700121
3943 1700121 1859088 1994807 2150955 2315271 2582829 2929963 3188596 3179220 2868206 2494823
3933 2494823 2190796 1937634 1703841 1546871 1468031 1399497 1353182 1303432 1221305 1180088 1229476
3922 1229476 1146479 1112446 1127496 1128328 1165781 1122641 1090122 1033340 991308 963394 973532 991815
3910 991815 952990 951703 971386 992995 959249 838647 840189 866168 842628 847977 811439 809557
3898 809557 800486 770974 762784 810289 787611 742946 714639 756873 709605 671982 722156 734643
3886 734643 801640 776296 717817 740683 774786 725043 728068 756094 768391 777388 880277 854013
3874H54013M2622O7723L615N5348n3850M7691J3780M425O3366K9006J5997L1742
3862A175478J1867l324K0492Q2139N2696Q8558Q7148J74775K01610J85972K99757
3851B377168K22340K00136O9386j54470k06680j90870j98291r1765j35573j07911
3841A783470o1969o4797K6601M5805M0591L7170J03940L5966N8032O0275J46907
3830B211991J68478K13756K89930L63662L90158O18236Q87249J282501J361223
3821G787184O01653o35053j234381j181091q61426o61436m58251k86047j95282
3812B875870j60372k50346k64775j77248j72233j51226j15656j39024k1072p8830
3802A345088n6400o2469o7987n2892K9100k8141j0145N7230J9407N6370J11543
$$ plain form
3874 854013 896635 964358 967973 1023321 969471 1017162 1030942 1035367 1098733 1127739 1143736 1175478
3862 1175478 1187345 1184021 1204513 1286652 1339348 1427906 1515054 1689829 1891439 2077411 2377168
3851 2377168 2599508 2799644 2869030 2714560 2507880 2317010 2118719 2026954 1891381 1783470
3841 1783470 1721501 1656704 1683305 1729110 1769701 1806871 1910811 1946777 2004809 2065084 2211991
3830 2211991 2380469 2594225 2884155 3247817 3637975 4256211 5143460 6425961 7787184
3821 7787184 8388837 7753784 6519403 5338312 4476886 3815450 3357199 3071152 2875870
3812 2875870 2715498 2465152 2200377 2023129 1850896 1699670 1584014 1444990 1423918 1345088
3802 1345088 1288688 1226219 1158232 1105340 1134440 1106299 1096154 1153384 1172791 1229161 1340704
3791A340704J2438r2794j40959p1754n3883q3512n4440l891k6635J4756n8128
3780G81902p6141J7741M8816j9879K0321j4003O8797J00866J11358R6946j5325
3769A121399m8656o0737k5898n8219j03347n9234q0067m409l932r272K0157n3167
3757F34618p491J9323J9133N5649O6177R0920R5661P0412O147r1888r4864p3456
3745G90341r1088j21638n1412j4529o9899o7343K6439k1238j6842l2698o0556
3734B69537O910L6466j4933P050J5510L3609K5359M4017n7861j6851k2622p5792
3722B50399k7472j4947N81j2549L9101J3817K9626J6246k7895R358l7629M5508
3710B84144M4304l446L0494l7972k6663j6563k3707N5180m3045l8435m099l9671
$$ plain form
3791 1340704 1353142 1260348 1119389 1047635 993752 910240 855800 851909 825274 840030 781902
3780 781902 705761 723502 772318 752439 772760 758757 827554 928420 1039778 1136724 1121399
3769 1121399 1072743 1012006 986108 927889 824542 765308 685241 680832 676900 667628 687785 634618
3757 634618 627127 646450 665583 721232 787409 878329 973990 1044402 1050549 958661 863797 790341
3745 790341 699253 577615 526203 511674 441775 374432 400871 379633 362791 330093 269537
3734 269537 276447 312913 297980 305030 320540 354149 379508 423525 365664 348813 326191 250399
3722 250399 222927 207980 208561 196012 235113 248930 278556 294802 266907 276265 238636 284144
3710 284144 328448 325002 355496 317524 290861 274298 250591 305771 262726 224291 220192 180521
3698A80521q854J3562J0863k3010j3578l6602k0292l4684J7496L4830M8213o172
3686A62293k2782m7908J8393M2925r6972M0766P1578K6680k3349j1047m4244m2615
3674G3718K2343K2453j3978j16181J0991N1733M156M0996J836k8942R137l0643
3662D7619j1580M3965J4029j8372R52l0700r549K8536j8596K5015K8225R526K0000
3649A29070j6203o0865K2541K6613l0093K6692k721n199j3864K836L0470L8180
3637A47457q689k2556l324l2760l9391L0574l9006K6395K0610j6617R426j745
3625G0374L5458q37n052K5454l5977k0693M9760K1887K8876k639Q254j3018L9412
3612B01259k6050l3085L1061k400m965r097j9845l2306m207o328K2533J2821k0087
$$ plain form
3698 180521 171667 185229 196092 173082 159504 122902 102610 67926 85422 120252 168465 162293
3686 162293 139511 91603 109996 152921 55949 96715 168293 194973 171624 160577 116333 73718
3674 73718 96061 118514 104536 -11645 -654 51079 55235 96231 98067 69125 78262 47619
3662 47619 36039 80004 94033 75661 76613 45913 36364 64900 46304 71319 99544 109070 129070
3649 129070 112867 52002 74543 101156 71063 97755 95034 89835 75971 78807 109277 147457
3637 147457 138768 116212 112888 80128 40737 71311 32305 58700 79310 62693 72119 70374
3625 70374 105832 104995 99943 125397 89420 68727 118487 140374 169250 166611 174865 161847 201259
3612 201259 175209 142124 173185 170785 165820 156723 136878 104572 100365 94037 116570 129391 109304
3599A09304L1464N1700J2071K3335n1334m259J1940l2898q947q0583R345L8522
3587A09660p298J5762J0606M00M8385q0907K9603M2220J167l2461k6785l2135
3575G8217L716J0710k7961k762N747M3803m5596J7416N755k2911M748L1908j0950
3562I1840k870J3484M7334j4686l376L51j1425K0166k5856j1897K2339o6741l769
3549E4894k927p596j0843k8956J644L100j0515K6509k1111J4722K5016M327n5223
3536f959K2249M2056k8049M9164k8617n7550J7565O9567j8982J6947j9740p3257
3524a5606m6538l1358N2156n737j0042Q535m3170N3634N0633j6759J5286L2565
3512D3599j9743K5492k4729j8813K1017J4694m6096M0364m903l6626O2523K8565
$$ plain form
3599 109304 140768 192468 204539 227874 176540 172281 184221 151323 142376 61793 71138 109660
3587 109660 102362 118124 128730 129130 177515 96608 126211 168431 169598 137137 110352 78217
3575 78217 81933 92643 64682 61920 67667 111470 65874 83290 89045 66134 70882 102790 91840
3562 91840 88970 102454 149788 135102 131726 132077 120652 140818 114962 103065 125404 58663 54894
3549 54894 51967 44371 33528 4572 6216 9316 -1199 25310 4199 18921 43937 48264 -6959
3536 -6959 15290 57346 29297 78461 49844 -7706 9859 79426 60444 77391 57651 -15606
3524 -15606 -62144 -93502 -41346 -47083 -57125 -48590 -91760 -38126 12507 -4252 11034 43599
3512 43599 23856 49348 24619 5806 26823 41517 -4579 35785 30882 -5744 56779 85344
3500H5344k7283J9206k6557o387j2065p132O4598k3397m3795p698O3174J8306
3488I6314k1774O703j665m347k7619K6298k9043K3648K3620j1521j3705k8005
3476C8904m9460M1784M0038k6162n0005l7228K3398P7831K2961j602j3196o2748
3464D515j51l935K4890J591k0398l45j0536L0998N4900o5169o340K8436j4389
3451B4067m7931P8672K2987l0640r716J68N3829N8969p6089n7065J1838K4355
3439E3444L5004k6574j9567K6547L2876m0996K9457Q353j4194P142O867r166N915
3426I5108j3419J1583K5028J8791J9730m3796J4124j6992j9197M3236J5076j3205
3414A36067J0088J1722M1214L3748L2416N8587K651k5319r424o2665p331P730
$$ plain form
3500 85344 58061 77267 50710 44323 32258 25126 89724 66327 22532 14834 78008 96314
3488 96314 74540 81243 79578 75231 47612 73910 44867 68515 92135 80614 66909 38904
3476 38904 -10556 31228 71266 45104 -4901 -42129 -18731 59100 82061 80459 67263 4515
3464 4515 4364 429 25319 26910 6512 6167 -4369 26629 81529 16360 10020 38456 24067
3451 24067 -23864 54808 77795 47155 37439 37607 91436 150405 74316 17251 29089 53444
3439 53444 88448 61874 42307 68854 101730 60734 90191 98544 84350 91492 98359 89193 95108
3426 95108 81689 93272 118300 137091 156821 113025 127149 110157 90960 134196 149272 136067
3414 136067 146155 157877 199091 232839 265255 323842 326493 301174 291750 229085 221754 229484
3402B29484l4236l5393N100k2930R657j5589O1719L360J1396j4471J8075L2212
3390B48384J2938n47L7955L2142l1337M9000L1763L5878O5467Q3431J32055J24982
3378H22111M6252K4043m2587q3113j42549n2297r2552q8978R222l4637q265m697
3366C51953k4548L9006n8344r0507K8345N1301J3650j2987J277L1147J0800m1885
3354B99208o779M0619k1693J6984K4848K8268K6908m797P4837O5128k1985l0714
3342D90832m6397M24j7080n4290o3126J8766M8070M3077j9868j4231n695J7869
3330C98351l2006k6520L3594N1697k8576j8445K7512K6739j3904M2686L807K8453
3318D93388j6383K5971L1720j3970N6674k2491K6932L0446K4367n833M9846k0420
$$ plain form
3402 229484 195248 159855 164955 142025 151682 136093 197812 201172 212568 198097 216172 248384
3390 248384 261322 260775 298730 330872 299535 348535 380298 416176 481643 565074 697129 822111
3378 822111 868363 892406 849819 766706 624157 571860 479308 390330 399552 364915 356650 351953
3366 351953 327405 366411 308067 217560 245905 297206 310856 297869 299146 330293 341093 299208
3354 299208 292429 333048 311355 328339 353187 381455 408363 403566 478403 543531 521546 490832
3342 490832 444435 444859 427779 373489 310363 329129 377199 420276 400408 386177 380482 398351
3330 398351 366345 339825 373419 425116 396540 378095 405607 432346 418442 461128 464935 493388
3318 493388 477005 502976 534696 520726 577400 554909 581841 612287 636654 630821 680667 660247
3306F60247q805J6982P906J9179N2874J848o3545m712p400P1442M2182J667j9188
3293G70677n920Q4271j1699k448R756P6122R8527J7055N6530R6423L8517j7231
3281A210580l9477K4066j5943J007Q2981M5200N2274J9050r378k0316J9698K9089
3269A398831N3824J445l45O4784M1173L4948j8768K7315N7258q821N4746Q4827
3257A791217Q2478O3293Q8147O6589m7117K8491O1143K5006K9153O8195R1328
3246B347923J42319J25642R8127J65972J82287Q8681M5862Q4838J26587K7353
3236C435591N6243L2165O1499O9848J0687j3115j4554k8993l5834n660M5914J03571
3224C717362Q5880Q8097j1663k86843l49760k59942k40995k35983j35471j05389
$$ plain form
3306 660247 651442 668424 676330 695509 748383 750231 686686 681974 674574 746016 788198 789865 770677
3293 770677 764757 849028 837329 834881 844637 920759 1019286 1036341 1092871 1189294 1227811 1210580
3281 1210580 1171103 1195169 1179226 1180233 1263214 1308414 1360688 1379738 1370360 1350044 1369742 1398831
3269 1398831 1452655 1454100 1453755 1518539 1559712 1594660 1575892 1603207 1660465 1651644 1706390 1791217
3257 1791217 1873695 1936988 2025135 2091724 2044607 2073098 2134241 2159247 2188400 2256595 2347923
3246 2347923 2490242 2615884 2714011 2879983 3062270 3150951 3196813 3281651 3408238 3435591
3236 3435591 3491834 3523999 3585498 3655346 3666033 3652918 3638364 3609371 3573537 3567877 3613791 3717362
3224 3717362 3803242 3891339 3879676 3592833 3243073 2983131 2742136 2506153 2370682 2265293
3214B265293q2909r2839j06819m0036l1390k5525m8648n798L8681K7537R455K9397
3202A936399Q7527J08296J47768J69681K53965K38196J32987L5889J50797K93436
3192C554941M13135L89695l3125m74677n45566m50487l78337k14590k07515j28005
3182A925469j74231j05289o0127m7059q7187J1156L3699K297m620O4679J04185
3171A662972P9143J26058J54828K14810L52707M02164L01887o468j29737q9790
3161C068574J0488Q4580L1763k16513m22760l62129k68920j93936j91540j33402
3151A406205r7829j43375p8098l6062n6462n0243l240M367J1563l8128q987O6997
3139I76708N9951r60L7346J18141J57280J19692J2688L308j22287q0146q6937
$$ plain form
3214 2265293 2182384 2089545 1982726 1942690 1911300 1885775 1837127 1831329 1870010 1897547 1907002 1936399
3202 1936399 2023926 2132222 2279990 2449671 2703636 2941832 3074819 3110708 3261505 3554941
3192 3554941 3968076 4357771 4324646 3849969 3304403 2853916 2475579 2260989 2053474 1925469
3182 1925469 1751238 1645949 1585822 1538763 1451576 1462732 1496431 1498728 1494108 1558787 1662972
3171 1662972 1742115 1868173 2023001 2237811 2590518 2992682 3294569 3288101 3158364 3068574
3161 3068574 3079062 3163642 3195405 2978892 2556132 2194003 1925083 1731147 1539607 1406205
3151 1406205 1308376 1165001 1086903 1050841 994379 944136 940896 945263 956826 918698 909711 976708
3139 976708 1036659 1035699 1073045 1191186 1348466 1468158 1480846 1484154 1361867 1281721 1194784
3128A194784j20626j06978j07763p0274q6059j04443p5053o841J4125m7858M3393
3117E26407j7802l3313k1823l3303K8235k4514l5906j8072j22150L5376K0382
3106C03517M5414N8265o0975r4402j8974J1066L214M5682j2246p7074N615m0318
3094A68784l2358n384M4328l4836n7371M3213K1023K189o7306K8552M5572K918
3082A59324j913o5355k1506N9876j783k1350K9791L207l8444M7054o8354k8227
3070E2320j5209k0608K5586J4833M0963p1353j9224J7463J6509J2504k7055J5903
3058D2632K3768J8036J5685M711m6076J4625l6490k2154Q808m9646J0218L5656
3046A9773J4316n536k18M8492n4324R361R065j3408k1988l8207K663O7181m6465
$$ plain form
3128 1194784 1074158 967180 859417 789143 703084 598641 523588 516747 530872 483014 526407
3117 526407 508605 475292 453469 420166 448401 423887 387981 369909 247759 283135 303517
3106 303517 348931 407196 346221 251819 232845 243911 247125 292807 280561 203487 209102 168784
3094 168784 136426 131042 175370 140534 83163 126376 147399 149588 82282 110834 156406 159324
3082 159324 157411 92056 70550 130426 128643 107293 137084 140291 101847 148901 80547 52320
3070 52320 37111 16503 42089 56922 97885 26532 7308 24771 41280 53784 26729 42632
3058 42632 66400 84436 100121 104832 58756 73381 36891 14737 23545 -26101 -15883 19773
3046 19773 34089 28553 28335 76827 22503 31864 40929 27521 5533 -32674 -30011 37170 -9295
3033i295k4291P5972J8882n3001K8267n977m4088L2246K5193p362j4080k2318
3021A48k9658J9146R99j9551J252K0505j0668K5953K6993l7791j3552J5490L355
3008B621J2758j2765P42k3347N475M2291N482N971L3716O955k9304k1155m046
2995B5394l331J4201p08P538M5904k075l6515K8534J421K1168m6376j8191l8877
2982a913N6589M3766j7898J7927M2268j0677n1928M1274p700k6746l6598J719
2970E0083M4124K606j1610R651j2602M3154M6399j3800K2499j5537j7842J8914
2958A66039K6200P369l6807O8031M1464j9913l9n4191j7236L7251K1820q203K1892
2945B53677k2483N4354k6572o708P712k2020J3025q192K8139k725m813J6976N8573
$$ plain form
3033 -9295 -33586 42386 61268 8267 36534 30557 -13531 18715 43908 36546 22466 148
3021 148 -29510 -10364 -9365 -28916 -27664 -7159 -17827 8126 35119 -2672 -16224 -734 2621
3008 2621 15379 2614 3356 -19991 -14516 27775 33257 39228 72944 79899 50595 29440 25394
2995 25394 22063 36264 35556 43094 88998 86923 50408 78942 80363 101531 55155 36964 -1913
2982 -1913 54676 98442 80544 98471 140739 130062 78134 119408 111708 84962 48364 50083
2970 50083 94207 96813 85203 94854 82252 125406 171805 158005 180504 164967 147125 166039
2958 166039 192239 199608 162801 230832 272296 252383 252344 198153 180917 218168 239988 231785 253677
2945 253677 231194 285548 258976 252268 259980 237960 250985 242793 270932 268207 263394 280370 338943
2932C38943J5468K260M8930k669k3082M6756N3149K6647O5628K426j3882O3378
2920F23952L6280K228L4028Q2247M355K2605q152L1511J3816o024J0527N2586
2908H99959J2241J4650R474o560J6339j6073l9117J9351R6563l4328l0394k3088
2896I19017N8609Q6632O1965L3827L8677J51649J17587J79863R9761j2397p9270
2885A655920j14232j92615j93511q5002m1673l6781m3934n6510n6790o1535L732
2874G77069Q029m5983j3861K3098m254k5293k5643l0751K3264K0750Q881k8771
2862F86535M5631J1119L2321O6597n5502n181l7293l797o5834l5762l2926q0503
2850E25405m7594l7986N382p057P875q798q8988l0655K5143k3488j8150m9480
$$ plain form
2932 338943 354411 356671 405601 402932 379850 426606 479755 506402 572030 574456 560574 623952
2920 623952 660232 662460 696488 778735 783090 805695 797543 829054 842870 836846 847373 899959
2908 899959 912200 926850 936324 929764 946103 930030 890913 910264 1006827 972499 942105 919017
2896 919017 977626 1064258 1126223 1160050 1198727 1350376 1467963 1647826 1747587 1735190 1655920
2885 1655920 1541688 1349073 1155562 1070560 1028887 992106 948172 891662 834872 773337 777069
2874 777069 785098 739115 725254 748352 744098 718805 693162 662411 685675 706425 715306 686535
2862 686535 732166 743285 775606 842203 786701 781520 744227 740430 674596 638834 605908 525405
2850 525405 477811 439825 445207 438150 446025 437227 348239 317584 342727 319239 301089 251609
2838B51609j584L6696M1773n4511k8179k0883p9128j6727j8602J7378O4845J5648
2826B08335n5083m8813j5948J1326j6140o5086N2194K8928l1905l3964j7279R945
2814B6510L8360k430j5112n5025O364j7708J4047K3272j6384l103l1072Q834Q300
2801a5147J5299k997J0645M4617m8931l9264r466j2699K3948k2147O718M3238
2789f186K3593j7647k5563K0664J8533k653k5172j1676J442L6722L0325r0511
2777d8129J4388j3157q818N115K422J617n481n123J6541M8689n5558j3132l9663
2764a00289n9929N7395M2215j0090J1696q786l3498p573o243l71M8207J9190N8699
2751A0623n1685K43k9878o330J6698O843J2902j4990J1300k2934k054L3432K4117
$$ plain form
2838 251609 250025 286721 328494 273983 245804 224921 145793 129066 110464 127842 192687 208335
2826 208335 153252 104439 88491 99817 83677 18591 70785 99713 67808 33844 16565 26510
2814 26510 64870 62440 47328 -7697 -1333 -19041 -4994 18278 1894 -1209 -32281 -23447 -15147
2801 -15147 152 -2845 7800 52417 3486 -35778 -45244 -57943 -33995 -56142 -49424 -6186
2789 -6186 17407 -240 -25803 -5139 13394 10741 -14431 -26107 -24665 12057 42382 -48129
2777 -48129 -33741 -46898 -55716 -50601 -48179 -46562 -52043 -57166 -40625 8064 -47494 -60626 -100289
2764 -100289 -160218 -102823 -60608 -70698 -59002 -67788 -101286 -108859 -115102 -115473 -67266 -48076 10623
2751 10623 -41062 -40819 -70697 -77027 -60329 -53486 -40584 -55574 -44274 -67208 -69262 -35830 -11713
2738a1713m1952j0328m62r622m649j0571P93M758k3107J8258m8663L0199M7831
2725e9228k0702k9460J0160l3833j2850M9093L9294m0238j1050j2339k9661L6696
2713a14118J02137l787j4900m3889j4355M3834o2459n0373J0023r668K2979l08
2701a34884K6184J4561O1820m6675j3081l608K3252L760l3951P0778r213k4883
2689f5940m7536M2984O836J7645k6066l105K293j0641M2913J9587l1451o3428
2677a15909k3910M1690j0804M7738J0046k1950p3004K6288Q1038N551n5319k0647
2665a09192K1275L8042l6812l2138O3635K6395l8860o6717M132P528N5453K6421
2653d0838n1920M067l513M652K6004n713m8685J5036M5231M718k8074k5494M252
$$ plain form
2738 -11713 -53665 -63993 -64455 -74077 -78726 -89297 -88504 -83746 -106853 -88595 -137258 -107059 -59228
2725 -59228 -79930 -109390 -99230 -133063 -145913 -96820 -57526 -97764 -108814 -121153 -150814 -114118
2713 -114118 -11981 -15768 -30668 -74557 -88912 -45078 -107537 -157910 -147887 -157555 -134576 -134884
2701 -134884 -108700 -94139 -32319 -78994 -92075 -95683 -72431 -68671 -102622 -31844 -41057 -65940
2689 -65940 -113476 -70492 -63656 -46011 -72077 -75182 -72889 -83530 -40617 -21030 -52481 -115909
2677 -115909 -139819 -98129 -108933 -61195 -51149 -73099 -146103 -119815 -38777 -33226 -88545 -109192
2665 -109192 -87917 -49875 -86687 -118825 -55190 -28795 -67655 -134372 -130240 -122712 -67259 -40838
2653 -40838 -92758 -88691 -92204 -87552 -61548 -67261 -115946 -100910 -55679 -50961 -79035 -104529 -100277
2640a00277k616Q330K3774m557j0573J5131P534J5315n0827m672L4672j8443J6910
2627g0299K2650j6280L6003n2242l8073l0514M6804n440j5938J5334O967K3319
2615g7709K0162K0312p1513J6928J4950K072n092k6076o602L2294m566j8513j2041
2602a15394L4509P854k0997j4721K9402n0829n846J4696j1006J0165q930N7478
2590g3619M6443l7410k7994K2963J0680k7361l5829r678N1377m5796J5909p132
2578a17447L6387O0625p7273R119k150k2863r433k5431J8111L1433K009p069O386
2565i7596O276K648k6004m4260J1675J5689K7288N1568l9426k6728M4082l2481
2553a07269k0021M4628K7905j4513l1951M701K8574m5048M4713k4241N0157j7946
$$ plain form
2640 -100277 -102893 -94563 -70789 -75346 -85919 -70788 -63254 -47939 -98766 -103438 -68766 -87209 -70299
2627 -70299 -47649 -63929 -27926 -80168 -118241 -148755 -101951 -107391 -123329 -107995 -101028 -77709
2615 -77709 -57547 -37235 -108748 -91820 -76870 -74798 -79890 -105966 -112568 -80274 -84840 -103353 -115394
2602 -115394 -80885 -73031 -94028 -108749 -79347 -130176 -136022 -121326 -132332 -122167 -131097 -73619
2590 -73619 -27176 -64586 -92580 -69617 -58937 -86298 -122127 -131805 -80428 -126224 -110315 -117447
2578 -117447 -81060 -20435 -97708 -88589 -90739 -113602 -123035 -148466 -130355 -98922 -96913 -103982 -97596
2565 -97596 -91320 -88672 -114676 -158936 -147261 -131572 -104284 -52716 -92142 -118870 -74788 -107269
2553 -107269 -127290 -82662 -54757 -69270 -101221 -96520 -67946 -112994 -68281 -92522 -42365 -60311
2541f0311K4582l5226j7272M1726O54l8534l4711L3196m3017O7021k6185P607
2529h0470M7220q5816l1844K9879L4857j4487K8405l5364P01j9482K0522M2461
2517f3418k3898j2545M129n269J7996L6650K5392m9664l1282j9949L7860O0254
2505b3744m3996j3477k0571J4451R612o757R717o492j2412M2441m6719q4405P866
2492a74486L7361K0812M3962K0349n4688l7555M4028L5042n2317J8898k0668J5028
2480a04234Q0890m2591J3720l2078j7275M6114k901k4423n77P3210p885n3471
2468g1501O269k2440J9032L5704k56k7361K382J2262j2237m1720J2561j051N1828
2455c6528L0077k9416m4599k1130P983N0917q028m6022J916M4389j6031l7273
$$ plain form
2541 -60311 -35729 -70955 -88227 -46501 -45847 -84381 -119092 -85896 -128913 -61892 -88077 -80470
2529 -80470 -33250 -119066 -150910 -121031 -86174 -100661 -72256 -107620 -106919 -126401 -105879 -63418
2517 -63418 -87316 -99861 -95732 -101001 -83005 -46355 -20963 -70627 -101909 -121858 -83998 -23744
2505 -23744 -67740 -81217 -101788 -87337 -77725 -84482 -74765 -81257 -93669 -51228 -97947 -182352 -174486
2492 -174486 -137125 -116313 -72351 -52002 -106690 -144245 -100217 -65175 -117492 -98594 -119262 -104234
2480 -104234 -23344 -65935 -52215 -84293 -101568 -55454 -58355 -82778 -83355 -10145 -18030 -71501
2468 -71501 -65232 -87672 -68640 -32936 -33192 -60553 -58171 -45909 -58146 -99866 -87305 -88356 -36528
2455 -36528 -6451 -35867 -80466 -101596 -93613 -42696 -50724 -96746 -94830 -50441 -66472 -103745
2443a03745k4034Q8428J715n1357K4057l744p21p21k4816M347l3046N7706J8298
2430d7633l7213L1030J3481m4363J797N2512l764r767J7833n6448K7578K8374
2418b6583j9318m0996j8130N5466j3402L8367J6605j770p0897m3516M7480K4239
2406e2455l5710O821j9617N74j9698j3319M7381N9288K0012n5518k8896N9075
2394c2062J0921p9975K348N202j4681N6324P863J9269l6272j9612P325Q833k7036
2381i1553j0914L2219N4991p264k1705k2127n059J799M6273j5751J9813R763p3192
2368h2707m5854J1483Q2166K8709n0587p51O4360m9403K8269L3407q470O7966
2356G8588m1319l3319n057J4190j6658p1985J2826k174k3452J3351n9469M3263
$$ plain form
2443 -103745 -127779 -39351 -37636 -88993 -64936 -68680 -69401 -70122 -94938 -90591 -123637 -65931 -47633
2430 -47633 -84846 -53816 -40335 -84698 -82901 -30389 -34153 -43920 -26087 -82535 -54957 -26583
2418 -26583 -45901 -86897 -105027 -49561 -62963 -24596 -7991 -9761 -80658 -124174 -76694 -52455
2406 -52455 -88165 -81344 -100961 -100387 -120085 -133404 -86023 -26735 -6723 -62241 -91137 -32062
2394 -32062 -21141 -101116 -98768 -93566 -108247 -51923 -44060 -24791 -61063 -80675 -73350 -64517 -91553
2381 -91553 -102467 -70248 -15257 -22521 -44226 -66353 -71412 -69613 -23340 -39091 -19278 -9515 -82707
2368 -82707 -128561 -117078 -34912 -6203 -56790 -57541 6819 -42584 -14315 19092 10622 78588
2356 78588 37269 3950 -1107 13083 -3575 -75560 -62734 -64908 -88360 -75009 -134478 -91215
2344i1215P3153L3016R117j9784K2162m4518L4706O3492j5937o8403j0824q87
2332a5922m5341P240o067n2498Q1747K6072m2603qP730m4694K4058J5147J6404
2319b8735J6161k1966j3622k9564N3840q248l0206O91K0554J3181J8163k5909
2307c5660m7167K5848J6002J0639L0333p247K2905k4029j7551o3925O4112L9616
2295A3876l5326l5873l234K1271L0716L0724k4566K9048k0610Q722j927Q397j5115
2282F103P826j3896j3333j5992m6421j003P2921K6318j7155l0398j8767q519N6673
2269D357o772l1523q111J9484k027J6354p866K7864j0259l831m2062m1433L7792
2256d8033N5620N223j4472k3444j1215P4170l9440n1520J4712J9754m823N75m3768
$$ plain form
2344 -91215 -18062 14954 24071 4287 26449 -18069 16637 80129 64192 -4211 -15035 -15922
2332 -15922 -61263 -54023 -60090 -112588 -30841 -4769 -47372 -47380 -39650 -84344 -60286 -45139 -28735
2319 -28735 -12574 -34540 -48162 -77726 -23886 -32134 -62340 -61649 -41095 -27914 -9751 -35660
2307 -35660 -82827 -56979 -40977 -30338 -5 -7252 15653 -8376 -25927 -89852 -25740 13876
2295 13876 -21450 -57323 -60557 -39286 -8570 22154 -2412 26636 6026 14748 12821 21218 6103
2282 6103 13929 33 -13300 -29292 -75713 -76716 -3795 22523 5368 -25030 -43797 -52316 4357
2269 4357 -2415 -33938 -42049 -22565 -24592 -8238 -16104 11760 1501 -2330 -44392 -85825 -48033
2256 -48033 7587 12810 -1662 -25106 -36321 37849 -1591 -53111 -38399 -18645 -23468 -22893 -66661
2243f6661M8901j1983J6072K0369K9809k3910j713K168j6281j2376N2634L3874
2231G0903k4945N387j62j6210j0040R193m2324o383K8708K8812j4296j9173j7645
2218h175L9706K8334J039L0635K3400j1047l7243m368j0189n253J2058n073M2682
2205I6506M2522k053l5721n896j1973N5928K1812l6347j7747k112k00k6720O2239
2192A40238L7014M4313J4897m4831J5870K3083N166n3863m6572L5903J4143M0554
2180B25915j992j2656j0803O140Q2426k2660n2801m004k5135K6400N2941J0954
2168B74725K1519o776J2022o2742L5083M3303K1555M3752k7012j3942l5613j2958
2156B92916M4425k0151m590Q769K4633j1523j3940j390K2759M5104L3773O4171
$$ plain form
2243 -66661 -17760 -29743 -13671 6698 36507 12597 10884 13052 -3229 -15605 37029 70903
2231 70903 45958 51345 51183 34973 24933 34126 -8198 -14581 14127 42939 28643 9470 -8175
2218 -8175 31531 59865 60904 91539 114939 103892 66649 62281 52092 46839 58897 53824 96506
2205 96506 139028 136975 101254 95358 83385 139313 161125 124778 107031 104919 104719 77999 140238
2192 140238 177252 221565 236462 191631 207501 230584 235750 181887 135315 171218 185361 225915
2180 225915 223923 211267 200464 206604 289030 266370 213569 209565 184430 210830 263771 274725
2168 274725 296244 289468 301490 238748 273831 317134 338689 382441 355429 341487 305874 292916
2156 292916 337341 317190 312600 321369 346002 334479 320539 319149 341908 387012 420785 484956
2144D84956l8170k6584j2052M716O6374M0398L6782k2082K7965N1347L3038L1710
2132F78398K8039L42K4724N4523p999K7738Q3214M9492L57P0433N829k5510P4320
2119A063900J3308K9014K9970Q4474P0743M9049J20872N2581J06123R8441J12586
2108A831061J02513J75934K60775K62412J10264J50639J77180K39249K68086L43563
2098C921676M51075N63187P09785R44404J233550J781650K813299M045906L540952
2089B0005484k36l595196l696090k659022k028266j437355j095777p47735o31587
2080D114220n07889m15114k48425k28697j40929j07049j09007k41770k44020j36172
2070A735148j08742j61171p5612p2715j24310r4617l7564k6034l1533l1003r7540
$$ plain form
2144 484956 446786 420202 408150 412866 479240 519638 556420 534338 562303 613650 646688 678398
2132 678398 706437 706779 731503 786026 778027 805765 888979 938471 938828 1009261 1015090 989580 1063900
2119 1063900 1077208 1106222 1136192 1220666 1291409 1340458 1461330 1513911 1620034 1718475 1831061
2108 1831061 1933574 2109508 2370283 2632695 2742959 2893598 3070778 3310027 3578113 3921676
2098 3921676 4372751 4935938 5645723 6590127 7823677 9605327 12418626 16464532 20005484
2089 20005484 20005248 16410052 12713962 10054940 8026674 6589319 5493542 4745807 4114220
2080 4114220 3606331 3191217 2942792 2714095 2573166 2466117 2357110 2115340 1871320 1735148
2070 1735148 1626406 1465235 1389623 1316908 1192598 1097981 1060417 1034383 1002850 971847 874307
2059H74307o6153o909j8841k6127o0006r0896j5113l1113n5497j3699R372m3252
2047D56073l7087O62m1164l245j1994R107N758j1020k8474p358L3361q8685K874
2034B78808R579j1812K7348j4904k9493n412J940m3660N3087m9311j8174m0819
2022A57177r777N029k1177J3240o1188J5990p576j5010o5081j8163Q998M949M3587
2009E0998O5143J7626j2000n9667J4881K1022N649K0256N235j3049K575k8054
1997I0615l6694L0475K3070n8179j3627M9525n3395k4446R387N6054J3590j0680
1985G5695q1432L8276L8131J312k9012l5394j4849L4149j0461o3419O1718n5469
1973d0755m0331O4565J7274j2153k4736O7818r330k722n432j2070j9525p691l9012
$$ plain form
2059 874307 808154 801245 782404 756277 696271 605375 590262 559149 503652 489953 499325 456073
2047 456073 418986 419648 378484 375239 363245 372352 378110 367090 338616 331258 364619 275934 278808
2034 278808 288387 276575 303923 289019 259526 254114 256054 212394 265481 216170 197996 157177
2022 157177 147400 152429 131252 144492 83304 99294 91718 76708 11627 -6536 2462 7411 50998
2009 50998 116141 133767 121767 62100 76981 98003 103652 123908 129143 116094 118669 90615
1997 90615 53921 84396 107466 49287 35660 85185 31790 7344 16731 72785 86375 75695
1985 75695 -5737 32539 70670 71982 42970 7576 -7273 26876 16415 -47004 14714 -40755
1973 -40755 -81086 -16521 753 -11400 -36136 31682 22352 19630 14198 2128 -17397 -25088 -64100
1960f4100M3017k5591J2450r689J0331q740k8231P975J185O2180n2573M6624J0922
1947E760k2517N096J4847O757R922j2433k7163k0049j7676r290j3093L6637M868
1934c8334L0277L2521j349p1805J5402L0140J6936j3113n0867m8514O3426N4458
1922A9178k4579l011p0400M0844l1018L898K5595L7161n8194J3343J4133k7234
1910f0284m4777N558K9382K9585p123K540J471M9714L181M606o8654L9556R642
1897e603m8862m4090P782L5634J7741L9476J5945k0022k0409O51l4540K3550l5995
1884f8742m251N4432L00m3625m5807L2509o402j1448M5005L149L7186l4571m5845
1871h8110J7867k8814o306K5519L0516N233k4119M9579K2068k8444k218J4277
$$ plain form
1960 -64100 -21083 -46674 -34224 -43913 -33582 -42322 -70553 -62578 -61393 787 -51786 -5162 5760
1947 5760 -16757 -11661 3186 9943 19865 7432 -19731 -39780 -57456 -66746 -79839 -43202 -38334
1934 -38334 -8057 24464 23115 -48690 -33288 -3148 13788 675 -50192 -98706 -35280 19178
1922 19178 -5401 -8412 -78812 -37968 -68986 -65088 -39493 -2332 -60526 -47183 -33050 -60284
1910 -60284 -105061 -99503 -70121 -40536 -47659 -45119 -43648 6066 9247 13853 -54801 -15245 -5603
1897 -5603 -54465 -98555 -90773 -55139 -37398 2078 18023 -1999 -22408 -21757 -56297 -32747 -68742
1884 -68742 -72993 -18561 -18261 -61886 -107693 -75184 -81586 -93034 -48029 -44880 -7694 -42265 -88110
1871 -88110 -70243 -99057 -105363 -79844 -49328 -44095 -68214 -18635 3433 -25011 -27229 -12952
1859a2952l1421j7029M102p41K3765j934l0359P796O5493l4704l342q213J3954
1846b5585M6560j6147L2393o2282p521k6500K5716K5006N508l0847L4116J2933
1834A3350k0988k9505k4456m2016N3644K8558N598k3424j0306O2278J0314L511
1822B6558j6413k7931J2615k7280J7832M8829m9735J5222l6714j9683k2292j5848
1810i4840N6323J9966j0686r506L717N2910m2931l674M394J0119j2512n7011J400
1797h2331J8702N7040j1809j4917p1877M790P2018O3969n7131j3838M7069k1822
1785a0137l565m6085O473j3949j8945J3227j3053L6506N9507k4783R312o4992
1773g0484k6396R1831k1052J1694p680l3850R83K7729J3382J8592L9172j8700
$$ plain form
1859 -12952 -44373 -61402 -57300 -58041 -34276 -36210 -66569 -58773 6720 -27984 -31326 -39539 -25585
1846 -25585 20975 4828 37221 -25061 -32582 -59082 -33366 -8360 -2852 -33699 417 13350
1834 13350 -7638 -37143 -61599 -103615 -49971 -21413 -15815 -39239 -49545 12733 23047 26558
1822 26558 10145 -17786 -5171 -32451 -14619 34210 -15525 -303 -37017 -56700 -78992 -94840
1810 -94840 -38517 -18551 -29237 -38743 -35026 17884 -25047 -28721 -24327 -14208 -26720 -83731 -82331
1797 -82331 -63629 -6589 -18398 -33315 -105192 -100402 -28384 35585 -21546 -35384 11685 -10137
1785 -10137 -13702 -59787 -53314 -67263 -86208 -72981 -86034 -49528 9979 -14804 -5492 -70484
1773 -70484 -96880 -5049 -26101 -14407 -22087 -55937 -54954 -27225 -13843 4749 43921 25221
1761B5221l2073n5774N217j49L2818K2828o5328n4146P9914k1074o2269P0388
1749e4427j4270L2585l4988k7955O8887J6573n1279J5858K3592j7235K267k3847
1737f4239N477J5413J9471r360K6838J7200k3571n2255M7254N300k5424l2463
1725g0359p665O1478n7206k1533M6284K4056J6663M783p652n069j4973K0371q443
1712a9265r615l5123K4434K090k5674L6848N483k5300R233J485J0972l4970L6714
1699b2688r658M15L4639N018k7379n6861N1333r131L569J5846k7390k1008J4619
1686d8676J2228o646n878J0357q274K6372j7777q74L8095k1963k470k3244m18
1673d9168J1709k0554K0530j0849J9657J7132j2471j8937O579m4418n3843L0150
$$ plain form
1761 25221 -6852 -62626 -57409 -57558 -24740 -1912 -67240 -121386 -41472 -62546 -124815 -54427
1749 -54427 -68697 -36112 -71100 -99055 -30168 -13595 -64874 -49016 -25424 -42659 -40392 -64239
1737 -64239 -58762 -43349 -23878 -33238 -6400 10800 -12771 -65026 -17772 -12472 -37896 -70359
1725 -70359 -78024 -16546 -73752 -95285 -49001 -24945 -8282 -3499 -11151 -16220 -31193 -10822 -19265
1712 -19265 -28880 -64003 -39569 -37479 -63153 -26305 -20822 -46122 -36889 -35404 -24432 -59402 -22688
1699 -22688 -32346 -31931 2708 7726 -19653 -76514 -25181 -34312 -30743 -14897 -42287 -63295 -48676
1686 -48676 -36448 -43094 -48972 -38615 -46889 -20517 -38294 -39168 -1073 -23036 -25506 -48750 -49168
1673 -49168 -37459 -58013 -37483 -48332 -28675 -11543 -24014 -42951 -36372 -80790 -134633 -104483
1661a04483N0080p416L0380K4045o208j3242J6970k9139J1467M4246k4138k1952
1649b9390J3875k0313k1572m148j3332j4887K7522J2183j4480p833l066j875q567
1636h5883L080M6164K074P725J3489k5860j3925l1021K8002J1860J0817J7992
1624a5486k6753J8925J366J9697k8531k7836J1255k5383J8974j6816N659J4766
1612e0163K5252m6457K6219k8415n5303K3909j482q404l4822M5767P7491M1468
1600A5060m0799O598l786O053l3069Q576l8141j0035P43l3298M3501l0557K3779
1587h5375K1700P8545k5443k2066L5451k7859k8584p037K6113K0604R56n870j9685
1574c8550j9427J9880l2377j4595K2450J4282M4953j5038l1801J7673J9420K3811
$$ plain form
1661 -104483 -54403 -61819 -31439 -7394 -13602 -26844 -9874 -39013 -27546 16700 -7438 -29390
1649 -29390 -15515 -35828 -57400 -61548 -74880 -89767 -62245 -50062 -64542 -72375 -75441 -77316 -85883
1636 -85883 -82803 -36639 -34565 -26840 -13351 -39211 -53136 -84157 -56155 -44295 -33478 -15486
1624 -15486 -42239 -23314 -21948 -2251 -30782 -58618 -47363 -72746 -53772 -70588 -64929 -50163
1612 -50163 -24911 -71368 -45149 -73564 -128867 -104958 -106440 -114844 -149666 -103899 -26408 15060
1600 15060 -25739 -19141 -22927 -16874 -49943 -41367 -79508 -89543 -88800 -122098 -78597 -109154 -85375
1587 -85375 -63675 14870 -10573 -32639 2812 -25047 -53631 -60668 -34555 -13951 -12995 -18865 -38550
1574 -38550 -57977 -38097 -70474 -85069 -62619 -48337 -3384 -18422 -50223 -32550 -13130 10681
1562A0681q00k2602l0620l4063K6610j6785m4489O939J16462m7581n3847J0846
1550g9249O9680K3896K6361n5545J1031m71m6742Q408P825L0487M1568m0637k8312
1537c1700M166k910J4308k2727l8962K5454K0836l0989q346M1744j6781L8470
1525g437j5986q950L2132k5779N562l4101K0148j7496m461j5612J5466J7739L2547
1512f228j3189J5977M102J5418r744j9302K4901m33J4795M361k9878N116n5950
1499e0054P652L0412L6659k3424K9895m5446Q489l156p52l4028j7306K9733k5916
1486e7242O1415j9626k5813N9695k7783j9997M0495m5444K9960Q569o0325L1858
1474b4238m2481j0984K097L3K7568k3266J5346l077j6102M8230M6561J1777Q756
$$ plain form
1562 10681 9881 -12721 -43341 -77404 -50794 -67579 -112068 -105129 11333 -36248 -90095 -79249
1550 -79249 -9569 14327 40688 -14857 -3826 -4297 -51039 -42631 -34806 -4319 37249 -3388 -31700
1537 -31700 -27534 -30444 -16136 -38863 -77825 -52371 -31535 -62524 -70870 -29126 -45907 -7437
1525 -7437 -23423 -32373 -241 -26020 -20458 -54559 -34411 -51907 -56368 -71980 -56514 -38775 -6228
1512 -6228 -19417 -3440 662 16080 6336 -12966 11935 11502 26297 30658 780 5896 -50054
1499 -50054 -42402 -11990 24669 1245 31140 -14306 -5817 -8973 -9725 -43753 -61059 -31326 -57242
1486 -57242 4173 -15453 -41266 18429 -9354 -29351 11144 -34300 -4340 4229 -56096 -24238
1474 -24238 -66719 -77703 -75606 -75573 -48005 -71271 -55925 -59002 -75104 -26874 19687 31464 40220
1461D0220n1024k8244m799k0194k0809J3039k562M6937N414J9915j1277n718l0917
1448e0019R203L4436k3481k3083K3524j552K0596m9571p447J8658p405p400K49
1435f3292M1486m6128L3538O6108j7222p4707J1862Q624J3348K5398O7156l2753
1423C3418k4505l9693l057J3882j4480j7112m4196L4481P3090m4548J1654J8393
1411b673J0303j1148r8167k0440K9743M2518K3589m2659J6506K4349l316L0981
1399d14j0410j2463N3129L0046m7254j4233K2302K9213j4135l9451l8202J8271
1387b3601l208l8290L8737j0973r043M8234j7860J2041k7906N6280k4909m9629
1375e0127k516r936J6885m4664L8583K0254J5768L5049j1789p977j0452l602j9523
$$ plain form
1461 40220 -10804 -39048 -43847 -64041 -84850 -71811 -74373 -27436 -22022 -2107 -13384 -19102 -50019
1448 -50019 -40816 -6380 -29861 -52944 -29420 -30972 -10376 -59947 -67394 -48736 -56141 -63541 -63292
1435 -63292 -21806 -67934 -34396 31712 14490 -60217 -48355 -39731 -26383 -985 66171 33418
1423 33418 8913 -30780 -33837 -19955 -34435 -51547 -95743 -61262 11828 -32720 -21066 -2673
1411 -2673 7630 -3518 -101685 -122125 -92382 -49864 -26275 -68934 -52428 -28079 -31395 -414
1399 -414 -10824 -23287 29842 59888 12634 -1599 20703 49916 35781 -3670 -41872 -23601
1387 -23601 -26809 -65099 -26362 -37335 -46378 1856 -16004 -3963 -31869 24411 -498 -50127
1375 -50127 -52643 -62579 -45694 -90358 -51775 -31521 -15753 19296 7507 -470 -10922 -14524 -34047
1362c4047k284k263j97m7120N8655J4676p009K5302n985o6631N4023L2681n3350
1349c3549p661N9875L8689k8447J1877n1616k9058p597K7781K213J3343L1007
1337B6857l056K8083j6250j4485l2236L3272j8748m3978M8209q2991r328J8149
1325f6502P7663L1810l8665m4240K6138L1062K1386M3295l1856r3188n505L779
1313d4823L666j3402l559J7764k8371J96Q1740L2000j650J2524p2978j2530L1095
1300A672J8116J2361J1571l5788l7121n3245O9943J060j8490j4664p208k4572
1288g6365K4827N2107q070J9798J6970n8110l9839J1361L1788n0878j5348K2366
1276f9393O3515P511o9205j1419N8213m7076j2167N3079m3334J4295K0901M3780
$$ plain form
1362 -34047 -36331 -38594 -38791 -85911 -27256 -12580 -19589 5713 -272 -66903 -12880 19801 -33549
1349 -33549 -41210 18665 57354 28907 40784 -10832 -39890 -47487 -19706 -17493 -4150 26857
1337 26857 23801 51884 35634 21149 -11087 22185 3437 -40541 7668 -75323 -84651 -66502
1325 -66502 11161 42971 4306 -39934 -13796 17266 38652 81947 50091 -43097 -48602 -44823
1313 -44823 -41157 -54559 -58118 -40354 -68725 -68529 13211 45211 43561 56085 -16893 -29423 1672
1300 1672 19788 32149 43720 7932 -29189 -82434 -12491 -11431 -29921 -44585 -51793 -76365
1288 -76365 -51538 569 -7501 12297 29267 -28843 -68682 -57321 -25533 -76411 -91759 -69393
1276 -69393 -5878 1633 -67572 -78991 -20778 -67854 -80021 -26942 -70276 -55981 -35080 8700
1264H700j691M153k8912J2308K2036o878j6209k3802K2943L9193m078J0055K4748
1251F2566r023k7641J1315m8631q219K4169j8165p704M4510J9300k6939J9881
1239C5419j7405J7276J6208k7390R704n3839p616j4133K7582J8011m7569k1606
1227f5358R1735q829o0885K6533L3918K1840k9540l225O744K4993k9308k3020
1215a4402n031j0159L9485k220j199k4545l92q159k0762K8888L743J2391J14k6729
1201b8977L3385M714J2563q583J4597m2662r155J8219M1321j3729m2489R855K6406
1188A5465N8947n6938p288K1720N3037m5045j8641L9006j6672k4892n1191k1545
1176e4037L9992M5613l1573o850K8053n8640j181L4713Q46K1747l4765m2576J7759
$$ plain form
1264 8700 7009 11162 -17750 -5442 16594 9716 -6493 -30295 -7352 31841 27763 37818 62566
1251 62566 53543 25902 37217 -11414 -19633 4536 -13629 -21333 23177 42477 15538 35419
1239 35419 18014 35290 51498 24108 33812 -20027 -27643 -41776 -14194 3817 -43752 -65358
1227 -65358 26377 17548 -43337 -16804 17114 38954 9414 6189 12933 37926 8618 -14402
1215 -14402 -19433 -29592 9893 7673 6474 -18071 -18463 -26622 -47384 -18496 -14753 -2362 -2248 -28977
1201 -28977 4408 9122 21685 13102 27699 -14963 -24118 -5899 35422 21693 -20796 -10941 15465
1188 15465 74412 17474 10186 31906 84943 39898 21257 60263 43591 18699 -32492 -54037
1176 -54037 -14045 31568 -5 -6855 21198 -37442 -38623 -3910 -3064 18683 -16082 -58658 -40899
1163d0899K5430m651K8398k9621K4094L5119p5676P344M2620j2471j0497L8594
1151B7784J5730J0825j3826m6422l694M154o496k9928L6254P767k5429k6220k3802
1138g3303P8922L5242L956k8796k9770j5706M998l6117L4611k321l2370J5992
1126d4662J8652K874l8782P2010N9969p3759m7337N6512K9130j5119k254K014
1114A9248k742n269j0079L4518j1522l4953M7670l6348K6756J2157k0944L1995
1102E0487r428m0243J6787m9224M8688O2520M4199K3835o4863O509k3467l0153
1090C5647m4854k4877J9160L3782m670p442J547o7093N1417M0239M818J011L3730
1077G2415o574p66O735p9290p5248k0004M064K9281J7159J4616P4258M38M1296
$$ plain form
1163 -40899 -15469 -20120 8278 -21343 2751 37870 -37806 -30462 12158 -313 -10810 27784
1151 27784 43514 54339 40513 -5909 -9603 -5449 -11945 -41873 -5619 2148 -23281 -49501 -73303
1138 -73303 5619 40861 44817 16021 -13749 -29455 -24457 -60574 -25963 -28284 -60654 -44662
1126 -44662 -26010 -23136 -61918 10092 70061 -3698 -51035 5477 34607 19488 17234 19248
1114 19248 16506 11237 1158 35676 24154 -10799 36871 523 27279 39436 18492 50487
1102 50487 41059 816 17603 -31621 17067 79587 123786 147621 82758 89267 65800 35647
1090 35647 -9207 -34084 -14924 18858 14188 6746 8293 -58800 -7383 32856 37674 38685 72415
1077 72415 65841 65075 71810 -7480 -82728 -102732 -98668 -69387 -52228 -37612 36646 37084 78380
1064G8380q93l9205o1212K226R292K6573j6190k3892J1323P163q27j6546K987
1051b0821P961M0531K4203m3833j2948k8015K5341M3306J0608J4352j8639R913
1039E1959r85k2256l8169K0075R282Q824k6981L2914p964M459j5493o7154J014
1026e0475K6564K8684J1032J7461p961J382k3110K7048M0136m8954l4031j3912
1014b6136K3520N082j2796n0373K339R1000P764j373k7609j5433k9227N3946L7318
1001E8022m1083K0552N539J3061j3474n5190M612j1691j7671N837J1096L907K2636
988F153m9296O5795K1235j0019j271L9154j1106m336l2415j1696L9337r021M920
975D7434m3948K5121j2547j9176L735j0524N9730n3260O609q355p584j3299O056
$$ plain form
1064 78380 77487 38282 -22930 -20704 -11412 15161 -1029 -24921 -13598 -6435 -7262 -23808 -20821
1051 -20821 -12860 27671 51874 8041 -4907 -32922 -7581 35725 46333 60685 42046 51959
1039 51959 50974 28718 -9451 10624 19906 28730 1749 34663 26699 31158 15665 -51489 -50475
1026 -50475 -23911 4773 15805 33266 25305 26687 3577 30625 70761 21807 -12224 -26136
1014 -26136 -2616 2466 -10330 -60703 -58364 32636 40400 39027 11418 -4015 -33242 20704 58022
1001 58022 16939 37491 43030 56091 42617 -12573 -7961 -19652 -37323 -31486 -20390 -16483 6153
988 6153 -43143 22652 43887 33868 32597 71751 60645 56309 23894 12198 51535 42514 47434
975 47434 3486 28607 16060 -3116 619 -9905 49825 -3435 3174 -5181 -12765 -26064 -20008
962b0008O8620l2738J7922n2176K147K1102l2617L7582J5362j0390N3021m579
950F3248j1381L5298m8199J5918k504k5505o342K2072p1300l8908J1240n937P8106
937A5806o589m7227J6982L3236j0759N7571k7890o3043k9096M0129J5782k1289
925b6387M0492J4372m3505M8101k0854k5921R330J1939l4444j0515j4998k053
913e4443L5756k6163m0837M5828O0625Q883k3861L1797J2491j6597m0880q5111
901i2512L1533O1238L0839K7780n4246m432M1911J3550l6585P734k4105k2679
889a9974M5797n784J2220m0228O835m66J1565M2444L3979k6457q1277l9133P07
876e9772N9877K6710m7900r353L6412j8167J5400P94l9078N0690k8692k7263M9217
$$ plain form
962 -20008 48612 15874 33796 -18380 -16233 4869 -27748 9834 25196 14806 67827 63248
950 63248 51867 87165 38966 54884 52380 26875 20533 42605 -28695 -67603 -56363 -62300 15806
937 15806 9217 -38010 -21028 12208 1449 59020 31130 -31913 -61009 -20880 -5098 -26387
925 -26387 14105 28477 -15028 33073 12219 -13702 -4372 7567 -26877 -37392 -52390 -54443
913 -54443 -18687 -44850 -85687 -39859 20766 29649 5788 37585 50076 33479 -7401 -92512
901 -92512 -60979 259 31098 58878 4632 200 42111 55661 19076 26810 2705 -19974
889 -19974 25823 20039 32259 -7969 -1134 -1600 9965 52409 86388 59931 -21346 -60479 -59772
876 -59772 105 26815 -21085 -30438 5974 -12193 3207 4001 -35077 15613 -13079 -40342 8875
863H875j9422L3618k498l3407J2083J2224M7070J7493l2907o669j7113o342J7651
850C0656l7235p662J9418M2166J8938j9901N1049o1040j346J1367O997l3563m6722
837b6878j0445M4714K4825j8837J9944k7309j7604Q686n95K3636j7098K8878j4147
824A7770k074k5339j3604Q184J0933L0459N396j0232k5223J9079m0436K1005J2635
811H553J3080K127J1994n3220j3065N6944L2486q1854j7274J3905M5104J29l6815
798a7906p232J9276K3562m0905j9639J2371L4109M1124l6432M330L626L7664k2853
785C1095j9075L1096o063m5949M1921M9687k8767k3794Q149K208M3625n695Q527
772H6965K9348J0815l8122l2758J6186l422j9843J4793m0830M0564l3460m0965
$$ plain form
863 8875 -10547 23071 20573 -12834 -751 11473 58543 76036 43129 36460 19347 13005 30656
850 30656 -6579 -14241 5177 47343 66281 46380 97429 36389 35043 46410 53407 19844 -26878
837 -26878 -37323 7391 32216 13379 33323 6014 -11590 -2904 -3499 20137 3039 31917 17770
824 17770 15696 -9643 -23247 -15063 -4130 26329 31725 21493 -3730 15349 -25087 -4082 8553
811 8553 21633 23760 35754 -17466 -30531 26413 58899 -22955 -40229 -26324 18780 18909 -17906
798 -17906 -25138 -5862 17700 -23205 -42844 -30473 3636 44760 8328 12658 16284 53948 31095
785 31095 12020 43116 37053 -8896 33025 82712 53945 30151 38300 40508 84133 78438 86965
772 86965 116313 127128 89006 56248 72434 69012 49169 63962 23132 63696 30236 -10729
760a0729P910J4082p449q131k7730J7344L6513L4497O263n7033j2042Q927L1799
747C4221J9371l8106K854J2169q0588L7242J0473l245k38L419j1168l969n0649
734f8214J3519O240M8519J8291j2956n2795K8808Q41M8178L522m4914r375K4684
721D348k9498j1537M7423J4776j0068K981J2230j9898j9798j7993J9643L5102
709B7711J4833q6j5532L6075l909N471k7202m2432P945k1717K4738Q160J0480
$$ plain form
760 -10729 -2819 11263 3814 -4317 -32047 -14703 21810 56307 62570 5537 -6505 2422 34221
747 34221 53592 15486 18340 30509 -50079 -12837 -2364 -5609 -5847 -2428 -13596 -17565 -68214
734 -68214 -54695 -48455 64 18355 5399 -47396 -18588 -17747 30431 33953 -10961 -20336 4348
721 4348 -25150 -36687 10736 25512 15444 18425 30655 10757 -9041 -27034 -7391 27711
709 27711 42544 42458 26926 63001 59092 64563 37361 -5071 2874 -18843 5895 14055 24535
$$ [...]
##END NTUPLES=NMR SPECTRUM
##END=
