##TITLE=1H_TG-2340-XI
 CDCl3
 8 sc, 
 5.6.2023
##JCAMPDX= 6.0         $$ Bruker NMR JCAMP-DX V2.0
##DATA TYPE= NMR SPECTRUM
##DATA CLASS= NTUPLES
##ORIGIN= UXNMR, Bruker Analytische Messtechnik GmbH
##OWNER= root
$$ XWIN-NMR		Version 3.5
$$ Mon Jun  5 13:44:25 2023 Russian Standard Time (UT+4h)  she@DPX200
##.OBSERVE FREQUENCY= 200.13135
##.OBSERVE NUCLEUS= ^1H
##.ACQUISITION MODE= SIMULTANEOUS
##.ACQUISITION SCHEME= undefined
##.AVERAGES= 8
##.DIGITISER RES= 18
##SPECTROMETER/DATA SYSTEM= spect
##.PULSE SEQUENCE= zg30
##.SOLVENT NAME= CDCl3
##.SHIFT REFERENCE= (INTERNAL, CDCl3, 0, 15.7822)
##AUDIT TRAIL= $$ (NUMBER, WHEN, WHO, WHERE, WHAT)
$$ ##TITLE= Audit trail, XWIN-NMR		Version 3.5
$$ ##JCAMPDX= 5.01
$$ ##ORIGIN= Bruker BioSpin GmbH
$$ ##OWNER= she
$$ F:/spectra/data/she/nmr/H-F/1/pdata/1/auditp.txt
$$ ##AUDIT TRAIL=  $$ (NUMBER, WHEN, WHO, WHERE, WHAT)
(   1,<2023-06-05 13:43:12.92 +0400>,<she>,<DPX200>,
      <created by zg, POWCHK disabled, PULCHK disabled
       configuration hash MD5:
       00 E9 B6 7A A2 85 ED C7 34 08 36 98 17 FE 4E 26
       data hash MD5: 16K
       D0 56 C6 36 6E D9 05 B1 4C E1 56 9E B7 D8 2E 02>)
(   2,<2023-06-05 13:43:15.48 +0400>,<she>,<DPX200>,
      <Start of raw data processing
       efp BC_mod = 2 LB = 0.24 FT_mod = 6 PKNL = 1 PHC0 = -19899.33 PHC1 = 12.25272 SI = 16K 
       data hash MD5: 16K
       3B 50 CA B2 3F CA 8F 54 DC F9 22 85 8C DF 19 8E>)
(   3,<2023-06-05 13:43:31.68 +0400>,<she>,<DPX200>,
      <pk PHC0 = -3.35505 PHC1 = -1.2 
       data hash MD5: 16K
       78 DB D9 C1 BF 65 7C F9 52 31 EE 92 0A C8 83 6D>)
(   4,<2023-06-05 13:43:37.01 +0400>,<she>,<DPX200>,
      <abs ABSG = 5 
       data hash MD5: 16K
       93 87 09 5E 72 96 B2 B4 EC 02 17 0F 46 BE 48 99>)
(   5,<2023-06-05 13:43:59.54 +0400>,<she>,<DPX200>,
      <abs ABSG = 5 
       data hash MD5: 16K
       6D A7 E5 08 C8 1D 23 36 06 20 0A E9 F8 CC F2 96>)
$$ ##END=
$$ 
$$ hash MD5
$$ 8A 31 4F 60 85 06 9E 5A E2 53 D3 EA 40 30 81 40
##$RELAX= 
##$RELAX= 
##$RELAX= 
##$RELAX= 
##$RELAX= 
##$RELAX= 
$$ Bruker specific parameters
$$ --------------------------
##$DU= <F:/spectra>
##$EXPNO= 1
##$NAME= <H-F>
##$PROCNO= 1
##$TYPE= <nmr>
##$USER= <she>
##$AMP= (0..31)
100 100 100 100 100 100 100 100 100 100 100 100 100 100 100 100 100 100 
100 100 100 100 100 100 100 100 100 100 100 100 100 100 
##$AQSEQ= 0
##$AQ_mod= 1
##$AUNM= <au_zg>
##$AUTOPOS= <>
##$BF1= 200.13
##$BF2= 200.13
##$BF3= 200.13
##$BF4= 200.13
##$BF5= 200.13
##$BF6= 200.13
##$BF7= 200.13
##$BF8= 200.13
##$BYTORDA= 1
##$CFDGTYP= 0
##$CFRGTYP= 5
##$CHEMSTR= <none>
##$CNST= (0..31)
1 1 145 1 1 1 1 1 1 1 1 1 1 1 1 1 1 1 1 1 1 1 1 1 1 1 1 1 1 1 1 1 
##$CPDPRG= <>
##$CPDPRG1= <>
##$CPDPRG2= <>
##$CPDPRG3= <>
##$CPDPRG4= <mlev>
##$CPDPRG5= <mlev>
##$CPDPRG6= <mlev>
##$CPDPRG7= <mlev>
##$CPDPRG8= <mlev>
##$CPDPRGB= <>
##$CPDPRGT= <>
##$D= (0..31)
0 1.2 0 0 0 0 0 0 0 0.06 0 0.03 0 0 0 0 0.0002 0 0 0 0 0 0 0 0 0 0 0 0 
0 0 0 
##$DATE= 1685958192
##$DBL= (0..7)
$$ [...]
##$SUBNAM3= <"">
##$SUBNAM4= <"">
##$SUBNAM5= <"">
##$SUBNAM6= <"">
##$SUBNAM7= <"">
##$SUBNAM8= <"">
##$SUBNAM9= <"">
##$SW= 18.05172834244
##$SWIBOX= (0..15)
0 0 2 0 0 0 0 0 0 0 0 0 0 0 0 0 
##$SW_h= 3612.71676300578
##$TD= 16384
##$TD0= 1
##$TE= 0
##$TE2= 300
##$TE3= 300
##$TEG= 300
##$TL= (0..7)
0 120 120 120 120 120 120 120 
##$TP= (0..7)
150 150 150 150 150 150 150 150 
##$TP07= 0
##$TPNAME0= <>
##$TPNAME1= <>
##$TPNAME2= <>
##$TPNAME3= <>
##$TPNAME4= <>
##$TPNAME5= <>
##$TPNAME6= <>
##$TPNAME7= <>
##$TPOAL= (0..7)
0.5 0.5 0.5 0.5 0.5 0.5 0.5 0.5 
##$TPOFFS= (0..7)
0 0 0 0 0 0 0 0 
##$TUNHIN= 0
##$TUNHOUT= 0
##$TUNXOUT= 0
##$USERA1= <user>
##$USERA2= <user>
##$USERA3= <user>
##$USERA4= <user>
##$USERA5= <user>
##$V9= 5
##$VALIST= <valist>
##$VCLIST= <CCCCCCCCCCCCCCC>
##$VD= 0
##$VDLIST= <DDDDDDDDDDDDDDD>
##$VPLIST= <PPPPPPPPPPPPPPP>
##$VTLIST= <TTTTTTTTTTTTTTT>
##$WBST= 1024
##$WBSW= 4
##$XGAIN= (0..3)
0 0 0 0 
##$XL= 0
##$YL= 0
##$YMAX_a= 477712
##$YMIN_a= -562054
##$ZGOPTNS= <>
##$ZL1= 120
##$ZL2= 120
##$ZL3= 120
##$ZL4= 120
##$ABSF1= 15.78215
##$ABSF2= -2.269699
##$ABSG= 5
##$ABSL= 3
##$ALPHA= 0
##$AQORDER= 0
##$ASSFAC= 0
##$ASSFACI= 0
##$ASSFACX= 0
##$ASSWID= 0
##$AUNMP= <proc_1d>
##$AZFE= 0.1
##$AZFW= 0.1
##$BCFW= 0
##$BC_mod= 2
##$BYTORDP= 0
##$COROFFS= 0
##$CY= -3
##$DATMOD= 1
##$DC= 0
##$DFILT= <>
##$DTYPP= 0
##$F1P= 0
##$F2P= 0
##$FCOR= 1
##$FTSIZE= 16384
##$FT_mod= 6
##$GAMMA= 0
##$GB= 0
##$INTBC= 1
##$INTSCL= 3.70164e-10
##$ISEN= 128
##$LB= 0.24
##$LEV0= 0
##$LPBIN= 0
##$MAXI= 10000
##$MC2= 0
##$MEAN= 0
##$ME_mod= 0
##$MI= 1.114404
##$NCOEF= 0
##$NC_proc= -6
##$NLEV= 6
##$NOISF1= 3.799351
##$NOISF2= 2.8
##$NSP= 0
##$NTH_PI= 0
##$NZP= 0
##$OFFSET= 15.78215
##$PC= 1
##$PHC0= -19902.69
##$PHC1= 11.05272
##$PH_mod= 1
##$PKNL= yes
##$PPARMOD= 0
##$PSCAL= 0
##$PSIGN= 0
##$REVERSE= no
##$SF= 200.129997877407
##$SI= 16384
##$SIGF1= 3
##$SIGF2= 2
##$SINO= 5.538805
##$SIOLD= 16384
##$SREGLST= <1H.CDCl3>
##$SSB= 0
##$STSI= 16384
##$STSR= 0
##$SW_p= 3612.71676300578
##$SYMM= 0
##$S_DEV= 0
##$TDeff= 16384
##$TDoff= 0
##$TI= <>
##$TILT= no
##$TM1= 0
##$TM2= 0
##$TOPLEV= 0
##$USERP1= <user>
##$USERP2= <user>
##$USERP3= <user>
##$USERP4= <user>
##$USERP5= <user>
##$WDW= 1
##$XDIM= 16384
##$YMAX_p= 512578041
##$YMIN_p= -601056
$$ End of Bruker specific parameters
$$ ---------------------------------
##NTUPLES= NMR SPECTRUM
##VAR_NAME=  FREQUENCY,     SPECTRUM/REAL,   SPECTRUM/IMAG
##SYMBOL=    X,             R,               I
##VAR_TYPE=  INDEPENDENT,   DEPENDENT,       DEPENDENT
##VAR_FORM=  AFFN,          ASDF,            ASDF
##VAR_DIM=   16384,         16384,           16384
##UNITS=     HZ,            ARBITRARY UNITS, ARBITRARY UNITS
##FACTOR=    0.220516191357247, 1,           1
##FIRST=     3158.48169974677, 0,            0
##LAST=      -454.235063259012, 0,           0
##MIN=       -454.235063259012, -601056,     0
##MAX=       3158.48169974677, 512578041,    0
$$ Real data points
##PAGE= N=1
##DATA TABLE= (X++(R..R)), XYDATA
$$ [...]
6942A361813p7982M4646n3932L8615p4129j45548r0495L7679J9270m2408j7084
6931A000445j10695L0789n7816K6617j08685n5606M2296j4985M0798M1231j30445
6920G03944p9141K2473K8340r730J181q2316K1787l1962l8627m7301o4255J25203
6908E49596P2458k5731m7324L190n1166o4171J8215O6640n6378k2772O4302j81401
6896C25458n5803O9947k0286N7182K9159P01j7879l7928l7843j24669L9151Q7762
6884C14952R571J5580L3555J728j13844Q0339J7400J4778r2206M4514j9202q0357
6872B26808P8623j4953K7717m5787k7789O460l9424m2363j00091k7276P7582M3739
6860A63246J16887o5398k7513J0397J00534j50972M2901N2801K1501o4493o3103
$$ plain form
6942 1361813 1283831 1328477 1274545 1313160 1239031 1093483 1002988 1040667 1059937 1017529 1000445
6931 1000445 889750 920539 862723 889340 780655 725049 767345 752360 793158 834389 703944
6920 703944 624803 647276 675616 665886 667067 584751 606538 574576 535949 488648 424393 549596
6908 549596 622054 596323 548999 552189 501023 436852 455067 521707 465329 442557 506859 325458
6896 325458 269655 339602 319316 376498 405657 406358 388479 350551 312708 188039 227190 314952
6884 314952 324523 340103 373658 375386 261542 341881 359281 374059 281853 326367 307165 226808
6872 226808 305431 290478 318195 272408 244619 251079 211655 169292 69201 41925 119507 163246
6860 163246 280133 214735 187222 197619 298153 147181 190082 242883 264384 199891 136788
6849A36788R959M0193K10912p8200q0223p5392j5905M78k603L2809Q3370m3949
6837B18237K2657P093j18675M1527J47999j33980n581k5887J08304K896o3365
6826B01225J2523K5321o8611n2599K0237R5655k8049q891p7636P2526N7010j08168
6814A40543o0393N0606J16099l5781o7214k6325l5834K1904J77070J07818l8809
6803C49684j00940r2863K0937n4603R869Q1923N4353j02006r703P4135q894n3382
6791A68510O206K2618J5807J8253o4962k6888J1291O4938q9239N8031n3467m0900
6779I0198r905J552L5103J16801l3288l3865j15206l4401J16371m861L3674l3585
6767A28588j31294M9511k7872P6294O1474j6897j8531q9465M6589P3693r535J130
$$ plain form
6849 136788 146747 186940 397852 319652 239429 164037 148132 148610 146007 178816 262186 218237
6837 218237 240894 247987 129312 170839 318838 184858 179277 153390 261694 264590 201225
6826 201225 213748 239069 170458 117859 138096 233751 205702 196811 119175 191701 248711 140543
6814 140543 80150 130756 246855 211074 143860 117535 81701 103605 280675 388493 349684
6803 349684 248744 155881 176818 122215 132084 214007 268360 166354 156651 230786 221892 168510
6791 168510 174716 197334 213141 231394 166432 139544 150835 215773 126534 184565 131098 90198
6779 90198 80293 81845 116948 233749 200461 166596 51390 16989 133360 128499 162173 128588
6767 128588 -2706 46805 18933 95227 156701 139804 121273 31808 78397 152090 142555 143685
6755A43685J1816N6403L2103q3155M0800j07230J07464l0625j43809P7577L2945
6744A37974N5868J927M1157K4427m7816o9825Q76k6699n159j7104J05401o6531
6732A34496J9269l9745q3586L0643M3941p5755M0293j1408l4337K5148J5530m0326
6720B4163o8106n0705j9632J51800r9319J14511p2164Q729p2503J2146J50023
6709G8943j1090J39038k8643n7134k6426J6894j38675l1400K4472M969K5343j267
6697d976M2505Q0425q3489J31309n7328Q236J00002j04484M6817O5493r7965Q5426
6685B11971O2986n3886N9580N9319M03K7591K0310J9619J65148J06950l5411K8757
6673F73337N9030q6440L3698j25952r8202m0612l5523j6235q8782j40439N8656
$$ plain form
6755 143685 155501 211904 244007 160852 201652 94422 201886 171261 27452 105029 137974
6744 137974 193842 195769 236926 261353 213537 143712 144588 117889 112730 95626 201027 134496
6732 134496 153765 114020 30434 61077 105018 29263 69556 58148 23811 48959 64489 24163
6720 24163 -43943 -94648 -114280 37520 -61799 52712 -19452 -10723 -83226 -71080 78943
6709 78943 67853 206891 178248 121114 94688 111582 -27093 -58493 -34021 -29052 -3709 -4976
6697 -4976 37529 117954 34465 165774 108446 116682 216684 112200 159017 224510 126545 211971
6685 211971 274957 221071 280651 339970 340373 367964 388274 407893 573041 679991 644580 673337
6673 673337 732367 645927 679625 553673 455471 414859 379336 363101 274319 133880 192536
6662A92536p8008q8437j2263k0210L3168J6105m0149L0882n1542J27876L3272
6651A43230m9969n741n4384L3585q797j21501P0220P8432m3277j9188R6526m2024
6639G7112n6833J8968k7193O7585M1145p6363L2342p1134m830J4639o3766m0943
6627h9271Q0848L1910m3858N9339k1543R8769l6371q4623j10657O4443M1693m1302
6615e0623K9302J28188j558j32495J9779L3374L106j61294Q7920L3593L4962j5975
6603H279m0074l9294p06L6740O5980Q486m1548Q136l4531J01555N353m5162r0729
6590e7515P920k881Q503Q7621o7974O1285Q3568P68k3232l6721R3226m3555L1937
6577A42950m4451j526P5000Q0705m4606q6483p1425P5925k9706r5148N289j817
$$ plain form
6662 192536 114528 26091 13828 -6382 26786 42891 2742 33624 -17918 109958 143230
6651 143230 93261 87520 33136 66721 57924 -63577 6643 85075 41798 22610 119136 77112
6639 77112 20279 39247 12054 79639 120784 44421 76763 5629 799 15438 -48328 -89271
6627 -89271 -8423 23487 -20371 38968 17425 116194 79823 -4800 -115457 -51014 -9321 -50623
6615 -50623 -21321 106867 105309 -27186 -7407 25967 29073 -132221 -44301 -10708 24254 8279
6603 8279 -31795 -71089 -71795 -35055 30925 39411 -2137 5999 -28532 73023 78376 33214 -57515
6590 -57515 -49595 -52476 -43973 43648 -24326 36959 120527 121295 98063 61342 154568 111013 142950
6577 142950 98499 96973 171973 252678 208072 121589 50164 126089 96383 1235 6524 4707
6565D707R7713P3490q3865j36171k6499k4058K5752m9081K0547J54476p682M2502
6553I1831N9835r5974j04175P4034j5L1086L3700j8726j28065M197J30115n040
6541G2803r2579O7266J40169J4056j17766J01172p5693m7950O6320n344m3629
6530G8825m1409m9066K8778J34640L4571L2816o8834m569k4036P6404j2202j8596
6518A67322J7559K9388k3819q2385L894J07529Q851L803Q6474j20586Q552M1875
6506B48457k8754P2439Q7295K5601j0377m266O9601l5917R6810k4597j12J4420
6494E10600j41404q7874j9570P2831p0088N3298K6711n9143j1690m3326j27475
6483A02870p391L4867N3083O4802j774L2100L2663m2388P2741o3795R3920o0351
$$ plain form
6565 4707 102420 175910 92045 -44126 -70625 -94683 -68931 -118012 -97465 57011 49329 91831
6553 91831 151666 55692 -48483 25551 25536 56622 90322 71596 -56469 -52272 77843 72803
6541 72803 -19776 47490 187659 201715 83949 185121 109428 61478 127798 122454 78825
6530 78825 37416 -11650 17128 151768 186339 219155 150321 145752 121716 198120 185918 167322
6518 167322 184881 214269 190450 108065 111959 219488 228339 232142 318616 198030 206582 248457
6506 248457 219703 292142 379437 405038 394661 390395 459996 424079 520889 496292 496180 510600
6494 510600 369196 281322 261752 334583 264495 317793 344504 285361 273671 230345 102870
6483 102870 95479 130346 183429 248231 246457 278557 311220 268832 341573 277778 371698 311347
6471C11347J1551J11322L5366j49996o6926J0680R3621O6257r2376o4943N7989
6460C23892R2336o1303M1673Q466k6879r99O3448Q045L152K3301J9696o9835j5495
6447D09498J8319M7074P645P9768m4756k7676o547J02404J06508o3932J5821j2969
6435F31157l0374r0332M6776J32630l6510L2945M5757K8392K6086N1835j09224
6424G29138m1263J33911N6588m3134j0768J03768m6321j0650L4905j9287o4547
6413H22340J07703l296j08889J21700R6843p1945Q6404P236K6976q3723R7879
6402A099228k7514J9242L4588p4805N7432k1036K6533J24104j9725j9575n9168
6391A139304R5743K0422j33943Q7912O820o099Q769L5072m1838J3728R3019j813
$$ plain form
6471 311347 322898 434220 469586 319590 252664 263344 356965 423222 330846 265903 323892
6460 323892 416228 354925 396598 405064 378185 377186 440634 448679 451831 475132 494828 424993 409498
6447 409498 427817 474891 482536 562304 517548 489872 483325 585729 692237 628305 644126 631157
6435 631157 600783 510451 557227 689857 653347 686292 732049 760441 786527 838362 729138
6424 729138 687875 821786 878374 835240 824472 928240 881919 871269 906174 886887 822340
6413 822340 930043 926747 817858 939558 1036401 964456 1050860 1058096 1085072 1001349 1099228
6402 1099228 1071714 1090956 1125544 1050739 1108171 1087135 1113668 1237772 1218047 1198472 1139304
6391 1139304 1235047 1255469 1121526 1209438 1216258 1210159 1218928 1254000 1212162 1225890 1318909 1317096
6379A317096j4946J4958R0463N8605o6458R454M348o2192M7961J9118k6951J4048
6367A405504m4771j4561J999J37144j9678l6010l6786J2861p104l1711r374j7269
6355A340244N135N5503k0967o723k27857L9399R6320P3641r1548j00776J36404
6344A298775j5370N0187K3882j05415r0387N1328M7406k916K2714N0785m761n9233
6332A266995O5704p8151K9066M100L1795N1620K935Q4596K2118l2856j4191P3591
6320A507322q2175k7370P8420k570n5953k9380m5573j36116J40868O6869L5935
6309A450277J3766m5906j0350p4030J9941P2956K1509q1832M1099J1549L7464
6298A456443Q259j18057M1697Q7308j1420J14744o479j1321j9733j45356K3434
$$ plain form
6379 1317096 1302150 1317108 1407571 1466176 1399718 1409172 1413520 1351328 1399289 1418407 1391456 1405504
6367 1405504 1360733 1346172 1348171 1485315 1465637 1429627 1392841 1405702 1398598 1366887 1357513 1340244
6355 1340244 1345379 1400882 1379915 1373192 1145335 1184734 1281054 1354695 1263147 1162371 1298775
6344 1298775 1283405 1333592 1357474 1252059 1161672 1213000 1260406 1257490 1280204 1330989 1326228 1266995
6332 1266995 1332699 1254548 1283614 1287714 1319509 1371129 1374064 1458660 1480778 1447922 1433731 1507322
6320 1507322 1425147 1397777 1476197 1473627 1417674 1388294 1342721 1206605 1347473 1414342 1450277
6309 1450277 1464043 1418137 1407787 1333757 1353698 1426654 1448163 1366331 1407430 1418979 1456443
6298 1456443 1464702 1346645 1388342 1475650 1464230 1578974 1572495 1561174 1541441 1396085 1419519
6287A419519J72985R514R443J10347O5952p257R2148j17850k3806M2427P3979
6276A847401L669K662J6293K04316N2829m3324J4793L1337J16230n62J3910O8097
6264B327651O4704N8057o4962L4103q837q5949j1988k4635J59764J21742l4679
6253B534971p5254R9190J45777m8499l7693M1360J27398J02191q5560j9760j9926
6242B764195K3446J01071j672o7087Q7517r5217M0200J28538L4502p5514j5285
6231B924694J21328J07449q1477P230P8565Q0085O0049n7169n3896O4649q990
6220C242517o6512k5084M6177K9869j23309L4883L0901K8179m0383Q7269L6651
6209C281158p3926o3898p8616R7663o3r4236R2708J60095l8014j84630l3067N7742
$$ plain form
6287 1419519 1592504 1602018 1611461 1721808 1787760 1780503 1872651 1754801 1730995 1773422 1847401
6276 1847401 1851070 1853732 1870025 2074341 2127170 2083846 2098639 2129976 2246206 2245644 2259554 2327651
6264 2327651 2392355 2450412 2385450 2419553 2410716 2324767 2312779 2288144 2447908 2569650 2534971
6253 2534971 2459717 2558907 2704684 2656185 2618492 2659852 2787250 2889441 2803881 2784121 2764195
6242 2764195 2787641 2888712 2887040 2819953 2907470 2812253 2852453 2980991 3015493 2939979 2924694
6231 2924694 3046022 3153471 3071994 3079224 3157789 3237874 3297923 3240754 3186858 3251507 3242517
6220 3242517 3176005 3150921 3197098 3226967 3103658 3138541 3169442 3197621 3157238 3244507 3281158
6209 3281158 3207232 3143334 3064718 3162381 3162318 3068082 3160790 3320885 3282871 3098241 3065174 3122916
6197C122916n5653j5680K5909J3747k4669q6892p0265p5870L8766K0345m9215
6186B843439M7887l9573K1328J03584m4781q0978P7144J17302l0294o4562O3586
6175C014082O9375Q2085J04060j25757n5346p4784k9507j06782j16458M5055J9862
6164B825885J3151r9841j5603O1118m6736J00053o0681J5028j657k191n6314J30367
6152B862579N6297p4481N3779K9564p0362r1183L4128Q6102J03762o9259Q948
6141B929874m0846n517M0772N8277p0691n0206J24683L2067m7782K5821k7236
6130B969216J37219Q2889O841j167J02067L9649l0662N4625P0560R9220l0768
6119C499689J3102K9101Q4259k6583q091J18665R2968m7753M4860M3994O5838
$$ plain form
6197 3122916 3067263 3051583 3077492 3091239 3066570 2979678 2909413 2833543 2872309 2892654 2843439
6186 2843439 2891326 2851753 2873081 2976665 2931884 2850906 2928050 3045352 3015058 2950496 3014082
6175 3014082 3083457 3165542 3269602 3143845 3088499 3013715 2984208 2877426 2760968 2806023 2825885
6164 2825885 2839036 2739195 2723592 2784710 2737974 2838027 2777346 2792374 2790717 2788526 2732212 2862579
6152 2862579 2918876 2844395 2898174 2927738 2857376 2766193 2800321 2886423 2990185 2920926 2929874
6141 2929874 2889028 2883511 2924283 2982560 2911869 2861663 2986346 3018413 2970631 2996452 2969216
6130 2969216 3106435 3189324 3196165 3194998 3297065 3336714 3306052 3360677 3431237 3530457 3499689
6119 3499689 3512791 3541892 3626151 3599568 3591477 3710142 3803110 3755357 3800217 3844211 3910049
6108C910049K14626Q7149j48P3315J06534p5321J7990Q6844K19912O8177O0781
6097D769908K8450O8611R6363L0463L255J44698J36528J11982J35821J80497J58113
6086E864689J46002J0105P4202J64332R2692K25294K14258J45067J77122K00509
6076G314272K30166L30104K18151J38568K48051J84654K25014L42142K70442J62987
6066I664551L68666M57390K85541M44146N06399N60783M47418O69775P12916R52594
6056A5070179J133559J261223J609551J761338K137447K639445L031104L273127
6048C1916973L413915L801267L659738K360461j8291k563349l692663l013615
6040C5864436j396508M1620J146529J664672J948997K519891K463286J106512
$$ plain form
6108 3910049 4124675 4211824 4211676 4284991 4391525 4316204 4334194 4421038 4640950 4709127 4769908
6097 4769908 4798358 4866969 4963332 4993795 4997050 5141748 5278276 5390258 5526079 5706576 5864689
6086 5864689 6010691 6020796 6094998 6259330 6352022 6577316 6791574 6936641 7113763 7314272
6076 7314272 7544438 7874542 8092693 8231261 8479312 8663966 8888980 9231122 9501564 9664551
6066 9664551 10033217 10490607 10776148 11220294 11726693 12287476 12734894 13404669 14117585 15070179
6056 15070179 16203738 17464961 19074512 20835850 22973297 25612742 28643846 31916973
6048 31916973 35330888 39132155 42791893 45152354 45134063 42570714 38878051 35864436
6040 35864436 34467928 34509548 35656077 37320749 39269746 41789637 44252923 45359435
6032D5359435j576537m256757n406184m992925l675627k648691j843314j331440
6024A9627960r94340o81953n65569m58884l01869k18870j97535l3939K9303n3769
6014A6150535J03579J88581J59910L19102M09052M30105N83065P53936R08093
6005B0005958J163355J366274J672400K116644K580882K914237L614740L962560
5997C9397050M276700M620041M753678M005302J550100j955166m591670m726365
5989D7329670l099240j070333M86276J556481K101120K739243L096771K252079
5981E5392067m56470m126948o940987p310680o016591m336045l146127k351928
5973B0706291j859519j601445j129543r76939q45291o32603n78348n03441n36358
$$ plain form
6032 45359435 43782898 39526141 34119957 29127032 25451405 22802714 20959400 19627960
6024 19627960 18633620 17951667 17386098 16927214 16625345 16406475 16208940 16175001 16204304 16150535
6014 16150535 16254114 16442695 16602605 16921707 17330759 17760864 18343929 19097865 20005958
6005 20005958 21169313 22535587 24207987 26324631 28905513 31819750 35434490 39397050
5997 39397050 43673750 48293791 53047469 57052771 58602871 56647705 52056035 47329670
5989 47329670 44230430 43160097 43646373 45202854 47303974 50043217 53139988 55392067
5981 55392067 54935597 50808649 43867662 36556982 30540391 26204346 23058219 20706291
5973 20706291 18846772 17245327 16115784 15138845 14293554 13660951 13082603 12579162 12042804
5964A2042804m22114l41123l13150l26524l16551j80213j59310j14455k14950
5955I654414j49051k15974j03771j61268q6835j13208j13552j89514j82442j42346
5945H196453k04451n2747l7193j61754j41267p5157r3907q3646R7049p0620K5032
5934G397792l9366P888L5002n6880m618j01668o9080k7370j26660j81781J10833
5923F944092P1990j70403k7206O0957j1724M9929q5748M0615L8416j3072J4286
5912F912132J40802J59015K6538R2413J83114J15650L4198O9906O7050K10977
5902H011795L9605k30J82732N0228J62143J04463J61857J15050J73341Q7358R1675
5891I180017J31647J31392J28474J24696J79602O1283J16137J86258P9655J41419
$$ plain form
5964 12042804 11620690 11279567 10966417 10639893 10323342 10143129 9983819 9869364 9654414
5955 9654414 9505363 9289389 9185618 9024350 8937515 8824307 8710755 8521241 8338799 8196453
5945 8196453 7992002 7939255 7902062 7740308 7599041 7523884 7429977 7346331 7443380 7372760 7397792
5934 7397792 7358426 7366314 7401316 7344436 7339818 7238150 7169070 7141700 7015040 6833259 6944092
5923 6944092 7016082 6845679 6818473 6879430 6867706 6917635 6831887 6872502 6910918 6897846 6912132
5912 6912132 7052934 7211949 7238487 7330900 7514014 7629664 7663862 7733768 7800818 8011795
5902 8011795 8051400 8051170 8233902 8284130 8446273 8550736 8712593 8827643 9000984 9088342 9180017
5891 9180017 9311664 9443056 9571530 9696226 9875828 9937111 10053248 10239506 10319161 10460580
5881A0460580J54305J08789K63890J10913Q8954L5718J34843K59526O3270J82404
5871A1863192Q4092J04684J81623K44854K49918J74680K81139L95955L15341M71880
5861A4367358N43021M87948O00804O24339O56522O42181O38596P52199O27186
5852A9940154P19548P66131P79824Q37378P39224O66769N40104L57917L37422
5843B5684471J48002Q997Q473k09355k60305j63818q0044k03511k51111j84026
5833B4497773k51251k83731j02330o5718m8943L0825O1869J52101K65916L95227
5823B4651738O53582P79603Q81828J040964J118960J219081J164273J054260P97117
5814C3361406L69427l01211r29474j227383j298861j136857o17841o62434l20841
$$ plain form
5881 10460580 10614885 10723674 10987564 11098477 11187431 11223149 11357992 11617518 11680788 11863192
5871 11863192 11947284 12051968 12233591 12478445 12728363 12903043 13184182 13580137 13895478 14367358
5861 14367358 14910379 15398327 15999131 16623470 17279992 17922173 18560769 19312968 19940154
5852 19940154 20659702 21425833 22205657 23043035 23782259 24449028 24989132 25347049 25684471
5843 25684471 25832473 25841470 25849943 25640588 25380283 25216465 25136421 24932910 24681799 24497773
5833 24497773 24246522 23962791 23860461 23794743 23745800 23776625 23838494 23990595 24256511 24651738
5823 24651738 25305320 26084923 26966751 28007715 29126675 30345756 31510029 32564289 33361406
5814 33361406 33730833 33429622 32500148 31272765 29973904 28837047 28219206 27556772 27235931
5805B7235931P9078J0758J75666L67630P31374J018806J024372Q81325N14618
5796C2039558K26336M3075m06223o09155r35540r55527j048462q79793p49984
5787B6724285p42557m94615m51471l37328l64923m71434j17001R5775L88014L62018
5777B4590763N69600P43778P10437O88964J04757q11383j475118k068321j883482
5768B1169995j597306j295531r53996q08095p26991n64716n58358m57207l87281
5759A3820514l46498k84882m11315j83208j33124j97186j20508q0901j51312j64104
5749A1747476j26950j54625r2487J8923p202k82816j32428j17384q8934K0187
5739A0783760k5382q0399r4444Q590m1101R3312L4070J47062J22319J57398L8790
$$ plain form
5805 27235931 27315009 27325767 27501433 27869063 28600437 29619243 30643615 31524940 32039558
5796 32039558 32265894 32308969 31902746 31293591 30358051 29402524 28354062 27474269 26724285
5787 26724285 25981728 25487113 25035642 24698314 24333391 23861957 23744956 23840731 24228745 24590763
5777 24590763 25160363 25904141 26614578 27303542 27408299 26596916 25121798 23053477 21169995
5768 21169995 19572689 18277158 17323162 16515067 15788076 15223360 14665002 14207795 13820514
5759 13820514 13474016 13189134 12777819 12594611 12461487 12264301 12143793 12062892 11911580 11747476
5749 11747476 11620526 11465901 11373414 11392337 11385135 11102319 10969891 10852507 10763573 10783760
5739 10783760 10758378 10677979 10583535 10592125 10551024 10644336 10678406 10825468 10947787 11105185 11143975
5728A1143975Q5134K17229K53863Q3754J69885K31888K32470K74556L46093N14164
5718A3553011M09310O89674O46615O43366R57351R78758J226837J597072J876821
5709B2578815K152004K538618K968636K874162K867920L435409L731339L265531
5701D6412434J824724l95401l399150n235195n608167m565227l017551k021877
5693B3994590j398504q89156o01734k30075o6778K49203M38803O25089J000929
5684B3122367J279746J523413K221708K736138K841205K795574K868119L504386
5676D2892656L548140L228763J854686q39353l883642o023643n977079m690535
5668C0109993l429119k279794j458824j097927p29295k45853j87538J85349M79463
$$ plain form
5728 11143975 11229109 11446338 11700201 11783955 11953840 12185728 12418198 12692754 13038847 13553011
5718 13553011 13962321 14651995 15298610 15941976 16899327 17878085 19104922 20701994 22578815
5709 22578815 24730819 27269437 30238073 33112235 35980155 39415564 43146903 46412434
5701 46412434 48237158 47841757 44442607 39207412 33599245 29034018 26016467 23994590
5693 23994590 22596086 21706930 21105196 20875121 20808343 21057546 21496349 22121438 23122367
5684 23122367 24402113 25925526 28147234 30883372 33724577 36520151 39388270 42892656
5676 42892656 46440796 49669559 51524245 50684892 46801250 40777607 34800528 30109993
5668 30109993 26680874 24401080 22942256 21844329 21115034 20869181 20681643 20866992 21346455
5659B1346455O94750Q66566J319262J726434J793525J800588K079779K323925
5651C3951284K520404J716324N24550j403989l596102m560971l966997k787229
5643B2397274k108961j317867q03919n71146m04503k74071j16332J74494L19545
5634A7294514M85872P16328J075910J264693J587118K085355K082131J993760
5626B8585681K194814K640931K716482J908946M95485j831012m084933n080213
5618B7546181m410924l215699k246033j785551j341439r21426p62525p79696o32030
5609A1450858n11653n81283m58679l23228m28335l40126k61446k89324j98591
5600H058193j38836k7611k05720j18337J06755M2993o2846J20891j2717o5286
$$ plain form
5659 21346455 22041205 22907771 24227033 25953467 27746992 29547580 31627359 33951284
5651 33951284 36471688 38188012 38712562 37308573 33712471 29151500 25184503 22397274
5643 22397274 20288313 18970446 18166527 17595381 17190878 16916807 16800475 16974969 17294514
5634 17294514 17780386 18496714 19572624 20837317 22424435 24509790 26591921 28585681
5626 28585681 30780495 33421426 36137908 38046854 38542339 36711327 32626394 27546181
5618 27546181 23135257 19919558 17673525 15887974 14546535 13625109 12862584 12082888 11450858
5609 11450858 10939205 10357922 9899243 9576015 9147680 8807554 8546108 8256784 8058193
5600 8058193 7919357 7891746 7686026 7567689 7674444 7717437 7654591 7775482 7762765 7697479
5590G697479l2882p6008r3983j20828j79254j84627j22689k59052k93016k46584
5580F088556J0408m0229j89096j62892j22006k0630M8740o1716k15231n3998J00448
5569E382354m4446J5953j5542L2728j09440j6018j06159q3309o9591r0721L763
5558D899572j08239o5100j21332N1355l4749J24670M3032l4079J40121K26308
5548E121559J44246Q7536K9783Q9570l8057r6411p7617j96917k54450j55193k44185
5537D409864k29081m5126q682o325j21326k2725p0155q0228j4652l4978K9689
5526C806275n8662N9667J8587J74938R4182J34136K07115Q3914P8928R3251p7996
5515D614335J15263k0831j22808j30221l29408k19765m6267n2486j49516j18250
$$ plain form
5590 7697479 7664597 7588589 7494606 7373778 7194524 7009897 6887208 6628156 6335140 6088556
5580 6088556 6098964 6058735 5869639 5706747 5584741 5564111 5612851 5551135 5335904 5281906 5382354
5569 5382354 5337908 5353861 5338319 5371047 5261607 5245589 5139430 5056121 4986530 4895809 4899572
5558 4899572 4791333 4726233 4604901 4656256 4621507 4746177 4789209 4755130 4895251 5121559
5548 5121559 5265805 5353341 5383124 5472694 5434637 5338226 5260609 5063692 4809242 4654049 4409864
5537 4409864 4180783 4135657 4126975 4120650 3999324 3976599 3906444 3826216 3811564 3776586 3806275
5526 3806275 3747613 3807280 3825867 4000805 4094987 4229123 4436238 4520152 4599080 4692331 4614335
5515 4614335 4729598 4708767 4585959 4455738 4126330 3906565 3860298 3807812 3658296 3540046
5505C540046L5933j5360J2453Q7196J9831L7173K04405J29656L8810R0251J32735
5494D313129J84915l1134l3098r7996j25491m8382n0370k08168j64899j57628
5484C580878J0701J83552Q9330j01307M8451J69268L3798M9645L2975P8076J37579
5473D312946L7677J79949J34119K85274J47792J90380K67598N4452l964j4197
5463E592026j99435j57029j37659k39658j16193L1560j35476l7106Q5987k0002
5453D667015j12272P3951n2423j66563o3044j30190J4732j5011j50719J9645m6251
5442D038870j40233j21376K604m1371r8604J3016q1372J1318O1828k6771j7588
5431C600321M0148J11803p853r9553O9969J01678J19841P8791J18006J04950j7576
$$ plain form
5505 3540046 3575979 3560619 3573072 3660268 3680099 3717272 3921677 4051333 4090143 4180394 4313129
5494 4313129 4498044 4466910 4433812 4335816 4210325 4161943 4111573 3903405 3738506 3580878
5484 3580878 3591579 3775131 3864461 3763154 3811605 3980873 4014671 4064316 4097291 4175367 4312946
5473 4312946 4350623 4530572 4664691 4949965 5097757 5288137 5555735 5610187 5606223 5592026
5463 5592026 5392591 5235562 5097903 4858245 4742052 4773612 4638136 4601030 4687017 4667015
5453 4667015 4554743 4628694 4576271 4409708 4346664 4216474 4231206 4216195 4065476 4085121 4038870
5442 4038870 3898637 3777261 3779865 3738494 3639890 3652906 3571534 3582852 3644680 3617909 3600321
5431 3600321 3640469 3752272 3744419 3644866 3714835 3816513 3936354 4015145 4133151 4238101 4220525
5420D220525J37850P2332J98366L41628O3339J07985J12598O865j43972l12622
5410D804894k36187j48566k1168N8883J41422J15075P3868M8627k3859K41987
5400E054976j7336n9050m7684q2174n3147j84795j68604j47910j42508j03873
5390D047895M6335J6352J8764K2137j6582j5515K9040J35340M2558R7477M1358
5379D465159R3623R9057J67206Q6661J4180J51227J28187P7996J93797K91594
5369E768687J21887K23191K89423J28691J05842J88008J38712J54048P7503k06666
5359F989326n6599P1349K23090K57240K29398L14158L24327K82517M78042M73047
5349I585895L90803N73030N41455M82813J72970J46441K5057j69918r4979j64337
$$ plain form
5420 4220525 4358375 4430707 4629073 4970701 5034040 5142025 5254623 5261488 5117516 4804894
5410 4804894 4568707 4420141 4398973 4457856 4599278 4714353 4788221 4836848 4812989 5054976
5400 5054976 5037640 4978590 4930906 4848732 4795585 4610790 4442186 4294276 4151768 4047895
5390 4047895 4094230 4110582 4129346 4151483 4134901 4119386 4148426 4283766 4326324 4423801 4465159
5379 4465159 4558782 4657839 4825045 4911706 4925886 5077113 5205300 5283296 5477093 5768687
5369 5768687 5890574 6113765 6403188 6531879 6637721 6825729 6964441 7118489 7195992 6989326
5359 6989326 6932727 7004076 7227166 7484406 7713804 8027962 8352289 8634806 9112848 9585895
5349 9585895 9976698 10549728 11091183 11573996 11746966 11893407 11918464 11748546 11653567 11489230
5339A1489230j30498m17004l30685k61554j87753k74069j17736J55724N0870K548
5329I979073j1143R1563J12955J23523J61493J83317k5407j14326k92425k66813
5319I941810j04203m9350p1896j5033r5009l07047l94575l39272l65012j42185
5309H058228j64260l8832J9551R1023J70740J45006L59065M02802L92490K82143
5299I717956L51909K02149J10735J59728K45023K69724q9130j74003m97496o11693
5289I684902l36413k31675j65803l01406k63599k19684k65572j55122n2468J04089
5279G797249l4798J04436K66561K21747K49543K62853K88335L63608O90573M40396
5269A0650503K71126J22308k24166n07365m48059m08746k38040j47116j89849
$$ plain form
5339 11489230 11358732 10941728 10611043 10349489 10161736 9887667 9769931 9925655 9976525 9979073
5329 9979073 9967930 10059493 10172448 10295971 10457464 10640781 10615374 10501048 10208623 9941810
5319 9941810 9837607 9788257 9716361 9701328 9606319 9299272 8904697 8565425 8200413 8058228
5309 8058228 7893968 7855136 7874687 7965710 8136450 8281456 8640521 9043323 9435813 9717956
5299 9717956 10069865 10272014 10382749 10542477 10787500 11057224 10968094 10794091 10296595 9684902
5289 9684902 9348489 9116814 8951011 8649605 8386006 8166322 7900750 7745628 7693160 7797249
5279 7797249 7762451 7866887 8133448 8355195 8604738 8867591 9155926 9519534 10210107 10650503
5269 10650503 10921629 11043937 10819771 10312406 9864347 9455601 9217561 9070445 8880596
5260H880596k5717J17086K25639K47123N0098J84753J05246j7684J91637j1660
5250I947117k18892k24593k71318j71233o8773j07519o8969J9835O0721J03201
5240H999577J10853J51668J94557K05087J99612J27399m8846j26996J0127k5548
5230I797490j64953J9641R1648k5230k3436k68434j95689j72390k67341k62577
5220H528729k12855m1968n9516K6571j32224j34677L358j02679o2040o2709R1279
5209G841269j0152o729R7198J11971j04780m941p2752O444k27191J7759J6763
5198G664859j11536j7105m5149m4593j18874o1902r1594O590O3176J2460m8991
5187G207341L107P8283r7945k23953R8420P5901O903j1688K38032m4399L7454
$$ plain form
5260 8880596 8854879 8971965 9197604 9444727 9494825 9679578 9784824 9767140 9958777 9947117
5250 9947117 9728225 9503632 9232314 9061081 8992308 8884789 8815820 8835655 8896376 8999577
5240 8999577 9110430 9262098 9456655 9661742 9861354 9988753 9939907 9812911 9823038 9797490
5230 9797490 9632537 9652178 9743826 9718596 9695160 9426726 9231037 9058647 8791306 8528729
5220 8528729 8315874 8273906 8214390 8240961 8108737 7974060 7977418 7874739 7812699 7749990 7841269
5209 7841269 7831117 7824388 7921586 8033557 7928777 7923836 7851084 7857528 7630337 7648096 7664859
5198 7664859 7553323 7536218 7491069 7446476 7327602 7265700 7174106 7180696 7243872 7256332 7207341
5187 7207341 7210448 7288731 7190786 6966833 7065253 7141154 7148057 7136369 7374401 7330002 7367456
5176G367456J64498K1264J70602M329m151J68315L7620o8374l3200K9417m1617
5165G816159J37987Q2386O4104J87275J06996J04887J47366J83541k0932J38968
5155H948737K40831K07649R1560J41298J86223K71380L50804L79387L16999L00822
5145A1435690L62286K58762K03776M6496R1902O7160K17905L34147K23894M73176
5135A3715194L44780L23037N18565M57922M31030O08319Q37701P66927J017333
5126A9020808J135946J283950J318186J252013J531956J655935J377879J030883
5118B9607556M59767k9275J11276O35405J154474J515770J721336K123126K467264
5109C9766699K655974K216970J227419j1003q09287n69663N47864J422630J701068
$$ plain form
5176 7367456 7531954 7553218 7723820 7728149 7723998 7892313 7929933 7861559 7828359 7857776 7816159
5165 7816159 7954146 8036532 8100636 8287911 8394907 8499794 8647160 8830701 8809769 8948737
5155 8948737 9189568 9397217 9488777 9630075 9816298 10087678 10438482 10817869 11134868 11435690
5145 11435690 11797976 12056738 12260514 12307010 12398912 12466072 12683977 13018124 13242018 13715194
5135 13715194 14059974 14383011 14901576 15359498 15790528 16398847 17236548 18003475 19020808
5126 19020808 20156754 21440704 22758890 24010903 25542859 27198794 28576673 29607556
5118 29607556 30067323 30038048 30149324 30784729 31939203 33454973 35176309 37299435 39766699
5109 39766699 42422673 44639643 45867062 45856059 45046772 44477109 45024973 46447603 48148671
5100D8148671J728955J446560J552968K146837K574428K874532K742005K293556
5092F5508512K378321K536957K506003K238154J499644j58026j813262k745273
5084G1951030k754486k168627j314136p89410p35429j234101j610632j165545
5076F0178664p65078o95769p84980r35969r89687n14571K39270J089913J408668
5067E8230461J170342P95947R58236J123923P50948l90910j897350l609451m365832
5058E2766314l967276l159099k600701j943545j175183o88136k65636j65115l05407
5049C8496216p71629j239536j471562j077823m65006Q3965M34224Q88604J156315
5040C6033768J253483J341179J569175J650456J452443R22270L13770j56891o84819
$$ plain form
5100 48148671 49877626 51324186 52877154 55023991 57598419 60472951 63214956 65508512
5092 65508512 67886833 70423790 72929793 75167947 76667591 76509565 74696303 71951030
5084 71951030 69196544 67027917 65713781 64924371 64188942 62954841 61344209 60178664
5076 60178664 59413586 58717817 57932837 56996868 56007181 55492610 55731880 56821793 58230461
5067 58230461 59400803 60196750 61154986 62278909 63029857 62638947 60741597 57132146 52766314
5058 52766314 48799038 45639939 43039238 41095693 39920510 39232374 38966738 38801623 38496216
5049 38496216 37724587 36485051 35013489 33935666 33470660 33554625 33988849 34877453 36033768
5040 36033768 37287251 38628430 40197605 41848061 43300504 44222774 44536544 44379653 43694834
5031D3694834q30722n64348q44409j331683j470174j001703n22252J68430N68071
5022C7866044R93824J215510J322122J346654J601980J945931K673554L089542
5014E2055161L191285L329523L957404M310709M059824L307764K459803J304868
5006G7976341k93l81011j039045k580923m172539l779411k181773j63746J709433
4997F5387033K588118L080567L274428K581746J841458J728208J777110J170835
4989H3429503Q32984J378619J775016J677031L589633O115492P556466P276871
4981A13631615N337955K2721n166140o752575m127658j448949r24513k778684
4973I7793772o033882q099711q064414o080287m035054j929980o04561j59711
$$ plain form
5031 43694834 42864112 42299764 41455355 40123672 38653498 37651795 37129543 37297973 37866044
5022 37866044 38859868 40075378 41397500 42744154 44346134 46292065 48965619 52055161
5014 52055161 55246446 58575969 62533373 66844082 70903906 74211670 76671473 77976341
5006 77976341 77976048 77595037 76555992 73975069 69802530 66023119 63841346 63677600 65387033
4997 65387033 67975151 71055718 74330146 76911892 78753350 80481558 82258668 83429503
4989 83429503 84262487 85641106 87416122 89093153 92682786 98798278 106354744 113631615
4981 113631615 118969570 118992291 113826151 107073576 102945918 101496969 100572456 97793772
4973 97793772 91759890 83660179 75595765 69515478 65480424 63550444 62945883 62786172
4965F2786172m00425j615009k825028k873858k280551j530024n69498N91633J111665
4956E2395077J061143O1925j326457k260893k027023j348611q49136j401639k206476
4947D2097910k883751k598998j738170j142153p69715j29000J51200k06338p53048
4938C2027937j537010k318747k389153j649729j136410r04571o57258m98104m70606
4929B0466349j96426k67717l29401k50086k04990j71951k44961j50178j85911
4920A8464728j41983n2375l8791l6371J2952j07332J6802j1297K4037l2205J02948
4909A8201113J53357M1928P7906L3356R7219J12926J90827L72396L72546L83790
4899B0037364N10911N17722P18612Q39646R25339J204843J551553J844892K180247
$$ plain form
4965 62786172 62385747 60770738 57945710 55071852 52791301 51261277 50691779 51283412 52395077
4956 52395077 53456220 53518145 52191688 49930795 47903772 46555161 45706025 44304386 42097910
4947 42097910 39214159 36615161 34876991 33734838 32965123 32836123 32987323 32780985 32027937
4938 32027937 30490927 28172180 25783027 24133298 22996888 22092317 21435059 20936955 20466349
4929 20466349 20269923 20002206 19672805 19422719 19217729 19045778 18800817 18650639 18464728
4920 18464728 18322745 18270370 18231579 18195208 18208160 18100828 18117630 18106333 18130370 18098165 18201113
4909 18201113 18354470 18396398 18474304 18507660 18604879 18717805 18908632 19281028 19653574 20037364
4899 20037364 20548275 21065997 21784609 22624255 23549594 24754437 26305990 28150882 30331129
4890C0331129K751368L167749L641742M339772M844433M207582K961396K039031
4882E8284202J31992k964180o082249p188874o040406m158797k886498j923035
4874B7172155j196519r67552p64571m21975m81837m28424j67763L6352o3840k4300
4864B2691726J41992J39843K53268L85116M72670P02869R14347R29946J282425
4855B7914202J389719J635532K031350K267274K043465J736250K241346L376786
4847D4635924M460671M578268N275066O020755L992760j013518o389525p535955
4839E4024446n443686l317046j716053o86122M31016J463597K757340L545632
4831E1059124L569437L702813M003473J624583l191033p470830p886773n847212
$$ plain form
4890 30331129 33082497 36250246 39891988 44231760 49076193 53283775 56245171 58284202
4882 58284202 58416194 55452014 49369765 42180891 36140485 31981688 29095190 27172155
4874 27172155 25975636 25008084 24243513 23821538 23339701 22911277 22743514 22779866 22716026 22691726
4864 22691726 22833718 22973561 23226829 23611945 24084615 24787484 25701831 26631777 27914202
4855 27914202 29303921 30939453 32970803 35238077 37281542 39017792 41259138 44635924
4847 44635924 49096595 53674863 58949929 64970684 68963444 67949926 61560401 54024446
4839 54024446 48580760 45263714 43547661 42861539 43292555 44756152 47513492 51059124
4831 51059124 54628561 58331374 62334847 63959430 60768397 53297567 45410794 39563582
4823C9563582l804597k675505j694237j177379j258434j388215j319873r85361
4815B5259981o20806o03572m15143k65686k53305j85543j31106P9196O5057N3290
4805B2982363K20109K04663K72645L07221M65361N06356N76442O98597O09306
4796B6843063R25191J090094J415661J660229J679951K001582K031155J317538
4788C8964464o3517j009153j331717j365257j043839o21631j02224m2499M41592
4779C3826219N18449Q23018R21813J129138J282418J579585J699628K022766K560169
4770D6363203K791262K802112L031656L783069M069547L866986K922605J034025
4762G0664465l02253j92667O30330N97322m4813j243267j059669J43252J333382
$$ plain form
4823 39563582 35758985 33083480 31389243 30211864 28953430 27565215 26245342 25259981
4815 25259981 24639175 24035603 23620460 23354774 23101469 22915926 22784820 22864016 22929073 22982363
4805 22982363 23202472 23407135 23679780 23987001 24452362 24958718 25535160 26233757 26843063
4796 26843063 27768254 28858348 30274009 31934238 33614189 35615771 37646926 38964464
4788 38964464 38900947 37891794 36560077 35194820 34150981 33529350 33427126 33384627 33826219
4779 33826219 34344668 35167686 36089499 37218637 38501055 40080640 41780268 43803034 46363203
4770 46363203 49154465 51956577 54988233 58771302 62840849 66707835 69630440 70664465
4762 70664465 70362212 70169545 70799875 71397197 71352384 70109117 69049448 69192700 70526082
4753G0526082K404954L272891M064253M734702N136058M419355K997032L002902
4745A00558229L531216M036878L242880J060148j823885l414751k484555m58004
4737A04248156M65546L46841J60562K44994Q5663J475278K875772L988259N031077
4728A18922148O082134O002335N930874O767890Q122716R626787J1650915J3560200
4720A86665999J5548251J8297162K4096589K8245176K9972393L4855102L7213917
4713C74894589L9574473L9888481K9330232M187347k7532364n3432057o6328037
4706C40582664o4692228m9434934l3995062k2921117j6102141j1361096q260265
4699A33815821o093764m366220k926558k347553j518380k16543O18381P63206
$$ plain form
4753 70526082 72931036 76203927 80268180 85002882 90138940 94558295 97555327 100558229
4745 100558229 104089445 108126323 111369203 112429351 110605466 107190715 104706160 104248156
4737 104248156 104713702 105060543 105221105 105466099 105551762 107027040 109902812 113891071 118922148
4728 118922148 125004282 131006617 136937491 143705381 151828097 161454884 173105799 186665999
4720 186665999 202214250 220511412 244608001 272853177 302825570 337680672 374894589
4713 374894589 414469062 454357543 483687775 487875122 460342758 406910701 340582664
4706 340582664 275890436 226455502 192460440 169539323 153437182 142076086 133815821
4699 133815821 127722057 123355837 120429279 118081726 116563346 116346803 116965184 117728390
4691A17728390m30305k744336n324919o277631m990237l148111j727214n90109
4683I2495528L98102J277859K114679K933719L869674M568572M916852N831584
4675A18406569O761791O915712O650230O155818M313245J216868j431995l471870
4667A45516368n017746m708409j958082J543832M613309P648800J0894935J4356942
4659A72889949J8371233K3194333K9614898L2229051L2047932L9625119M4252244
4652C92224759M1628542L6887783K1749076o451852l4166900n0355261o1676873
4645C39839274o5775553n4383301l8775577k6986768j9665176j4911858j1721542
4638A07619499r500946q061601o838542n996901n338072m539873m000780l611939
$$ plain form
4691 117728390 117298085 114553749 109228830 102951199 97960962 94812851 93085637 92495528
4683 92495528 92893630 94171489 96286168 99219887 103089561 107658133 112574985 118406569
4675 118406569 125168360 132084072 138734302 144890120 149203365 150420233 148988238 145516368
4667 145516368 140498622 135790213 133832131 135375963 139989272 147638072 158533007 172889949
4659 172889949 191261182 214455515 244070413 276299464 308347396 347972515 392224759
4652 392224759 433853301 470741084 492490160 486038308 451871408 401516147 339839274
4645 339839274 274063721 219680420 180904843 153918075 134252899 119341041 107619499
4638 107619499 98118553 90056952 83218410 77221509 71883437 67343564 63342784 59730845
4630E9730845l124801k748411k462438k233637j885649j814220j694495j137819
4622D2629375j084186j207072j052013r44097q32034p90891r31366q45666q11190
4613C4130860q21384o66545o95993q41813q56630n52318m95492n63290m85732
4604B8151663l37126m34944l43032l18406k36181k87969k16470k37528j45224
4595B5594783k4708q1414j04399m2053j37426j57631p5740j10618l0852j26018
4585B4703924n9187M2241R635q7951k02670m52703n30683n64561n41525k42747
4575B2073773M6963k2640Q1559K69042J80682R2680K09616N0954J79654K41614
4565B3403897K83871J87504J63746O7619L3888R984k3111r8359n9628k6639P577
$$ plain form
4630 59730845 56606044 53857633 51395195 49161558 47275909 45461689 43767194 42629375
4622 42629375 41545189 40338117 39286104 38342007 37509973 36719082 35787716 34942050 34130860
4613 34130860 33309476 32642931 31946938 31105125 30248495 29696177 29200685 28637395 28151663
4604 28151663 27814537 27379593 27036561 26718155 26481974 26194005 25977535 25740007 25594783
4595 25594783 25570075 25488661 25384262 25342209 25204783 25047152 24971412 24860794 24829942 24703924
4585 24703924 24644737 24686978 24696613 24608662 24405992 23953289 23422606 22858045 22316520 22073773
4575 22073773 22120736 22098096 22179655 22448697 22629379 22722059 22931675 22982629 23162283 23403897
4565 23403897 23687768 23875272 24039018 24106637 24140525 24150509 24127398 24029039 23969411 23942772 23950349
4554B3950349K24758K89691L07576M86263O40123O26030P13244P54375Q53084
4545B8845493J051143J217425J497613J576346K058614K384276K821888L354516
4537D4807314L568948L692321M254989M774900M849766M356845K120742r79264
4529G1446561l308565l851640k510153o17899P53675J498109K296652L327321
4521F9034061L520133K568648N74652k395371m451192m476974l008282j501557
4513E9864118k5054J305344J826144J480468P858k277799l985525m240695k940029
4504E1014830j259048j18307M01419J061089J475771J498042Q84106j077131l294759
4495E0586012n171635n433416m457798l350337k461872j885237j483666j098642
$$ plain form
4554 23950349 24175107 24464798 24772374 25258637 25898760 26524790 27238034 27992409 28845493
4545 28845493 29896636 31114061 32611674 34188020 36246634 38630910 41452798 44807314
4537 44807314 48376262 52068583 56323572 61098472 65948238 70305083 72425825 71446561
4529 71446561 68137996 64286356 61776203 61158304 61911979 63410088 65706740 69034061
4521 69034061 72554194 75122842 75697494 73302123 68850931 64373957 61365675 59864118
4513 59864118 59839064 61144408 62970552 64451020 64458878 62181079 58195554 53954859 51014830
4504 51014830 49755782 49637475 50038894 51099983 52575754 54073796 54957902 53880771 50586012
4495 50586012 45414377 39980961 35523163 32172826 29710954 27825717 26342051 25243409
4487B5243409j075780r29799o80885l73259n10102m11227k77651l61254k41554
4478B0381898j96751k45774l80648m14552k06458n1512M9633Q4845J58004O7948
4468A9246633J92369J87385J13687J30436J2327J54259J72849K71446L25021L01517
4458B1107929M88036O04496O93240P29892Q12146Q83729J110406J161920J481810
4449B9073604J799886K160980K632625L174776L748004L999817M081393M673828
4441E5344913N333779N210198L459593n3572l161364m183598k193449p09303N02832
4432E9550029K403850L429265L190572J150231k532522o325270o324365l653015
4424E0888775j459817J31783R54413J821056K783791L236807L026400J951252
$$ plain form
4487 25243409 24167629 23237830 22556945 22183686 21673584 21262357 20984706 20623452 20381898
4478 20381898 20185147 19939373 19558725 19144173 18937715 18886203 18935836 19020681 19178685 19246633
4468 19246633 19439002 19626387 19740074 19870510 19882837 20037096 20209945 20481391 20806412 21107929
4458 21107929 21595965 22200461 22893701 23623593 24435739 25319468 26429874 27591794 29073604
4449 29073604 30873490 33034470 35667095 38841871 42589875 46589692 50671085 55344913
4441 55344913 60678692 65888890 69348483 69294911 66133547 61949949 59756500 59047197 59550029
4432 59550029 61953879 65383144 68573716 69723947 67191425 60866155 54541790 50888775
4424 50888775 49428958 49560741 50515154 52336210 55120001 58356808 61383208 63334460
4416F3334460l40559k264667k921492k576427j665760m20854J162366J779657
4408E6086724J068239j263011m438592o441806o072616m160166k826453j934854
4400C0017465j468612j453428j214397r99724j121955j320916j269852j240255
4392A9928326j122246p63049m85289m81018l21702j71159j12063o4867j03263
4383A6303670k81572k49258k82478j00773j09970k63386r7122j79784k89992l25053
4373A4124282o9109k39998j75456p1749P0130J72648J06312P1769p5638j09761
4363A3803430j21008J6448j03603j63851k65583j98126j54044j84460k33312l41168
4353A2054723k66498j69250k1623l392k6962K706J81880M6348K23764m807j95873
$$ plain form
4416 63334460 62993901 60729234 57807742 55231315 53565555 53144701 54307067 56086724
4408 56086724 57154963 55891952 51453360 45011554 38938938 34778772 31952319 30017465
4400 30017465 28548853 27095425 25881028 24881304 23759349 22438433 21168581 19928326
4392 19928326 18806080 18043031 17557742 17076724 16755022 16583863 16471800 16406933 16303670
4383 16303670 16022098 15772840 15490362 15389589 15279619 15016233 14919111 14739327 14449335 14124282
4373 14124282 14055173 13815175 13639719 13567970 13638100 13810748 13917060 13988829 13913191 13803430
4363 13803430 13682422 13698870 13595267 13431416 13165833 12967707 12813663 12629203 12395891 12054723
4353 12054723 11788225 11618975 11597352 11593960 11566998 11569704 11751584 11797932 12021696 12016889 11821016
4342A1821016n2787j97560k74398m1057J0769l219j19141j31039k99904l27797
4332A0384883k70161n45869n19393m86792l48798l10212j68980j90768j66859
4323G377051j47669j3145o4939r5258j39452j08052p1197M2391j01302j57281
4313F521147J7191o9480j68661p9324K9129K5781P736N5956p53P5846J90610J55417
4301F760595J58051K69197Q3554K0115J69464K01878J54295J71182L22060J81183
4291H491574Q4841J02857R9409q5861j67191k84185j92875q7829j02082o814J12549
4280G964393M9870O2348J63131O2505J62878J71993J4485M2922j4125m9254J06689
4269H737835M5103P3066R4010o303q7029k22394q0140j29341j16678n4969j77723
$$ plain form
4342 11821016 11768229 11570669 11296271 11255214 11265983 11262764 11143623 11012584 10712680 10384883
4332 10384883 10114722 9568853 9049460 8562668 8213870 7903658 7734678 7543910 7377051
4323 7377051 7229382 7216237 7151298 7056040 6916588 6808536 6737339 6779730 6678428 6521147
4313 6521147 6538338 6468858 6300197 6220873 6250002 6275783 6283519 6339475 6338722 6414568 6605178 6760595
4301 6760595 6918646 7187843 7271397 7291512 7460976 7662854 7817149 7988331 8310391 8491574
4291 8491574 8576415 8679272 8778681 8692820 8525629 8241444 8048569 7960740 7858658 7851844 7964393
4280 7964393 8014263 8076611 8239742 8302247 8465125 8637118 8651603 8694525 8680400 8631146 8737835
4269 8737835 8782938 8856004 8950014 8943711 8856682 8634288 8554148 8424807 8308129 8253160 8075437
4258H075437r6689M1507j5965M4416K5132M0161J84148O5488J7899N3812J59346
4247H594692N6418Q3178J67669J04167J38697J70936J68333L37524K53344Q5683
4237A0160641K39736J68705K5999Q6634J05657P0858J76335J51439L56099J97863
4227A1739966K73813L15542K08302P3035M9765J24557J35852K77111J64963K00766
4217A3563672K44928K54878L47022K94174K44141J96019J75266L26259O9694J86690
4207A5902743K71559J99284J18773Q9365m0028N8453Q7370R3758R0530K23193
4197A7095000J67113J98603K69188J93314L05736K69419K93969K06291K87016
4188A9285649L03707K43730J95275R6179J51745K01334K16464L55688L78387L13324
$$ plain form
4258 8075437 7978748 8020255 8004290 8048706 8073838 8113999 8298147 8363635 8381534 8435346 8594692
4247 8594692 8651110 8734288 8901957 9006124 9144821 9315757 9484090 9821614 10074958 10160641
4237 10160641 10400377 10569082 10595081 10681715 10787372 10858230 11034565 11186004 11542103 11739966
4227 11739966 12013779 12329321 12537623 12610658 12660423 12784980 12920832 13197943 13362906 13563672
4217 13563672 13808600 14063478 14410500 14704674 14948815 15144834 15320100 15646359 15716053 15902743
4207 15902743 16174302 16373586 16492359 16581724 16541696 16600149 16687519 16781277 16871807 17095000
4197 17095000 17262113 17460716 17729904 17923218 18228954 18498373 18792342 18998633 19285649
4188 19285649 19589356 19833086 20028361 20124540 20276285 20477619 20694083 21049771 21428158 21741482
4178B1741482L83872L35953K41838L41515M04208L09520K15067J78952K38708
4169B4391115K46878L05524L28588M61397P17492O32098N82166O00224O32726
4160B8898208R35018Q48784P82530R19165J049791R86102R69504J090564J113754
4151C7593420J131580J241641J448591J392395J450057J513117J624024J713384
4143D9108209J793861J822966K005274J931842K106201K106016J948841K060088
4135F4883298K326490K544813L077476L355753M048723M773487N641739O493838
4127I7145617P565418Q731101J0638928J2754232J5901954J9640174K3955002
4120A96332426K8961527L5547711L9486692M2522233M5482483M8049437M5857374
$$ plain form
4178 21741482 22125354 22461307 22703145 23044660 23448868 23758388 23973455 24152407 24391115
4169 24391115 24637993 24943517 25272105 25733502 26450994 27083092 27665258 28265482 28898208
4160 28898208 29833226 30682010 31464540 32383705 33433496 34419598 35389102 36479666 37593420
4151 37593420 38725000 39966641 41415232 42807627 44257684 45770801 47394825 49108209
4143 49108209 50902070 52725036 54730310 56662152 58768353 60874369 62823210 64883298
4135 64883298 67209788 69754601 72832077 76187830 80236553 85010040 90651779 97145617
4127 97145617 104711035 113442136 124081064 136835296 152737250 172377424 196332426
4120 196332426 225293953 260841664 300328356 342850589 388333072 436382509 482239883
4113D82239883L0338158j041435l7145364o1515343o8833966n9146869m5309330
4106B39585734l2296492k3010297j6218626j1506059q410061p048280p228765
4099A33867154r053651j0715480j1298683j0647315q827508p352902o298722n315520
4091F4357373m687654l823607l278254k888410k414462k124431j902681j634671
4083D1603203j351449j307422j363656j283891j071833j110988j120021j162719
4075C1831224j164020j340354j325937j153425r97583r05690p33009o69029o01421
4066B2940756m34372l92657m11303l63046l09054l17619l82906l31860l25568
4057A9672371l00207k57446l10795k95491k63181k54520p4738k07845j22519k46999
$$ plain form
4113 482239883 512578041 511536606 474391242 412875899 344041933 284895064 239585734
4106 239585734 207289242 184278945 168060319 156554260 148144199 141095919 133867154
4099 133867154 124813503 114098023 102799340 92152025 83324517 75971615 69672893 64357373
4091 64357373 59669719 55846112 52567858 49679448 47264986 45140555 43237874 41603203
4083 41603203 40251754 38944332 37580676 36296785 35224952 34113964 32993943 31831224
4075 31831224 30667204 29326850 28000913 26847488 25849905 24944215 24211206 23542177 22940756
4066 22940756 22506384 22113727 21702424 21339378 21030324 20712705 20329799 19997939 19672371
4057 19672371 19372164 19114718 18803923 18508432 18245251 17990731 17915993 17708148 17585629 17338630
4047A7338630q8636j49500j13993L2477K02041L82938O23470O72032Q67645J339825
4037B1106929J527858J763446K240553K798734K797957K689711L217798L215173
4029D1358159K557366O03061k291766m853282n596362m731674l396898k505732
4021B1142872k028797j319332j104094r84560p99436p05021p16967o78040n44583
4012A2262042n00487m16521k92474l14579k77954j79999j73657k49076j68875
4003I688420j91239j93309j46794l1248q9266m0392j01678j76597j09864m0654
3993H567379k54380k41021l01089j84733r9539k82987r5168O9533l1829L8022
3983G184188o0942r5301N901o9952K7432K9329n7023p0275j11417q8978N8026
$$ plain form
4047 17338630 17249994 17100494 16986501 17018978 17221019 17603957 18227427 18899459 19767104 21106929
4037 21106929 22634787 24398233 26638786 29437520 32235477 34925188 38142986 41358159
4029 41358159 43915525 44518586 42226820 37373538 31777176 27045502 23648604 21142872
4021 21142872 19114075 17794743 16690649 15706089 14906653 14201632 13484665 12806625 12262042
4012 12262042 11761555 11345034 11052560 10737981 10460027 10280028 10106371 9857295 9688420
4003 9688420 9497181 9303872 9157078 9125830 9036564 8996172 8894494 8717897 8608033 8567379
3993 8567379 8312999 8071978 7770889 7586156 7486617 7203630 7108462 7177995 7146166 7184188
3983 7184188 7123246 7027945 7033846 6963894 6991326 7020655 6963632 6893357 6781940 6692962 6750988
3972F750988l7256p7981j76740j82008j23288k2446P5702k2782O978J22077J18778
3961F432022Q5407Q7626N8855j44516j74523k16181j99280j25790j36414q1720
3951E585486J7417O5277N3249J0145k4638k23645l17987l96485k08947l25777
3941D234095l33237k97149j71384j63131j32800n7080j28873J3549m92K8726J21677
3930C113901m0865O5616O7456R9464j6814j64093J292Q9005J51819L3063J1064
3919C410908q7974j19082q1304r4705M18J67120p0252l5607j96502j37128k8783
3908B727109l7908K8410j14163j3448o1171J30826J41369L9201K7024o1189l440
3897B802620j33017L2253j65930j7477K7811l2958j04027m4974R8723R0470k8560
$$ plain form
3972 6750988 6713732 6635751 6459011 6277003 6153715 6131269 6206971 6184189 6191167 6313244 6432022
3961 6432022 6517429 6605055 6663910 6519394 6344871 6128690 5929410 5803620 5667206 5585486
3951 5585486 5602903 5668180 5721429 5731574 5706936 5483291 5165304 4768819 4559872 4234095
3941 4234095 3900858 3603709 3432325 3269194 3136394 3079314 2950441 2963990 2963498 2992224 3113901
3930 3113901 3073036 3138652 3206108 3305572 3288758 3124665 3125957 3214962 3366781 3399844 3410908
3919 3410908 3322934 3203852 3122548 3027843 3028261 3195381 3125129 3089522 2893020 2755892 2727109
3908 2727109 2689201 2717611 2603448 2590000 2528829 2659655 2801024 2840225 2867249 2806060 2802620
3897 2802620 2669603 2701856 2535926 2518449 2546260 2513302 2409275 2364301 2463024 2553494 2524934
3886B524934N7375q8345p3176J02223L5192o7391l8589m5882m0597P6882o5404
3875B377222J1690O0891p4429M6477J8062J5741J52351l2678j2915N2603Q8107
3864B703122J03099J9347m3255O4259M0740l7586J9318Q4617J39980K7550j59882
3853B961309o3977O1087O6025l104O3082J22440K07184J2250m6892k9797K36059
3842C585666P7968R2393K52562k5283J95489J93591P7815R933P9207K47417R9310
3831D886068J92962L83430K52997L24999K61589L73539M48279M02342L53974K73041
3821H153220K05065J10701O5720K5533L05536M82948O54676J006336J217576J584591
3811A3811902J845763J455086J587305J985278K184812K004932J319216j33339
$$ plain form
3886 2524934 2582309 2493964 2420788 2523011 2558203 2490812 2452223 2406341 2365744 2442626 2377222
3875 2377222 2388912 2449803 2375374 2421851 2439913 2455654 2608005 2575327 2562412 2615015 2703122
3864 2703122 2806221 2825568 2782313 2846572 2887312 2849726 2869044 2953661 3093641 3121191 2961309
3853 2961309 2897332 2958419 3024444 3021340 3084422 3206862 3414046 3426296 3379404 3349607 3585666
3842 3585666 3663634 3756027 4008589 3983306 4178795 4372386 4450201 4460134 4539341 4786758 4886068
3831 4886068 5079030 5462460 5715457 6040456 6302045 6675584 7123863 7526205 7880179 8153220
3821 8153220 8358285 8468986 8534706 8560239 8865775 9348723 10003399 11009735 12227311 13811902
3811 13811902 15657665 17112751 18700056 20685334 22870146 24875078 26194294 26060955
3803B6060955k083123l618530l558143k619071j810600j200099j077114r40430
3795I153845r72900q31167n61893m59720m77086l22434l51394j39344j0869k54601
3785D772437j03454l1855o7646p73q9804k9485J83244J07723q753j2708k06278
3774D512648l78985l13876k04259k92210l09941k7861J1107q590P9436J11133
3764C178602P8017P5513J2126Q4043P2757R5004L8035J68161Q5831p2305k96413
3753C519371k67257k77598k23873o7494o9287m0205p2770K2192p4662K0685J80834
3742B649936J35082K4928P5682m2940J05385M3920Q7383l6427n1629j43722k94805
3731B552793k14902j3072j05337k67479o8636j89961L0761l2439r5979L599O223
$$ plain form
3803 26060955 23977832 20359302 16801159 14182088 12371488 11171389 10094275 9153845
3795 9153845 8180945 7349778 6787885 6328165 5851079 5528645 5177251 5037907 5027038 4772437
3785 4772437 4668983 4637128 4569482 4568709 4478905 4449420 4632664 4740387 4731634 4718926 4512648
3774 4512648 4133663 3819787 3615528 3323318 3013377 2985516 2996623 2988033 3067469 3178602
3764 3178602 3256619 3332132 3344258 3428301 3501058 3596062 3634097 3802258 3888089 3815784 3519371
3753 3519371 3252114 2974516 2750643 2683149 2613862 2573657 2500887 2523079 2448417 2469102 2649936
3742 2649936 2785018 2809946 2885628 2842688 2948073 2991993 3079376 3042949 2991320 2847598 2552793
3731 2552793 2337891 2324819 2219482 1952003 1883367 1693406 1724167 1691728 1595749 1599348 1605571
3720A605571j0207L0447j1488o5790k2531j17597p7950n7860R049Q220o0149r2786
3708A136929L4746J05361L9590q163L1071j23056q459O3145j21465k6758j3648
3697A109293k8153o8214l6470n1425J10862J9706o4538j1998o0084K8649j29331
3686H18297K5678K5084Q671o737L3411J8851L6308K7200j29886M262K8895r1788
3674G98246M3498K4875N0156l9962q9022P0096P636o3176l5987o6645R6199P2992
3662H68906L6923r7569o5435l4840J1455O0058k8850n0757j9045n9362L3189J02532
3650G57205m3037Q9388m6249l5526K8672k1308j4098k2357j3523P5577l3158o9900
3638F51686l8704J82026o3186k4096j00205m5924J02276J66203M1708j8597J1806
$$ plain form
3720 1605571 1595364 1625811 1614323 1548533 1526002 1408405 1330455 1272595 1281644 1289864 1229715 1136929
3708 1136929 1171675 1277036 1316626 1308463 1339534 1216478 1208019 1271164 1149699 1122941 1109293
3697 1109293 1081140 1012926 976456 925031 1035893 1055599 991061 979063 918979 947628 818297
3686 818297 843975 869059 877730 870993 904404 923255 959563 986763 856877 861139 890034 798246
3674 798246 841744 866619 916775 876813 787791 857887 865523 802347 766360 699715 795914 868906
3662 868906 905829 808260 742825 707985 719440 779498 750648 699891 680846 621484 654673 757205
3650 757205 714168 803556 757307 721781 750453 729145 715047 692690 679167 754744 721586 651686
3638 651686 612982 795008 731822 707726 607521 561597 663873 830076 871784 853187 864993
3627H64993m08J0100k1609q8510P7823o3955O989o0362L3858M6913K4302k9995
3615H00139r9626J3462O529j07491J8121N8711m5160J74917j0652K1248r0417
3604G39781j4256L5033j6762j1781l2885M3606l7462p6178J3676j9377L7806N6361
3592G17562J2038j1878L7423q2361o3959K3531R1569J4253m2840l2856J0949q2539
3580E90892j4496N3927J21689l8529M6710k909P3085o6398o8966j05590M9505
3569F38920l5289K1187R051m7763j8689M8013l7326q1178M6882k6936o101N4976
3557E65747J10816j14928j14507M3567J743Q387J35930r3419M9115J682N2439
3546F46572j8297p2470p943R6957l2371L5900n995K487j17434j8731K1469j352
$$ plain form
3627 864993 864585 874685 853076 764566 842389 778434 785423 725061 758919 805832 830134 800139
3615 800139 700513 713975 720504 613013 631134 689845 644685 819602 808950 830198 739781
3604 739781 725525 760558 743796 732015 699130 742736 705274 629096 642772 623395 661201 717562
3592 717562 729600 717722 755145 672784 608825 632356 723925 738178 695338 662482 673431 590892
3580 590892 576396 630323 752012 713483 760193 757284 830369 763971 695005 589415 638920
3569 638920 603631 624818 633869 586106 567417 615430 578104 496926 543808 516872 510771 565747
3557 565747 676563 561635 447128 490695 492438 500825 636755 543336 592451 594133 646572
3546 646572 628275 555805 547862 644819 612448 648348 642353 644840 527406 508675 530144 528792
3534E28792l328j07339K7784j0292o097Q7525q0116L0413L5265N9821n5356L1006
3522E38078R0310p3357J2094K103J9667l3156M3641P2984j1336j3505Q2317K5148
3510G54988o9888j76532l6969L8945J2736m5501O1053o7637q928j9392j5753M824
3498D31946M2171J07898J15905r4063o8589O3880k6427n8460O4492N9876r950
3487F28679M6476l6068j30083M0012P2587p5335M5653j6531j30154j4264J10162
3476E41134j3240J23944r482l6973j9548J6296K8447N0760p07m1606N3791m5325
3464F47491m5841p395p577M401M0171P693l3891k2010k8880K586Q0961m753l818
3451F29138j0398q0364M0688J54708l9404m8024m9734L4634q6779P648O2077P8524
$$ plain form
3534 528792 525464 418125 445909 435617 429520 517045 436929 467342 502607 562428 507072 538078
3522 538078 628388 555031 567125 569228 588895 555739 599380 672364 661028 647523 729840 754988
3510 754988 685100 508568 471599 510544 523280 477779 538832 471195 462267 442875 427122 431946
3498 431946 474117 582015 697920 603857 535268 599148 572721 514261 578753 638629 628679
3487 628679 675155 639087 509004 549016 621603 546268 591921 575390 445236 430972 541134
3476 541134 527894 651838 642356 605383 585835 602131 630578 681338 680631 639025 692816 647491
3464 647491 601650 594255 586678 591079 631250 638943 605052 583042 554162 556748 637709 632956 629138
3451 629138 618740 538376 579064 733772 694368 646344 596610 631244 544465 552113 614190 692714
3439F92714J04974j04066q2581m175j2765k3188r9205J08299J02205q1539J09478
3428G10151j43238j25232J37726L0624j09243P2167N7820M8661k3155J18673j10987
3417F63967L5162M0723l5949j09104p4628N3433O0952N2324o4705J8514J8490
3406F59179J9936M6284M0555n7399m0972k7943K04114l4608r0866j8758q8060
3395F11462J62716N0720k2121n132n5816O1929Q0361J16685M0577M0441K5951
3384A107773J4147K8077j01527j36407l0689K2084l8940l1689J7022Q5J18630
3373I68566l7970J4756Q7761k5309J4704j15385J0268Q3811j6911p2007m219R4779
3361A002844P2999K9304J35921P6407o544O6725J9760J29909J68799j1486k85844
$$ plain form
3439 692714 797688 693622 611041 606866 594101 570913 471708 580007 682212 600673 710151
3428 710151 566913 441681 579407 610031 500788 572955 630775 679436 656281 774954 663967
3417 663967 699129 739852 703903 594799 520171 573604 634556 686880 622175 640689 659179
3406 659179 679115 725399 765954 708555 667583 639640 843754 809146 718280 699522 611462
3395 611462 774178 824898 802777 797645 741829 803758 884119 1000804 1041381 1081822 1107773
3384 1107773 1121920 1149997 1048470 912063 881374 903458 864518 832829 849851 849936 968566
3373 968566 930596 945352 1033113 1007804 1022508 907123 917391 1001202 984291 912284 908065 1002844
3361 1002844 1075843 1105147 1241068 1317475 1310931 1377656 1397416 1527325 1696124 1684638 1398794
3350A398794j66717M1246J2940m9702j0981j4996l832q901k0661m4856r5260j3406
3338A023668K1607R4371M9855p8336m0520L1071J601o4273l985L9986Q4717M139
3326A163901M4862O4387O7224n6315Q4904J12784j9832l3200l5909j1621J8120
3315A399305O0688m6474o9198n7581m581j7812L9725m7879l980J10012J7595O7166
3303A446986k8985q0893k8533J19167L0140j18426J8085K306Q2405k6673K6847
3292A442426J7278n8908J30092R4154P257M7349J06195K9000R1649R7605M0586
3281B044683R034P050L8588m3652L4497N2544O4729J05093o7828N55R7618l7332
3269B305579j07615Q697Q2363j6754q2428J62614N9408P9292K01097K2225j5016
$$ plain form
3350 1398794 1232077 1273323 1286263 1236561 1225580 1210584 1206752 1197851 1177190 1132334 1037074 1023668
3338 1023668 1045275 1139646 1189501 1111165 1070645 1101716 1103317 1039044 1035059 1075045 1159762 1163901
3326 1163901 1208763 1273150 1340374 1284059 1368963 1481747 1461915 1428715 1392806 1381185 1399305
3315 1399305 1459993 1413519 1344321 1286740 1282159 1264347 1304072 1256193 1252213 1362225 1379820 1446986
3303 1446986 1418001 1337108 1308575 1427742 1457882 1339456 1357541 1359847 1442252 1415579 1442426
3292 1442426 1459704 1400796 1530888 1625042 1632299 1679648 1785843 1814843 1906492 2004097 2044683
3281 2044683 2053717 2060767 2099355 2055703 2090200 2142744 2207473 2312566 2244738 2245293 2342911 2305579
3269 2305579 2197964 2206661 2289024 2272270 2189842 2352456 2411864 2491156 2692253 2714478 2699462
3258B699462Q3904J42512J27082l5618N6124M8623J8119J75280J39700N6792j4052
3247C497928Q7563k1715P6498j56322K2655K8125N6708O6507P5370O4271K4652
3236C822240O2271N4777K5149J80624J00883J29858R8290L6162J55710J04731
3226D770695o407p0595K3114M1129J70113Q9997J11947K58586J65998J17372J71906
3215E843855q93J01052J24197K04073J74317J47090J72823L02833M29707L24689
3205G823743L64323K29371L70011L52774M02481L68563J71676K77672J20586r6530
3195A0384670r2541m60065o58977p83163q09447o18081l50217k38142k53991p7111
3185F042935r2470j0554j54294K8649J98094J00446J9870J01378L45356K81072
$$ plain form
3258 2699462 2783366 2925878 3052960 3017342 3073466 3122089 3140208 3315488 3455188 3511980 3497928
3247 3497928 3585491 3563776 3640274 3483952 3506607 3534732 3591440 3657947 3733317 3797588 3822240
3236 3822240 3884511 3939288 3964437 4145061 4245944 4375802 4474092 4510254 4665964 4770695
3226 4770695 4764288 4693693 4716807 4757936 4928049 5018046 5129993 5388579 5554577 5671949 5843855
3215 5843855 5842962 5944014 6068211 6272284 6446601 6593691 6766514 7069347 7499054 7823743
3205 7823743 8188066 8417437 8787448 9140222 9542703 9911266 10082942 10360614 10481200 10384670
3195 10384670 10292129 9832064 9173087 8389924 7580477 6962396 6612179 6374037 6120046 6042935
3185 6042935 5950465 5939911 5785617 5814266 6012360 6112806 6132676 6234054 6579410 6860482
3175F860482K29864L82874M93857N81263M99654M67198L90449L59964N26398O84638
3165A1476641O45254M28078K4415o23686j387527j573063j288877q33162n92501
3156F275572m06277k75299j25316k81731j18957L8092J51123K28423P3552J73824
3146E733006K08747L82540L60280L34448L94931M56243M10390J77217o4669j83692
3136H209441k35650r3701M7833r5070j11826k04295n00911p70664p96469o36685
3126D812003m37209l46368k64635k29044j71615r8293p3518l0743k5216J3470
3116C148832K263O9067R5924J20862J15801Q0445Q2951Q1417P0066R9478k45122
3105C721984l87166k36804k95569j89691j24150j63852j69909k08407q9766K2168
$$ plain form
3175 6860482 7090346 7473220 7967077 8548340 9047994 9515192 9905641 10265605 10792003 11476641
3165 11476641 12121895 12549973 12574388 11950702 10563175 8990112 7701235 6868073 6275572
3156 6275572 5869295 5593996 5468680 5186949 5067992 5106084 5257207 5485630 5559182 5733006
3146 5733006 5941753 6324293 6684573 7019021 7413952 7870195 8280585 8457802 8393133 8209441
3136 8209441 7973791 7880090 7927923 7832853 7721027 7516732 7015821 6245157 5448688 4812003
3126 4812003 4374794 4028426 3763791 3534747 3363132 3264839 3191321 3160578 3135362 3148832
3116 3148832 3151095 3220162 3316086 3436948 3552749 3633194 3716145 3797562 3867628 3967106 3721984
3105 3721984 3334818 3098014 2802445 2612754 2488604 2324752 2154843 1946436 1856670 1878838
3095A878838j15648m9755r5293l7273K3613j23233k14943k0114L624j15072M0082
3084A174826L3831m9966j9564j40275O3638J40743m7846l2738j19743N261m380
3073A003787m9526O9075O2134q5991q9209K768n402M7069L508j26148l8758P845
3061H01152M4618m7395n8508p4801J07778K1903k1052p4216q0928K9794J06132
3050G54477O3492j03510l6323J6098o7150o8585L9979l550M3669L996q2881j8266
3038E41446J00742K7505q2477p0318L3679j9393l324R5146p723m5398K001P4208
3026F46094p810j40178j6034J31701n6441J1039L2245n700k0949k7368k7223L6435
3014E55811j02243M0151K2625q8971K3217j06326M4269L5637q6536N8435l6866
$$ plain form
3095 1878838 1763190 1713435 1618142 1580869 1604482 1481249 1266306 1246192 1249816 1134744 1174826
3084 1174826 1208657 1158691 1139127 998852 1062490 1203233 1155387 1122649 1002906 1008167 1003787
3073 1003787 954261 1023336 1085470 999479 910270 913038 907636 954705 958213 832065 793307 801152
3061 801152 845770 798375 739867 665066 772844 794747 773695 699479 618551 648345 754477
3050 754477 817969 714459 678136 694234 627084 558499 598478 594928 638597 642593 559712 541446
3038 541446 642188 669693 587216 516898 550577 531184 527860 623006 615283 569885 571886 646094
3026 646094 638284 498106 482072 613773 557332 568371 600616 594916 573967 546599 519376 555811
3014 555811 453568 493719 516344 427373 450590 344264 388533 424170 337634 396069 359203
3003C59203P0816J22080m4660m9300p760k0563M0517K5701o4760L1706l8087l2024
2991C92869J2161j0325o0621m6350O1819Q4057J3581n5036j30300Q5755R908K3394
2979C80912P5949J9786J11495q2090q5409O6762L747Q097N1411j34883j20387
2968B95390k3514P8556J06991p0865j0629K9055J2358L0524J22208m7901o2196
2957D59977M278j0222N3976o131q2376n6489l5379N0552J48280J03215j19542
2946E10139p1416k50Q7336m4167q6833J29191J24588p2751P9243P0206k9066q1518
2934F14702P5411J9185j3229O4129k218j4677k4035l0691m3172l4400o0648M2738
2922E93095N073J4128q4641P164J30323m8083j6497K5357R275P2183J6017K7524
$$ plain form
3003 359203 430019 552099 507439 458139 450379 429816 470333 496034 431274 462980 424893 392869
2991 392869 405030 394705 334084 287734 349553 433610 447191 392155 261855 347610 357518 380912
2979 380912 456861 476647 588142 506052 420643 487405 491152 499249 550660 415777 295390
2968 295390 271876 350432 457423 386558 375929 404984 417342 447866 570074 522173 459977
2957 459977 464255 454033 508009 501878 419502 363013 327634 378186 526466 629681 510139
2946 510139 438723 438473 525809 481642 394809 524000 648588 575837 655080 725286 696220 614702
2934 614702 690113 709298 696069 760198 757980 743303 719268 688577 645405 611005 550357 593095
2922 593095 598168 612296 527655 534819 665142 617059 600562 625919 635194 707377 723394 750918
2910G50918q1744M2363M0273Q2167k1804L6589J69255j16625n1870N7964R3111
2899A000597J7912l8594O3482K5376K1607n86m2662L7935P3921n5649L9260J07338
2887A249937J2944J8626L7837Q5793J54768q713J17306j06861j55612k1173p9902
2876A304950m1509j8919K9177l016P879J7585O1065N1474l5819J0966K5727J20474
2864A530034K6221j4894J13469Q2165N8221J850O3753n8365J05667j54602k7192
2853A726327O2007k8062l9510k39996j06253K7230r3612k9143R9695m090P4402
2842A448995n6812q0399r2469P4942j15577m0793J36495o4745J3476K3550k1518
2831A225145j7585J0282n0339m1681n248k8694n9455R119O918m7836j9057P2938
$$ plain form
2910 750918 669174 711537 751810 833977 812173 848762 1018017 901392 849522 907486 1000597
2899 1000597 1018509 979915 1043397 1068773 1090380 1089794 1047132 1085067 1158988 1103339 1142599 1249937
2887 1249937 1262881 1281507 1319344 1405137 1559905 1551192 1668498 1561637 1406025 1384852 1304950
2876 1304950 1263441 1244522 1273699 1270683 1278562 1296147 1357212 1408686 1372867 1383833 1409560 1530034
2864 1530034 1556255 1541361 1654830 1736995 1795216 1797066 1860819 1802454 1908121 1753519 1726327
2853 1726327 1788334 1760272 1720762 1480766 1374513 1401743 1308131 1278988 1378683 1374593 1448995
2842 1448995 1392183 1311784 1219315 1294257 1178680 1137887 1274382 1209637 1223113 1246663 1225145
2831 1225145 1207560 1217842 1167503 1125822 1120574 1091880 1032425 1041544 1048462 1000626 981569 1054507
2819A054507m3687L1376o6446p9925n5848l1712J6561m5268N9554m655L4319j52560
2807G16216m2337k4312j7270R9622j8551j11077j5851k3349J9455J4323p610l7168
2795E52091R296M7139m8668l4913m2915L8536O2974k2484N257l9416p1518j09217
2783C46162j37578P7919L9651M6216J14663o6962j44013N449M0258J29112n0702
2772D00175P1840q418r6672n2497N42P291j00596O295Q8662L0542p6915L3314
2760C03563k454j8830j8769P522p5764N8837k4550O070J8899p5836Q7620j8887
2748B47421K7652n6733k7031J5750M0759J9729o3750j5191K8748J33694l334r6211
2736B51503k35493M7733J99655j09638m6693J02839K4469k4668O0546j6920L4494
$$ plain form
2819 1054507 1010820 1042196 975750 895825 839977 808265 824826 779558 839112 834457 868776 716216
2807 716216 673879 649567 632297 731919 713368 602291 586440 563091 582546 596869 589259 552091
2795 552091 561387 608526 559858 524945 482030 520566 583540 561056 566313 526897 455379 346162
2783 346162 208584 286503 326154 372370 487033 420071 276058 281507 321765 450877 400175
2772 400175 472015 463597 366925 314428 314970 322261 221665 227960 316622 347164 270249 303563
2760 303563 301109 282279 263510 271032 195268 254105 229555 235625 254524 178688 266308 247421
2748 247421 275073 218340 191309 207059 247818 267547 203797 188606 217354 351048 347714 251503
2736 251503 16010 63743 263398 153760 107067 209906 234375 209707 270253 253333 287827
2725B87827k6113o4185j24178L3799R2230j16684j66744J19800O2096r5285K2291
2714B4854M2833k954p599M986q2128R9520l3532P431L9805M139o3931l5549L501
2701A376J7117J02990k4658P4922n4711j15865Q6664L8981j8030n8341L5637L8899
2689A24981m2179R2813O3651r5963j50293o9424P5256N5935k7759q6168J9294
2678c9856m5831J03608K6445L6413j3493n5165J28160m9143j24853j0887J4205
2667c0397K0163p3318J0318J31852N5281j57231k2467Q4754K7051R2091r2983
2656D5114r1615K8774O9235l404r176p8250K9981O1013k7761j7424Q1916m8381
2644D0022l1082j8615L8700L113o877P0323M453q391m2856l7976o3990J06998
$$ plain form
2725 287827 261714 197529 73351 107150 199380 82696 -84048 35752 97848 2563 24854
2714 24854 67687 64733 57134 62120 -20008 79512 45980 53411 93216 97355 33424 -2125 1376
2701 1376 18493 121483 96825 171747 117036 1171 87835 126816 108786 50445 86082 124981
2689 124981 82802 175615 239266 143303 -6990 -76414 -1158 54777 27018 -59150 -39856
2678 -39856 -85687 17921 44366 80779 67286 12121 140281 91138 -33715 -44602 -30397
2667 -30397 -10234 -83552 -73234 58618 113899 -43332 -65799 18955 46006 138097 45114
2656 45114 -46501 -17727 51508 48104 38928 -39322 -9341 51672 23911 6487 88403 40022
2644 40022 8940 -9675 29025 32138 25261 95584 100037 91646 48790 10814 -53176 53822
2632E3822Q7250j42716n8333Q1016K0301j7782q4672l04O1456o7964J19992O1404
2620A13470j4226n8508L6244K4232m1004k6344K9267Q0263l5704r9603K1739j7415
2608A2411k7016m4041k6149R7245l5649l1341N2333j22090N2848J41810P0672
2597A41033j38502J7239k0717m0577q3209M1537M1510L0061O13n8642K2156P1642
2585B4144J6813o5108M388J6329M2938p5042P6288m5129r1709N2523N0110Q0912
2573H7457K1454p1596P756n9802m845m6509J5805l3699N3222p9876j45823O707
2561b49749K38396O0929o1326j16320j2286J9587M0382L4654M6766N0927k5551
2550B6409m6308P7184L226k1814n1030k6174L1136N641M936m2468K8141q0085
$$ plain form
2632 53822 141072 -1644 -59977 21039 41340 23558 -61114 -61418 38 -67926 52066 113470
2620 113470 99244 40736 76980 101212 60208 33864 63131 143394 107690 8087 29826 12411
2608 12411 -14605 -58646 -84795 12450 -23199 -54540 -2207 -124297 -71449 70361 141033
2597 141033 2531 19770 -947 -41524 -124733 -83196 -41686 -11625 -11012 -69654 -47498 24144
2585 24144 40957 -24151 -19763 -3434 39504 -35538 40750 -4379 -96088 -43565 6545 87457
2573 87457 108911 37315 45071 -14731 -19576 -66085 -50280 -83979 -30757 -110633 -256456 -249749
2561 -249749 -11353 49576 -11750 -128070 -140356 -120769 -80387 -45733 1033 51960 26409
2550 26409 -19899 57285 60511 38697 -12333 -38507 -7371 -1730 3206 -39262 -11121 -91206
2538i1206M3578J4278j1832J05124j4210p7506L4212N2633l8493p1556j7532J12647
2526D0137J1176N2501r5644j9973l862K8146o5463n2126O3654O8088j7977l074
2514E583l6005l0866o2372M3510L7128l2862m5429J4482K6498L8273M2719q9153
2502h8494K0422P5568P8839j2909L3888p0500K614P8583r7301j42866r662M5498
2490h6320J73287q3358l7686Q7025N6993m22P1645j04506p6748J0137J22575J1047
2478A43669j53143N314N5355J9104M4741m1830m1267L3754j03887O7009P6094
2467A04913p8012j0517p054p5980N8886R2544j37127l3343m105l8835J27298R636
2455H304m0757Q459p3107J0006q201O7268m0198j0938M7516l4998k9294q3326
$$ plain form
2538 -91206 -47628 -33350 -45182 59942 45732 -31774 2438 55071 16578 -54978 -72510 40137
2526 40137 51313 103814 8170 -11803 -15665 12481 -52982 -105108 -41454 26634 8657 5583
2514 5583 -30422 -61288 -123660 -80150 -43022 -75884 -121313 -106831 -80333 -42060 659 -88494
2502 -88494 -68072 7496 86335 73426 107314 36814 39428 118011 20710 -122156 -131818 -86320
2490 -86320 86967 3609 -34077 52948 109941 109519 181164 76658 -90 10047 132622 143669
2478 143669 -9474 -4160 51195 70299 115040 73210 31943 65697 -38190 28819 104913
2467 104913 26901 16384 9330 -66650 -7764 84780 -52347 -85690 -89795 -128630 -1332 8304
2455 8304 -32453 -23994 -97101 -87095 -95296 -28028 -68226 -79164 -31648 -66646 -95940 -179266
2443a79266o7267J05791J42314P5695n9040q9670N3058J84133m8094P617r9095
2432B6176r8254k3273l100Q6815M2993j31944O3884n7913j3834J16102k0879o3458
2420g6685M2725p1867l2451L8055r2922N625R1723M265Q4993l1463P595m3401
2408g3808l0840J27289L8122o7455j18571N1707l044K7704m214L4749o735j6315
2396d1411l681J8542q8315L9920R5732O0671L3812n2517r0763J11469p6839n3895
2384d7275L2824R4878j13160l9969J0579P8086n4221j33702j8308J62073k9113
2373e7308j9754M0143n6642J04873k2242o7815r6362J0044J35967l528o1959R683
2361h4900J59451R293r0137m8025j9520Q7905N3064j71610k102O9445l9186K8864
$$ plain form
2443 -179266 -246533 -140742 1572 77267 18227 -71443 -18385 165748 117654 125271 26176
2432 26176 -72078 -95351 -98451 -11636 31357 -100587 -36703 -94616 -108450 7652 -13227 -76685
2420 -76685 -33960 -105827 -138278 -100223 -193145 -187520 -95797 -91532 -6539 -38002 -30407 -73808
2408 -73808 -104648 22641 60763 -6692 -125263 -73556 -76600 -48896 -53110 -18361 -25096 -41411
2396 -41411 -45092 -26550 -114865 -74945 20787 81458 115270 62753 -28010 83459 6620 -47275
2384 -47275 -14451 80427 -32733 -72702 -62123 15963 -38258 -171960 -190268 -28195 -57308
2373 -57308 -77062 -36919 -93561 11312 -10930 -78745 -175107 -165063 -29096 -32624 -94583 -84900
2361 -84900 74551 83844 -6293 -54318 -73838 14067 67131 -104479 -106581 -37136 -76322 -47458
2349d7458m8126k5068Q0038Q3309J7723O342L2396m0463n4467j37348J57506N8822
2337H3206k2670l9480J5791Q5426o4403m4044R9145J73177l5388n5375n8688n6885
2325G9812J7553p3521p49J48315q166J2837r7845r9659K4426P0637L8917Q7872
2313B00429j66126o156j7046o2405L4105J8756Q8201K9601K4409k1674r2943r0910
2301f1759J73574K8397n3529j94352O7121J29054M0218k2572p8742K764P2033
2290A02207l7150j75525J16042M3591J3464o1557k8040l5982P729M9915N2783
2279D7477l480q5640l7877R8725M2657J3609P8873n6641o334Q9668m4184N6293
2267A93146k0072n164O6378q1967j58403n884P0014P6056M0159J2091o5724J3343
$$ plain form
2349 -47458 -95584 -120652 -40614 42695 60418 66760 99156 58693 4226 -133122 24384 83206
2337 83206 60536 21056 36847 122273 57870 13826 112971 286148 250760 195385 136697 79812
2325 79812 97365 23844 23095 171410 163244 176081 78236 -21423 3003 73640 112557 200429
2313 200429 34303 28147 11101 -51304 -17199 1557 89758 119359 143768 122094 29151 -61759
2301 -61759 111815 140212 86683 -107669 -40548 88506 128724 106152 27410 30174 102207
2290 102207 65057 -110468 5574 49165 62629 1072 -26968 -62950 -55221 -5306 47477
2279 47477 43997 -41643 -79520 19205 61862 75471 154344 97703 91369 181037 136853 193146
2267 193146 173074 167910 234288 152321 -6082 -11966 58048 134104 174263 186354 120630 133973
2255A33973o6098l7509o1280m0238m399J54615J31495j40219k8408K277o6582
2244b2373L8897M9579N0435r9390q859J57265N7856p4645j42209m5337L6547n0036
2232e2270N0896J39089p9440n5435M8387l1807P443J2267R3385p6440L0472j2001
2220G4546o3789k547l8232P3576k6703M6601J9407k4059R3784r428m3114M4564
2208A44606o4936l4070M4933o829k4169M0880O6803j27501j3541J25103k6380
2197A24899j4386O2290j7586n0971k5974J12200l2751p2337Q2122j2786k6137
2186A28583l2283j3250j0758K039n6598j4065k7352J36841R7411K3644o5976M7243
2174B15479M3468K8480q0549J03288r3580K4113J9611m9285N989M7450J09081
$$ plain form
2255 133973 67875 30366 -30914 -71152 -75551 79064 210559 70340 41932 44209 -22373
2244 -22373 16524 66103 116538 17148 8289 165554 223410 148765 6556 -38781 -2234 -52270
2232 -52270 -1374 137715 58275 2840 51227 19420 26863 39130 132515 56075 86547 74546
2220 74546 10757 8210 -30022 43554 16851 63452 82859 58800 152584 143156 100042 144606
2208 144606 79670 45600 90533 83704 59535 100415 167218 39717 26176 151279 124899
2197 124899 110513 172803 155217 104246 78272 190472 157721 85384 167506 154720 128583
2186 128583 96300 83050 72292 74331 17733 3668 -23684 113157 210568 234212 168236 215479
2174 215479 258947 287427 206878 310166 216586 240699 260310 211025 217014 264464 373545
2163C73545m0681q7233l8815M697N4931Q9271J19148l7209R677K6755J2132l030
2151D83188l5503N1342l2605Q3042o648r9666k1240J17943Q2163l1540q780O3326
2139F45022R561j6866J31220M6356J4539n8393o596J4966j2657J027N8847Q6412
2127I13438O0838k0262r7129J46222L5475M3701j5359m6069m4862r9197R6605
2116I73401L9156M9595R6938P5877L4506J08059p8681M3108L9968L3936J50239
2105A566102J3883J27802P8273L7474M648M6417N9951J05932J52299P6991j106
2094B268666J23234k1957Q2860J57442R9504Q1298J22876K06079K41069J18041
2084C479112J13890K51322L39137L03741K35855L18820L99397M80951M37876M15719
$$ plain form
2163 373545 332864 245631 206816 211513 266444 355715 474863 437654 447331 474086 486218 483188
2151 483188 447685 499027 466422 549464 542816 443150 421910 539853 622016 590476 581696 645022
2139 645022 654583 637717 768937 815293 829832 771439 764843 779809 767152 768179 827026 913438
2127 913438 974276 954014 856885 1003107 1038582 1082283 1066924 1020855 975993 876796 973401
2116 973401 1012557 1062152 1159090 1234967 1269473 1377532 1298851 1341959 1381927 1415863 1566102
2105 1566102 1579985 1707787 1786060 1823534 1828182 1874599 1934550 2040482 2192781 2269772 2268666
2094 2268666 2391900 2369943 2452803 2610245 2709749 2791047 2913923 3120002 3361071 3479112
2084 3479112 3593002 3844324 4183461 4487202 4723057 5041877 5441274 5922225 6360101 6775820
2074F775820M27676N56747Q92684J049422J349873J772327K192649K721914L638748
2065B1377860L260700L040641M431750L678765N37896m420748p400340o114370
2057A8392154m059846k673967j954388j324522j090589p22736l24139n07091l90651
2048E344225k38239l27731j95469l85445m01986l02323l75686l05872j73151j25521
2038B512802j48391j95891j31317j8384o4215j05140q0339J13547o4477j69796
2028A648399p7488J9041k1544j17687q2370q3678n7740n5153m6933k6108m9131
2017A049608J5326K8422o2715r9465j47593q4835M3744j9022q6240P191r1100
2006E53321Q1059J3676k4072r0781j1631J30442R574j04321j06592o0874M8944
$$ plain form
2074 6775820 7203496 7760243 8652927 9702349 11052222 12824549 15017198 17739112 21377860
2065 21377860 24638560 27679201 32110951 35789716 36327612 31906864 24506524 18392154
2057 18392154 14332308 11658341 9703953 8379431 7288842 6566106 6241967 5734876 5344225
2048 5344225 5105986 4778255 4582786 4197341 3795355 3493032 3117346 2811474 2638323 2512802
2038 2512802 2364411 2168520 2037203 2018819 1954604 1849464 1769125 1882672 1818195 1648399
2028 1648399 1570911 1589952 1568408 1450721 1368351 1284673 1226933 1171780 1124847 1098739 1049608
2017 1049608 1064934 1093356 1030641 931176 783583 698748 742492 723470 637230 644421 553321
2006 553321 634380 648056 623984 533203 521572 652014 661588 557267 450675 389801 438745
1995D38745N5140m9825n6883r585J6820Q189l7372m6940k4641R676M7076M5957
1983C96357o0040J1712o6379O0426j2866o7413l7728o1663J19887o0682m0939
1972A80672M7266J7919j22676K1198M574J39448l0198M77N3490n5067m6491q97
1960B09715o597n7145j29051J52835J20001J90j0452l4223j2635j17617n3972
1949F1049n1761J44523K9971o9560K4375M4973Q722q5809n9705M2447L6679p6741
1937D9163P3528K2009n4177K3569p8383P5489M890R1773o9702n5342R0580q0314
1925I3083N8840k8007j1318L0538L5715j4773l6520L0015p7805l902m369j19599
1913d8102J3301P1833m1924L6658O0190o9177L5114l8115R2040o084j09122j4848
$$ plain form
1995 438745 493885 444060 387177 377592 394412 402601 365229 318289 293648 303324 350400 396357
1983 396357 336317 348029 281650 342076 329210 261797 224069 162406 282293 221611 180672
1972 180672 227938 245857 123181 144379 148953 288401 258203 258680 312170 257103 210612 209715
1960 209715 203118 145973 16922 169757 289758 289948 279496 245273 232638 115021 61049
1949 61049 9288 153811 183782 114222 138597 183570 192292 106483 46778 89225 125904 49163
1937 49163 122691 144700 90523 114092 35709 111198 116088 207861 138159 82817 173397 93083
1925 93083 151923 123916 112598 143136 178851 164078 127558 157573 79768 75866 71497 -48102
1913 -48102 -34801 37032 -4892 31766 91956 22779 57893 19778 111818 105734 -3388 -18236
1901a8236k2464P7793m355j8026P8341j5704j5303n3535j03813R208O1438J2110
1889a2546j2125k5490m0462j835N5366l5410J06909n1185J35471L0187j9754q8936
1877D0190o4461N3208Q5883m4775o5619Q9932R92r4109o556j0212P8149O3555
1865A26177L5156l4696o7941N7711k0274o2151p418P6422r828L6051p8915o9072
1853a8778O988J05019k25067J4752J9630j3346r295N0027O5427j7784k0513k1210
1841f4150L0697R9055r8002J11012r5833p1692J09239k4700O2873O4295p2595
1830E0199l2639p4012j61347M2730J01826J560n5727p703K6626J37610K3399j4722
1818C7800J8096N1567o1113r7187L9244k3564O7296r1051m8960N8870N4974O2446
$$ plain form
1901 -18236 -40700 37093 32738 14712 93053 77349 62046 8511 -95302 -86094 -24656 -12546
1889 -12546 -24671 -50161 -90623 -92458 -37092 -72502 34407 -16778 118693 148880 129126 40190
1877 40190 -24271 28937 114820 70045 4426 94358 95350 1241 -5315 -15527 62622 126177
1865 126177 161333 126637 58696 116407 96133 33982 26564 102986 93158 129209 50294 -18778
1853 -18778 -11790 93229 -131838 -117086 -97456 -110802 -120097 -70070 -4643 -22427 -42940 -64150
1841 -64150 -33453 65602 -32400 78612 -17221 -88913 20326 -4374 58499 122794 50199
1830 50199 17560 -56452 -217799 -175069 -73243 -71683 -127410 -135113 -108487 29123 52522 37800
1818 37800 55896 107463 46350 -50837 -11593 -35157 32139 -58912 -107872 -49002 5972 68418
1806F8418P741o8010N3791o737Q074n3705l1119L1124K2886P3305O8455k3785
1794A50438k0313k127n4162K8299O2623j35102K7985k9345m8441K6335L7099O2435
1782A05724o6621R831K1542n4451j9001K0252r9245J26368j82715N7582N8004
1771b2730P4907J8231j5105J7717l4463m9072K2057J12697j5894P4731n4481j34960
1759f365m5979M8769J39261j14998r0288J10615m7403J0640N1415k8954j02182
1748g5469N3401K9931K486k6501K0244N0404p0487M0343j5513j3246m3557k6521
1736g4485L3330J18555j34641m9505k1380J3524l0479M8188J22157o6259m97O3704
1724B2212o6354N9320M2326r98j06588n6216j4852R162J21383N6499p0834j108
$$ plain form
1806 68418 76159 8149 61940 55203 63277 9572 -21547 9577 32463 105768 174223 150438
1794 150438 130125 127998 73836 102135 164758 29656 57641 28296 -20145 6190 43289 105724
1782 105724 39103 48934 70476 16025 -2976 17276 -81969 44399 -138316 -80734 -22730
1771 -22730 52177 70408 55303 73020 38557 -10515 11542 124239 108345 183076 128595 -6365
1759 -6365 -52344 -3575 135686 20688 -69600 41015 -6388 4252 55667 26713 -75469
1748 -75469 -22068 7863 10349 -16152 4092 54496 -15991 24352 8839 -4407 -47964 -74485
1736 -74485 -41155 77400 -57241 -106746 -128126 -114602 -145081 -96893 25264 -40995 -41492 22212
1724 22212 -44142 15178 57504 56506 -50082 -106298 -121150 -111988 9395 65894 -4940 -6048
1712f048q7429J7512J10468J4134p8793l3653J48664J2724j39610r3336R3969
1701d1398J3695r739O3003M6500k8216m3941M7586j5205q9766N7678P083N6343
1689F3623O195l128l1507J4452r8810L4366J7182k4789j7808L0767j5143N0917
1677B6317k574L362j9511j9709n3j9446Q3740M2684q1387p2570j0461M4366N2999
1664B7757q3302m3776L7266O0974n9201q5660P7333L8771O9794l402K43J61402
1652A98199K302p9695j01633j17683N8553l0110K2815Q8175l8310P4194J769j20413
1640d1837r7005K0275j1319o2464K2151J53074K6769o6727L0070J32219m6142
1629E9064j40192J8941R1719k0611n0741M5402K7106o1925J8486K6932q8590k9027
$$ plain form
1712 -6048 -93477 -75965 34503 48637 -30156 -63809 84855 97579 -42031 -135367 -41398
1701 -41398 -27703 -37442 25561 72061 43845 -96 47490 32285 -57481 197 7280 63623
1689 63623 69818 66690 35183 49635 -49175 -14809 2373 -22416 -40224 -9457 -24600 26317
1677 26317 23743 27105 7594 -12115 -12168 -31614 52126 94810 13423 -59147 -69608 -25242 27757
1664 27757 -55545 -99321 -62055 -1081 -60282 -145942 -68609 -29838 39956 36554 36797 198199
1652 198199 200501 120806 19173 -98510 -39957 -70067 -47252 40923 2613 76807 78576 -41837
1640 -41837 -138842 -118567 -129886 -192350 -170199 -17125 9644 -57083 -27013 105206 59064
1629 59064 -81128 -62187 29532 8921 -41820 3582 30688 -31237 -12751 14181 -74409 -103436
1617a03436l3014O7588L7098m5311R5977n2582Q1380n0914n5517q420p2229O0538
1605g8842R88K9981P1058k6804j62414J4362P8552Q845j6636L4674M1022q806
1593a4020k8520K0625J7911l0600j8317k6999p27M0676n0514R1695K9194n3131
1581b2727K6625k6256m295p8132M7704M0045n4018m31N1718n7469M9278M3794
1569A5836j0113j29713j9393J07068m1859n101o7539Q2171j7277P5400O3070j53732
1557a01182r0494M4030m7917R1081N699L0245L7500k4556J53152n8204l8611J626
1545B369J0670M7332l332l0536o3293o1570N9715J57156M6479j19236l8376K8928
1533C6306N3210k9122n2835m4006Q0658J1457n5155O3261j02434R930j09361R8383
$$ plain form
1617 -103436 -136450 -68862 -31764 -77075 18902 -33680 47700 -3214 -58731 -67151 -139380 -78842
1605 -78842 -77854 -47873 23185 -3619 -166033 -151671 -73119 -64274 -80910 -46236 -5214 -14020
1593 -14020 -42540 -21915 -4004 -34604 -52921 -79920 -80647 -39971 -90485 1210 30404 -22727
1581 -22727 3898 -22358 -26653 -104785 -57081 -17036 -71054 -71485 -19767 -77236 -27958 15836
1569 15836 5723 -123990 -143383 -36315 -78174 -83275 -150814 -68643 -85920 -10520 52550 -101182
1557 -101182 -191676 -147646 -195563 -104482 -98783 -68538 -31038 -55594 97558 39354 743 2369
1545 2369 13039 60371 57039 26503 -36790 -98360 -38645 118511 164990 45754 7378 36306
1533 36306 89516 60394 7559 -36447 44211 55668 513 63774 -38660 -28730 -138091 -39708
1521c9708P0363J3523n6550k9545J77314n7404m5233l0406l8759L2133n3082L9873
1509a7481N4726m2896R640M971m7861p3419Q4426r7007m1232K10645J992j80407
1497a33903J2019L8182O7632L2194J13382R324q2999k5930r8462L6039K0890R471
1485b161j2226q0906Q4728r019Q6465Q0243o9920m1988n9835M7067p7294j14990
1473a69836J00714Q4385n6530k882r1096k0999J55370M3750M6344N2099q2311
1462E9008P458P1051K3630r8252m6782n3181J21962J8118p9555j65223p490J71968
1450B2712m1748m4672j04916J02942J17835r1985n7944J33705o0190k6008J4200
1439c6069o4469L2977K1152j24244L8134Q6314N6251N7517K6129j58140r298p2122
$$ plain form
1521 -39708 30655 44178 -12372 -41917 135397 77993 32760 2354 -36405 -4272 -57354 -17481
1509 -17481 37245 -5651 3989 8960 -38901 -112320 -27894 -124901 -166133 44512 46504 -133903
1497 -133903 -121884 -83702 -16070 16124 129506 138830 55831 29901 -68561 -32522 -11632 -2161
1485 -2161 -14387 -95293 -10565 -19584 66881 147124 77204 35216 -24619 22448 -54846 -169836
1473 -169836 -69122 15263 -41267 -44149 -135245 -156244 -874 42876 89220 141319 59008
1462 59008 66466 137517 161147 62895 16113 -37068 84894 103012 23457 -141766 -149256 22712
1450 22712 -19036 -63708 -168624 -65682 52153 -39832 -97776 35929 -24261 -50269 -36069
1439 -36069 -100538 -67561 -46409 -170653 -132519 -46205 10046 67563 93692 -64448 -73746 -145868
1427a45868k9081R2101M9144j0312j2319L1284p8O7822r5407K0856l2129p3984
1415a37971j8162J17238p046N378O4526o9673J4876J2936J3236o0889l2720K1470
1403g6801j5313N08P6148k6493O1229p1812N6474j9391j14231J36649L3376m0100
1391B43n7557M349j5546K5422Q1456m4382K0023K534O3326q5030l0978o1138o3720
1378a60998P4227N6577L2525p4359m4921J4710J95572k2752j29027L6794R3812
1367G2160j18600Q781l7657n096M8883M1202l3045J0761m7596L089m2896p4345
1355a74359R6471P6220o7377p2511O6670J12053q6729Q411p8316M4707P5694O0696
1343F1630L3190j09422j11251O5031m112J21335k2386p3870q0768Q2181P9117
$$ plain form
1427 -145868 -174949 -82848 -33704 -44016 -56335 -25051 -25129 42693 -52714 -31858 -63987 -137971
1415 -137971 -156133 -38895 -45941 -40563 23963 -45710 -30834 -17898 -4662 -65551 -98271 -76801
1403 -76801 -92114 -91606 -15458 -41951 19278 -52534 3940 -15451 -129682 6967 40343 243
1391 243 -57314 -52965 -68511 -43089 38367 -6015 14008 16542 79868 -5162 -36140 -97278 -160998
1378 -160998 -86771 -30194 2331 -72028 -116949 -102239 93333 70581 -58446 -21652 72160
1367 72160 -46440 -37659 -75316 -80412 -31529 9673 -23372 -12611 -60207 -57118 -100014 -174359
1355 -174359 -77888 -1668 -69045 -141556 -74886 37167 -49562 -41151 -119467 -74760 934 61630
1343 61630 94820 -14602 -125853 -60822 -64934 56401 34015 -39855 -120623 -38442 40675
1332D0675j18641N9174o7229Q3163j16427j0225N1683n4840K8726R4175L6813
1321B7047k1834N9594p8659j32173J28716j8593n0903N3574j16912j09397Q8024
1310a71516Q9602j9265K6973N7687N2980J3363o9169l2340J21511j27875o7437
1299a25486P7495k2982K0478m2695l1923P4434M7814p9851J4997M9053p4882j7166
1287a10714M7688n9591M0992j4682J04281l4945p1790K813Q6515m6844o335P9983
1275A7371J8755m6219J7399j22460O7988j6831j88321J09609J44008o200q776
1264a3677l9838j7574p148O9172O3812p1170l5121P674J07009k2335p2339m6693
1252g8228k011j03165P4508j17M0621J05847j05561O7156j4389j15429Q8903P4140
$$ plain form
1332 40675 -77966 -18792 -86021 -2858 -119285 -129510 -77827 -132667 -103941 -9766 27047
1321 27047 5213 64807 -13852 -146025 -17309 -35902 -86805 -33231 -150143 -259540 -171516
1310 -171516 -81914 -101179 -74206 -16519 36461 49824 -19345 -51685 69826 -58049 -125486
1299 -125486 -47991 -70973 -50495 -93190 -125113 -50679 -2865 -82716 -67719 -18666 -93548 -110714
1287 -110714 -63026 -122617 -81625 -96307 7974 -26971 -98761 -95948 -9433 -56277 -62612 17371
1275 17371 36126 -10093 7306 -115154 -47166 -63997 -252318 -142709 1299 -4901 -13677
1264 -13677 -53515 -71089 -78237 -9065 54747 -16423 -51544 -43870 63139 40804 -31535 -78228
1252 -78228 -80239 -183404 -108896 -109013 -68392 37455 -68106 -950 -15339 -130768 -41865 32275
1240C2275j0786j00819n6476K4569L3586N1780m2245R069K8016m1968M1783J4546
1228a6670O7318k6783n1500j0232j2181M3894m8750O4875Q9283k4428J4035J16742
1216B05603q9207L5154J1790m9129j7077k9315k8683o3286l1758L5179M7775k0599
1204F447p903o7615L7029M884K6603J9805M230N8026R3822j51817p3790j1792
1192f2071J7243O2047r3963N3266p8693O3816J753l3672m5532j4598R9546m3068
1180g3926p8138K9510J5585P6012M2173l6548Q9609k6482O8025k2257j01433m9803
1168f7673l0205J8293P7974J4216N0920o4604R794K2291L143l9455J0341j0087
1156e052j19712J13198N188O812K0648r26Q1547j00297j686K9653n9374o7778
$$ plain form
1240 32275 21489 -79330 -135806 -111237 -77651 -25871 -68116 -59047 -31031 -72999 -31216 -16670
1228 -16670 50648 23865 -27635 -37867 -50048 -6154 -54904 9971 99254 74826 88861 205603
1216 205603 116396 151550 163340 114211 97134 67819 39136 -24150 -55908 -20729 27046 6447
1204 6447 -1456 -69071 -32042 -27158 -555 19250 23480 81506 175328 23511 -50279 -62071
1192 -62071 -44828 17219 -76744 -23478 -102171 -38355 -36602 -70274 -115806 -130404 -30858 -73926
1180 -73926 -152064 -122554 -106969 -30957 11216 -25332 64277 37795 105820 83563 -17870 -67673
1168 -67673 -97878 -79585 -1611 12605 63525 -1079 8715 31006 34149 -5306 5035 -5052
1156 -5052 -124764 -11566 -6378 434 21082 20156 101703 1406 -280 29373 -30001 -97779
1144i7779Q3032K1183r3113N1694r2142L5013K7702k099R8631m9264l3748M9351
1132a539K0237n3660j4226P1020n7222k7420P1549k5832o0907Q10j8755o0632
1120a56577L5268J05614k8286m5775N2913l0208N9057l722N3256k1641M3130J9763
1108H2792j68608k5020J18336N0209q2897p9661n1467K1582Q6070L7211J32799
1097A21346J3114o3936n2888L0036l6341o206j6181q3068L4186j5696P4520O4602
1085F3488n3985O2048p688j61384n3241P8306P22p5767Q3641N0626q6830q11O0508
1072d0367q7400k7685J21627M660r2063J29538m2427n7582l6652l1077N1491N8808
1060d9129K6251k9135n7683P8975O842J36414M9560j37813L493o0993j07002n9805
$$ plain form
1144 -97779 -14747 6436 -86677 -34983 -127125 -92112 -64410 -66509 32122 -17142 -50890 -1539
1132 -1539 18698 -34962 -49188 21832 -35390 -62810 8739 -17093 -78000 -77190 -95945 -156577
1120 -156577 -121309 -15695 -43981 -89756 -36843 -67051 -7994 -11716 41540 19899 63029 82792
1108 82792 -85816 -110836 7500 57709 -25188 -104849 -156316 -134734 -48664 -11453 121346
1097 121346 134460 70524 17636 47672 11331 5125 -11056 -94124 -59938 -75634 -1114 63488
1085 63488 9503 71551 63863 -97521 -150762 -72456 -71734 -147501 -63860 -13234 -100064 -100875 -40367
1072 -40367 -127767 -155452 -33825 -29165 -121228 8310 -34117 -91699 -128351 -159428 -107937 -49129
1060 -49129 -22878 -52013 -109696 -30721 -23879 112535 162095 24282 27775 -33218 -140220 -200025
1048b00025L6671J41603n4391N3255J01897o8299L6080R270k818q6723m4464o0301
1036a38245N7165K3647M1164M5471k0535J13605k3371q0710K480L5504l7257k4531
1024e613l2113Q7418n0100J3421L3037R452j08352n8860J04999J1292P8712N7836
1012A41129N41q5170j58456Q7306N0045o4382j5942o5640O1193O8406p0003Q4504
1000C3531n2148r089M9905K2562O0232j32261m5246Q5801k4832J4405J42689o2806
988H2743l2406l8431p185L9798J0967O0379o3129p1235N4953N5332j61063J8276
976e1001J16772k7826o0499k5127M7123M317J110J4618j971j7514P8599m9641
964B8960j9817O6954N9908j33774k8205J09662m7059j13369M3766n2225j3873
$$ plain form
1048 -200025 -163354 -21751 -76142 -22887 79010 10711 46791 56061 53243 -33480 -77944 -138245
1036 -138245 -81080 -57433 -16269 29202 8667 122272 98901 18191 20671 56175 18918 -5613
1024 -5613 -37726 49692 -408 13013 46050 55502 -52850 -111710 -6711 4581 83293 141129
1012 141129 141670 56500 -101956 -14650 35395 -28987 -44929 -110569 -49376 19030 -50973 33531
1000 33531 -18617 -27706 22199 44761 104993 -27268 -72514 13287 -11545 2860 145549 82743
988 82743 50337 11906 4721 44519 55486 115865 52736 -18499 36454 91786 -69277 -51001
976 -51001 65771 37945 -22554 -47681 -558 3759 4869 19487 17516 2 78601 28960
964 28960 9143 76097 136005 2231 -25974 83688 36629 -76740 -32974 -85199 -99072
953i9072n950k341J8971M9893O5055l2428l7L3885R172j07035J5388O4423j5274
940e350K8124R077p3685k0187L1260j3787J8331J8893Q8488r7949j6905P9065
928D5375j5000o3034m585J5602K2793k3137l5124M7380l46P9041n9825L3760J39243
915A82143r8862J7996p104j5082K4292K0685j01904m1806O7214l2699m9386k1874
903e6387k59Q9052k0022k066O8057J4612j8745j25049K479M2247O1172m7733Q098
890A5456o435l7097J7614O1849l2292j3487j0888n044J1327n8044r369J8398K3367
877b4645n624P7823n1124j98124J43305Q4483L378l9966n2434k3036L2103k3447
865g7308L3409J07017M889N4817j18724r2286K1779J06860J3528p2145p9473P4376
$$ plain form
953 -99072 -105022 -107363 -88392 -38499 26556 -5872 -5909 27976 37148 -69887 -54499 9924 -5350
940 -5350 22774 31851 -41834 -62021 -30761 -44548 -26217 -7324 81164 -16785 -33690 45375
928 45375 30375 -32659 -37244 -21642 1151 -21986 -57110 -9730 -10076 68965 9140 42900 182143
915 182143 83281 101277 94173 79091 103383 124068 22164 -19642 47572 14873 -34513 -56387
903 -56387 -56646 32406 12384 10318 78375 92987 74242 -50807 -48328 -6081 55091 7358 15456
890 15456 9021 -28076 -10462 51387 19095 5608 -5280 -10324 1003 -57041 -66410 -48012 -24645
877 -24645 -30269 47554 -3570 -201694 -58389 26094 29472 -10494 -62928 -85964 -53861 -77308
865 -77308 -43899 63118 68007 122824 4100 -88186 -66407 40453 53981 -18164 -97637 -23261
853b3261K8956k7217l9894J11018J7547r2040J4259r019o7843J39047M205j26458
$$ plain form
853 -23261 5695 -21522 -61416 49602 67149 -24891 -10632 -19651 -87494 51553 55758 -70700
$$ [...]
##END NTUPLES=NMR SPECTRUM
##END=
