##TITLE=1H_TG-2340-XI-a
 CDCl3
 8 sc, 
 6.6.2023
##JCAMPDX= 6.0         $$ Bruker NMR JCAMP-DX V2.0
##DATA TYPE= NMR SPECTRUM
##DATA CLASS= NTUPLES
##ORIGIN= UXNMR, Bruker Analytische Messtechnik GmbH
##OWNER= root
$$ XWIN-NMR		Version 3.5
$$ Tue Jun  6 15:40:36 2023 Russian Standard Time (UT+4h)  she@DPX200
##.OBSERVE FREQUENCY= 200.13135
##.OBSERVE NUCLEUS= ^1H
##.ACQUISITION MODE= SIMULTANEOUS
##.ACQUISITION SCHEME= undefined
##.AVERAGES= 8
##.DIGITISER RES= 18
##SPECTROMETER/DATA SYSTEM= spect
##.PULSE SEQUENCE= zg30
##.SOLVENT NAME= D2O
##.SHIFT REFERENCE= (INTERNAL, D2O, 0, 15.7546)
##AUDIT TRAIL= $$ (NUMBER, WHEN, WHO, WHERE, WHAT)
$$ ##TITLE= Audit trail, XWIN-NMR		Version 3.5
$$ ##JCAMPDX= 5.01
$$ ##ORIGIN= Bruker BioSpin GmbH
$$ ##OWNER= she
$$ F:/spectra/data/she/nmr/H-F/1/pdata/1/auditp.txt
$$ ##AUDIT TRAIL=  $$ (NUMBER, WHEN, WHO, WHERE, WHAT)
(   1,<2023-06-06 15:39:22.25 +0400>,<she>,<DPX200>,
      <created by zg, POWCHK disabled, PULCHK disabled
       configuration hash MD5:
       00 E9 B6 7A A2 85 ED C7 34 08 36 98 17 FE 4E 26
       data hash MD5: 16K
       04 47 E7 B8 CD 7D D2 D5 79 C8 08 5A 8C 82 37 C1>)
(   2,<2023-06-06 15:39:24.48 +0400>,<she>,<DPX200>,
      <Start of raw data processing
       efp BC_mod = 2 LB = 0.24 FT_mod = 6 PKNL = 1 PHC0 = -20063.69 PHC1 = 10.45272 SI = 16K 
       data hash MD5: 16K
       59 E7 16 EF B1 A3 E2 89 79 76 48 C1 14 42 E5 F9>)
(   3,<2023-06-06 15:39:42.82 +0400>,<she>,<DPX200>,
      <pk PHC0 = 160.1569 PHC1 = -2 
       data hash MD5: 16K
       8C 00 5B 8B 61 95 EC 76 5A D0 8C AF C8 6E 47 2F>)
(   4,<2023-06-06 15:39:46.50 +0400>,<she>,<DPX200>,
      <abs ABSG = 5 
       data hash MD5: 16K
       01 37 42 19 5C C6 0C 93 27 7E A6 9D 3F B6 DE C4>)
$$ ##END=
$$ 
$$ hash MD5
$$ 20 68 EF AD 90 28 FF 01 28 9D E0 24 36 D9 A3 D2
##$RELAX= 
##$RELAX= 
##$RELAX= 
##$RELAX= 
##$RELAX= 
##$RELAX= 
$$ Bruker specific parameters
$$ --------------------------
##$DU= <F:/spectra>
##$EXPNO= 1
##$NAME= <H-F>
##$PROCNO= 1
##$TYPE= <nmr>
##$USER= <she>
##$AMP= (0..31)
100 100 100 100 100 100 100 100 100 100 100 100 100 100 100 100 100 100 
100 100 100 100 100 100 100 100 100 100 100 100 100 100 
##$AQSEQ= 0
##$AQ_mod= 1
##$AUNM= <au_zg>
##$AUTOPOS= <>
##$BF1= 200.13
##$BF2= 200.13
##$BF3= 200.13
##$BF4= 200.13
##$BF5= 200.13
##$BF6= 200.13
##$BF7= 200.13
##$BF8= 200.13
##$BYTORDA= 1
##$CFDGTYP= 0
##$CFRGTYP= 5
##$CHEMSTR= <none>
##$CNST= (0..31)
1 1 145 1 1 1 1 1 1 1 1 1 1 1 1 1 1 1 1 1 1 1 1 1 1 1 1 1 1 1 1 1 
##$CPDPRG= <>
##$CPDPRG1= <>
##$CPDPRG2= <>
##$CPDPRG3= <>
##$CPDPRG4= <mlev>
##$CPDPRG5= <mlev>
##$CPDPRG6= <mlev>
##$CPDPRG7= <mlev>
##$CPDPRG8= <mlev>
##$CPDPRGB= <>
##$CPDPRGT= <>
##$D= (0..31)
0 1.2 0 0 0 0 0 0 0 0.06 0 0.03 0 0 0 0 0.0002 0 0 0 0 0 0 0 0 0 0 0 0 
0 0 0 
##$DATE= 1686051561
##$DBL= (0..7)
120 120 120 120 120 120 120 120 
##$DBP= (0..7)
150 150 150 150 150 150 150 150 
##$DBP07= 0
##$DBPNAM0= <>
##$DBPNAM1= <>
##$DBPNAM2= <>
##$DBPNAM3= <>
##$DBPNAM4= <>
##$DBPNAM5= <>
$$ [...]
##$SUBNAM3= <"">
##$SUBNAM4= <"">
##$SUBNAM5= <"">
##$SUBNAM6= <"">
##$SUBNAM7= <"">
##$SUBNAM8= <"">
##$SUBNAM9= <"">
##$SW= 18.05172834244
##$SWIBOX= (0..15)
0 0 2 0 0 0 0 0 0 0 0 0 0 0 0 0 
##$SW_h= 3612.71676300578
##$TD= 16384
##$TD0= 1
##$TE= 0
##$TE2= 300
##$TE3= 300
##$TEG= 300
##$TL= (0..7)
0 120 120 120 120 120 120 120 
##$TP= (0..7)
150 150 150 150 150 150 150 150 
##$TP07= 0
##$TPNAME0= <>
##$TPNAME1= <>
##$TPNAME2= <>
##$TPNAME3= <>
##$TPNAME4= <>
##$TPNAME5= <>
##$TPNAME6= <>
##$TPNAME7= <>
##$TPOAL= (0..7)
0.5 0.5 0.5 0.5 0.5 0.5 0.5 0.5 
##$TPOFFS= (0..7)
0 0 0 0 0 0 0 0 
##$TUNHIN= 0
##$TUNHOUT= 0
##$TUNXOUT= 0
##$USERA1= <user>
##$USERA2= <user>
##$USERA3= <user>
##$USERA4= <user>
##$USERA5= <user>
##$V9= 5
##$VALIST= <valist>
##$VCLIST= <CCCCCCCCCCCCCCC>
##$VD= 0
##$VDLIST= <DDDDDDDDDDDDDDD>
##$VPLIST= <PPPPPPPPPPPPPPP>
##$VTLIST= <TTTTTTTTTTTTTTT>
##$WBST= 1024
##$WBSW= 4
##$XGAIN= (0..3)
0 0 0 0 
##$XL= 0
##$YL= 0
##$YMAX_a= 413541
##$YMIN_a= -528031
##$ZGOPTNS= <>
##$ZL1= 120
##$ZL2= 120
##$ZL3= 120
##$ZL4= 120
##$ABSF1= 15.78215
##$ABSF2= -2.269699
##$ABSG= 5
##$ABSL= 3
##$ALPHA= 0
##$AQORDER= 0
##$ASSFAC= 0
##$ASSFACI= 0
##$ASSFACX= 0
##$ASSWID= 0
##$AUNMP= <proc_1d>
##$AZFE= 0.1
##$AZFW= 0.1
##$BCFW= 0
##$BC_mod= 2
##$BYTORDP= 0
##$COROFFS= 0
##$CY= -3
##$DATMOD= 1
##$DC= 0
##$DFILT= <>
##$DTYPP= 0
##$F1P= 0
##$F2P= 0
##$FCOR= 1
##$FTSIZE= 16384
##$FT_mod= 6
##$GAMMA= 0
##$GB= 0
##$INTBC= 1
##$INTSCL= 3.70164e-10
##$ISEN= 128
##$LB= 0.24
##$LEV0= 0
##$LPBIN= 0
##$MAXI= 10000
##$MC2= 0
##$MEAN= 0
##$ME_mod= 0
##$MI= 1.114404
##$NCOEF= 0
##$NC_proc= -6
##$NLEV= 6
##$NOISF1= 3.799351
##$NOISF2= 2.8
##$NSP= 0
##$NTH_PI= 0
##$NZP= 0
##$OFFSET= 15.7546
##$PC= 1
##$PHC0= -19903.53
##$PHC1= 8.45272
##$PH_mod= 1
##$PKNL= yes
##$PPARMOD= 0
##$PSCAL= 0
##$PSIGN= 0
##$REVERSE= no
##$SF= 200.13000339054
##$SI= 16384
##$SIGF1= 3
##$SIGF2= 2
##$SINO= 5.538805
##$SIOLD= 16384
##$SREGLST= <1H.CDCl3>
##$SSB= 0
##$STSI= 16384
##$STSR= 0
##$SW_p= 3612.71676300578
##$SYMM= 0
##$S_DEV= 0
##$TDeff= 16384
##$TDoff= 0
##$TI= <>
##$TILT= no
##$TM1= 0
##$TM2= 0
##$TOPLEV= 0
##$USERP1= <user>
##$USERP2= <user>
##$USERP3= <user>
##$USERP4= <user>
##$USERP5= <user>
##$WDW= 1
##$XDIM= 16384
##$YMAX_p= 533388013
##$YMIN_p= -336778
$$ End of Bruker specific parameters
$$ ---------------------------------
##NTUPLES= NMR SPECTRUM
##VAR_NAME=  FREQUENCY,     SPECTRUM/REAL,   SPECTRUM/IMAG
##SYMBOL=    X,             R,               I
##VAR_TYPE=  INDEPENDENT,   DEPENDENT,       DEPENDENT
##VAR_FORM=  AFFN,          ASDF,            ASDF
##VAR_DIM=   16384,         16384,           16384
##UNITS=     HZ,            ARBITRARY UNITS, ARBITRARY UNITS
##FACTOR=    0.220516191357247, 1,           1
##FIRST=     3152.96806560647, 0,            0
##LAST=      -459.748697399315, 0,           0
##MIN=       -459.748697399315, -336778,     0
##MAX=       3152.96806560647, 533388013,    0
$$ Real data points
##PAGE= N=1
##DATA TABLE= (X++(R..R)), XYDATA
$$ [...]
7016B472747j46231k9802m3828O5847n877j62549j10465k0800m5520r3591l0115
$$ 2472747 2326516 2296714 2252886 2318733 2312856 2150307 2039842 2019042 1973522 1879931 1849816
7005A849816j7623Q3832j5363q5804j9031q4777j03109n0869J8824K1364J2702
$$ 1849816 1832193 1916025 1900662 1814858 1795827 1711050 1607941 1557072 1575896 1597260 1609962
6994A609962j62704m8438k0282j63674P2251O0408j29819j13347m878p6598l3142
$$ 1609962 1447258 1398820 1378538 1214864 1287115 1347523 1217704 1104357 1099479 1022881 989739
6983I89739J09916L3377m3478n2119P583o7842m1164K3689R1050q2049q9146J1778
$$ 989739 1099655 1133032 1089554 1037435 1045018 977176 936012 959701 1050751 968702 879556 891334
6971H91334k320j6815r844K5494j2091J1924k058j9982M0736Q2716J7128n7862
$$ 891334 889014 872199 862355 887849 875758 887682 885624 865642 906378 989094 1006222 948360
6959I48360O343l5672n970l2958j51884J12616K8386m6280n0215M2349l28M0588
$$ 948360 954703 919031 913061 880103 728219 840835 869221 822941 772726 815075 814747 855335
6947H55335k2287q3416l9993M1507O7897p9785K1116p4283O5969K0690J7840P5308
$$ 855335 833048 749632 709639 751146 819043 739258 760374 686091 752060 772750 790590 865898
6935H65898j39962N6299j0771j30240M5779m1379J0764m2225R9183L3094j04148
$$ 865898 725936 782235 771464 641224 687003 645624 656388 614163 713346 746440 642292
6924F42292m0993l1502M4857M4362L4447o9522k4828M0929j1880r5021M9703L6995
$$ 642292 601299 569797 614654 659016 693463 623941 599113 640042 628162 533141 582844 619839
6912F19839r0546p0594K2323j20259p5157L5167l3149k3865M3797O7414j271N6897
$$ 619839 529293 458699 481022 360763 285606 320773 287624 263759 307556 374970 373699 430596
6900D30596k863n4954j25786O9961n968j25688P8417N1782l8309Q0893J29973
$$ 430596 427733 372779 246993 316954 310986 185298 263715 315497 277188 358081 488054
6889D88054j25388p7578P1901K6078m6565l7559K3958J05575j53230P6907M5002
$$ 488054 362666 285088 356989 383067 336502 298943 322901 428476 275246 352153 397155
6878C97155j22072K3484r620j1353Q4516j9725j03750M6497k6055M2574k1240
$$ 397155 275083 298567 288947 277594 362110 342385 238635 285132 259077 301651 280411
6867B80411k7623K5070o982O3309N4402l2019L1019p587r8615q3975L952J3343
$$ 280411 252788 277858 270876 334185 388587 356568 387587 380000 281385 197410 201362 214705
6855B14705J22613j1438k2320j7536O1240K3821p9894K1557Q5558R299R0904k8855
$$ 214705 337318 325880 303560 286024 347264 371085 291191 312748 398306 407605 498509 469654
6843D69654Q8432o0433o3048o0912j17995N1996J4719L2447R632O6107j00449
$$ 469654 558086 497653 434605 373693 255698 307694 322413 354860 364492 430599 330150
6832C30150m2045L9065l2462k9887J9880O4982J8798k5783J17241o6398N5382
$$ 330150 288105 327170 294708 264821 284701 349683 368481 342698 459939 393541 448923
6821D48923J3839r9995k8196J11438N6971J574k940L3862r9026L25j8291j05777
$$ 448923 462762 362767 334571 446009 502980 504554 501614 535476 436450 436775 418484 312707
6809C12707p4926J1044L9561q8380K5376K8345j28661n615P2076K9543R795J2232
$$ 312707 237781 248825 288386 200006 225382 253727 125066 119451 191527 221070 230865 243097
6797B43097j15136j9393n244K0406K2298K0118K8898p7217l6653o034P2496m7034
$$ 243097 127961 108568 103324 123730 146028 166146 195044 117827 81174 75140 147636 100602
6785A00602K6205L0384J02610J4623J11760j58450j48579J03373N527J1558m3908
$$ 100602 126807 157191 259801 274424 386184 227734 79155 182528 188055 199613 155705
6774A55705o2334O5837J49427j42977m3254R6141J06260m8023r5399k3318L9397
$$ 155705 93371 159208 308635 165658 122404 218545 324805 276782 181383 158065 197462
6763A97462l6853Q637k1537O9019J23357p313J3230n588q0082p1204M8440J1161
$$ 197462 160609 169246 147709 216728 340085 332772 346002 340414 260332 189128 237568 248729
6751B48729K900j28781l0965J6508Q2947L6996m4243j63048j6523Q2342k4445
$$ 248729 251629 122848 91883 108391 191338 228334 184091 21043 4520 86862 62417
6740F2417N4000J4465r0565r8345L7547Q5379p896j1891o4597m7012M201J13774
$$ 62417 116417 130882 40317 -58028 -20481 64898 57002 45111 -19486 -66498 -62297 51477
6728E1477L9934N478j8529M7298K8959R3227m5470m705l3477k1062l6052m7223
$$ 51477 91411 96889 78360 125658 154617 247844 202374 197669 164192 143130 107078 59855
6716E9855Q738J23979r3157O9819R7535j01196K7525N5653K9511k4020p3638n5522
$$ 59855 68593 192572 99415 169234 266769 165573 193098 248751 278262 254242 180604 125082
6704A25082J08493j3151R5939N8080M0787O0510R6326J5130J93902J00337N5551
$$ 125082 233575 220424 316363 374443 415230 475740 572066 587196 781098 881435 936986
6693I36986j2399j0864Q06j07265k6132j81482l9138j5563j01515l3482o3569
$$ 936986 924587 913723 914529 807264 781132 599650 560512 544949 443434 409952 346383
6682C46383L3002k348j39902q1063k0521j16724Q5131m5846n4794M0918N490Q2574
$$ 346383 379385 377037 237135 156072 135551 18827 103958 58112 3318 44236 49726 132300
6670A32300r4831l7716K0757P6070l7654m5460Q2901j40067J3295K3093J38694
$$ 132300 37469 -247 20510 96580 58926 13466 96367 -43700 -30405 -7312 131382
6659A31382n0477O1742M886n5190l141o3067J05658j8886k2648m4799O3476k9500
$$ 131382 80905 142647 147533 92343 89202 26135 131793 112907 90259 45460 108936 79436
6647G9436p2397j8421j7482L3419m1612P4645J7881j7824L6050m7441q8396K9145
$$ 79436 7039 -11382 -28864 4555 -37057 37588 55469 37645 73695 26254 -62142 -32997
6635c2997K2678n6864m536J00096l0830k7170O1290L2823k7416m8535K0484q3393
$$ -32997 -10319 -67183 -71719 28377 -2453 -29623 31667 64490 37074 -11461 9023 -74370
6623g4370N4271Q4270n7447l7343q50l1844j3814J20487M0031j23113m8840l2797
$$ -74370 -20099 64171 6724 -30619 -31469 -63313 -77127 43360 83391 -39722 -88562 -121359
6611a21359o7902M2711J05932L4479R6368j32375k3613k6109l285J19678r184
$$ -121359 -189261 -146550 -40618 -6139 90229 -42146 -65759 -91868 -95153 24525 15341
6600A5341Q593k8472J168l7714L5161R0244O5476q5097j0590m1456k6916M5779
$$ 15341 23934 -4538 -3370 -41084 -5923 84321 149797 64700 54110 12654 -14262 31517
6588C1517k7199O9388k8711Q1245l634p1817j2885N3978k603L6006k7919j8141
$$ 31517 4318 73706 44995 126240 122606 50789 37904 91882 89279 125285 97366 79225
6576G9225l3543J1373q9476M5133L2937l5118J46007n8722l3966L1051N3749m8629
$$ 79225 45682 57055 -32421 12712 45649 10531 156538 97816 63850 94901 148650 100021
6564A00021j6016O1064q4958M5269k5275p4738j7756L153Q6241j3202p505j22748
$$ 100021 84005 145069 60111 105380 80105 5367 -12389 -9236 77005 63803 56298 -66450
6552f6450K6430O9990J18098J07233j22786o7305K6175P8180K6573n8988j1660
$$ -66450 -40020 29970 148068 255301 132515 65210 91385 169565 196138 137150 125490
6541A25490L3604n0970Q903O0208J7363m5583N3610L6570P9993L4503Q569k4616
$$ 125490 159094 108124 117027 177235 194598 149015 202625 239195 319188 353691 362260 337644
6529C37644l8914K0137l5534q331N0259p2742j18239P3500J25193j5332K3516
$$ 337644 298730 318867 283333 275002 325261 252519 134280 207780 332973 317641 341157
6518C41157J23536r8137M4512L8158l814p9456N1922J4531m8471n6828j64855
$$ 341157 464693 366556 411068 449226 445412 365956 417878 432409 383938 327110 162255
6507A62255M7998k1670j14349O5139N4886n0816j3841l4242Q6480M0113j10690
$$ 162255 210253 188583 74234 139373 194259 143443 129602 95360 181840 221953 111263
6496A11263J0697j26397P4R0431N1063n6491o865Q3378q8078j30225J13901M0806
$$ 111263 121960 -4437 -4363 86068 137131 80640 73775 157153 69075 -61150 52751 93557
6484I3557l2057j0318k4788M8592m7125J5354L2336n2480L668K2094p5645J7247
$$ 93557 61500 51182 26394 74986 27861 43215 75551 23071 26739 48833 -26812 -9565
6472i565j9320L0123l5862L8112R9299o9142L6209M5152m3520j11270N8958o5147
$$ -9565 -28885 1238 -34624 3488 102787 33645 69854 115006 71486 -39784 19174 -45973
6460d5973l4388j7247J3866J01784N0378J1062M9879L2910o4251j16337j5941
$$ -45973 -80361 -97608 -83742 18042 68420 79482 129361 162271 98020 -18317 -34258
6449c4258J05205M1545k3081l0260R789N7969p4978l0815j1573M662O1355j10633
$$ -34258 70947 112492 89411 59151 68940 126909 51931 21116 9543 14205 75560 -35073
6437c5073l5811j2160R1408l8680L267K8921O7368J0807O0587m8719k7710m5748
$$ -35073 -70884 -83044 8364 -30316 -27049 1872 69240 80047 140634 91915 64205 18457
6425A8457M7575j2329J11007K6668n573K5347p7356M0018R020k6712q9058L6788
$$ 18457 66032 53703 164710 191378 185805 211152 133796 173814 182834 156122 67064 103852
6413A03852J3551p1393O3046r350j1403k9330P1335J480q8329J8268J1140L6105
$$ 103852 117403 46010 109056 99706 88303 58973 130308 131788 43459 61727 72867 108972
6401A08972R7773j4708j6212J31329J2447k3748J0789j1288P5810l508q6134l6794
$$ 108972 206745 192037 175825 307154 319601 295853 306642 295354 371164 367656 281522 244728
6389B44728L8357N3654J3037j0434q2950N7049L4533P2087p3167k0575M7175M5451
$$ 244728 283085 336739 349776 339342 256392 313441 347974 420061 346894 326319 373494 418945
6377D18945J4996j3132j8921J2018p2584K959j1012r8280J31839P080O2181J0059
$$ 418945 433941 420809 401888 413906 341322 344281 333269 234989 366828 373908 436089 446148
6365D46148j33019J2110o1678P6679J5808k0237j19496m0213K3136Q1769L3214
$$ 446148 313129 325239 263561 340240 356048 335811 216315 176102 199238 281007 314221
6354C14221l7238k6496J5229M6294O2530j9696N1680l3457l1973n364P9210r981
$$ 314221 276983 250487 265716 312010 374540 354844 406524 373067 341094 335730 414940 404959
6342D04959j5245N221J3227P6808k4259Q747L055K5851Q5152j7n3046j7497J0503
$$ 404959 389714 394935 408162 484970 460711 469458 472513 498364 583516 583499 530453 512956 523459
6329E23459p8531J5623K3073P8359K6733j01046j00895K4392M9461J9819p124
$$ 523459 444928 460551 483624 561983 588716 487670 386775 411167 460628 480447 473323
6318D73323k7485O8131m0938O5398p775j10426L3101O5306l4032L6947j14340
$$ 473323 445838 513969 473031 538429 530654 420228 453329 518635 484603 521550 407210
6307D07210j0039q375r5012p0481K02948N3451l6386p0146n1542K3552k7733J55949
$$ 407210 397171 388796 293784 223303 426251 479702 443316 373170 321628 345180 317447 473396
6295D73396L2479j41566J03690R5259q5335N3265k5019j62124J6775M2636J33496
$$ 473396 505875 364309 467999 563258 477923 531188 506169 344045 360820 403456 536952
6284E36952j25862j1760O5718l2215j85052r6133J28426M8551j63325J58963J79651
$$ 536952 411090 399330 465048 432833 247781 151648 280074 328625 165300 324263 503914
6273E03914J8131o3007j8772J7612m1210M3516J1877j3640l2657l2211K8096J0330
$$ 503914 522045 459038 440266 457878 416668 460184 472061 458421 425764 393553 421649 431979
6261D31979K2156J47124k6580j9416M9774l3184j9307m3456n3290K1875N0744
$$ 431979 454135 601259 574679 555263 605037 571853 552546 509090 455800 477675 528419
6250E28419M1218Q580m283N1578P595N2626N4271p607k4253m0217p4726r8035
$$ 528419 569637 578217 573934 625512 633107 685733 740004 732397 708144 667927 593201 495166
6238D95166R4427M7817j8559k180m2990J9488k6172j42887N2589Q81m1774M2325
$$ 495166 589593 637410 618851 616671 573681 593169 566997 424110 476699 477580 435806 478131
6226D78131J90812m5125q820O2218m6548l9613m6626p7034J75081j3983R3778
$$ 478131 668943 623818 614998 677216 630668 591055 544429 467395 642476 628493 722271
6215G22271L7791p7579N6588n2064j02481r194J28731P7212n6344O34n0903K939
$$ 722271 760062 682483 739071 687007 584526 575332 704063 781275 724931 725565 674662 677601
6203F77601L1427P5065L307o1849K4981M4869Q8309J271l1421J2171m0971r0969
$$ 677601 709028 784093 787400 725551 750532 795401 883710 884981 853560 865731 824760 733791
6191G33791J1424J8557J54270N9860j9786l6547k832K2019N167l4548m766L7995
$$ 733791 745215 763772 918042 977902 958116 921569 918737 940756 945923 911375 906609 944604
6179I44604m335k6460L7249J376M1915L7325J77554M0647k8346p512o8383O2734
$$ 944604 940269 913809 951058 952434 994349 1031674 1209228 1249875 1221529 1214017 1145634 1208368
6167A208368p5323j3198P0537P4621N1866o3163K7901K5468J1795P0707L8066
$$ 1208368 1133045 1119847 1190384 1265005 1316871 1253708 1281609 1307077 1318872 1389579 1427645
6156A427645P2821J14132O1476r1032j0633r3420J9706J38116J55289M3512K9126
$$ 1427645 1500466 1614598 1676074 1585042 1574409 1480989 1500695 1638811 1794100 1837612 1866738
6145A866738j5533R6962O2915N536J11667J27626j8914k1445K7333J3494J3836
$$ 1866738 1851205 1948167 2011082 2016618 2128285 2255911 2236997 2215552 2242885 2256379 2270215
6134B270215J7730K14403k4261O2570J53785j20247L1035J10624J43544K7761
$$ 2270215 2287945 2502348 2478087 2540657 2694442 2574195 2605230 2715854 2859398 2887159
6124B887159k7739K05742j4188R4544J27970j01493J18404K04402j4517Q8492
$$ 2887159 2859420 3065162 3050974 3145518 3273488 3171995 3290399 3494801 3480284 3568776
6114C568776J69164O3223J33706J77955p8237J67070K13781L5517J29766P7137
$$ 3568776 3737940 3801163 3934869 4112824 4034587 4201657 4415438 4450955 4580721 4657858
6104D657858Q2607J60400K9596L31848K70016J06077J04872K30095J51867K33355
$$ 4657858 4740465 4900865 4930461 5262309 5532325 5638402 5743274 5973369 6125236 6358591
6094F358591K48760K32689K19173J94540J98641L84656L16556K72600L73149L69488
$$ 6358591 6607351 6840040 7059213 7253753 7452394 7837050 8153606 8426206 8799355 9168843
6084I168843L95897M39227L60062L38334M30558M97149O34080P39325P42627Q63020
$$ 9168843 9564740 10003967 10364029 10702363 11132921 11630070 12264150 13003475 13746102 14609122
6074A4609122J003252J060410J392254J501881J983853K371891K852934L508248
$$ 14609122 15612374 16672784 18065038 19566919 21550772 23922663 26775597 30283845
6066C0283845L899784L826328L651757L058315K290901J435702J076640L35429
$$ 30283845 34183629 38009957 41661714 44720029 47010930 48446632 49523272 49858701
6058D9858701o50453j216521q83392o5735L69762P49131J107113Q60132J92356
$$ 49858701 49208248 47991727 47108335 47042600 47412362 48161493 49268606 50128738 50321094
6049E0321094m25496r11671j543072k661747l786062m160373l682588l353359
$$ 50321094 49895598 48983927 47440855 44779108 40993046 36832673 33150085 29796726
6041B9796726k854206k239709j811102j409214j040148p08246o07544m72781j47012
$$ 29796726 26942520 24702811 22891709 21482495 20442347 19734101 19126557 18653776 18506764
6032A8506764j59277P4340J76436O7463K02029L36281N41743O26240Q43809R28220
$$ 18506764 18347487 18421827 18598263 18665726 18867755 19204036 19745779 20372019 21215828 22144048
6022B2144048J179608J464612J785043K073561K579285L340146M225913M808704
$$ 22144048 23323656 24788268 26573311 28646872 31226157 34566303 38792216 43600920
6014D3600920M860624M773932M360849L420570K147945J317368P94397m22099
$$ 43600920 48461544 53235476 57596325 61016895 63164840 64482208 65276605 64854506
6006F4854506j658080j782981j063455p4962N21093J119443J197215L65782o63972
$$ 64854506 63196426 61413445 60349990 60275028 60796121 61915564 63112779 63478561 62814589
5997F2814589j182290j898166l198956m746674n669870n552956n104428m437182
$$ 62814589 61632299 59734133 56535177 51788503 46118633 40565677 35461249 31024067
5989C1024067l851296l293313k576106k146743j703588j473739j260460j128487
$$ 31024067 27172771 23879458 21303352 19156609 17453021 15979282 14718822 13590335
5981A3590335r41000p90613o15871n39794n60437l94027m04171l42366l37354
$$ 13590335 12649335 11858722 11242851 10703057 10142620 9748593 9344422 9002056 8664702
5972H664702l46092l41584k35508l01556k09984l38055k56623q9937j29608j34002
$$ 8664702 8318610 7977026 7741518 7439962 7229978 6891923 6635300 6545363 6415755 6281753
5962F281753j41780n8200o4013j52106k9438n1147k60724j00012j73175j27992
$$ 6281753 6139973 6081773 6017760 5865654 5836216 5785069 5524345 5424333 5251158 5123166
5952E123166j21389j2670j14006k15416j56685k14649L4546l1265q7181m5808
$$ 5123166 5001777 4989107 4875101 4659685 4503000 4288351 4322897 4291632 4204451 4158643
5942D158643j36466j23330r5751Q934p8248k3511q5822O392J3986o3601K3871
$$ 4158643 4022177 3898847 3803096 3812030 3733782 3710271 3624449 3630841 3644827 3581226 3605097
5931C605097j05809K0193R2502n936j59784R4743O0916O4434j07207q1057L0363
$$ 3605097 3499288 3519481 3611983 3606047 3446263 3541006 3601922 3666356 3559149 3478092 3508455
5920C508455P7951n4100j39166p3205m2586j9176q5061O819J3589j62856k6906
$$ 3508455 3586406 3532306 3393140 3319935 3277349 3258173 3173112 3179931 3193520 3030664 3003758
5909C003758k0120j991M2211r6207r451l871M5612r7687J28000P2757k8537p4723
$$ 3003758 2983638 2981647 3023858 2927651 2918200 2914329 2959941 2862254 2990254 3063011 3034474 2959751
5897B959751Q4718J13256m8771P4250M012M3263J22352n4769p6070j8931n352
$$ 2959751 3044469 3157725 3108954 3183204 3187216 3230479 3352831 3298062 3221992 3203061 3197709
5886C197709M9941R3408k6045k1911K4590j13089m5459N1438J31026J08399p3007
$$ 3197709 3247650 3341058 3315013 3293102 3317692 3204603 3159144 3210582 3341608 3450007 3377000
5875C377000l5179O2645l5197q582J49108N8451K4043J4846j9528n0344o9674
$$ 3377000 3341821 3404466 3369269 3360687 3509795 3568246 3592289 3607135 3587607 3537263 3467589
5864C467589m57n8356l2913R0464l1212j40127m5899R6233J20355Q6245j89235
$$ 3467589 3467132 3408776 3375863 3466327 3435115 3294988 3249089 3345322 3465677 3551922 3362687
5853C362687Q696q255p5571J46112m5900r691k2597J20644K3035J23870R4451
$$ 3362687 3371383 3363128 3287557 3433669 3387769 3378078 3355481 3476125 3499160 3623030 3717481
5842C717481M8383q1099N0226J94536n1789R250M9454l5690p9144n5212q9184
$$ 3717481 3765864 3684765 3734991 3929527 3877738 3886988 3936442 3900752 3821608 3766396 3677212
5831C677212L8640J03832L0888L4240J3948m195P4832J29917L5260o07L4041J11855
$$ 3677212 3715852 3819684 3850572 3884812 3898760 3894565 3969397 4099314 4134574 4133967 4168008 4279863
5819D279863J60023R3543J84341P9614J31028M8090J88825Q1585L5369P7744J33910
$$ 4279863 4439886 4533429 4717770 4797384 4928412 4976502 5165327 5246912 5282281 5360025 5493935
5808E493935M7875J09656Q8037r3115Q2603J13052m0438K1268k3940n7145J03864
$$ 5493935 5541810 5651466 5739503 5646388 5728991 5842043 5801605 5822873 5798933 5741788 5845652
5797E845652j01510k790K7825J87118J89132K0270M5540J33180l3932J18799J36701
$$ 5845652 5744142 5741352 5769177 5956295 6145427 6165697 6211237 6344417 6310485 6429284 6565985
5786F565985J91014J10391P742K5161o8515J20848N5858J04122K21749K25287
$$ 6565985 6756999 6867390 6875132 6900293 6831778 6952626 7008484 7112606 7334355 7559642
5776G559642K8486N0579O7102R9963J13097K89505K91569J83114J44135L9251
$$ 7559642 7588128 7638707 7705809 7805772 7918869 8208374 8499943 8683057 8827192 8866443
5766H866443R5624J70273J15002J71034J89283K53555K17527L0930J49553J03754
$$ 8866443 8962067 9132340 9247342 9418376 9607659 9861214 10078741 10109671 10259224 10362978
5756A0362978J27474J61035K54617K65063J84255L03940L19239L08669N37799
$$ 10362978 10490452 10651487 10906104 11171167 11355422 11659362 11978601 12287270 12825069
5747A2825069M50005O12259N27939O46861Q12371R15212J274520J376306J711649
$$ 12825069 13275074 13887333 14415272 15062133 15874504 16789716 18064236 19440542 21152191
5738B1152191K093371K450205K862551L111863K803682K583279K876157K669238
$$ 21152191 23245562 25695767 28558318 31670181 34473863 37057142 39933299 42602537
5730D2602537J700496O84602O61322P43271N06651l9207m26537j255381k131921
$$ 42602537 44303033 44987635 45648957 46392228 46898879 46859672 46433135 45177754 43045833
5721D3045833k130138k241136k221653k268888j869431j532940j003420l90700
$$ 43045833 40915695 38674559 36452906 34184018 32314587 30781647 29778227 29387527
5713B9387527L02619R09255J383662J967821K603285K663199K113777K318196
$$ 29387527 29690146 30599401 31983063 33950884 36554169 39217368 41331145 43649341
5705D3649341K643250K313570J170996L60734L20578N08963J92210l55154r40425
$$ 43649341 46292591 48606161 49777157 50137891 50458469 50967432 51159642 50804488 49864063
5696D9864063j948808k442661k408092k572627k675334k547742k197069j618653
$$ 49864063 47915255 45472594 43064502 40491875 37816541 35268799 33071730 31453077
5688C1453077r69701l78288K54906Q01785J260263J340009J108508J266184J595492
$$ 31453077 30483376 30105088 30359994 31161779 32422042 33762051 34870559 36136743 37732235
5679C7732235J101958M07073M0490J21171K24915q3403m36957q76181j508584
$$ 37732235 38834193 39241266 39281756 39402927 39627842 39544439 39107482 38231301 36722717
5670C6722717j880229j691587j749121j850635j884304j414562j050757o66461
$$ 36722717 34842488 33150901 31401780 29551145 27666841 26252279 25201522 24535061
5662B4535061k07669K99786N87305R61940J485544J761630J598551J405481J694632
$$ 24535061 24327392 24627178 25214483 26176423 27661967 29423597 31022148 32427629 34122261
5653C4122261J773400J069107K07758N9665J00607N991l96431p58203j466008
$$ 34122261 35895661 36964768 37172526 37232191 37332798 37338789 36942358 36184155 34718147
5644C4718147j995268k262675k409017k369342k523732k373031k138927j835354
$$ 34718147 32722879 30460204 28051187 25681845 23158113 20785082 18646155 16810801
5636A6810801j534353j198520r65264p77009o32255o76600o20649m47881m07300
$$ 16810801 15276448 14077928 13112664 12335655 11703400 11026800 10406151 9958270 9550970
5627I550970m09792l32530l06223k30470j55375k33773k29167j62670j25652p4682
$$ 9550970 9141178 8808648 8502425 8271955 8116580 7882807 7653640 7490970 7365318 7290636
5617G290636l01034k6594o5648j23204j9890p8704q7008j40752j16553j31361
$$ 7290636 6989602 6963008 6897360 6774156 6754266 6675562 6588554 6447802 6331249 6199888
5607F199888p7157j42684q6238l8432o8212j073j05046O058j39900j17370R4015
$$ 6199888 6122731 5980047 5893809 5855377 5787165 5786092 5681046 5687104 5547204 5429834 5523849
5596E523849k8916J2248m0311j11817o9741N626r1820n4803o0238j09890J7083
$$ 5523849 5494933 5507181 5466870 5355053 5285312 5290938 5199118 5144315 5084077 4974187 4991270
5585D991270L6082k28660j50958J730J22885L3006r0193j5169J31100p8740j7439
$$ 4991270 5027352 4798692 4647734 4649464 4772349 4805355 4715162 4699993 4831093 4752353 4734914
5574D734914k2804R9966M3349o1345k8066k5992q8238N0307p846j56232j30010
$$ 4734914 4712110 4812076 4855425 4794080 4766014 4740022 4651784 4702091 4694245 4538013 4408003
5563D408003n5730J6729j6192k6380j27877p6960k5573j91749r9655L7361o477
$$ 4408003 4352273 4369002 4352810 4326430 4198553 4121593 4096020 3904271 3804616 3841977 3835500
5552C835500n774k7652N3954m2939L2257M8407j6827J8221J13905j5138J29109
$$ 3835500 3829726 3802074 3856028 3813089 3845346 3893753 3876926 3895147 4009052 3993914 4123023
5541D123023K0280k2217M0311o0331j7356m6163j32596j51199p895Q7806l2294
$$ 4123023 4143303 4121086 4161397 4101066 4083710 4037547 3904951 3753752 3745857 3833663 3801369
5530C801369m2422j02139J109L7456N5007O88J01849K0874N0347p8328L9179l8324
$$ 3801369 3758947 3656808 3657917 3695373 3750380 3751068 3852917 3873791 3924138 3845810 3884989 3846665
5518C846665M7558J9740j16987N7553o696q8857M998r5743J17692j00337n3133
$$ 3846665 3894223 3913963 3796976 3854529 3847833 3758976 3763974 3668231 3785923 3685586 3632453
5507C632453P6660K0506L9302l7573n004j06378O2274L9337P9192O240P8867J8559
$$ 3632453 3709113 3729619 3768921 3731348 3726344 3619966 3682240 3721577 3800769 3807009 3885876 3904435
5495C904435O0283L1779R4166L3602K7117K4274o7622o6476R7405K4103J0625
$$ 3904435 3964718 3996497 4090663 4124265 4151382 4175656 4108034 4041558 4138963 4163066 4173691
5484D173691L2852p2215j15693k4376k3918J18027q43l1462J1245J48346l6129
$$ 4173691 4206543 4134328 4018635 3994259 3970341 4088368 4087525 4056063 4067308 4215654 4179525
5473D179525o6408l9679M3189K5176J3781j86452j38879J04917j94130j07144
$$ 4179525 4113117 4073438 4116627 4141803 4155584 3969132 3830253 3935170 3741040 3633896
5463C633896o362O9207k225J771L9705J12735N253J77992P1367K4411J02512L9370
$$ 3633896 3627534 3696741 3694516 3696287 3735992 3848727 3853980 4031972 4103339 4127750 4230262 4269632
5451D269632k0838Q3777Q4819m5541J8304J9717P3822O0100p9140O4638J06970
$$ 4269632 4248794 4332571 4417390 4371849 4390153 4409870 4483692 4543792 4464652 4529290 4636260
5440D636260J56603J24956O9297P8015O5052J65113N9974O712o4216j08889k3215
$$ 4636260 4792863 4917819 4987116 5065131 5130183 5295296 5355270 5361982 5297766 5188877 5165662
5429E165662K933n6206O1085M486P1449L1762l6082J96005O9186L6855j7434m4131
$$ 5165662 5168595 5112389 5173474 5177960 5249409 5281171 5245089 5441094 5510280 5547135 5529701 5485570
5417E485570J2855j33809m1406k4435o2914o4327m362r2494m4713k3546o5516
$$ 5485570 5498425 5364616 5323210 5298775 5235861 5171534 5167172 5074678 5029965 5006419 4940903
5406D940903j05921O4859O8620r2267R0943N688j3607p8156M8999p7304J3834
$$ 4940903 4834982 4899841 4968461 4876194 4967137 4972825 4959218 4881062 4930061 4852757 4866591
5395D866591j9881J9567P6063p6546j1082r5477o009J16771M9224j1179J4858
$$ 4866591 4846710 4866277 4942340 4865794 4854712 4759235 4753226 4869997 4919221 4908042 4922900
5384D922900j09534L2580O0704P0323n5052L8789J57045L5299N0736J46209R8740
$$ 4922900 4813366 4845946 4906650 4976973 4921921 4960710 5117755 5153054 5203790 5349999 5448739
5373E448739J69312O6494N5568J39132J67879J12766K6237J25146R8509J17430
$$ 5448739 5618051 5684545 5740113 5879245 6047124 6159890 6186127 6311273 6409782 6527212
5363F527212L7188J51725P1903M2767j9944L0957N4268o462J55479J85321K2009
$$ 6527212 6564400 6716125 6788028 6830795 6810851 6841808 6896076 6889614 7045093 7230414 7252423
5352G252423N5096K72469K67668J89958J24545J68774K09406N3272K8683J03156
$$ 7252423 7307519 7579988 7847656 8037614 8162159 8330933 8540339 8593611 8622294 8725450
5342H725450M041O7791j08456j17727m4789j00024j17162K6484j84262k88292
$$ 8725450 8729491 8797282 8688826 8571099 8526310 8426286 8309124 8335608 8151346 7863054
5332G863054k5245k704k11295o8171o0152P1718J31185o479o8463n6901q0018
$$ 7863054 7837809 7835105 7623810 7555639 7495487 7567205 7698390 7691911 7623448 7566547 7486529
5321G486529Q3038J6869j55677q6873o8161j46809L879k0052o8023m4429j34480
$$ 7486529 7569567 7586436 7430759 7343886 7275725 7128916 7132795 7112743 7044720 7000291 6865811
5310F865811J1461j72371r5751k06465k50969j86510n4684o3845p5774K3859M9768
$$ 6865811 6877272 6704901 6609150 6402685 6151716 5965206 5910522 5846677 5770903 5794762 5844530
5299E844530L4055J72825J53978K13738K7605O3600R4711p753J06238O0766p4725
$$ 5844530 5878585 6051410 6205388 6419126 6446731 6510331 6605042 6597289 6703527 6764293 6689568
5288F689568N5081k45961j20389k465K7050J808K967q2289l4824P1432J24605
$$ 6689568 6744649 6498688 6378299 6375834 6402884 6404692 6407659 6325370 6290546 6361978 6486583
5277F486583J22326k9961J2997P0170l682m6355J18419J2263J38977K05289J30439
$$ 6486583 6608909 6578948 6591945 6662115 6658433 6612078 6730497 6742760 6881737 7087026 7217465
5266G217465K0125K0496O3328J76944J87561Q5043o785L5855P0031P2538n6046
$$ 7217465 7237590 7258086 7321414 7498358 7685919 7770962 7764177 7800032 7870063 7942601 7886555
5255G886555J41172P3528O4622k4670J813R1934n6319n2695l5859N3969n5738
$$ 7886555 8027727 8101255 8165877 8141207 8143020 8234954 8178635 8125940 8090081 8144050 8088312
5244H088312j42874n7220M8700K0129n8695j0249r805R7993J15145P3730K92183
$$ 8088312 7945438 7888218 7936918 7957047 7898352 7888103 7878298 7976291 8091436 8165166 8457349
5233H457349R4301P8013O3151J50438M095k9336l3335o5836J25924L1982n5148
$$ 8457349 8551650 8629663 8692814 8843252 8847347 8818011 8784676 8718840 8844764 8876746 8821598
5222H821598l9151j49798m3727m5198N8180k6966l5695R3487K12440R268L394
$$ 8821598 8782447 8632649 8588922 8543724 8601904 8574938 8539243 8632730 8845170 8854438 8857832
5211H857832J87736O1192K14778K63360K35859J43511J58733N8923K23997l1696
$$ 8857832 9045568 9106760 9321538 9584898 9820757 9964268 10123001 10181924 10405921 10374225
5201A0374225Q3588J86266R638q4101L778l221k1491o6606q2598r2620M9729J70270
$$ 10374225 10457813 10644079 10653717 10569616 10573394 10570173 10548682 10482076 10399478 10306858 10356587 10526857
5189A0526857J74105k9617J01924J20051J97204K54073J16262N8268K5940J36789
$$ 10526857 10700962 10671345 10773269 10893320 11090524 11344597 11460859 11519127 11545067 11681856
5179A1681856J16661R2906K97699R6557J74131K36603J57643K22823M6435J39891
$$ 11681856 11798517 11891423 12189122 12285679 12459810 12696413 12854056 13076879 13123314 13263205
5169A3263205J78540R3766J51628L11663K05095J93913L05618K93450K63950K89700
$$ 13263205 13441745 13535511 13687139 13998802 14203897 14397810 14703428 14996878 15260828 15550528
5159A5550528M48641N34650L49996M24775O08484N68091O27111P74481R19893
$$ 15550528 15999169 16533819 16883815 17308590 17917074 18485165 19112276 19886757 20806650
5150B0806650J151845J075787J184593J220616J215475J434050J233193R31791
$$ 20806650 21958495 23034282 24218875 25439491 26654966 28089016 29322209 30254000
5142C0254000J039881J212882J440411J279138J262185J320350J639981J488088
$$ 30254000 31293881 32506763 33947174 35226312 36488497 37808847 39448828 40936916
5134D0936916J431772J782958J584761J332050J586222J815426J685239J481399
$$ 40936916 42368688 44151646 45736407 47068457 48654679 50470105 52155344 53636743
5126E3636743J242750R55050Q02652P64863J206467J453706J331772J176251J518569
$$ 53636743 54879493 55834543 56637195 57402058 58608525 60062231 61394003 62570254 64088823
5117F4088823J595938J091533J130551J208310O92055L00588L20911P26762O15596
$$ 64088823 65684761 66776294 67906845 69115155 69807210 70107798 70428709 71155471 71771067
5108G1771067L19768L72982K79449L10065O599M47880R77891P92885Q06106P58104
$$ 71771067 72090835 72463817 72743266 73053331 73059930 73507810 74485701 75278586 76084692 76842796
5098G6842796L94031N11520K73305J25376O1637L15579K17014K60394L34671j08196
$$ 76842796 77236827 77748347 78021652 78147028 78208665 78524244 78741258 79001652 79336323 79228127
5088G9228127j09024j17547m51597q02910o60284m34699o76228p89672j300381
$$ 79228127 79119103 79001556 78549959 77747049 77086765 76652066 75975838 75186166 73885785
5079G3885785j380451j325398j341420j171136q52975q74988r43089k66971L59375
$$ 73885785 72505334 71179936 69838516 68667380 67814405 66939417 65996328 65729357 66088732
5070F6088732L63554M41619O63689O87713O75243M9637M7884P15363P60106K82201
$$ 66088732 66452286 66893905 67557594 68245307 68920550 68970187 69018071 69733434 70493540 70775741
5060G0775741P7711k5750j80859k71444m90913o98772j039490j151142p11220
$$ 70775741 70853452 70827702 70646843 70375399 69884486 69185714 68146224 66995082 66283862
5051F6283862p73312m02622N9774N49104J383537K259160K912214K989449L322698
$$ 66283862 65510550 65107928 65167702 65716806 67100343 69359503 72271717 75261166 78583864
5042G8583864M417593M679458L586142K911568L608331M173067L645285K447573
$$ 78583864 83001457 87680915 91267057 94178625 97786956 101960023 105605308 108052881
5034A08052881J789918J570139J251413O78400j15688k97027m33304K58608O08035
$$ 108052881 109842799 111412938 112664351 113342751 113227063 112930036 112496732 112755340 113363375
5025A13363375K9260R85482K359671K580842K998023M273272N222445N648785
$$ 113363375 113392635 114378117 116737788 119318630 122316653 126589925 131812370 137461155
5017A37461155O293877N554099M415306N949800O835039N631561M015519K837673
$$ 137461155 143755032 149309131 153724437 159674237 166509276 172140837 176156356 178994029
5009A78994029K575507L171528J888892J890981L86047k843166l919485n108505
$$ 178994029 181569536 184741064 186629956 188520937 188906984 186063818 182144333 177035828
5001A77035828p150753p216015p208863p820009o964080p416066p105425o140136
$$ 177035828 169885075 162669060 155460197 147640188 140676108 133260042 126154617 120014481
4993A20014481n795066m942021l836951l742371l153637j698423j221391j691009
$$ 120014481 114219415 109277394 105440443 101698072 98544435 96846012 95624621 93933612
4985I3933612k496945k844332j767460k027055k108243j527318k171410k243910
$$ 93933612 91436667 88592335 86824875 84797820 82689577 81162259 78990849 76746939
4977G6746939j369468k515468l073919k447373k505404k285870j937280k178280
$$ 76746939 75377471 72862003 69788084 67340711 64835307 62549437 60612157 58433877
4969E8433877k270380k105186j737217j457175j833199j896296j412500j401402
$$ 58433877 56163497 54058311 52321094 50863919 49030720 47134424 45721924 44320522
4961D4320522j346520j838641k368506k033386k078263j941197j690942j384070
$$ 44320522 42974002 41135361 38766855 36733469 34655206 32714009 31023067 29638997
4953B9638997j217413j026340r31771o26205p84473n90699n37640m56000l03373
$$ 29638997 28421584 27395244 26463473 25837268 25052795 24462096 23924456 23468456 23165083
4944B3165083m12907k80427l38959k39167j12145r9008j99534k408K61p7131j32374
$$ 23165083 22752176 22471749 22132790 21893623 21781478 21682470 21482936 21480528 21480789 21403658 21271284
4933B1271284p3638o6244J25602k1686J00205J25546N1697J77272K18459K17457
$$ 21271284 21197646 21131402 21257004 21235318 21335523 21461069 21512766 21690038 21908497 22125954
4923B2125954J70825K99215K65506M14642M28836N20362N77215N36416P16490
$$ 22125954 22296779 22595994 22861500 23276142 23704978 24225340 24802555 25338971 26055461
4914B6055461Q89286Q45351J117165J465627J587833K131729K524443L286135
$$ 26055461 26944747 27790098 28907263 30372890 31960723 34092452 36616895 39903030
4906C9903030L907527M675647N667084O382375O675708O933641N866034L206759
$$ 39903030 43810557 48486204 54153288 60535663 67211371 74145012 80011046 83217805
4898H3217805P86799j737951m556032o748111p811189p472726o163710m755081
$$ 83217805 84004604 82266653 77710621 70962510 63151321 55678595 49514885 44759804
4890D4759804l658481k827112k233024j582572r79594n72085l44183j81310M6503
$$ 44759804 41101323 38274211 36041187 34458615 33479021 32906936 32562753 32381443 32427946
4881C2427946J33071K98380N74282R87855J175396J502640J804970K048067K163967
$$ 32427946 32561017 32859397 33433679 34421534 35596930 37099570 38904540 40952607 43116574
4872D3116574K151386J872386K109451K155381J951304K113967K739773L944840
$$ 43116574 45267960 47140346 49249797 51405178 53356482 55470449 58210222 62155062
4864F2155062N458390P173207Q419303Q986242Q303880M938129R61950j856082
$$ 62155062 67613452 74786659 83205962 92192204 100496084 105434213 106396163 104540081
4856A04540081n274689q361760p828267n380631l323509j661469k62776J222521
$$ 104540081 99265392 90903632 83075365 77694734 74371225 72709756 72446980 73669501
4848G3669501K670526M422441N621947N452864L515469R63979j474736n296763
$$ 73669501 76340027 80762468 86384415 91837279 95352748 96316727 94841991 89545228
4840H9545228q503610r149958q031725o655768n309492l721229k656902k001870
$$ 89545228 81041618 71891660 63859935 57204167 51894675 48173446 45516544 43514674
4832D3514674j891385j967036k082928k255317j962654j458603j124549r61179
$$ 43514674 41623289 39656253 37573325 35318008 33355354 31896751 30772202 29811023
4824B9811023n35045m34518m26517k03133j35748J1278N0765J40237K28584M49353
$$ 29811023 29275978 28841460 28414943 28211810 28076062 28087340 28138105 28278342 28506926 28956279
4814B8956279N04573M75920Q11673J221102J435525J989970K697304L105072L238790
$$ 28956279 29460852 29936772 30748445 31969547 33405072 35395042 38092346 41197418 44436208
4805D4436208K743043K061013J285748J48122j034920j324961j174061n34685
$$ 44436208 47179251 49240264 50526012 50674134 49639214 48314253 47140192 46605507
4797D6605507o8342O92776J572330K794196K616887K546032L647938M306643L273613
$$ 46605507 46537165 47229941 48802271 51596467 54213354 56759386 60407324 64713967 67987580
4788F7987580K524451L003038L209375K485337K227424M14019m76138M21860N61113
$$ 67987580 70512031 73515069 76724444 79209781 81437205 81851224 81375086 81796946 82358059
4779H2358059M04686N7829L61173J054831J629844K145312L224718L570376K915615
$$ 82358059 82762745 82820574 83181747 84236578 85866422 88011734 91236452 94806828 97722443
4770I7722443L334692M634829L360072J296629J60300P89090J096732j96209j870403
$$ 97722443 101057135 105691964 109052036 110348665 110508965 111298055 112394787 112198578 110328175
4761A10328175l314433l051381k900588l677446l173665k912777j960592k132643
$$ 110328175 107013742 103962361 101061773 97384327 94210662 91297885 89337293 87204650
4753H7204650k469218j227081j02519j224293j592005p83258j066807k066021
$$ 87204650 84735432 83508351 83405832 82181539 80589534 79806276 78739469 76673448
4745G6673448k611911k782122k891663l089763l019541m050304m161305l475751
$$ 76673448 74061537 71279415 68387752 65297989 62278448 58228144 54066839 50591088
4737E0591088l416536l242535k740360k190240j739789j291691q42345o64680
$$ 50591088 47174552 43932017 41191657 39001417 37261628 35969937 35127592 34462912
4729C4462912l54220j37893R0295M16325O92751J033574J511235J807790K402027
$$ 34462912 34108692 33970799 34061094 34477419 35170170 36203744 37714979 39522769 41924796
4720D1924796K927839K386486K237375K799326K675354J205889O06186Q79598
$$ 41924796 44852635 47239121 49476496 52275822 54951176 56157065 56763251 57642849
4712E7642849J059921M27369K56436m92672j490017j080366r39803o53340J4964
$$ 57642849 58702770 59130139 59386575 58893903 57403886 56323520 55383717 54730377 54745341
4703E4745341O85913K052155L100149L238966M127792N222887M397428L023217
$$ 54745341 55431254 57483409 60583558 63822524 67950316 73173203 77570631 80593848
4695H0593848L112850L073543J331926k8334o5882o55370k633070k706315l820421
$$ 80593848 83706698 86780241 88112167 88083833 88017951 87362581 84729511 82023196 78202775
4686G8202775n193234m900607m156191l770498l065609k036638o97164K84428
$$ 78202775 73009541 68108934 63952743 60182245 57116636 55079998 54382834 54667262
4678E4667262J26161M32441J349715J092568k08918r25789n89987l81879j194947
$$ 54667262 54793423 55225864 56575579 57668147 57459229 56533440 55943453 55561574 54366627
4669E4366627j374120k522200l586806l465932l524809l685061l611877l100487
$$ 54366627 52992507 50470307 46883501 43417569 39892760 36207699 32595822 29495335
4661B9495335k622071k128998j788588j423679j250205j029309r03334q25859
$$ 29495335 26873264 24744266 22955678 21531999 20281794 19252485 18349151 17523292
4653A7523292o70185p06220n47938l84971m48304k71920k83646k01403k03508
$$ 17523292 16853107 16146887 15598949 15213978 14765674 14493754 14210108 14008705 13805197
4644A3805197j69742j83028j43253k9275j62812j3189o7613j34729j00151o0922
$$ 13805197 13635455 13452427 13309174 13279899 13117087 13103898 13036285 12901556 12801405 12740483
4634A2740483l0589o1307j25739k39510j44841L3212r8516k13042j11928j9392
$$ 12740483 12709894 12648587 12522848 12283338 12138497 12171709 12073193 11860151 11748223 11728831
4624A1728831k980R6382K24r7997J42515J17248M7097k904m2623J74217R3582
$$ 11728831 11725851 11822233 11822457 11724460 11866975 11984223 12031320 12028416 11985793 12160010 12253592
4613A2253592N5148l6340J46321J54969k4884M6125N827j1493j44791L9624R7539
$$ 12253592 12308740 12272400 12418721 12573690 12548806 12594931 12600758 12589265 12444474 12484098 12581637
4602A2581637M9574R2982o7438j404R5338J46413J95781J41624J70031J90616
$$ 12581637 12631211 12724193 12656755 12655351 12750689 12897102 13092883 13234507 13404538 13595154
4592A3595154J31440L08066K99482K59561J32653K87915K59213K88577K65577
$$ 13595154 13726594 14034660 14334142 14593703 14726356 15014271 15273484 15562061 15827638
4583A5827638K39633K86900J53262L20807N52052N13357N00140M76598M79837
$$ 15827638 16067271 16354171 16507433 16828240 17380292 17893649 18393789 18870387 19350224
4574A9350224N40224P43052P35552P58467Q62787J089073J196122J222295J565809
$$ 19350224 19890448 20633500 21369052 22127519 22990306 24079379 25275501 26497796 28063605
4565B8063605J763445K076806K348578K964527L560868M136248L977311L913920
$$ 28063605 29827050 31903856 34252434 37216961 40777829 44914077 48891388 52805308
4557E2805308M092153L988686L173708K237413K170027K485087K424530K131048
$$ 52805308 56897461 60886147 64059855 66297268 68467295 70952382 73376912 75507960
4549G5507960J528433Q93386M92368J85513L60504L68611k86709o11830k0103
$$ 75507960 77036393 77929779 78422147 78607660 78968164 79336775 79050066 78438236 78418133
4540G8418133O13610P76622O51017k19665j260573j283496j158368j838586k220617
$$ 78418133 79031743 79808365 80459382 80239717 78979144 77695648 76537280 74698694 72478077
4531G2478077j816111j060093p22918o55588o89144r80702j184270j275364j084195
$$ 72478077 70661966 69601873 68878955 68223367 67534223 66553521 65369251 64093887 63009692
4522F3009692j045929j475276j858949j620732j371607j554901j938337k638460
$$ 63009692 61963763 60488487 58629538 57008806 55637199 54082298 52143961 49505501
4514D9505501l224183l145900l251111l090411k927675k423001k054678j642319
$$ 49505501 46281318 43135418 39884307 36793896 33866221 31443220 29388542 27746223
4506B7746223j348266r98712r08767n52590n76200n31277l27136k83252j70422
$$ 27746223 26397957 25399245 24490478 23937888 23361688 22830411 22503275 22220023 22049601
4497B2049601j73182j78009K1877M7180r834L3520Q5881K13377L15281K42650
$$ 22049601 21876419 21698410 21720287 21767467 21757633 21791153 21877034 22090411 22405692 22648342
4487B2648342K54721M20505M42256N18804N90454O21871N91759P04593R32465
$$ 22648342 22903063 23323568 23765824 24284628 24875082 25496953 26088712 26793305 27725770
4478B7725770Q45116R54751J349136J445535J688733J945188K380033K674381
$$ 27725770 28570886 29525637 30874773 32320308 34009041 35954229 38334262 41008643
4470D1008643L091388L850672M993559N692292O087387O310509O305719O082357
$$ 41008643 44100031 47950703 52944262 58636554 64723941 71034450 77340169 83422526
4462H3422526N166842L846977L419924M087635L965552L162550J595475r90462
$$ 83422526 88589368 92436345 95856269 99943904 103909456 107072006 108667481 107677019
4454A07677019K11011O78975j712791k604292r54802o54029q45403j751868l406900
$$ 107677019 107888030 108567005 106854214 104249922 103295120 102641091 101795688 100043820 96636920
4445I6636920k273848j560470j099186j082O99816K09583O68934J400754J740517
$$ 96636920 94363072 92802602 91703416 91702334 92402150 92611733 93280667 94681421 96421938
4436I6421938J514087Q09864O7834q47965j434712k321094l076546l773625l353426
$$ 96421938 97936025 98745889 98813723 97965758 96531046 94209952 91133406 87359781 84006355
4427H4006355l176471m261653n387666o701272o557799o105253n827188m954857
$$ 84006355 80829884 76568231 71180565 64479293 57921494 51816241 45989053 41034196
4419D1034196m248054l449382k869678k365453j956937j698874j400197j158602
$$ 41034196 36786142 33336760 30467082 28101629 26144692 24445818 23045621 21887019
4411B1887019j126012r34005o72751n98101o08203n41948m89080m84751m51340
$$ 21887019 20761007 19827002 19154251 18556150 17947947 17405999 16916919 16432168 15980828
4402A5980828l44990l29314m61279l40026l05245l14495l62282l09213l41936
$$ 15980828 15635838 15306524 14845245 14505219 14199974 13885479 13523197 13213984 12872048
4393A2872048m05879k83499k34061l12588k78520j23737k05848k03197k13298
$$ 12872048 12466169 12182670 11948609 11636021 11357501 11233764 11027916 10824719 10611421
4384A0611421k94439k67855j29672k66474k12383k81545k11386l08340k20978
$$ 10611421 10316982 10049127 9919455 9652981 9440598 9159053 8947667 8639327 8418349
4375H418349j89432j84686o6097p2322j37723j87369n0989k17969j42624j84544
$$ 8418349 8228917 8044231 7978134 7905812 7768089 7580720 7529731 7311762 7169138 6984594
4365F984594m3859j301k90231j06590j28964k62252q0974r9466j36903j33645
$$ 6984594 6940735 6939434 6649203 6542613 6413649 6151397 6070423 5970957 5834054 5700409
4355E700409j72647j07982j55307j99m9926j31349L4843j51336n3897M9529P1583
$$ 5700409 5527762 5419780 5264473 5264274 5214348 5082999 5117842 4966506 4912609 4962138 5033721
4344E033721j6933j02468j21032L0985l479m263q4940q4157N2711n4146j37384
$$ 5033721 5016788 4914320 4793288 4824273 4820794 4816531 4731591 4647434 4700145 4645999 4508615
4333D508615K737m7729L8160k4420l5540p0641l9041j02081R380m1007l2680R551
$$ 4508615 4511352 4463623 4501783 4477363 4441823 4371182 4332141 4230060 4239440 4198433 4165753 4175304
4321D175304o0873m2887N0077O752n4862P7209J1354p293n6302K290k0695L1185
$$ 4175304 4114431 4071544 4121621 4128373 4073511 4150720 4162074 4154781 4098479 4100769 4080074 4111259
4309D111259k1877P2631j09021j6616M3937M8757q439N848P3190M971K6604Q3113
$$ 4111259 4089382 4162013 4052992 4036376 4080313 4129070 4120631 4126479 4199669 4204640 4231244 4314357
4297D314357K0530j0479N5006R1320N4445R3163J00558M9523k94J4001J47476
$$ 4314357 4334887 4324408 4379414 4470734 4525179 4618342 4718900 4768423 4768129 4782130 4929606
4286D929606M3725J04334J2453J25360K6230j3457K3575l9436Q0573O9426L4629
$$ 4929606 4973331 5077665 5090118 5215478 5241708 5228251 5251826 5212390 5292963 5362389 5397018
4275E397018k304Q0276j1499l7295M223J16225O9332Q7999O4137J8306K6448J23894
$$ 5397018 5394714 5474990 5463491 5426196 5430419 5546644 5615976 5703975 5768112 5786418 5812866 5936760
4263E936760J30661J07085K4817l5896R8281J86125J1170n8963L1081M491J50680
$$ 5936760 6067421 6174506 6199323 6163427 6261708 6447833 6459003 6400040 6431121 6435612 6586292
4252F586292O6081J34386J26082L5577J21129J61185J05369J64939P8689J75782
$$ 6586292 6652373 6786759 6912841 6948418 7069547 7230732 7336101 7501040 7579729 7755511
4242G755511K15021R4265K0183J75808M8368R6545K05022L57996L29139J85065
$$ 7755511 7970532 8064797 8084980 8260788 8309156 8405701 8610723 8968719 9297858 9482923
4232I482923L37731K86049K85465J48818K29784K05782K22863L04761J55694K27794
$$ 9482923 9820654 10106703 10392168 10540986 10770770 10976552 11199415 11504176 11659870 11887664
4222A1887664K14140K67177J69923J84083L34359L29058K63836J03689K12649
$$ 11887664 12101804 12368981 12538904 12722987 13057346 13386404 13650240 13753929 13966578
4213A3966578J93023Q6644J19157K47363K32007M5027L9747J95810L97144K25827
$$ 13966578 14159601 14246245 14365402 14612765 14844772 14889799 14929546 15125356 15522500 15748327
4203A5748327J80792L37221L36867M50015M87170M96718L73975L24832N31603
$$ 15748327 15929119 16266340 16603207 17053222 17540392 18037110 18411085 18735917 19267520
4194A9267520N36875M69225P45893N19587O39636P30304N90423N92058Q08878
$$ 19267520 19804395 20273620 21019513 21539100 22178736 22909040 23499463 24091521 24900399
4185B4900399Q84252R46640J054565J210840J354010J378405J378239J425008
$$ 24900399 25784651 26731291 27785856 28996696 30350706 31729111 33107350 34532358
4177C4532358J405798J497049J417200J330084J614861J865233J876204K055297
$$ 34532358 35938156 37435205 38852405 40182489 41797350 43662583 45538787 47594084
4169D7594084K165730K272473K407015K657522K940156L074439L173565L471156
$$ 47594084 49759814 52032287 54439302 57096824 60036980 63111419 66284984 69756140
4161F9756140L767479L962660M385836M521351N139683N850680O727258P847080
$$ 69756140 73523619 77486279 81872115 86393466 91533149 97383829 104111087 111958167
4153A11958167R282803J0785774J2228608J4149394J7188321K1652931K8291043
$$ 111958167 121240970 132026744 144255352 158404746 175593067 197245998 225537041
4146B25537041L6833249M6407164N1481752N4182967N0095648L7078892K3750815
$$ 225537041 262370290 308777454 360259206 414442173 464537821 501616713 525367528
4139E25367528Q020485o626522k5045347m4684799n6543267n7708759n1462383
$$ 525367528 533388013 526761491 501716144 457031345 400488078 342779319 291316936
4132B91316936m4175984l6189014k9647966k4029747j9541329j5864619j3031841
$$ 291316936 247140952 210951938 181303972 157274225 137732896 121868277 108836436
4125A08836436j0792571q925472p466912o283031n513637m691531m161462l763660
$$ 108836436 98043865 89118393 81651481 75368450 69854813 65163282 61001820 57238160
4117E7238160l304602l003973k681561k541025k357531k126223j900243j691573
$$ 57238160 53933558 50929585 48248024 45706999 43349468 41223245 39323002 37631429
4109C7631429j737894j549919j403616j441818j316115j184120j078742j086462
$$ 37631429 35893535 34343616 32940000 31498182 30182067 28997947 27919205 26832743
4101B6832743r63170q13936q39032p51794p25027q08834p25914n82131o34557
$$ 26832743 25869573 25055637 24216605 23464811 22739784 21930950 21205036 20622905 19988348
4092A9988348n10899n31129n06274m96726n12933m47851o23616o59941m14790
$$ 19988348 19477449 18946320 18440046 17943320 17430387 16982536 16358920 15698979 15284189
4083A5284189m52127n91103m51518l50747l58085k25213l54991l28484j78031
$$ 15284189 14832062 14240959 13789441 13438694 13080609 12855396 12500405 12171921 11993890
4074A1993890k97805j97373l49142k85976k45648k67304l11575l03880k75395
$$ 11993890 11696085 11498712 11149570 10863594 10617946 10350642 10039067 9735187 9459792
4065I459792k43256k44620k56421k00854l5838j34151j58259j45664j3932L429
$$ 9459792 9216536 8971916 8715495 8514641 8478803 8344652 8186393 8040729 8026797 8030226
4055H030226n191n4633j13387o1243k3803J9743q5267k6061p4321l1017O8913
$$ 8030226 8025035 7970402 7857015 7795772 7771969 7791712 7706445 7680384 7606063 7575046 7643959
4044G643959l6459j38055j46286p1917j95409j39597j25297k02765k04440M3837
$$ 7643959 7607500 7469445 7323159 7251242 7055833 6916236 6790939 6588174 6383734 6427571
4034F427571R6173j90944m0306j59553q393p3461n4787J16533P3921N9201k126
$$ 6427571 6523744 6332800 6292494 6132941 6124548 6051087 5996300 6112833 6186754 6245955 6243829
4023F243829J47481M495J6769L49L3102L4450j8280R5439R9109k3661l6067m4592
$$ 6243829 6391310 6395805 6412574 6412923 6446025 6480475 6462195 6557634 6656743 6633082 6597015 6552423
4011F552423l4526j04394n4798l228j5880O5459O6211L2121l9876n4501l0681
$$ 6552423 6517897 6413503 6358705 6355477 6339597 6405056 6471267 6503388 6463512 6409011 6378330
4000F378330L0390m272j07406j11296n1039j14577K107m8317n2728p7952J34792
$$ 6378330 6408720 6404448 6297042 6185746 6134707 6020130 6022237 5973920 5921192 5843240 5978032
3989E978032J72863J22303K9875p319R7822O6292P9122m0016k4546p1063q6821
$$ 5978032 6150895 6273198 6303073 6295754 6393576 6459868 6538990 6498974 6474428 6403365 6316544
3978F316544p2936j30730j84623r585P271n4023r8819r0796j35418k02692K123
$$ 6316544 6243608 6112878 5928255 5918670 5925941 5871918 5773099 5682303 5546885 5344193 5346316
3967E346316J870j14058o8363Q1172l5754m0180L8499j23118j95107o0046o6005
$$ 5346316 5348186 5234128 5165765 5246937 5211183 5171003 5209502 5086384 4891277 4831231 4765226
3956D765226j35106M7974r1188j18951L0267M7673j3656K4176J06671j37225m2342
$$ 4765226 4630120 4678094 4586906 4467955 4498222 4545895 4532239 4556415 4663086 4525861 4483519
3945D483519p3066l0710r3600l8243q6852j83864l06954j70210r2566j44479j34472
$$ 4483519 4410453 4379743 4286143 4247900 4161048 3977184 3670230 3500020 3407454 3262975 3128503
3934C128503j27613j72778r8378j74800j16673J05409k9785p7187p3030Q677j26336
$$ 3128503 3000890 2828112 2729734 2554934 2438261 2543670 2513885 2436698 2363668 2372345 2246009
3923B246009l9574P7130q2174j00564l2779j21602k0593m7649l8863K4839l728
$$ 2246009 2206435 2283565 2201391 2100827 2068048 1946446 1925853 1878204 1839341 1864180 1860452
3912A860452l9538j61760O578p070M811m2496k01450l7671p0031J8161K2167L3466
$$ 1860452 1820914 1659154 1665732 1658662 1663473 1620977 1419527 1381856 1311825 1329986 1352153 1385619
3900A385619K9707j13068j16835J4351N270K8268k3593j05123j3567N2222L9702
$$ 1385619 1415326 1302258 1185423 1199774 1205044 1233312 1209719 1104596 1091029 1143251 1182953
3889A182953R0162P9487m9843k1255K8595o1651o7043M5802J2483p1723R3036
$$ 1182953 1273115 1352602 1302759 1281504 1310099 1248448 1181405 1227207 1239690 1167967 1261003
3878A261003J14025L0089L3829R414m3376p3678O6804n1308n3081R4645O867J2755
$$ 1261003 1375028 1405117 1438946 1448360 1404984 1331306 1398110 1346802 1293721 1388366 1395233 1407988
3866A407988N9168L3573j6607P4797K07616n6599J5417L8428O1485J81522L51510
$$ 1407988 1467156 1500729 1484122 1558919 1766535 1709936 1725353 1763781 1825266 2006788 2358298
3855B358298L25071J93781L06999J69421K84415J15888n5474n0476m4985k12105
$$ 2358298 2683369 2877150 3184149 3353570 3637985 3753873 3698399 3647923 3602938 3390833
3845C390833l12144k78545k39368k84529l37485k05428j95224j45954M7065j14919
$$ 3390833 3078689 2800144 2560776 2276247 1938762 1733334 1538110 1392156 1439221 1324302
3835A324302j38790J9362r6437r0542q576O370m1714K1461k0221r3543j6585J7916
$$ 1324302 1185512 1204874 1108437 1017895 1009319 1015689 973975 995436 975215 881672 865087 883003
3823H83003J4952o1667j19729r7856L2320J284M0972l9583j09888J178J3592q9084
$$ 883003 897955 836288 716559 618703 651023 652307 693279 653696 543808 544986 558578 469494
3811D69494Q0806J6638o213m1302J01668n0541j87496J12085J689m2036J13566
$$ 469494 550300 566938 560725 519423 621091 570550 383054 495139 496828 454792 568358
3800E68358K1779M0964j21860k4792Q2760o5410l8087J2618j3055o538O9114o6809
$$ 568358 590137 631101 509241 484449 567209 501799 463712 476330 463275 456737 525851 459042
3788D59042R3894J17590o1540q3025k2464m7094R4010m4013P0778L4879p7530
$$ 459042 552936 670526 608986 525961 503497 456403 550413 506400 577178 612057 534527
3777E34527J11742J7615p6896o0065J4631k35p458N4629n0869Q9515O0928r1224
$$ 534527 646269 663884 586988 526923 541554 541319 533861 588490 537621 627136 688064 596840
3765E96840r6537j1120K508j4187m9216K0956j2926M6352J6873k7991J734j9107
$$ 596840 500303 489183 491691 477504 428288 449244 436318 482670 499543 471552 473286 454179
3753D54179N0663L7069M6442N8941j7767o669n6575m8433L2018o4210K4214l4319
$$ 454179 504842 541911 588353 647294 629527 622858 566283 517850 549868 485658 509872 475553
3741D75553K0688K9488J3365L9228J6590n1569l5220O7086k8867m1484l6732p3146
$$ 475553 496241 525729 539094 578322 594912 543343 508123 575209 546342 504858 468126 394980
3729C94980p9902L2380O3065M0506o7463m395P1737K3870m0601k6418J3707j48720
$$ 394980 315078 347458 410523 451029 383566 379171 450908 474778 434177 407759 421466 272746
3717B72746j01999L1155R9394M079R758r5109Q1068M5297j33905J79223q0938
$$ 272746 170747 201902 301296 305375 315133 220024 301092 346389 212484 391707 310769
3706C10769M1646N297O9093j8959J4400p251j00977J27738J7216M3007q1813j20315
$$ 310769 352415 357712 426805 407846 422246 414995 314018 441756 458972 501979 420166 299851
3694B99851N099Q9205L3376N4918J5499m0085m438O5534j03658n3677P5558l6596
$$ 299851 304950 394155 427531 482449 497948 457863 453425 518959 415301 361624 437182 400586
3682D00586k867k180L8063j5962P4102k9546L1409r7383m4445K25701j29526j25664
$$ 400586 397719 395539 433602 417640 491742 462196 493605 396222 351777 577478 447952 322288
3670C22288J28127N3973o9830j43146M4957J60N7962k4343J17387P8170k03671
$$ 322288 450415 504388 434558 291412 336369 336529 394491 370148 487535 565705 362034
3659C62034R705j7733M6236P876L7084n0254l7466J06514L7560M3960P5085j15536
$$ 362034 371739 354006 400242 408118 445202 394948 357482 463996 501556 545516 620601 505065
3647E05065N7550q2723n961q5560O6361M1917K029j5399o8308M3702M962N1822
$$ 505065 562615 479892 473931 388371 454732 496649 498678 483279 414971 458673 463635 515457
3635E15457l8110m030L3052P0735r3611o8552p7738L2158R4488L290M1000m4790
$$ 515457 477347 473317 506369 577104 483493 414941 337203 369361 463849 467139 508139 463349
3623D63349K6282j4464l0222k6004Q9842R5327K331o5802m934N5863j23535j9687
$$ 463349 489631 475167 444945 418941 508783 604110 606441 540639 535705 591568 468033 448346
3611D48346K8372O7155L131j37592J5271Q8383J32128m4315q1414k4044M9961
$$ 448346 476718 543873 547004 409412 424683 513066 645194 600879 519465 495421 545382
3600E45382l9345q4215P6077p1794O1553P0422L2524m4530O8565j45177J08783
$$ 545382 506037 421822 497899 426105 487658 558080 590604 546074 614639 469462 578245
3589E78245N4146j75719K6107L4394R0843j02952o5609j06521M6492Q4380O0989
$$ 578245 632391 456672 482779 517173 608016 505064 439455 332934 379426 463806 524795
3578E24795k5666M5240J4966p1395l112N7027K9621j3971K9952P4573N2517j00601
$$ 524795 499129 544369 559335 487940 484828 541855 571476 557505 587457 662030 714547 613946
3566F13946r6581J6707l3606L9721Q9626J2469m1277r2686j46726Q3953P244J34898
$$ 613946 517365 534072 500466 540187 629813 642282 601005 508319 361593 445546 452790 587688
3554E87688q750j51882P9062J23211n2541q6058O0350M2195L722q2168P573k8929
$$ 587688 578938 427056 506118 629329 576788 490730 551080 593275 596997 514829 522402 493473
3542D93473Q2641p9065j20947Q8889L3574j736J16254l2830q6870R9369Q4893
$$ 493473 576114 497049 376102 464991 498565 496829 613083 580253 493383 592752 677645
3531F77645L7290o3643j03228l8891P9475P2041L2166M908p5584k6404o5535L6146
$$ 677645 714935 651292 548064 509173 588648 660689 692855 697763 622179 595775 530240 566386
3519E66386n6205m4936K5804J07569N2867L1414n8475J3106k4356l5643l8426
$$ 566386 510181 465245 491049 598618 651485 682899 624424 637530 613174 577531 539105
3508E39105M0558J6675L0123N0696O564J2883j5251L0901Q633j07868J52055j2625
$$ 539105 579663 596338 626461 677157 683721 696604 681353 712254 720887 613019 765074 752449
3496G52449p2391J1921J3157J667n2911L0633J04507M1226n7071J04464r3749
$$ 752449 680058 691979 705136 706803 653892 684525 789032 830258 773187 877651 783902
3485G83902r3883J56630m4252N4738J21363k4098R241J16391k0439r1442J62266
$$ 783902 690019 846649 802397 857135 978498 954400 963641 1080032 1059593 968151 1130417
3474A130417N4394J107p410j8823j11450o3852l8313P534L0578m9667k9497k8410
$$ 1130417 1184811 1185918 1178508 1159685 1048235 984383 946070 953604 984182 934515 905018 876608
3462H76608j8424o2013K1177Q7039l4200j1275m259n0845k1147J13202P5612l5722
$$ 876608 858184 796171 817348 904387 870187 858912 854653 803808 782661 895863 971475 935753
3450I35753j23232J2917M9224Q1136N2176k8440l0122L0109j03765p409M6182
$$ 935753 812521 825438 874662 955798 1007974 979534 949412 979521 875756 868347 914529
3439I14529L9415N9847j0290J1442m6424K3805l4520p5992N4057m0303J10518
$$ 914529 953944 1013791 1003501 1014943 968519 992324 957804 881812 935869 895566 1006084
3428A006084j8907m6514R5189K5888j04244n0049J01920m843k4845J15112J45621
$$ 1006084 987177 940663 1035852 1061740 957496 907447 1009367 1004524 979679 1094791 1240412
3417A240412j3508J29241l6275J48248L6958o7757J76871n738j519j6937J29172
$$ 1240412 1226904 1356145 1319870 1468118 1505076 1437319 1614190 1608452 1606933 1589996 1719168
3406A719168m2157J8328O6954j40276j5025q5822j63204R8952l2574K4673j0209
$$ 1719168 1677011 1695339 1762293 1622017 1606992 1521170 1357966 1456918 1424344 1449017 1438808
3395A438808n9933N0918K7305K5994K5456j5167L240M0741J0148J03661J59124
$$ 1438808 1378875 1429793 1457098 1483092 1508548 1493381 1496621 1537362 1547510 1651171 1810295
3384A810295N3379J95004K64774L8465J40735K48872J73920L3391J30388J15248
$$ 1810295 1863674 2058678 2323452 2361917 2502652 2751524 2925444 2958835 3089223 3204471
3374C204471j34340r1708L0925k05472k18371j40965j44756j24941j22382j08567
$$ 3204471 3070131 2978423 3009348 2803876 2585505 2444540 2299784 2174843 2052461 1943894
3364A943894l6486m0579K4331R9003J18231o848k3675j08270L5263O5372J9265
$$ 1943894 1907408 1866829 1891160 1990163 2108394 2101546 2077871 1969601 2004864 2070236 2089501
3353B089501M1744l737N7630J6527O977J46430Q1592M1937J84831J6174k322l8414
$$ 2089501 2131245 2127508 2185138 2201665 2208642 2355072 2436664 2478601 2663432 2679606 2677284 2638870
3341B638870N8306k1324o7628l1599j0716K8893N1066o7050l8001J4663k3698
$$ 2638870 2697176 2675852 2608224 2576625 2565909 2594802 2645868 2578818 2540817 2555480 2531782
3330B531782p6676K7087K4418M895Q2439j27006n3233M2412O7842M5414Q2107
$$ 2531782 2455106 2482193 2506611 2511506 2593945 2466939 2413706 2456118 2523960 2569374 2651481
3319B651481M3274R237J14777K1956K3189J03484J2467M2217R5509L2989N1104
$$ 2651481 2694755 2703992 2818769 2840725 2863914 2967398 2979865 3022082 3117591 3150580 3201684
3308C201684J02050P4895J06111J37904K07246l6510P9386J60993P9761q4276
$$ 3201684 3303734 3378629 3484740 3622644 3829890 3793380 3872766 4033759 4113520 4029244
3298D029244L6774J06265r471K926J7945k0389j12188J23325K4970J27476J51887
$$ 4029244 4066018 4172283 4162812 4165738 4183683 4163294 4051106 4174431 4199401 4326877 4478764
3287D478764Q611J46864J09276K00743K75672J00820J35353J81684N3262J14204
$$ 4478764 4487375 4634239 4743515 4944258 5219930 5320750 5456103 5637787 5691049 5805253
3277E805253J79728L5253J57356J59023J17530J18338P5659l1029P0026O9695
$$ 5805253 5984981 6020234 6177590 6336613 6454143 6572481 6648140 6617111 6687137 6756832
3267F756832K216l7510j11184N1087J5646P1799J35791J91392J29383J45452J27944
$$ 6756832 6759048 6721538 6610354 6661441 6677087 6748886 6884677 7076069 7205452 7350904 7478848
3256G478848K36543K64479K21619K29017J89262J63178J81945J36559J1886m2044
$$ 7478848 7715391 7979870 8201489 8430506 8619768 8782946 8964891 9101450 9113336 9071292
3246I071292J13690P8482K25783K76218J39619K71420K63395J83085K52097L47464
$$ 9071292 9184982 9263464 9489247 9765465 9905084 10176504 10439899 10622984 10875081 11222545
3236A1222545K82071K64033M14964M15680L74464M83026M56830M20346M83242
$$ 11222545 11504616 11768649 12183613 12599293 12973757 13456783 13913613 14333959 14817201
3227A4817201N20130N24765M75664L58931K56062p1713k93062n15477n72514p11286
$$ 14817201 15337331 15862096 16337760 16696691 16952753 16881040 16587978 16072501 15499987 14788701
3217A4788701o86053o59018r07283p92534p00837o24270m80594m20592l52903
$$ 14788701 14102648 13443630 12536347 11743813 11042976 10418706 9938112 9517520 9164617
3208I164617k55287k29493k03483j02025r7091m4938P3487K9616n2598j992J82094
$$ 9164617 8909330 8679837 8476354 8374329 8277238 8232300 8305787 8335403 8282805 8280813 8462907
3197H462907O5239m5285N5533J40450J70319J82656J58430J67784J62226l3621
$$ 8462907 8528146 8482861 8538394 8678844 8849163 9031819 9190249 9358033 9520259 9486638
3187I486638j09830j06473j14134m22522n54671n67366m69353m76189m46221k70427
$$ 9486638 9376808 9270335 9156201 8733679 8179008 7611642 7142289 6666100 6219879 5949452
3177E949452j15853k38531k1602N2298O8054N3925L1659K05047K24133K40355
$$ 5949452 5833599 5595068 5573466 5625764 5693818 5747743 5779402 5984449 6208582 6448937
3167F448937K05704J65846J0662L5198N9507J01772o916p2892j38638k28079j18725
$$ 6448937 6654641 6820487 6831149 6866347 6925854 7027626 7020710 6947818 6809180 6581101 6462376
3156F462376j67669k69509k78658k62338l01171l38141j62806k58432l04551j48026
$$ 6462376 6294707 6025198 5746540 5484202 5183031 4844890 4682084 4423652 4119101 3971075
3146C971075j82276j36860n0373K5363l3320k9443M9697k1950k3956P4228R2628
$$ 3971075 3788799 3651939 3601566 3626929 3593609 3564166 3613863 3591913 3567957 3642185 3734813
3135C734813K1129l6423J20526o6455l3805q1291j14411j33851j71296j82879
$$ 3734813 3755942 3719519 3840045 3773590 3739785 3658494 3544083 3410232 3238936 3056057
3125C056057n3339j34185k15560j57469j38519j10729j71471N3096J2123j1052
$$ 3056057 3002718 2868533 2652973 2495504 2356985 2246256 2074785 2127881 2140004 2128952
3115B128952j8281j86630j21710L9098J3511p8j42738O547K1936O006k3903J5059
$$ 2128952 2110671 1924041 1802331 1841429 1854940 1854862 1712124 1718671 1740607 1746613 1722710 1737769
3103A737769Q369j14768j46883M9502m9142N127j8337M6971j10010r2677Q3110
$$ 1737769 1746138 1631370 1484487 1533989 1484847 1489974 1471637 1518608 1408598 1315921 1399031
3092A399031q2457j49680Q6475O4354l556l4566N003J8818k88O927j26451J9502
$$ 1399031 1316574 1166894 1253369 1317723 1314167 1279601 1284604 1303422 1303134 1310061 1183610 1203112
3080A203112J9365J7276j30176M3225J4564p669l1571q3861J43642m6119m0016
$$ 1203112 1222477 1239753 1109577 1152802 1167366 1159697 1128126 1044265 1187907 1141788 1101772
3069A101772J09573o5137r2467R568J180m3527j7969M2348j425K3243P965j03782
$$ 1101772 1211345 1146208 1053741 1063309 1064489 1020962 1002993 1045341 1043916 1067159 1075124 971342
3057I71342o6649J9461j211J8096K0078N680l1735j1795M6662l7857N6591n260
$$ 971342 904693 924154 922943 941039 961117 966797 935062 923267 969929 932072 988663 983403
3045I83403j46373Q3137L2264N0454p2021q9407o7737J6210J92543n1338n4414
$$ 983403 837030 920167 952431 1002885 930864 841457 773720 789930 982473 931135 876721
3034H76721n3426R8949j1107j6672k7046L4658M444j31394R333j0835j2642j0268
$$ 876721 823295 922244 911137 894465 867419 902077 906521 775127 784460 773625 760983 750715
3022G50715l8682Q0812N5371o1622j05821J6293Q0483O3543m8599O1526J11609
$$ 750715 712033 792845 848216 786594 680773 697066 777549 841092 792493 854019 965628
3011I65628q1043l6480j936J1566J07986o002o8724L9388q6266L319k6739j4020
$$ 965628 884585 848105 846169 857735 965721 959719 890995 930383 844117 847436 820697 806677
2999H06677J3256R6921p068K9343J7688q8830N6524O62R0069m9926j2563O2058
$$ 806677 819933 916854 909786 939129 956817 867987 924511 925173 1015242 965316 952753 1014811
2987A014811J16153K1176l8622P306l7902k6991N8249m6133n7754K7287o1308
$$ 1014811 1130964 1152140 1113518 1120824 1082922 1055931 1114180 1068047 1010293 1037580 976272
2976I76272O1340k2068L4531o8516P9948K0372K2665L2015o9596K5492R0137K933
$$ 976272 1037612 1015544 1050075 981559 1061507 1081879 1104544 1136559 1066963 1092455 1182592 1185525
2964A185525l0115R0184j01162J7317K9576Q5574L4645P8395N9615K9054N3704
$$ 1185525 1155410 1245594 1144432 1161749 1191325 1276899 1311544 1389939 1449554 1478608 1532312
2953A532312J5383K3698J62823p5552m4370N2172j00651o6219P1959m7354k438
$$ 1532312 1547695 1571393 1734216 1658664 1614294 1666466 1565815 1499596 1571555 1524201 1521763
2942A521763o789J2513k0076J27614K4327k7221M5171p7909n377J868J05383q6552
$$ 1521763 1514974 1527487 1507411 1635025 1659352 1632131 1677302 1599393 1594016 1595884 1701267 1614715
2930A614715l7474M8222J80918O4065R1697K9467K2890O7494R3214L2706N1245
$$ 1614715 1577241 1625463 1806381 1870446 1962143 1991610 2014500 2081994 2175208 2207914 2259159
2919B259159K89J27253P7940N2019j20347K7606N1136M7859K00616J37943k1474
$$ 2259159 2259448 2386701 2464641 2516660 2396313 2423919 2475055 2522914 2723530 2861473 2839999
2908B839999k7770Q2938N1860J8389j15447k9252J7021Q018J9622L4092k0496
$$ 2839999 2812229 2895167 2947027 2965416 2849969 2820717 2837738 2845756 2865378 2899470 2878974
2897B878974P6839k4349M5856J48237N955J12973J53193R0079J47011J23663J45286
$$ 2878974 2955813 2931464 2977320 3125557 3131512 3244485 3397678 3487757 3634768 3758431 3903717
2886C903717M4340Q1918J73371J37193k4720L4199k9325j96922k39649m8526j27860
$$ 3903717 3948057 4029975 4203346 4340539 4315819 4350018 4320693 4123771 3884122 3835596 3707736
2875C707736j31263o6914k2807r0822j03993L9354j4526P6976n8608j5700J90269
$$ 3707736 3576473 3509559 3486752 3395930 3291937 3331291 3316765 3393741 3335133 3319433 3509702
2864C509702m5711k7507P2355J05696k0917l661M2365k3797l3165k9796l413j42111
$$ 3509702 3463991 3436484 3508839 3614535 3593618 3589957 3632322 3608525 3575360 3545564 3542151 3400040
2852C400040j05198K6001p5317j30443j26087j18696r5694q1217j2088j24487
$$ 3400040 3294842 3320843 3245526 3115083 2988996 2870300 2774606 2693389 2681301 2556814
2842B556814l6859P2541j0302j37091q4327l5430J01834j44792q4805O500r1468
$$ 2556814 2519955 2592496 2582194 2445103 2360776 2325346 2427180 2282388 2197583 2204083 2112615
2831B112615o5429k1801r5071j80001J2163P77n4593j8034o6796k1028j24259
$$ 2112615 2047186 2025385 1930314 1750313 1762476 1763253 1708660 1690626 1623830 1602802 1478543
2820A478543j61049p0020r339p0189K1232R1097m2793j47612k1091j67222j8287
$$ 1478543 1317494 1247474 1238135 1167946 1189178 1280275 1237482 1089870 1068779 901557 883270
2809H83270J49334l2062j23946M7560J300q7445k0612O6731L2484j13957o9057
$$ 883270 1032604 1000542 876596 924156 925456 838011 817399 884130 916614 802657 733600
2798G33600j7434O8795r3928Q621p3693P2207Q3752k1909N378J0072j24012m3278
$$ 733600 716166 784961 691033 699654 625961 698168 781920 760011 765389 775461 651449 608171
2786F08171q7896P4690L114j61065o2821L1052O2160j30614O1969J15459q210
$$ 608171 520275 594965 598079 437014 374193 405245 467405 336791 398760 514219 506009
2775E06009k6223o2474J9006Q13K3079o2411k7128K4345p5894J8223R4211k7864
$$ 506009 479786 417312 436318 437131 460210 397799 370671 395016 319122 337345 431556 403692
2763D03692j37494j9618P6188p7553r394O6472N2779K398p0872p2768m9424L5610
$$ 403692 266198 246580 322768 245215 235821 302293 355072 357470 286598 213830 164406 200016
2751B00016j4759M9826n4655r6946l921L4892J27405k8047k0813K8628k2070R0222
$$ 200016 185257 235083 180428 83482 79561 114453 241858 213811 192998 221626 199556 289778
2739B89778m8003j07953R260P1403n4875L3519k0513N7857K6902j03012o9774
$$ 289778 241775 133822 143082 214485 159610 193129 172616 230473 257375 154363 84589
2728H4589l0637O503n1713J7243j8359j6825J06392p005K6917O715M469J115J9913
$$ 84589 53952 60455 8742 25985 7626 -9199 97193 90188 117105 123820 128289 129404 149317
2715A49317l6576P3125n5551p3449k8341j002o6541N2942k973k9426Q7828K7546
$$ 149317 112741 185866 130315 56866 28525 27523 -39018 13924 10951 -18475 69353 96899
2703I6899L6624o2290m2220n9742J01496K9023j3147O2588m2960j35043P6866
$$ 96899 133523 71233 29013 -30729 70767 99790 86643 149231 106271 -28772 48094
2692D8094m649J8332N0444p3750j08027R1860J40326n7916j12955k5900m6322
$$ 48094 43445 61777 112221 38471 -69556 22304 162630 104714 -8241 -34141 -80463
2681h0463K3085N3111o8686J7647N7855r5722O8378m4508p0816M0157N8858j50038
$$ -80463 -57378 -4267 -72953 -55306 2549 -93173 -24795 -69303 -140119 -99962 -41104 -191142
2669a91142j04312J42285J01505O0659L0297l444P0555l3444j13825q1668l8645
$$ -191142 -295454 -153169 -51664 8995 39292 35848 106403 72959 -40866 -122534 -161179
2658a61179M6941O2179J03479p287r0349P4564l5121m8327q5231O8277J21923
$$ -161179 -114238 -52059 51420 44133 -46216 28348 -6773 -55100 -140331 -72054 49869
2647D9869J5867M699l5841o1787p6516M3425K9963k4973J162p152N0471J3233
$$ 49869 65736 70435 34594 -27193 -103709 -60284 -30321 -55294 -54132 -61284 -10813 2420
2635B420j32241n6433J04878M3446n6704J01114q4730n3336Q3723P1205j24359
$$ 2420 -129821 -186254 -81376 -37930 -94634 6480 -78250 -131586 -47863 23342 -101017
2624a01017p9078K3549J43071l515l8378k5899O7922K2418J01940m3677o6191
$$ -101017 -180095 -156546 -13475 -16990 -55368 -81267 -13345 9073 111013 67336 1145
2613A145q465j8732R7800p864m5818j03302P258k4863j0809O2912J47712j9249
$$ 1145 -7320 -26052 71748 63884 18066 -85236 -77978 -102841 -113650 -50738 96974 77725
2601G7725o5494j4553K5906J2481k1744N2564q5793L9936o3650p3259M5392o8554
$$ 77725 12231 -2322 23584 36065 14321 66885 -18908 21028 -42622 -115881 -70489 -139043
2589a39043O032J31521L6288q149l2883k6581R0635m4942O4996m1015n4003K2915
$$ -139043 -133011 -1490 34798 26649 -6234 -32815 57820 12878 77874 36859 -17144 5771
2577E771k4067L4847J7693p7161q0096J5159P5882P1714j09605m9117j5027l0134
$$ 5771 -18296 16551 34244 -42917 -123013 -107854 -31972 39742 -69863 -118980 -134007 -164141
2565a64141N5427j9063l0440N5918L5051j8256R2144N7532j41624j3419O5303
$$ -164141 -108714 -127777 -158217 -102299 -67248 -85504 6640 64172 -77452 -90871 -25568
2554b5568o2506l7153J9329N0064q4936O2755R119m6285l729M6957n5622R986
$$ -25568 -88074 -125227 -105898 -55834 -140770 -78015 -68896 -115181 -118910 -71953 -127575 -117589
2542a17589R264O7383M4206M7077j8668k7350M2438j22512P8058p1937Q943J636
$$ -117589 -108325 -40942 3264 50341 31673 4323 46761 -75751 2307 -69630 -60687 -59051
2530e9051l1931j00359l7616L8828R6209n6448n8019J7248m1150o7690J40776
$$ -59051 -90982 -191341 -228957 -190129 -93920 -150368 -208387 -191139 -232289 -299979 -159203
2519a59203N8274k6792J14668jj46396P0108J17499o3121k2749P7729o423o289
$$ -159203 -100929 -127721 -13053 -13054 -159450 -89342 28157 -34964 -57713 20016 13593 7304
2507G304O101j05763O6322l4640j1047n9774k1466j7417N7968r72p1559m0900
$$ 7304 13405 -92358 -26036 -60676 -71723 -131497 -152963 -170380 -112412 -113384 -184943 -225843
2495b25843Q5026O9838J990j07841K7171L6645K5347j3642l9801k0651o2574R988
$$ -225843 -140817 -70979 -68989 -176830 -149659 -113014 -87667 -101309 -141110 -161761 -224335 -214347
2483b14347M2933N3000r663l1423m0711q6189M013J62302q834J2109o2930j3338
$$ -214347 -171414 -118414 -128077 -159500 -200211 -286400 -282387 -120085 -128919 -116810 -179740 -193078
2471a93078k5584J22877K8360j37184J08060j3302l5877m1527L3500M3883j0798
$$ -193078 -218662 -95785 -67425 -204609 -96549 -109851 -145728 -187255 -153755 -109872 -120670
2460a20670K0096L3957J0736o5854N832k8427P8669p4270m3547l3751L5866k6575
$$ -120670 -100574 -66617 -55881 -121735 -115903 -144330 -65661 -139931 -183478 -217229 -181363 -207938
2448b07938J08635J3377m8331l5267k5685l1119J03339P9358p2787M5173M8013
$$ -207938 -99303 -85926 -134257 -169524 -195209 -226328 -122989 -43631 -116418 -71245 -23232
2437b3232q0025P167J40824j3178R900p4645j6895j70085M3797O2683J17076m8331
$$ -23232 -103257 -96090 44734 31556 41456 -33189 -50084 -220169 -176372 -113689 3387 -44944
2425d4944J4164j185j23368o8011j8144k6995M8471K3514o76L3742J38310k6375
$$ -44944 -30780 -31965 -155333 -223344 -241488 -268483 -220012 -196498 -197174 -163432 -25122 -51497
2413e1497n5666k6226l6633j0487J7698J16260m8599m7772m0072m9190J21160
$$ -51497 -107163 -133389 -170022 -180509 -162811 -46551 -95150 -142922 -182994 -232184 -111024
2402a11024j32880K3234K00014l9593k6869j20649O2872J21169J0651o0946o775
$$ -111024 -243904 -220670 -20656 -60249 -87118 -207767 -144895 -23726 -13075 -74021 -80796
2391h0796m3340Q7775m7161L623L2138q4872N9020p2949p9474l9066J11471J11186
$$ -80796 -124136 -36361 -83522 -79899 -47761 -132633 -73613 -146562 -226036 -265102 -153631 -42445
2379d2445q8404p4824L4078N4892K3130n7672R015Q8140J1811J638J1590L2832
$$ -42445 -130849 -205673 -171595 -116703 -93573 -151245 -142230 -54090 -42279 -40641 -29051 3781
2367C781p4672j7018M4774Q3869j5530k9916O7616j9854j25241L4656L4652Q122
$$ 3781 -70891 -87909 -43135 40734 25204 -4712 62904 43050 -82191 -47535 -12883 -4761
2355d761M1007l968L6108R9258K436j25102n5956p061J35906n8779j68809j0181
$$ -4761 36246 32278 68386 167644 170080 44978 -10978 -18039 117867 59088 -109721 -119902
2343a19902J0896n9339j2045N8734k6018K7104M6973j03341N8053K5556M9454
$$ -119902 -109006 -168345 -180390 -121656 -147674 -120570 -73597 -176938 -118885 -93329 -43875
2332d3875K5481j42662P3985O7114k6584p8520k674q8837j0727J38464M5797P895
$$ -43875 -18394 -161056 -87071 -19957 -46541 -125061 -127735 -216572 -227299 -88835 -43038 -35143
2320c5143J0623q3093m0275j1775q985O7963L6868k4805o0657m9412P6806k7166
$$ -35143 -24520 -107613 -147888 -159663 -168648 -100685 -63817 -88622 -149279 -198691 -121885 -149051
2308a49051K6803p695Q3313j03953k570N7213Q2916k3874l5521l3719k6620K2583
$$ -149051 -122248 -129943 -46630 -150583 -153153 -95940 -13024 -36898 -72419 -106138 -132758 -110175
2296a10175O5734P8953l0219j64444j6702L1397m7509N2352K3614J9210m4637
$$ -110175 -44441 34512 4293 -160151 -176853 -145456 -192965 -140613 -116999 -97789 -142426
2285a42426j1848M4314p454M1702L9878m8297R3869o8930O6652R4260j31660M5198
$$ -142426 -154274 -109960 -117414 -75712 -35834 -84131 9738 -59192 7460 101720 -29940 15258
2273A5258l8587n0702J87646n3963n5443k6827r733j0194L8319n3789L8638p6113
$$ 15258 -23329 -74031 113615 59652 4209 -22618 -32351 -42545 -4226 -58015 -19377 -95490
2261i5490L1385K6869p833N4665p017r3039M4183m1027L5025J03627p9572p6519
$$ -95490 -64105 -37236 -45069 9596 2579 -90460 -46277 -87304 -52279 51348 -28224 -104743
2249a04743j4113j20088Q7122k4489J17269J20063J3302m0392j38163M128L4961
$$ -104743 -118856 -238944 -151822 -176311 -59042 61021 74323 33931 -104232 -100104 -65143
2238f5143J9136R9763P4631j38796k6275Q5506k3338P7425j4168o5614R145j0289
$$ -65143 -46007 53756 128387 -10409 -36684 48822 25484 102909 88741 23127 32272 21983
2226B1983J9768q6620R7227M0403L3567n1039J02488p6846Q423J35356j05340
$$ 21983 41751 -44869 52358 92761 126328 75289 177777 100931 109354 244710 139370
2215A39370j27479P0791K9761m1454m5962N2858M021l8420J6147P9300J21680
$$ 139370 11891 82682 112443 70989 25027 77885 81906 43486 59633 138933 260613
2204B60613r3271n2305R3683o3081l5116J4383j2668P5037K8274N7119K8757J7545
$$ 260613 167342 115037 208720 145639 110523 124906 112238 187275 215549 272668 301425 318970
2192C18970j17736j3434M9259O1052m0161O867n4948r142j424o2219R4126K7999
$$ 318970 201234 187800 237059 298111 257950 264817 209869 200727 199303 137084 231210 259209
2180B59209K2137O1508J7193N152m91R4858P028m7030j9507k319O5057p047J06381
$$ 259209 281346 342854 360047 365199 364708 459566 466594 419564 400057 397738 462795 455748 562129
2167E62129m8503N4762J34767r15o1712m3667j11562P7977R2499k9381j9167O6637
$$ 562129 513626 568388 703155 702240 640528 596861 485299 563276 655775 626394 607227 673864
2155F73864P0805M1652k2166n2435n5161L6612Q8177r1764o591L5126k3829J10295
$$ 673864 744669 786321 764155 711720 656559 693171 781348 689584 682993 718119 694290 804585
2143H04585L7507J85731Q991n0900J11740O5439n4687n9469O4031L9042J4296
$$ 804585 842092 1027823 1036814 985914 1097654 1163093 1108406 1048937 1112968 1152010 1166306
2132A166306J2812R3708j9993J33681N5277N5868m1002K08524M1743L064J28415
$$ 1166306 1179118 1272826 1252833 1386514 1441791 1497659 1456657 1665181 1706924 1709988 1838403
2121A838403K9541J79943J57563P8959M0872O7776O2261J88013K47051K04492
$$ 1838403 1867944 2047887 2205450 2284409 2325281 2393057 2455318 2643331 2890382 3094874
2111C094874k0060J86125J46698K11603J07974J65003K15406L75619N27379L37685
$$ 3094874 3074814 3260939 3407637 3619240 3727214 3892217 4107623 4483242 5010621 5348306
2101E348306L55333M17765L70171L94174M95707N22553N35393P04361J149583
$$ 5348306 5703639 6121404 6491575 6885749 7381456 7904009 8439402 9143763 10293346
2092A0293346J358793J911449K716660L782102M674446M923360L947977J358315
$$ 10293346 11652139 13563588 16280248 20062350 24736796 29660156 33608133 34966448
2084C4966448p59110k528748m878958n527638m167429l038945k312642j876251
$$ 34966448 34207338 31678590 26799632 21271994 17104565 14065620 11752978 9876727
2076I876727j541104j106209q57828p46626m62697k44890k86439m08188m10521
$$ 9876727 8335623 7229414 6371586 5624960 5162263 4917373 4630934 4222746 3812225
2067C812225l25315j75589k23122j91193k27798k96847j85248j38250r1325j29471
$$ 3812225 3486910 3311321 3088199 2897006 2669208 2372361 2187113 2048863 1957538 1828067
2057A828067q6339r4924k8347j00541r4394j33745k0398l7700j59102l4220n36
$$ 1828067 1741728 1646804 1618457 1517916 1423522 1289777 1269379 1231679 1072577 1038357 1037821
2046A037821l8568M1353n6305o4570j45507r863N7270L0713j42845R08l0609n5537
$$ 1037821 999253 1040606 984301 919731 774224 764361 821631 852344 709499 710407 679798 624261
2034F24261o3379L1898J51124p2624n1201p4552n6548m6249K6882J11547j28786
$$ 624261 560882 592780 743904 671280 620079 545527 488979 442730 469612 581159 452373
2023D52373l4720O7047k6806k5767o1134o3904M0588J14100K4303j24125p1443
$$ 452373 417653 484700 457894 432127 370993 307089 347677 461777 486080 361955 290512
2012B90512J5677m0806L094K3617j9290p0861J22432L9550J7047n5595q7417J5528
$$ 290512 306189 265383 268477 292094 272804 201943 324375 363925 380972 325377 237960 253488
2000B53488l1757J1123m1910j19053k7982K9778P9525l8609r1115K7127j3427
$$ 253488 221731 232854 190944 71891 43909 73687 153212 114603 23488 50615 37188
1989C7188L3477O0358j34655J1551J42676m9290m7793n1069l520n677k6327J25837
$$ 37188 70665 131023 -3632 7919 150595 101305 53512 2443 -1077 -6754 -33081 92756
1977I2756N888o3747p2360P007J16053N7317J2344o5686J41818j02897q6998k0942
$$ 92756 98644 34897 -37463 -30456 85597 142914 155258 89572 231390 128493 41495 20553
1965B0553k4969o2282j1064R3877m8881l9699j14178J05936Q7272J4777j30156
$$ 20553 -4416 -66698 -77762 16115 -32766 -72465 -186643 -80707 6565 21342 -108814
1954a08814L4725M6341j3192l3072Q6420K2024K3281j72482P3413K9929j00989
$$ -108814 -74089 -27748 -40940 -74012 12408 34432 57713 -114769 -41356 -11427 -112416
1943a12416N2157j5295l1477N5349Q9822Q1795l5958l8312j4275o6416M2038l7493
$$ -112416 -60259 -75554 -107031 -51682 38140 119935 83977 45665 31390 -35026 7012 -30481
1931c0481n7144L501R5688O4943j3708l6525l3277o505P6815k2495l7714k2874
$$ -30481 -87625 -84124 11564 76507 62799 26274 -7003 -13508 63307 40812 3098 -19776
1919a9776Q2697o367n7456k1448J6684j4771p7644k872O641N927M0189l2281M0380
$$ -19776 62921 56554 -902 -22350 -5666 -20437 -98081 -100953 -94312 -88385 -48196 -80477 -40097
1906d0097m7585K8875J7405p0566n3900M6548L8542J7173n2985J7734n2698L3158
$$ -40097 -87682 -58807 -41402 -111968 -165868 -119320 -80778 -63605 -116590 -98856 -151554 -118396
1894a18396L1210L6715N050o9809M885N9149m372l0831o4121k7012J2822M3653
$$ -118396 -87186 -50471 -45421 -115230 -110345 -51196 -55568 -86399 -150520 -177532 -164710 -121057
1882a21057L8965m3704R3628n2830J7346R5653j13516o108O6984k5327M2646M885
$$ -121057 -82092 -125796 -32168 -84998 -67652 28001 -85515 -91623 -24639 -49966 -7320 -2435
1870b435j7958q3578m311O0353k5741m2455L9446Q1029n2319n7205P7490n6317
$$ -2435 -20393 -103971 -108282 -47929 -73670 -116125 -76679 4350 -47969 -105174 -27684 -84001
1858h4001M9626K9320k2700N7172L5763j93699j8378J09451j2756K7433l9536
$$ -84001 -34375 -5055 -27755 29417 65180 -128519 -146897 -37446 -50202 -22769 -62305
1847f2305p7500l8718N2711n5178M7347O8073j3727P0692m6098N965K2633O3202
$$ -62305 -139805 -178523 -125812 -180990 -133643 -65570 -79297 -8605 -54703 -48738 -26105 37097
1835C7097O5701l4914j09629q2950O2281O9465J7555k1348n560M7999J7777N4207
$$ 37097 102798 67884 -41745 -124695 -62414 7051 24606 3258 -2302 45697 63474 117681
1823A17681k1264k8113k2997Q3766M6252K6603k0607J7341p3643j0992m788p5233
$$ 117681 96417 68304 45307 129073 175325 201928 181321 198662 125019 114027 109239 34006
1811C4006k3628o6156l231M0625K7965q1005m7738P8581M1014o8474R3335m6438
$$ 34006 10378 -55778 -59009 -18384 9581 -71424 -119162 -40581 433 -68041 25294 -21144
1799b1144l8285M6939o7809q2260j576p5268M7164L4802N2705M0945l9580l2825
$$ -21144 -59429 -12490 -80299 -162559 -164135 -239403 -192239 -157437 -104732 -63787 -103367 -136192
1787a36192p0596J27072O4112n9978K6666k6196r9963l3859l6565L1429J13132
$$ -136192 -206788 -79716 -15604 -75582 -48916 -75112 -175075 -208934 -245499 -214070 -100938
1776a00938L7148J8236K0415k7816J776k5179J8009r172j6910J30522k0295j16410
$$ -100938 -63790 -45554 -25139 -52955 -51179 -76358 -58349 -67521 -84431 46091 25796 -90614
1764i0614k3179R5769j36037O7643k2218j841J5285k2968L2972n9349p3031R1063
$$ -90614 -113793 -18024 -154061 -86418 -108636 -110477 -95192 -118160 -85188 -144537 -217568 -126505
1752a26505p2386O8356K1979j3982Q7035j4328L9282j18765J2891K0646K861k867
$$ -126505 -198891 -130535 -108556 -122538 -35503 -49831 -10549 -129314 -116423 -95777 -92916 -95783
1740i5783L7208R5765R3605l5295j11490J3690K700j05936K7460J195L383J33846
$$ -95783 -58575 37190 130795 95500 -15990 -2300 400 -105536 -78076 -76881 -73498 60348
1728F0348K4247r2472r337J8197q7513n4964L2727M7034j222j05283K2235J29402
$$ 60348 84595 -7877 -17214 983 -86530 -141494 -108767 -61733 -62955 -168238 -146003 -16601
1716a6601L4929k1964L0908m2412m2794K2007j06295r020R9928q6098k3908K6358
$$ -16601 18328 -3636 27272 -15140 -57934 -35927 -142222 -151242 -51314 -137412 -161320 -134962
1704a34962k9144N7024N8360R3775j6780j15064N233l0236j5278M1776P7746o1372
$$ -134962 -164106 -107082 -48722 45053 28273 -86791 -81558 -111794 -127072 -85296 -7550 -68922
1692f8922r8402n3084J17963J03498M946k1960m4134K3790J02784q6730q7900
$$ -68922 -167324 -220408 -102445 1053 5999 -15961 -60095 -36305 66479 -20251 -108151
1681a08151O148K851k6862L2645m0794Q9263k008k7551j0014L8956m2764m7286
$$ -108151 -102003 -99152 -126014 -93369 -134163 -44900 -46908 -74459 -84473 -45517 -88281 -135567
1669a35567L4481J31104J26428p5921n9310r1501l4260J5691l9079m6366l974
$$ -135567 -101086 30018 156446 80525 21215 -70286 -104546 -88855 -127934 -174300 -178274
1658a78274R6402O225l4387m1293J4396L1501j3545N2636P6131q8928m9239Q3982
$$ -178274 -81872 -75647 -110034 -151327 -136931 -105430 -118975 -66339 9792 -79136 -128375 -44393
1646d4393j49411K9660j208r4503J02558J7857k5066J15501Q881j61637K6176
$$ -44393 -193804 -164144 -165352 -259855 -157297 -139440 -164506 -49005 -40124 -201761 -175585
1635a75585J68660K6353L3043j7905N4694j38093M91L5859l2465J1012r077M5060
$$ -175585 -6925 19428 52471 34566 89260 -48833 -48342 -12483 -44948 -33936 -43013 2047
1623B047P0723l4445k8436j45431m1258O7952K6601m9079l3534N5760Q0717k7144
$$ 2047 72770 38325 9889 -135542 -176800 -108848 -82247 -131326 -164860 -109100 -28383 -55527
1611e5527j50334J70486Q3207j10601M5203r1510O8193Q103O3463o3036l1146
$$ -55527 -205861 -35375 47832 -62769 -17566 -109076 -40883 -32780 30683 -32353 -63499
1600f3499J6020j27718J27228q0154N839K328l0810L6669J464n0885M9302L9968
$$ -63499 -47479 -175197 -47969 -128123 -122284 -119956 -150766 -114097 -112633 -163518 -114216 -74248
1588g4248O2056q3115n1629J09232O4548r2077j32502J01836k2589J6442O6378
$$ -74248 -12192 -95307 -146936 -37704 26844 -65233 -197735 -95899 -118488 -102046 -35668
1577c5668n1058O7183k488j02845L0496j5176L2891J0232N8011J6058k7377K7220
$$ -35668 -86726 -19543 -22031 -124876 -94380 -109556 -76665 -66433 -8422 7636 -19741 7479
1565G479j5530n9251N3574N442o0522j29072M128J17804j3068J9473m6289N7751
$$ 7479 -8051 -67302 -13728 -8286 -68808 -197880 -193752 -75948 -89016 -69543 -115832 -58081
1553e8081J1094J0972L7526q5758p6892J02793N533J8816Q225j32700L4615q9677
$$ -58081 -46987 -36015 1511 -84247 -161139 -58346 -52813 -33997 -25772 -158472 -123857 -213534
1541b13534K3903J35728m952n7543M2796J13830k1400o9384K6368o5048O0848
$$ -213534 -189631 -53903 -58855 -116398 -73602 40228 18828 -50556 -24188 -89236 -28388
1530b8388N6773m0538j74455K4345J24970m2414k1470o1863R0972n7749o5020
$$ -28388 28385 -12153 -186608 -162263 -37293 -79707 -101177 -163040 -72068 -129817 -194837
1519a94837n9325R4369L1456N6947l3818K5231k0687M4323N7225o1958l6418O9817
$$ -194837 -254162 -159793 -128337 -71390 -105208 -79977 -100664 -56341 884 -61074 -97492 -27675
1507b7675O849J3715L8470N3701l4536j28477O8662k5871q9441Q673O0012k2910
$$ -27675 -20826 -7111 31359 85060 50524 -77953 -9291 -35162 -124603 -115930 -55918 -78828
1495g8828J03032k2827o4424k3413P7306k2793j9432R0005j21240j1244Q183K2452
$$ -78828 24204 1377 -63047 -86460 -9154 -31947 -51379 38626 -82614 -93858 -85675 -63223
1483f3223p0315j0444J9255M394O374J18297o44r3281o0085M2641M5036k6507
$$ -63223 -133538 -143982 -124727 -120333 -113959 4338 3694 -89587 -149672 -107031 -61995 -88502
1471h8502k8624K3352J8130O2666k2283q9773O1399j8098J7092J26320n3448j34290
$$ -88502 -117126 -93774 -75644 -12978 -35261 -125034 -63635 -81733 -64641 61679 8231 -126059
1459a26059O5936j16606P0018M2762j2285q8918P0550J05305J8770j6574q5482
$$ -126059 -60123 -176729 -106711 -63949 -76234 -165152 -94602 10703 29473 12899 -72583
1448g2583J157O7989m6865r379J7617P6732N3692j42909n3669J00580J12888l2303
$$ -72583 -71426 -3437 -50302 -59681 -42064 34668 88360 -54549 -108218 -7638 105250 72947
1436G2947p6118m5662k8513n5499O3394L5j3046l37J26556r0126N222l9096l4749
$$ 72947 -3171 -48833 -77346 -132845 -69451 -69416 -82462 -82799 43757 -46369 -41147 -80243 -114992
1423a14992J41430k4054l3851p7800P3282N5264k4237o5208j1416l2106N7382
$$ -114992 26438 2384 -31467 -109267 -35985 19279 -4958 -70166 -81582 -113688 -56306
1412e6306P6052K7865j56499J42397M8410j11757J8262M019l3192J2594r9987
$$ -56306 19746 47611 -108888 33509 81919 -29838 -11576 -7557 -40749 -28155 -128142
1401a28142j6277K4665k0010N0010p1271L0956R1118j12339k1J65811j06577M602
$$ -128142 -144419 -119754 -139764 -89754 -161025 -130069 -38951 -151290 -151311 14500 -92077 -87475
1389h7475l2952o6442J02412O7120j05664q3545J63341J9006o5459m5468R0496
$$ -87475 -120427 -186869 -84457 -17337 -123001 -206546 -43205 -24199 -89658 -135126 -44630
1378d4630K4018q5915J2974L7053L3018l9942L880o905P4376j4029O2032o0734
$$ -44630 -20612 -106527 -93553 -56500 -23482 -63424 -59544 -66449 7927 -6102 55930 -4804
1366d804m9899p2711l1556O4929m1640Q8321P340K181o6335M2667k8559M9249
$$ -4804 -54703 -127414 -158970 -94041 -135681 -47360 -40020 -37839 -104174 -61507 -90066 -40817
1354d0817l0850o1167J0545m5410K0711O6098P6565L8641p9085j83581O1860j8346
$$ -40817 -71667 -132834 -122289 -167699 -146988 -80890 -4325 34316 -44769 -228350 -166490 -184836
1342a84836M7689N2692k0808j3139Q3872M4743L274j1471J7216j5233M0750l5565
$$ -184836 -137147 -84455 -105263 -118402 -34530 10213 13487 2016 19232 3999 44749 9184
1330I184k0173j02922K2654j7409K29J45200k0452P821j508j27185J02213J5340
$$ 9184 -10989 -113911 -91257 -108666 -108437 36763 16311 24132 22624 -104561 -2348 12992
1318A2992j27705K1490m680J4829O5045M961Q8141r5278p9739Q4981n9347N1351
$$ 12992 -114713 -93223 -97903 -83074 -18029 -13068 75073 -20205 -99944 -14963 -74310 -22959
1306b2959k7477m6926L0064R0271o6869L5911q9658k2225O2898J0719j8556r9610
$$ -22959 -50436 -97362 -67298 22973 -43896 -7985 -97643 -119868 -56970 -46251 -64807 -164417
1294a64417J70814q4131m5577J1229K1690Q1726J8713N0303l5518k4095q3776
$$ -164417 6397 -77734 -123311 -112082 -90392 -8666 10047 60350 24832 737 -83039
1283h3039l1138J16439K3268p4734j7950J4466N9416l4995n9572N9514o5987j615
$$ -83039 -114177 2262 25530 -49204 -67154 -52688 6728 -28267 -87839 -28325 -94312 -95927
1271i5927R2475n563o9672P1578M3313l2132K7396l1862l7786j8965J50400m8099
$$ -95927 -3452 -9015 -78687 -7109 36204 4072 31468 -394 -38180 -57145 93255 45156
1259D5156j34303K8432K3723m46l877j9230p909m9817M7889p4143Q7902k3760
$$ 45156 -89147 -60715 -36992 -37438 -41315 -60545 -68454 -118271 -70382 -144525 -56623 -80383
1247h0383K9140k5056j6751K1305j26282J20624J13271j06316q8207O0205R3626
$$ -80383 -51243 -76299 -93050 -71745 -198027 -77403 35868 -70448 -158655 -98450 -4824
1236d824k8789K4857m4761n1233M4931p439m8499M1098J40862n9018P6301n2995
$$ -4824 -33613 -8756 -53517 -104750 -59819 -67258 -115757 -74659 66203 7185 83486 30491
1224C0491q8316J093K1028J16520q0375L0540k7820j11811K2039M9000M0989K6106
$$ 30491 -57825 -56732 -35704 80816 441 30981 3161 -108650 -86611 -37611 3378 29484
1212B9484j03448m9991N6266Q8472j7216q2206P0375m0517k0915N9960J5988K0396
$$ 29484 -73964 -123955 -67689 20783 3567 -78639 -8264 -48781 -69696 -9736 6252 26648
1200B6648M3905R182p8630p9584l0180K7475j10N8590m1577Q4762O1199r3947
$$ 26648 70553 79735 1105 -78479 -108659 -81184 -81294 -22704 -64281 20481 81680 -12267
1188a2267L177J16233K0108q2092n1190K0994O9269n0496R596L8720K6057m3941
$$ -12267 -9090 107143 127251 45159 -6031 14963 84232 33736 43332 82052 108109 64168
1176F4168n1524n5642l7363M4309l3220J6258N7105k301o1321k9586m8697K1544
$$ 64168 12644 -42998 -80361 -36052 -69272 -53014 4091 1790 -59531 -89117 -137814 -116270
1164a16270R6110p93q5285N817K13377o9131j6010r5208M7309j8085o6845r088
$$ -116270 -20160 -20953 -106238 -100421 112956 43825 27815 -67393 -20084 -38169 -105014 -114102
1152a14102Q6653j4062R3661l9968k5616M7643m9729J6339q7703K2980J16644
$$ -114102 -27449 -41511 52150 12182 -13434 34209 -15520 819 -86884 -63904 52740
1141E2740j5200r667j1733n5610m8241J8543J24353P4640n2953q9166m2901Q4659
$$ 52740 37540 27873 16140 -39470 -87711 -69168 55185 129825 76872 -12294 -55195 29464
1129B9464l3930L5054l8476n3999J9757L238J2888J3208J1211K7007o742j34694
$$ 29464 -4466 30588 -7888 -61887 -42130 -38892 -26004 -12796 -1585 25422 18680 -116014
1117a16014j8523O5062N9685M6212j08958m9514O1006K5242N3021j06243M3495
$$ -116014 -134537 -69475 -9790 36422 -72536 -122050 -61044 -35802 17219 -89024 -45529
1106d5529J2089J4654K0438M5369P3180Q0275r1766l444N5045Q664j76270q0792
$$ -45529 -33440 -18786 1652 47021 120201 200476 108710 105266 160311 168975 -7295 -88087
1094h8087P286l6781O5865O5507L8154n3868n4605m136M3290L5793l1440p8052
$$ -88087 -80801 -117582 -51717 13790 51944 -1924 -56529 -60665 -17375 18418 -13022 -91074
1082i1074J76279j2849l8562P4266j5122N029K0181p7029L321M5054m6817O1738
$$ -91074 85205 72356 33794 108060 92938 97967 118148 41119 44440 89494 42677 104415
1070A04415p6962n43k4155l5075k6087N424J03983L4100j09257k208O15P26j1149
$$ 104415 27453 26910 2755 -32320 -58407 -52983 51000 85100 -24157 -26365 -25750 -25024 -36173
1057c6173k3774k0390J2233M1831R9597j51436p016J21598l1602M1238r7290j4204
$$ -36173 -59947 -80337 -68104 -26273 73324 -78112 -85128 36470 4868 46106 -51184 -65388
1045f5388Q1495k6454J36105j4615p7494l6429p6439r021N9095P2634K7343r8700
$$ -65388 16107 -10347 125758 111143 33649 -2780 -79219 -88240 -29145 43489 70832 -27868
1033b7868J35571M0424j02003j3953J5181J9381p1969J7692o345k6930J06586
$$ -27868 107703 148127 46124 32171 47352 66733 -5236 12456 6111 -20819 85767
1022H5767J4796j05112J6321o5765q5610L6814J02233J6060m2502k8318l591K410
$$ 85767 100563 -4549 11772 -53993 -139603 -102789 -556 15504 -26998 -55316 -58907 -56497
1010e6497m3305n847J10029m1562l3828M5151L7519L6106K8832J5036q2508L6179
$$ -56497 -99802 -105649 4380 -37182 -71010 -25859 11660 47766 76598 91634 9126 45305
998D5305O9752q4228K470m8133L9917K2675k4321L7650J16323L2695j07054K6458
$$ 45305 115057 30829 33299 -14834 25083 47758 23437 61087 177410 210105 103051 129509
986A29509R7949j52583m1676L5592j52026L053J19388L918n3408M7380K2116j22428
$$ 129509 227458 74875 33199 68791 -83235 -80182 39206 43124 -10284 37096 59212 -63216
974f3216l395J04713J1543r3969K0716L7871N3401l1200l4835R4543l3831j18814
$$ -63216 -66611 38102 49645 -44324 -23608 14263 67664 36464 1629 96172 62341 -56473
962e6473o539R1387j8990K5705k1023K8430J13399m9574q6561K5170P2972j0057
$$ -56473 -63012 28375 9385 35090 14067 42497 155896 106322 19761 44931 117903 107846
950A07846r6058l9374P0033l824k8605j3326q9405k3525P5842l0468J45929j06108
$$ 107846 11788 -27586 42447 38623 10018 -3308 -92713 -116238 -40396 -70864 75065 -31043
938c1043K3719m8064N1743O8676K428o606j35550j3669k372L9067o3232J11850
$$ -31043 -7324 -55388 -3645 65031 67459 60853 -74697 -88366 -90738 -51671 -114903 -3053
926c053M1008K7746R4075k5079o4504l4257j3557j05764j779j5882N046O6501
$$ -3053 37955 65701 159776 134697 70193 35936 22379 -83385 -85164 -101046 -96000 -29499
914b9499N8025N3692k9799j53600j3816J52966Q8116j21185P3121K5054j17394
$$ -29499 28526 82218 52419 -101181 -114997 37969 126085 4900 78021 103075 -14319
903a4319L3033O5549Q1783j70778O7671j8128q5432L3280j8427j9301M3103R8620
$$ -14319 18714 84263 166046 -4732 62939 44811 -40621 -7341 -25768 -45069 -1966 96654
891I6654r7146o2852Q1462m1101k5138N6596O4297j9581J5548n8698J9643j05325
$$ 96654 -492 -63344 18118 -22983 -48121 8475 72772 53191 68739 10041 29684 -75641
$$ [...]
##END NTUPLES=NMR SPECTRUM
##END=
