##TITLE=1H_TG-2340-Vc
 CDCl3
 8 sc, 
 17.5.2023
##JCAMPDX= 6.0         $$ Bruker NMR JCAMP-DX V2.0
##DATA TYPE= NMR SPECTRUM
##DATA CLASS= NTUPLES
##ORIGIN= UXNMR, Bruker Analytische Messtechnik GmbH
##OWNER= root
$$ XWIN-NMR		Version 3.5
$$ Wed May 17 14:01:00 2023 Russian Standard Time (UT+4h)  she@DPX200
##.OBSERVE FREQUENCY= 200.13135
##.OBSERVE NUCLEUS= ^1H
##.ACQUISITION MODE= SIMULTANEOUS
##.ACQUISITION SCHEME= undefined
##.AVERAGES= 8
##.DIGITISER RES= 18
##SPECTROMETER/DATA SYSTEM= spect
##.PULSE SEQUENCE= zg30
##.SOLVENT NAME= CDCl3
##.SHIFT REFERENCE= (INTERNAL, CDCl3, 0, 15.7436)
##AUDIT TRAIL= $$ (NUMBER, WHEN, WHO, WHERE, WHAT)
$$ ##TITLE= Audit trail, XWIN-NMR		Version 3.5
$$ ##JCAMPDX= 5.01
$$ ##ORIGIN= Bruker BioSpin GmbH
$$ ##OWNER= she
$$ F:/spectra/data/she/nmr/H-F/1/pdata/1/auditp.txt
$$ ##AUDIT TRAIL=  $$ (NUMBER, WHEN, WHO, WHERE, WHAT)
(   1,<2023-05-17 13:58:52.87 +0400>,<she>,<DPX200>,
      <created by zg, POWCHK disabled, PULCHK disabled
       configuration hash MD5:
       00 E9 B6 7A A2 85 ED C7 34 08 36 98 17 FE 4E 26
       data hash MD5: 16K
       4A 8C A5 0A 9F F2 78 85 EC EA 76 41 78 F5 B7 72>)
(   2,<2023-05-17 13:59:02.00 +0400>,<she>,<DPX200>,
      <Start of raw data processing
       efp BC_mod = 2 LB = 0.24 FT_mod = 6 PKNL = 1 PHC0 = -19907.34 PHC1 = 23.45272 SI = 16K 
       data hash MD5: 16K
       AF 3B 54 A5 1A 14 E1 A2 B9 3C 74 93 03 21 1E F3>)
(   3,<2023-05-17 13:59:43.25 +0400>,<she>,<DPX200>,
      <pk PHC0 = 17.27001 PHC1 = -20.2 
       data hash MD5: 16K
       07 3D 36 B0 BB 19 BE 14 25 67 22 A0 2E D8 D0 CF>)
(   4,<2023-05-17 13:59:46.85 +0400>,<she>,<DPX200>,
      <abs ABSG = 5 
       data hash MD5: 16K
       F6 65 A3 0F C3 76 F2 0E F9 0A B3 50 EF 8E A1 BA>)
$$ ##END=
$$ 
$$ hash MD5
$$ EF 28 2F D2 1A 3D 7D 79 F3 88 87 AD C3 BE 21 16
##$RELAX= 
##$RELAX= 
##$RELAX= 
##$RELAX= 
##$RELAX= 
##$RELAX= 
$$ Bruker specific parameters
$$ --------------------------
##$DU= <F:/spectra>
##$EXPNO= 1
##$NAME= <H-F>
##$PROCNO= 1
##$TYPE= <nmr>
##$USER= <she>
##$AMP= (0..31)
100 100 100 100 100 100 100 100 100 100 100 100 100 100 100 100 100 100 
100 100 100 100 100 100 100 100 100 100 100 100 100 100 
##$AQSEQ= 0
##$AQ_mod= 1
##$AUNM= <au_zg>
##$AUTOPOS= <>
##$BF1= 200.13
##$BF2= 200.13
##$BF3= 200.13
##$BF4= 200.13
##$BF5= 200.13
##$BF6= 200.13
##$BF7= 200.13
##$BF8= 200.13
##$BYTORDA= 1
##$CFDGTYP= 0
##$CFRGTYP= 5
##$CHEMSTR= <none>
##$CNST= (0..31)
1 1 145 1 1 1 1 1 1 1 1 1 1 1 1 1 1 1 1 1 1 1 1 1 1 1 1 1 1 1 1 1 
##$CPDPRG= <>
##$CPDPRG1= <>
##$CPDPRG2= <>
##$CPDPRG3= <>
##$CPDPRG4= <mlev>
##$CPDPRG5= <mlev>
##$CPDPRG6= <mlev>
##$CPDPRG7= <mlev>
##$CPDPRG8= <mlev>
##$CPDPRGB= <>
##$CPDPRGT= <>
##$D= (0..31)
0 1.2 0 0 0 0 0 0 0 0.06 0 0.03 0 0 0 0 0.0002 0 0 0 0 0 0 0 0 0 0 0 0 
0 0 0 
##$DATE= 1684317532
##$DBL= (0..7)
120 120 120 120 120 120 120 120 
##$DBP= (0..7)
150 150 150 150 150 150 150 150 
##$DBP07= 0
##$DBPNAM0= <>
##$DBPNAM1= <>
##$DBPNAM2= <>
##$DBPNAM3= <>
##$DBPNAM4= <>
$$ [...]
##$SUBNAM3= <"">
##$SUBNAM4= <"">
##$SUBNAM5= <"">
##$SUBNAM6= <"">
##$SUBNAM7= <"">
##$SUBNAM8= <"">
##$SUBNAM9= <"">
##$SW= 18.05172834244
##$SWIBOX= (0..15)
0 0 2 0 0 0 0 0 0 0 0 0 0 0 0 0 
##$SW_h= 3612.71676300578
##$TD= 16384
##$TD0= 1
##$TE= 0
##$TE2= 300
##$TE3= 300
##$TEG= 300
##$TL= (0..7)
0 120 120 120 120 120 120 120 
##$TP= (0..7)
150 150 150 150 150 150 150 150 
##$TP07= 0
##$TPNAME0= <>
##$TPNAME1= <>
##$TPNAME2= <>
##$TPNAME3= <>
##$TPNAME4= <>
##$TPNAME5= <>
##$TPNAME6= <>
##$TPNAME7= <>
##$TPOAL= (0..7)
0.5 0.5 0.5 0.5 0.5 0.5 0.5 0.5 
##$TPOFFS= (0..7)
0 0 0 0 0 0 0 0 
##$TUNHIN= 0
##$TUNHOUT= 0
##$TUNXOUT= 0
##$USERA1= <user>
##$USERA2= <user>
##$USERA3= <user>
##$USERA4= <user>
##$USERA5= <user>
##$V9= 5
##$VALIST= <valist>
##$VCLIST= <CCCCCCCCCCCCCCC>
##$VD= 0
##$VDLIST= <DDDDDDDDDDDDDDD>
##$VPLIST= <PPPPPPPPPPPPPPP>
##$VTLIST= <TTTTTTTTTTTTTTT>
##$WBST= 1024
##$WBSW= 4
##$XGAIN= (0..3)
0 0 0 0 
##$XL= 0
##$YL= 0
##$YMAX_a= 273051
##$YMIN_a= -332886
##$ZGOPTNS= <>
##$ZL1= 120
##$ZL2= 120
##$ZL3= 120
##$ZL4= 120
##$ABSF1= 15.73477
##$ABSF2= -2.31708
##$ABSG= 5
##$ABSL= 3
##$ALPHA= 0
##$AQORDER= 0
##$ASSFAC= 0
##$ASSFACI= 0
##$ASSFACX= 0
##$ASSWID= 0
##$AUNMP= <proc_1d>
##$AZFE= 0.1
##$AZFW= 0.1
##$BCFW= 0
##$BC_mod= 2
##$BYTORDP= 0
##$COROFFS= 0
##$CY= -3
##$DATMOD= 1
##$DC= 0
##$DFILT= <>
##$DTYPP= 0
##$F1P= 0
##$F2P= 0
##$FCOR= 1
##$FTSIZE= 16384
##$FT_mod= 6
##$GAMMA= 0
##$GB= 0
##$INTBC= 1
##$INTSCL= 3.70164e-10
##$ISEN= 128
##$LB= 0.24
##$LEV0= 0
##$LPBIN= 0
##$MAXI= 10000
##$MC2= 0
##$MEAN= 0
##$ME_mod= 0
##$MI= 1.114404
##$NCOEF= 0
##$NC_proc= -6
##$NLEV= 6
##$NOISF1= 3.799351
##$NOISF2= 2.8
##$NSP= 0
##$NTH_PI= 0
##$NZP= 0
##$OFFSET= 15.74358
##$PC= 1
##$PHC0= -19890.07
##$PHC1= 3.25272
##$PH_mod= 1
##$PKNL= yes
##$PPARMOD= 0
##$PSCAL= 0
##$PSIGN= 0
##$REVERSE= no
##$SF= 200.130005595671
##$SI= 16384
##$SIGF1= 3
##$SIGF2= 2
##$SINO= 5.538805
##$SIOLD= 16384
##$SREGLST= <1H.CDCl3>
##$SSB= 0
##$STSI= 16384
##$STSR= 0
##$SW_p= 3612.71676300578
##$SYMM= 0
##$S_DEV= 0
##$TDeff= 16384
##$TDoff= 0
##$TI= <>
##$TILT= no
##$TM1= 0
##$TM2= 0
##$TOPLEV= 0
##$USERP1= <user>
##$USERP2= <user>
##$USERP3= <user>
##$USERP4= <user>
##$USERP5= <user>
##$WDW= 1
##$XDIM= 16384
##$YMAX_p= 320827997
##$YMIN_p= -845530
$$ End of Bruker specific parameters
$$ ---------------------------------
##NTUPLES= NMR SPECTRUM
##VAR_NAME=  FREQUENCY,     SPECTRUM/REAL,   SPECTRUM/IMAG
##SYMBOL=    X,             R,               I
##VAR_TYPE=  INDEPENDENT,   DEPENDENT,       DEPENDENT
##VAR_FORM=  AFFN,          ASDF,            ASDF
##VAR_DIM=   16384,         16384,           16384
##UNITS=     HZ,            ARBITRARY UNITS, ARBITRARY UNITS
##FACTOR=    0.220516191357247, 1,           1
##FIRST=     3150.76272637867, 0,            0
##LAST=      -461.954036627111, 0,           0
##MIN=       -461.954036627111, -845530,     0
##MAX=       3150.76272637867, 320827997,    0
$$ Real data points
##PAGE= N=1
##DATA TABLE= (X++(R..R)), XYDATA
$$ [...]
9271 3993531 3952239 3958442 3910358 3785791 3728575 3752814 3821094 3817099 3855848 3873045 3829265 3909858
9259 3909858 3899650 3915216 3845294 3786073 3826061 3893385 3900620 3885193 3911290 3858076 3811761 3850447
9247 3850447 3993014 4023827 4055484 4128102 4051478 4053676 4056995 4111608 4111612 4100208 4185782 4211677
9235 4211677 4274794 4210807 4158158 4131557 4161329 4147581 4160088 4165606 4197705 4145214 4045220 4027260
9223 4027260 4069348 4127282 4138317 4107268 4039229 4114386 4110779 4137039 4123950 4134648 4245047
9212 4245047 4253893 4282635 4289648 4284125 4290290 4225794 4230306 4268518 4314715 4250875 4172865 4284284
9200 4284284 4337361 4285724 4346376 4461397 4506946 4485860 4484130 4482518 4465812 4461790 4527149 4572326
9188 4572326 4587641 4616651 4581500 4673293 4775496 4827110 4807924 4847052 4896576 4836527 4896478
9177 4896478 4933023 5025502 5033013 5106562 5086696 5077938 5131156 5175311 5229756 5150952 5178744 5173029
9165 5173029 5178165 5190701 5216036 5155166 5118962 5174523 5148546 5176178 5308747 5274429 5239829
9154 5239829 5356886 5345517 5290189 5425127 5450127 5560867 5733972 5731961 5780781 5816010 5866607
9143 5866607 5962884 5964137 5991568 6094810 6163845 6208493 6327986 6355859 6477512 6617386 6661420
9132 6661420 6713548 6725934 6847750 6939158 7043107 7068898 7105966 7301358 7413335 7498559 7705653
9121 7705653 7967316 8191614 8336319 8611274 8862099 8969805 9216233 9611395 9883406 10321039
9111 10321039 10753973 10992845 11223159 11521115 11928987 12248947 12523532 12865036 13176836
9102 13176836 13485157 13772245 13996480 14095946 14520536 14852467 15191628 15613387 16176855 16729769
9092 16729769 17377656 18275142 19151845 20199888 21594268 23338801 25345768 27664545 30215275
9083 30215275 32970469 36033269 39598592 43928237 48449254 52260825 55094127 57134270
9075 57134270 59125401 61779984 65150844 68151101 69683987 68817005 65790981 61730143
9067 61730143 57429014 53565468 50606273 48219852 46169471 44185508 42082586 40089673
9059 40089673 38169338 36595570 35510198 34785454 34377291 34247559 34531587 35386069 36737107
9050 36737107 38547810 41176882 44120086 47500435 51350023 55049071 58504685 61847959
9042 61847959 65122900 68869279 73342638 77857797 81749322 84738388 86585093 87511820
9034 87511820 87343076 85386954 81366739 75860768 69339654 62973886 57621538 52916712
9026 52916712 49226768 46120580 43688480 41538810 39518131 37541604 35417053 33294773
9018 33294773 31369292 29802124 28395794 27176059 26223956 25249865 24405915 23605252 22889551
9009 22889551 22394763 21920046 21488957 21156949 20925182 20565456 20219841 19873033 19804380 19788967
8999 19788967 19850574 19998696 20223342 20422900 20497634 20601860 20827966 21116436 21502202 21845165
8989 21845165 22126111 22240846 22246885 22133093 21889210 21405672 20670222 19814875 19101958 18304430
8979 18304430 17630920 17110017 16671000 16390917 16220225 16100733 15950520 15881768 15689570 15483046
8969 15483046 15286872 14973982 14373922 13776499 13276253 12737628 12151651 11750617 11515394
8960 11515394 11209498 10911658 10620578 10333435 10167376 10046465 9916835 9902427 9718882 9430551
8950 9430551 9349683 9230070 9096446 8986836 8868815 8721278 8686265 8675588 8585254 8515600
8940 8515600 8403417 8379785 8368374 8246412 8255124 8326661 8246248 8121184 8172083 8205995 8151137
8929 8151137 8099575 8046396 8129161 8099997 8062027 7999948 7991320 7967549 7967145 7948191 7853376 7911079
8917 7911079 7903453 7931562 8000566 8046854 8002082 7986667 8127512 8199621 8163493 8206279 8193240
8906 8193240 8237213 8302632 8398921 8451182 8570660 8569623 8578575 8616441 8749108 8847998 8912968
8895 8912968 8904588 8939965 9074534 9298193 9469446 9543228 9690829 9798418 10000475 10268314
8885 10268314 10483931 10725469 10867291 10962432 11200249 11461401 11762962 11943416 12219002 12424643
8875 12424643 12716004 13076824 13423268 13834603 14176465 14627911 15069319 15573652 15974891
8866 15974891 16478787 16975334 17510437 18159589 19000614 20158851 21639666 23250938 24934207
8857 24934207 26695360 28657591 30761148 33345034 36257822 39086131 41826095 44388012
8849 44388012 46506002 47721702 47821765 46693730 44707444 42490886 40771083 39538970
8841 39538970 38898267 38484717 38184347 37831047 37343782 36848634 36453922 36265118 36140374
8832 36140374 36191828 36403045 36721846 37430629 38527536 39723947 41185120 42875861 44890465
8823 44890465 47460925 50648122 54561872 59332211 64649376 70138241 75621402 80461472
8815 80461472 83836825 84947269 83990697 81229060 77745237 74454382 71687895 68931336
8807 68931336 65803139 62123367 58405053 54982939 52041583 49807511 47974139 46328424
8799 46328424 45004421 43606030 42358555 41269849 40237284 39445019 38866155 38661521 38713284
8790 38713284 39173382 39837474 41064750 42667183 44167167 45560184 46807453 48317950
8782 48317950 50341590 52876768 55670058 57959994 59191723 58765609 56686646 53373524
8774 53373524 49389569 45304401 41763939 38917806 36417945 34509095 32826990 31192310
8766 31192310 29956806 28943714 27927142 27009701 26329734 25571883 24712196 23741485 22749930
8757 22749930 21957675 21085827 20382569 19826516 19174280 18559438 18133962 17786767 17488562
8748 17488562 17269150 17072158 16902829 16664719 16685804 16727883 16793432 16748595 16729696 16737365 16572311
8737 16572311 16351944 16140893 16039595 15986452 15956853 15932385 15964118 16058165 16041876 16039396 16107107
8726 16107107 16106472 16193690 16187787 16142296 16230036 16242628 16357212 16458721 16606821 16781948 17052633
8715 17052633 17303232 17775695 18168770 18590023 19375393 20331049 21517159 22987604 24799490
8706 24799490 27017510 29658824 32991343 37429538 43171222 50447235 57269801 61728271
8698 61728271 63334593 62373833 60065669 58264468 56666427 54619464 52049861 49064505
8690 49064505 46334571 44201200 42223393 40093875 37658035 35067804 32739420 30728489
8682 30728489 29287605 28046312 26851582 25935820 25341122 24792065 24468236 24458401 24731500
8673 24731500 25181704 26016080 27126226 28169744 29038711 29995842 31024686 32275508 34275945
8664 34275945 36907652 39813193 42682572 44925957 46087689 45778607 44210442 41955669
8656 41955669 39402145 36959711 34840596 33056973 31547747 30000996 28416747 26849960
8648 26849960 25358335 23999477 22758433 21796024 20913543 19934923 19081425 18446764 17817421
8639 17817421 17349392 17123885 17146611 17254410 17562454 18076279 18558703 18866513 19244901 19619988
8629 19619988 20093347 20668247 20920786 20736488 20257107 19704221 19122426 18645417 17994549
8620 17994549 17138832 16082842 15163146 14325024 13568847 12960173 12431679 11977086 11438933
8611 11438933 11063293 10582471 10099592 9739567 9281543 8957447 8586245 8300735 8038857
8602 8038857 7736192 7607408 7334344 7046088 6799084 6734275 6644147 6526474 6332993 6116205
8592 6116205 6075427 6080074 5961530 5827583 5663857 5579739 5542665 5514145 5362623 5200977 5228728
8581 5228728 5209093 5180419 5142547 4993544 4999686 4893433 4677369 4636942 4574071 4488381 4442966
8570 4442966 4241805 4099219 4042524 3962228 3925368 3780228 3749551 3707498 3727945 3687772 3653816
8559 3653816 3625930 3681258 3653371 3489813 3415312 3379565 3326570 3213806 3207235 3230259 3155923
8548 3155923 3133051 3140272 3180333 3053723 3049448 3111034 3017539 3009616 2993232 2957995 2956940 2919424
8536 2919424 2872117 2810378 2752277 2691323 2663665 2706304 2683970 2656120 2616523 2601582 2663497
8525 2663497 2491877 2537463 2522236 2349529 2340040 2220994 2204557 2191020 2229094 2173785 2206892
8514 2206892 2131818 2116198 2096824 2073856 2118239 2094939 1979588 2001696 1989996 1945689 1868181
8503 1868181 1868925 1934189 1901846 1839418 1887897 1923382 1844886 1797558 1807835 1861940 1850274 1855801
8491 1855801 1842563 1861554 1837952 1787528 1811443 1800004 1766979 1902701 1967282 1928778 1801244
8480 1801244 1895499 1961815 1869253 1767690 1715472 1729729 1641437 1618192 1622835 1622948 1589006 1607903
8468 1607903 1629114 1498765 1471537 1500674 1470264 1425486 1434690 1491991 1622872 1642330 1517445
8457 1517445 1456747 1476512 1580529 1633016 1642140 1543818 1546010 1620412 1546659 1565506 1552191 1600844
8445 1600844 1546718 1441440 1398949 1452373 1478936 1516094 1542733 1427926 1464379 1321646 1342508
8434 1342508 1339226 1263156 1342656 1240762 1201526 1125516 1095080 1018679 1151555 1216445 1219436
8423 1219436 1153562 1103538 1095022 1156357 1147781 1102983 1120700 1011498 1074418 1142907 991107
8412 991107 1007037 1112180 1156499 1203627 1217573 1007478 884750 971894 925886 979939 988468
8401 988468 904860 913574 881834 869602 783015 819915 939392 914870 807159 784816 856810
8390 856810 812022 842338 812447 865517 815841 870610 787414 792172 832464 840308 795327 769085
8378 769085 731862 824220 845754 737977 742545 732134 765968 774907 696697 654568 715540 756842
8366 756842 745906 847985 825104 752857 723749 685033 634695 617761 574293 547731 657431
8355 657431 665388 594464 613581 668701 704545 754937 699806 642744 656179 653130 607239 690721
8343 690721 656680 679144 624020 605910 626026 665769 627367 595363 661716 552156 521642
8332 521642 583977 685248 715621 698677 704506 694110 688857 642348 623109 572226 560867 452358
8320 452358 468405 475610 475770 558184 603078 698321 650893 699906 726971 608757 556251 514778
8308 514778 568433 636642 618729 610612 695662 656262 616853 602083 648135 718204 724463 711295
8296 711295 652317 635294 588564 676359 690186 570227 524188 543864 615618 561876 514167
8285 514167 554174 563193 589168 462983 520222 491481 534461 497809 466438 585204 580938 488200
8273 488200 496161 489427 480898 460660 349206 354994 413888 446113 440784 481452 526557 473793
8261 473793 492753 425076 418594 523158 593045 516543 488179 355742 463319 531032 372477
8250 372477 467573 503981 474268 459006 457429 349132 356800 420633 453510 347637 433814 453250
8238 453250 304877 240046 333509 302309 392928 380059 349596 254886 280006 391352 402994
8227 402994 361627 362374 393794 412682 466964 499733 485571 456983 534267 491125 434010 393000
8215 393000 366424 362367 338027 391333 334556 365042 330881 310959 273090 231148 156914 274304
8203 274304 215953 202292 168183 169998 251720 282947 290284 308000 283507 176637 -139121 -845530
8191 -845530 -157833 147289 108496 192540 282535 279018 269672 230813 159719 151797 189572 267215
8179 267215 228999 179281 168629 231521 150882 149315 166938 141344 189319 244221 287864 276618
8167 276618 180019 186201 234340 204095 239216 200807 112804 190907 95553 121355 159894 167033
8155 167033 153603 190322 221261 171453 227891 197794 87290 232073 288157 152136 89407
8144 89407 178919 241653 190921 85705 100554 63725 204534 244844 148571 214957 244605
8133 244605 167554 131521 100781 127855 197330 211285 203196 56660 -4121 -3835 115578 150794
8121 150794 135123 180202 217298 161343 157941 106325 64135 185766 173213 206440 135023 85404
8109 85404 142779 70259 137457 289398 178003 157943 173100 265094 250110 225051 122781
8098 122781 141464 206859 216187 174863 116166 104466 96221 33001 11497 165681 113523 77450
8086 77450 115019 7199 -86580 43930 151510 204541 83904 172712 195441 122615 96462
8075 96462 129829 24042 42215 11598 39157 146921 98932 56075 67656 83197 102685
8064 102685 35078 110868 54197 11066 56888 144881 96177 96153 92511 99843 83684 59743 119567
8051 119567 171800 164585 130537 39858 -42108 119873 206864 231967 110145 107416 123961 109168
8039 109168 42343 86306 83535 48393 23915 67213 49190 61928 121391 122938 100914 208432
8027 208432 218451 188500 124647 -30585 3225 87737 94713 185278 99339 8846 122494
8016 122494 113776 148438 149066 92628 133863 154112 105690 102940 166945 118882 7363 59403
8004 59403 63378 84981 89058 -37108 9579 55472 126799 168559 123739 28676 76997 131456
7992 131456 101579 89141 53129 -30236 -52260 16640 26135 115569 119324 138711 113128 99379
7980 99379 56784 -17760 -26874 4993 51721 98220 101965 45286 16832 52056 -5870 -3516
7968 -3516 54879 84739 59101 109969 181313 170234 123820 94823 104377 137797 101988 -15347
7956 -15347 100095 110866 87722 119136 76522 33406 120272 78896 52568 -8018 54675 -13707
7944 -13707 12143 -4360 5388 -1409 16837 69033 14605 82065 97838 72149 62841 60088 114766
7931 114766 101984 -33931 60769 36470 6002 63015 -16487 70384 79440 28362 152586
7920 152586 232328 137552 55341 141943 125576 118656 187064 159375 127719 139156 90227 107711
7908 107711 124948 146931 134697 85675 108201 82444 16562 -15522 49266 85406 86100 79790
7896 79790 16956 74415 98201 106127 126073 65220 63229 83196 -2362 15455 72564 133855
7884 133855 144614 81189 69166 75668 -9006 20042 34598 50344 15291 83910 143943 66622
7872 66622 -10562 -37075 93113 253100 137406 84616 49539 30291 45549 64112 100873
7861 100873 27520 -9877 58828 69863 70945 93231 136687 93108 47239 30392 91155 103911
7849 103911 66498 68980 21647 49953 38819 37998 168593 224499 129970 72256 68177 117626
7837 117626 151695 -26070 -72230 60607 56587 159592 214795 139036 84490 96855 105908
7826 105908 99116 86250 -11198 -36529 62335 143501 153526 167134 89677 107915 142436 177936
7814 177936 131715 54771 41572 59822 75438 -130460 -16859 164667 168034 73023 46554
7803 46554 195294 94866 -4296 -31240 -7804 84517 87954 76096 24410 6397 203 227135
7791 227135 186864 133625 179242 151189 53245 105725 98758 137441 162214 62861 19435 42188
7779 42188 93081 84367 79436 190676 87040 92146 120157 136526 152147 88463 94064 66847
7767 66847 143549 170635 153179 124515 118340 123664 122858 110370 157928 152161 103864 146814 162352
7754 162352 73795 74040 73347 95983 69898 85284 106970 141809 186598 195555 104474 110054 229218
7741 229218 219857 219440 105654 110041 99511 57707 58310 13230 52472 170925 292049 299331
7729 299331 264795 270904 325778 390586 445520 426982 335857 431948 585560 585877 500628 369498
7717 369498 247501 288128 291726 181037 202903 248286 234893 176441 190756 125920 157693
7706 157693 196393 312958 385808 399423 310805 190517 264173 297453 144182 75351 191246
7695 191246 177996 108991 258504 256475 179034 187849 70387 110145 204373 180752 227800 303266
7683 303266 236455 125487 136446 164314 256941 248737 189800 201356 272481 185356 94898 47764
7671 47764 135844 177045 120903 161852 218952 231109 209345 160512 93570 101323 86652 171123
7659 171123 183170 135984 108811 99247 91769 85105 142011 160554 185143 257378 231457 128274
7647 128274 107994 305674 151663 187751 265110 229159 240932 235402 265063 274512 195776 216239
7635 216239 284360 244820 218849 144407 111039 184359 263121 314665 235014 223733 274914 173752
7623 173752 202069 113760 82846 189773 158402 93609 96955 58040 140327 219972 166449 156782
7611 156782 220184 227236 223105 152201 228357 119238 105678 213830 289894 336368 324850 301790
7599 301790 325636 287217 270758 248392 246303 317685 274596 244429 214052 126978 154499 174023
7587 174023 190937 151953 173782 292808 237561 299536 225969 264105 267526 337024 348210 249180
7575 249180 196398 223400 248204 344223 273887 257744 365975 324324 220829 138193 196952
7564 196952 226003 243633 239828 276500 293137 251937 247252 216419 232834 200018 239996 285002
7552 285002 156690 217065 284345 303354 324239 210116 259491 338865 367547 358491 316449
7541 316449 325546 264281 297592 375036 331364 270199 223405 264595 313309 291162 314682 382495
7529 382495 451840 479857 413150 303938 360851 387658 389891 410624 475084 475223 374754 396899
7517 396899 370632 398777 451830 451021 417257 494364 610573 570383 466539 482190 543512 553452
7505 553452 665431 657842 803499 888629 778183 770553 869373 879474 808931 701250 656346
7494 656346 618660 559008 602956 571736 572308 550591 612701 566179 502699 476750 445306 477636
7482 477636 531317 543647 512252 446922 373679 396551 434719 381673 371701 354058 383418 371029
7470 371029 335746 310944 380154 443076 353832 399138 399593 435185 456246 445999 433340 458795
7458 458795 503410 529283 523085 461868 498270 482467 466497 540960 542340 508889 425933 454082
7446 454082 516583 513533 508355 625136 562208 526942 523474 431552 436035 478388 483120 398161
7434 398161 386793 504858 555638 609311 630068 633533 580616 483838 547353 619434 606873 513197
7422 513197 482898 547007 632634 619490 555522 476604 520594 558599 520192 542054 575986 487521
7410 487521 480787 552635 575698 663185 549348 527173 678277 662656 551011 530062 593669
7399 593669 601470 600883 675954 650028 508792 510381 517556 570524 609334 505859 543339 557007
7387 557007 533190 585323 518540 526988 533880 573685 622173 527966 580821 578034 483542 594194
7375 594194 577237 587245 546532 510413 571863 582403 480282 554068 516613 519853 748915
7364 748915 691050 687841 706544 667733 618569 652849 662491 588542 501366 674144 701865 647403
7352 647403 558429 454003 487326 534085 444953 486579 587061 532499 545384 587914 729954
7341 729954 717033 601692 516896 553565 518297 497662 586129 662098 597340 625613 684564
7330 684564 698476 643166 686860 654066 623333 701470 701988 678357 750045 752121 644185 618403
7318 618403 642648 733642 673150 771279 718386 763190 708808 700742 740410 711070 777149 752289
7306 752289 779847 737469 724241 834911 793506 782391 745817 817187 859620 839485 849454 794461
7294 794461 702459 717347 697983 688859 698294 678184 720248 719141 698769 682973 697826 762293
7282 762293 739345 779490 835326 812170 766045 648466 616886 605621 693750 704414 703648 681705
7270 681705 726616 704449 684309 730770 777395 757665 835190 884805 882068 783786 782400 744935
7258 744935 851651 879861 809084 870808 972674 1072130 1019276 941987 928738 954548 976827
7247 976827 972091 1006750 930264 961450 1062367 1097834 951064 971372 1050044 1106042 1106991 1084483
7235 1084483 1131775 1075977 1079152 1171772 1172583 1193257 1270492 1178646 1260221 1241154 1173274 1340831
7223 1340831 1295094 1181568 1217594 1282529 1308177 1362084 1342139 1341314 1406562 1428277 1422926 1312842
7211 1312842 1357728 1369570 1386044 1471811 1475074 1451831 1445244 1449098 1530591 1525725 1588614 1719448
7199 1719448 1682323 1757146 1680134 1688743 1644500 1596187 1614601 1589118 1681548 1689894 1703878 1676288
7187 1676288 1698836 1652294 1738353 1753065 1755690 1729430 1891832 2051208 1983149 1894248 2002950
7176 2002950 2039195 2151999 2118317 2110606 2088235 2128729 2155577 2205327 2288914 2340998 2439794
7165 2439794 2493349 2468328 2586388 2649423 2631140 2773802 2867447 3032103 3121770 3172032 3256981
7154 3256981 3401907 3553968 3674703 3871325 3959461 4092396 4367019 4656943 4857453 5085914
7144 5085914 5353760 5593163 5834666 6027879 6305925 6619227 6884709 7182338 7381540 7515271
7134 7515271 7645629 7852612 8118183 8348762 8490934 8729416 8944487 9207135 9594822 9905324
7124 9905324 10359629 10929883 11430756 12025576 12782346 13640556 14637499 15893535 17345299
7115 17345299 19023382 21137372 23721471 27000704 30942251 35806125 41938074 49845026
7107 49845026 59362466 69871285 79718254 86878487 89605707 87403887 81184544 72649215
7099 72649215 63375295 54635706 46799052 40120252 34356436 29552057 25668876 22576721
7091 22576721 20243716 18316890 16839468 15575498 14546588 13650893 12755956 12124907 11458594
7082 11458594 10917080 10380355 9963487 9584881 9080367 8704915 8425484 8158881 7809105
7073 7809105 7587724 7366699 7251897 7270513 7248544 7272956 7342097 7440921 7562552 7735197
7063 7735197 8040991 8504130 8919396 9615155 10342980 11244769 12110758 13059483 14010219 14625055
7053 14625055 14945631 14792925 14164433 13237230 12021622 10981572 10007208 9020336 8236093
7044 8236093 7530859 6904029 6356148 5901455 5521041 5265958 4947538 4708088 4525962 4568970
7034 4568970 4406497 4199770 4116110 4031995 3937015 3823500 3792772 3661484 3629922 3541185 3500689
7023 3500689 3461675 3291178 3321445 3312171 3262887 3159890 3076311 3045232 3015813 2886978 2852131
7012 2852131 2764831 2782699 2665759 2607954 2701016 2687802 2690326 2750580 2734675 2706924 2757626
7001 2757626 2851287 2842830 2885409 2940032 3062334 3209444 3376111 3540848 3794446 4160819
6991 4160819 4458411 4915400 5493299 6046351 6457794 6581411 6510694 6240883 5773437 5184013
6981 5184013 4589284 4171008 3871254 3448454 3148623 2863332 2604249 2413319 2291941 2165645
6971 2165645 2050607 2023385 1834399 1797517 1734571 1795796 1793470 1594727 1631839 1594844 1593041
6960 1593041 1430116 1433301 1457285 1474743 1493111 1400969 1334311 1294836 1344379 1402025 1480251
6949 1480251 1396593 1456792 1490611 1407225 1261110 1189962 1169667 1151606 1244300 1293132 1313649
6938 1313649 1274668 1287453 1201738 1117536 1174189 1109173 1127845 1132805 1099565 1064273 1074318 1108881
6926 1108881 1105101 1003112 955913 962830 1001768 941270 806533 923185 911783 897811 831176
6915 831176 753788 776279 787024 749098 735672 824661 820409 776011 717023 777968 727568 813202
6903 813202 874875 769811 741470 702302 684852 672453 687911 643703 662741 688881 681855 613266
6891 613266 577851 693216 696462 760912 724567 657448 639275 631715 667515 714467 678453 693296
6879 693296 720479 758513 690570 643955 563059 626435 629327 644463 592236 566889 600450 598822
6867 598822 605885 541634 570257 586005 575632 573869 575270 525887 520309 559739 481589 502174
6855 502174 528498 561517 524086 497324 591881 607003 575096 485767 543938 541518 522994 613774
6843 613774 533339 475341 583269 608912 613168 651498 623994 598828 576525 539333 536282 520099
6831 520099 589068 604277 579987 513734 424045 483355 544367 560274 547466 525027 532097 448596
6819 448596 532394 592914 559394 493560 488729 517020 493865 476243 513822 507063 427721 373124
6807 373124 468185 450552 456452 528259 529299 541466 546238 574659 477704 423049 445777 484065
6795 484065 463508 458054 542270 469891 475197 412937 373145 370629 368627 303834 343737 468750
6783 468750 467952 488296 625794 620731 577830 504448 429331 396567 427296 359959 399853 410672
6771 410672 342978 413995 503804 551140 497502 437247 434463 482801 456065 493978 384276 408463
6759 408463 476829 461984 499134 478475 485118 448768 428687 466744 458489 308362 278506 415119
6747 415119 397824 426751 401004 435652 526621 404719 369003 420509 375165 387046 336117
6736 336117 342760 345595 386991 320231 376770 354981 368916 417398 261224 296585 400117 407325
6724 407325 500584 522026 514982 511726 564708 591067 579700 571494 515956 533037 561007 532598
6712 532598 690693 674644 490771 538481 608401 700479 700704 771019 815945 904172 835056 755816
6700 755816 676602 683287 780611 717619 622871 693985 566608 599109 603123 484603 463187 420024
6688 420024 494665 605109 591639 571069 552073 512931 456718 517856 589439 490077 465853
6677 465853 518780 464990 478130 573528 486549 505222 575843 481905 450285 479864 405178 413022
6665 413022 395566 525804 583618 539077 461231 559537 498186 496539 541385 592799 630977 637566
6653 637566 672982 627103 562991 541000 486012 440203 417869 519162 574468 519482 499348
6642 499348 532103 564461 402604 501562 584852 648746 669954 588171 535998 595672 584467
6631 584467 526012 507378 421039 418884 424852 496315 502683 525575 456650 403053 378079 416098
6619 416098 443190 376619 445887 540618 572050 440229 397288 349000 449502 514595 452912
6608 452912 466039 513531 432137 413463 544288 514598 462564 454645 513485 486211 501690 523185
6596 523185 565608 504804 476511 488956 489857 552239 503692 573523 546567 616486 591472 503282
6584 503282 610633 657797 619480 655162 539361 592711 538669 513365 565781 538635 628352
6573 628352 684190 703108 673783 612405 575386 603088 608369 607564 599743 601666 584969 542221 613768
6560 613768 644776 639772 615602 574734 670519 507649 466803 555318 686379 597674 566339
6549 566339 645801 651416 644872 634459 659460 665871 682798 728734 702445 698741 719970 705850
6537 705850 806072 695911 641273 652584 703751 687638 725259 696986 776370 808570 768824
6526 768824 731808 790770 799352 836179 764760 594322 696878 697217 763769 783172 857945 823692
6514 823692 767303 808633 844802 778847 822789 805827 764472 697708 688203 728498 834995 830680
6502 830680 800498 807851 726846 674980 799951 875781 796087 785675 797386 812151 764017 643987
6490 643987 721725 865026 776160 699885 722709 754455 794092 745938 821014 878086 863945
6479 863945 911557 896939 877530 902398 915590 934653 981547 952706 940672 865021 760716
6468 760716 771766 876878 870080 881982 853597 863405 773089 830740 876953 892213 937720 979817
6456 979817 918281 798505 829807 865926 757868 857265 853870 936507 966860 909401 925608
6445 925608 894172 860979 873292 834986 961646 985958 937027 964849 984290 898213 875861
6434 875861 965047 964615 1027969 1000783 946119 965358 1099818 1040080 957873 813095 835095 941264
6422 941264 1015283 1018004 1078902 1150620 1139829 1131818 1122454 1010603 1063237 1028311 1029841 996950
6410 996950 997209 946881 985660 1035396 1154816 1235068 1172256 1097895 1118009 1203976 1183845 1181313
6398 1181313 1133113 1129007 1122690 1124565 1167774 1165303 1242368 1307325 1240171 1245100 1150688 1129399
6386 1129399 1153597 1133707 1144100 1237667 1268753 1316457 1230318 1140343 1074601 1103410 1160554
6375 1160554 1101867 1094301 1183232 1301595 1138238 1144811 1157406 1151370 1212615 1128228 1132228 1151861
6363 1151861 1156217 1205037 1232220 1400155 1373310 1188296 1267908 1177183 1136838 1274276 1395624
6352 1395624 1397338 1368983 1383664 1364420 1401958 1319670 1341496 1415450 1491041 1451782 1442508 1461705
6340 1461705 1414851 1377365 1301895 1376665 1414124 1372819 1473293 1525454 1518008 1454469 1439959
6329 1439959 1425092 1476671 1481987 1434131 1430713 1429206 1407478 1369626 1394901 1409806 1436455 1440191
6317 1440191 1371713 1421985 1505282 1349903 1381352 1425505 1447089 1455682 1415173 1413539 1394847 1391331
6305 1391331 1511676 1476061 1445303 1459507 1456635 1475701 1487989 1523928 1460579 1435594 1459879
6294 1459879 1498342 1449966 1405104 1493144 1404093 1374458 1386526 1398570 1442182 1430736 1466866
6283 1466866 1490100 1567067 1626590 1569059 1637984 1628465 1630390 1626795 1597468 1617836 1676926 1659770
6271 1659770 1658358 1629200 1599678 1609723 1640052 1683678 1675441 1695351 1645406 1610473 1564886 1630863
6259 1630863 1790110 1822691 1691927 1684930 1763605 1799611 1848160 1926711 1977544 1779591 1703201
6248 1703201 1718051 1721258 1791550 1835160 1770382 1880786 1912307 1841180 1802875 1737520 1788269
6237 1788269 1872427 1848421 1789328 1776039 1864431 1853356 1879625 1961578 1916624 1877744 1951420
6226 1951420 1843613 1788189 1919415 1928632 1946750 1885953 1910349 1889637 1866238 1861905 1949273
6215 1949273 1970745 1971038 1946859 2045791 2102292 2103416 2093765 2119284 2072561 2202717 2262640 2160148
6203 2160148 2186134 2165483 2141237 2183439 2165113 2160068 2174550 2179375 2134423 2125107 2036249 2100248
6191 2100248 2107906 2184230 2126922 2083620 2086149 2134026 2204791 2287660 2287422 2191865 2212093 2287197
6179 2287197 2254033 2289987 2315056 2357351 2357179 2276241 2336608 2328011 2409285 2513250 2531198 2474738
6167 2474738 2488607 2471418 2409304 2343101 2418823 2475477 2537607 2595817 2631189 2650309 2687630
6156 2687630 2672304 2695417 2665692 2677294 2680298 2805588 2796680 2840419 2850516 2820636 2761665 2801689
6144 2801689 2825080 2776254 2800166 2848279 2866539 2851950 2969505 3026774 2938448 2948850 3071770
6133 3071770 3133330 3087215 3032519 3117769 3204160 3328968 3457219 3454221 3464884 3458995 3545107
6122 3545107 3488017 3518389 3634827 3703224 3795822 3822172 3878184 3931619 4029323 4134038 4360998
6111 4360998 4462842 4412541 4378740 4364945 4594855 4814985 4846259 4904905 5033198 5156061
6101 5156061 5200346 5309320 5355398 5501855 5638822 5705909 5869223 6104554 6196032 6226891
6091 6226891 6437078 6602577 6792859 6963704 7161285 7414574 7704814 8069651 8457941 8932841
6081 8932841 9447758 10192797 11061751 12047013 13300404 14712758 16527340 19063561 21870100
6072 21870100 24598174 26469467 27230338 26967014 25944018 24747548 23583143 22930393 22727544
6063 22727544 22966478 23899570 25404102 27257453 28669576 28867434 27921109 26040567 23743595
6054 23743595 21537820 19617789 17882934 16389074 15144213 14055244 13279827 12634779
6046 12634779 12085999 11794047 11453472 11177488 11033112 10898663 10888798 10875087 10816055 10911353
6036 10911353 11095646 11281281 11440932 11665211 12011893 12508819 13172009 13932541 14842973
6027 14842973 15939519 17484570 19270310 21533472 24398978 27807310 31380389 34463749
6019 34463749 36208972 36377952 35213182 33538696 31829524 30337518 29634026 29546180 30215730
6010 30215730 31690196 33886049 35811969 36720110 36002419 33883146 30821600 27547184
6002 27547184 24518556 21869830 19497591 17356257 15659526 14102562 12979728 12143772
5994 12143772 11422382 10796972 10179573 9717802 9403580 9076643 8713302 8429757 8245070
5985 8245070 8009859 7834162 7649267 7454042 7233456 7070584 6853151 6747469 6728915 6631277
5975 6631277 6509693 6410409 6380882 6457977 6347601 6237339 6196925 6221096 6263932 6162068 6156806
5964 6156806 6105222 6132223 6127791 6091753 6013461 5996094 5929416 5926630 5811685 5731248 5713235 5670996
5952 5670996 5632856 5603674 5621179 5591854 5543431 5606217 5489493 5461642 5493842 5570199 5625533
5941 5625533 5673806 5738667 5673546 5731243 5687514 5638028 5698587 5663834 5614975 5566882 5482422
5930 5482422 5467934 5321456 5348351 5364484 5347831 5255246 5190994 5220881 5260929 5336432 5361415
5919 5361415 5318647 5397394 5479026 5471065 5470919 5336081 5394596 5415233 5463464 5527631 5537355 5617535
5907 5617535 5667128 5716132 5635958 5630429 5620322 5673429 5653337 5626494 5597825 5573180 5509116 5572069
5895 5572069 5633412 5567619 5486478 5450762 5494980 5518341 5508172 5691574 5808175 5820176 5906344
5884 5906344 5956872 6123477 6218096 6233005 6204327 6279900 6353818 6348676 6409830 6442080 6672606
5873 6672606 6864708 6881193 6897171 7079174 7183175 7294113 7302058 7236523 7256327 7279543 7417453
5862 7417453 7616577 7658979 7731462 7657707 7644854 7724396 7791446 7896044 7866585 7874103 7968161
5851 7968161 7833921 7856312 7907663 7888113 7932794 7847276 7901300 8026375 8093607 8012887 8176593
5840 8176593 8303187 8361598 8522120 8676335 8781079 9023556 9159326 9277217 9541635 9851045
5830 9851045 10062437 10439523 10747500 10998104 11355338 11885774 12333801 12861243 13323811 13843398
5820 13843398 14334261 14846702 15413790 15961043 16262402 16657970 16868084 16958698 17060438 17021086
5810 17021086 16894923 16733635 16696500 16793080 16969609 17167568 17370020 17703962 18024029 18215571
5800 18215571 18232777 18025870 17630164 17128604 16745683 16467856 16222258 16010273 15903222 15816258
5790 15816258 15704876 15641103 15737540 15828474 16117682 16505326 16843944 17281409 17839635 18363950
5780 18363950 18732777 18634956 18367235 17842123 17182589 16391415 15633210 14653250 13892420 13358964
5770 13358964 12680294 12144151 11906687 11564982 11275989 11104416 11061138 11182573 11268323 11284854
5760 11284854 11345040 11459974 11569523 11704421 11894976 12353170 12834342 13266918 13869650 14666024
5750 14666024 15469644 16638352 17975864 19725148 21919530 24677899 28050052 31359972
5742 31359972 33759400 34526698 33707586 31761914 29339633 26769630 24581993 22684970
5734 22684970 20907086 19349920 18115980 17247421 16640350 16274094 16102877 16013397 16193856
5725 16193856 16697745 17413307 18257512 19337009 20724171 22617344 24947784 27860885 31349208
5716 31349208 34535037 36451618 36594010 35132799 32738196 29971963 27246927 24946005
5708 24946005 22889454 21131640 19547531 18245769 17323352 16559229 16159448 15985060 16115851
5699 16115851 16313150 16845746 17537453 18417129 19545928 21061899 23226358 25508947 27504058
5690 27504058 28543208 28346230 27130192 25398910 23491898 21656771 20103783 18593411
5682 18593411 17219108 16113427 15373359 14804913 14419024 14180008 14047555 14132388 14328336
5673 14328336 14537731 14989584 15790112 16668707 17826461 19377530 21337935 23848103 26415777
5664 26415777 28367872 29148693 28577722 26961184 24858806 22698952 20731681 18937079
5656 18937079 17306629 15898245 14641369 13675272 12876733 12321955 11779495 11434888 11138404
5647 11138404 10905876 10730732 10692129 10617517 10614904 10564406 10612900 10569731 10620576 10625926 10679952
5636 10679952 10613980 10628490 10692540 10620559 10683367 10774827 10765668 10786850 10805006 10958470 11055142
5625 11055142 11129381 11431637 11767045 12042498 12365426 12563315 12674858 12654753 12452037 12284876
5615 12284876 12053690 11617803 11240399 10839254 10437399 10257527 10034857 9829424 9655527
5606 9655527 9724988 9590523 9674226 9789740 9851172 9851185 9771748 9824567 9796047 9553849 9300482
5595 9300482 9113304 9006686 8762908 8502912 8384544 8243578 7972584 7905663 7950776 7933027
5585 7933027 7934593 8074626 8098934 8269751 8434202 8519437 8544043 8626269 8768745 8852295 8790441
5574 8790441 8578320 8291440 8078651 7939907 7798496 7615837 7322034 7154503 6884084 6757387
5564 6757387 6780485 6706056 6545854 6510182 6597087 6616633 6727132 6867286 6942254 7015211 7089591
5553 7089591 7322360 7470779 7510519 7516342 7467638 7364455 7158377 6935610 6778593 6621305
5543 6621305 6421148 6274216 6220191 6109603 6040035 6023173 5992621 6042751 6164296 6161469 6256681
5532 6256681 6356190 6401766 6385337 6336663 6395385 6276342 6197454 6128984 6048437 5914186 5831189
5521 5831189 5800608 5756534 5678707 5598299 5659664 5767928 5807323 5739441 5682747 5569437 5605278
5510 5605278 5626862 5583579 5653464 5720922 5722147 5695882 5744884 5826568 5832048 5965299 6048745 5994730
5498 5994730 5966615 5934753 5879290 5708194 5621131 5517030 5454698 5585796 5572042 5433282 5310104
5487 5310104 5367039 5424730 5384622 5434770 5401968 5406231 5412177 5477337 5483793 5449015 5444640 5531371
5475 5531371 5610939 5598252 5510397 5539744 5512907 5567282 5660004 5586587 5609595 5620105 5634340
5464 5634340 5648545 5673086 5666136 5767556 5861472 5892127 5959957 6036000 6137115 6285167 6253586
5453 6253586 6319110 6405417 6554514 6719637 6738562 6773461 6847374 6904928 6933419 6968436 6933445
5442 6933445 6926378 6931861 6991017 7155773 7289253 7347344 7461098 7433116 7366347 7203897 7098006
5431 7098006 7034536 6932955 6903953 6818696 6845391 6921412 6889070 6950248 7053909 7136755 6994140
5420 6994140 7079182 7217830 7084822 7036020 7111293 7229215 7281171 7352045 7460823 7483448 7496575
5409 7496575 7606090 7451713 7375746 7246409 7105189 6993435 6904129 6845197 6779079 6663452
5399 6663452 6745437 6770926 6717559 6822206 6877532 6861224 6861159 6964428 7025477 7011010 7206011
5388 7206011 7421833 7642837 7869861 8080873 8350599 8347478 8296440 8237710 8112552 8024885
5378 8024885 7979939 8005622 7938195 7821900 7803104 7781852 7828175 7943724 8103456 8316171 8292236
5367 8292236 8380418 8491353 8564994 8806726 9001694 9195470 9385387 9444051 9464467 9465070 9434558
5356 9434558 9436923 9315681 9284779 9210973 9048519 8884252 8776123 8825909 8834571 8696556 8682810
5345 8682810 8462874 8405047 8313624 8097655 8021029 7952338 7999416 7974336 7874961 7831953 7748842
5334 7748842 7725613 7724341 7597960 7560175 7485446 7378961 7291189 7150853 7082810 7061860 6956883
5323 6956883 6901662 6885106 6835615 6852123 6808120 6805333 6768371 6760634 6773558 6718312 6719704 6707033
5311 6707033 6791812 6879571 7055468 7056817 7132784 7180449 7122666 7113129 7154940 7120170 7010702
5300 7010702 7015589 6942419 6843047 6815745 6779347 6813227 6843179 6867874 6874365 6928096 7041299 7086248
5288 7086248 7107864 7247006 7417081 7445445 7444859 7384664 7293875 7137694 7129050 7153392 7232291
5277 7232291 7160252 7271675 7387427 7429423 7479573 7633608 7577269 7491785 7549209 7647780 7701880
5266 7701880 7746246 7772108 7724711 7672161 7708314 7678127 7577565 7500099 7469351 7339763 7285152
5255 7285152 7282430 7336622 7410873 7380531 7491841 7514761 7611605 7410266 7566317 7685490 7715314
5244 7715314 7812179 8059101 8108818 8209194 8270649 8282479 8215497 8123310 8145261 8038257 8001662
5233 8001662 7986975 7997906 8007498 8050075 8043385 8105026 8146832 8158525 8246959 8221664 8257238 8339150
5221 8339150 8399821 8558111 8694100 8846405 8926695 8973045 8984343 8968450 8956645 8918417 8847813
5210 8847813 8736056 8822903 8784783 8689126 8683208 8620103 8639049 8723728 8779364 8875008 9034036
5199 9034036 8970927 9052084 9257622 9371572 9327576 9480475 9671539 9777685 9814516 9850184
5189 9850184 9864075 9831808 9745301 9732947 9803530 9853127 9917260 10096523 10053505 10210873 10375881
5178 10375881 10322711 10448681 10599230 10738918 10847947 11027982 11256405 11362701 11573588 11879528
5168 11879528 11933259 12073728 12286826 12492682 12907833 13254092 13731267 14190035 14646876 15250352
5158 15250352 16046994 17033725 18015424 18959620 19657768 20122632 20209053 20244501 20376046 20611122
5148 20611122 21182763 21910609 22951951 24337024 25995427 27671315 28765141 29480897 29563150
5139 29563150 29430265 29553236 30066446 30631494 31053299 31330502 31648282 32246631 33044229
5130 33044229 33969147 34950617 35765874 36430712 37014007 37725224 38346533 38682119 38321144
5121 38321144 37748459 37112049 36766892 37131625 37911496 38635485 39145125 39498880 39771920
5112 39771920 39899708 40174236 40328657 40413964 40415348 40291164 40319394 40515688 40967586 41126477
5102 41126477 40831712 40055897 39359213 38932728 38668648 38297498 37461628 36193935 34629979
5093 34629979 33036397 31617021 30417255 29599232 29021650 29005146 29340427 30001844 30804173
5084 30804173 31413286 31906512 32553168 33035012 33471763 33767084 34035501 33930721 33625417
5075 33625417 33467347 33008106 32476216 31894616 31160845 30412186 29749982 29244535 28842618
5066 28842618 28456756 28089731 27861212 27775967 27899801 28227726 28828182 29657288 30819764
5057 30819764 32317053 34381074 36789237 39572912 41973906 44041439 45770197 47183862
5049 47183862 48147844 48572425 48560208 48229524 47736223 46978672 46136720 45039977 43783095
5040 43783095 42562140 41687732 41351541 41710772 42894339 44295947 45868864 47380410 49380937
5031 49380937 51835831 54219511 56505614 58606562 60640307 62946209 66040644 68734521
5023 68734521 71063854 72558738 73263040 73268778 73037933 72046962 70657584 68406966 65475890
5014 65475890 61853877 57695950 53472136 49424953 45770014 42762170 40618821 39136503
5006 39136503 38529924 38467859 38630663 38736625 38485665 37951636 37328214 36567920 35753527 34816906
4996 34816906 34177407 33701808 33082047 32427186 31573835 30693974 29898196 29291105 28541998
4987 28541998 27576840 26440967 25242885 24208330 23439812 22920158 22692413 22693850 22862739
4978 22862739 23061607 23001411 22615338 21725469 20897425 20089573 19179404 18366943 17763905 17094209
4968 17094209 16481397 16007963 15564577 15347694 15195142 15034906 14846686 14636201 14490097
4959 14490097 14349904 14304791 13959189 13781240 13639831 13547700 13424068 13310975 13367270 13355766
4949 13355766 13265759 13323641 13307025 13266086 13258742 13298035 13319552 13323482 13288186 13172323 13087677
4938 13087677 13053848 13151980 13233486 13162643 13038930 13002329 13027754 13055710 13100178 13093929 13156212
4927 13156212 13225128 13268555 13326534 13388942 13590777 13829648 14049182 14310054 14612168 15007458
4917 15007458 15549588 16252446 17010382 17957307 19183984 20636328 22343663 24034741 25800144
4908 25800144 27730384 29575746 31007670 31596815 31142885 29792831 27790633 25546560
4900 25546560 23530323 21908208 20580031 19417241 18341626 17509874 16809776 16347726 16055303
4891 16055303 15867741 15854252 15866225 15845796 15897528 16042665 16294385 16583673 17013815 17509082
4881 17509082 18147849 18673372 19275934 19958330 20330145 20580847 20875257 21572259 22645629
4872 22645629 23902602 25556206 27339442 29358124 31822965 34670698 36903250 37860111
4864 37860111 37303055 35693969 33444003 31399813 29925257 28904185 28221538 27752750 27750978
4855 27750978 28227591 29238201 31049531 33376468 35052771 35664003 35046145 33436687 31256758
4846 31256758 29165161 27220215 25392558 23625827 22084785 20938656 19966160 19354450
4838 19354450 18866027 18246404 17714759 17228291 16749556 16318045 16083434 15790073 15575584
4829 15575584 15321587 15181577 15171557 15093588 15093548 15155281 15230076 15374946 15609808 15827266 16126209
4818 16126209 16599025 17022838 17671608 18473502 19389803 20522982 21832640 23089126 24002540
4809 24002540 24524739 25062373 25521862 26305859 27457367 28938923 30683790 31886178 32648466
4800 32648466 32960300 33216471 33360419 33469190 33205085 32666289 31628204 30553286 29764166
4791 29764166 29329789 29629044 30524075 31829167 33343383 34730351 36097942 37795930 39629137
4782 39629137 42068545 44242001 45259358 44914540 43749497 42229414 40681787 39372332
4774 39372332 38169302 37114858 35822190 34515048 33517366 33011718 32715057 32386138 32189069
4765 32189069 32162102 32277670 32312018 32428844 32709461 32998959 32546522 31394598 29852520
4756 29852520 28060872 26175756 24588627 23339903 22240108 21497006 20878232 20563918 20469732
4747 20469732 20390360 20347756 20230620 20142342 19987215 19695775 19588865 19726026 19977263 20313437
4737 20313437 20788323 21486625 22384172 23339358 24654494 26440692 28802019 31837898 34782466
4728 34782466 36952540 37698291 37056830 35514419 33483494 31579434 29992751 28823401
4720 28823401 27809507 27189953 27095876 27344056 28009041 29287981 31172038 33600268 36842400
4711 36842400 41117103 45919651 50398538 54269337 57061286 57854832 56208637 52957532
4703 52957532 48715104 44233537 39942150 36341385 33414877 30967312 29049190 27808280
4695 27808280 27274244 27208629 27686717 28721233 30500834 32967829 36077524 39091593 40838625
4686 40838625 40787402 39031121 36053829 32888193 29729588 26952275 24405443 22207509
4678 22207509 20269067 18739588 17553746 16493402 15734249 15120212 14570257 14145710 13752880
4669 13752880 13430950 13142870 12843838 12652510 12346211 12162647 12018644 11820479 11712933
4660 11712933 11610237 11443913 11292374 11360722 11252012 11198292 11325978 11227436 11085179 11152566
4650 11152566 11170336 11193399 11230552 11125773 11055120 11072432 11155159 11103559 10968761 11032486 10936285
4639 10936285 10786034 10668112 10432669 10418302 10374872 10434278 10429499 10507859 10578052 10691578 10794870
4628 10794870 10882432 10962918 11166863 11292767 11465928 11581109 11740831 11835022 11957831 12094680
4618 12094680 12014248 11895431 11897017 11847544 11704547 11633674 11506987 11438357 11377253 11463141 11607241
4607 11607241 11681424 11773222 11943089 12274196 12544625 12757821 13042370 13265172 13459049 13695399
4597 13695399 13947375 14120431 14207195 14367178 14442579 14443532 14435412 14432574 14530105 14590973 14883132
4586 14883132 15129146 15469311 15830498 16219727 16684814 17185342 17737444 18399511 19080066
4577 19080066 19842087 20834141 22006295 23284265 24800328 26612722 28929352 31836009
4569 31836009 35419583 39258649 42406832 44199080 44456842 43571778 42051349 40649488
4561 40649488 39860059 39673648 40187902 41379588 43398243 45845257 47685046 48372594 47633247
4552 47633247 45879156 43755342 41929682 40797131 40539190 41005228 41838043 42376845 42173892
4543 42173892 40917496 39202716 37131254 35338182 34017311 33119389 32966489 33347544 34493633
4534 34493633 35803936 36688087 36573979 35335490 33087587 30531683 27983676 25699219
4526 25699219 23682246 21945747 20264347 18824467 17708454 16870616 16234024 15723051 15187261
4517 15187261 14741511 14520014 14217317 14166166 14011431 13824788 13686183 13648671 13598768 13607046
4507 13607046 13574467 13649437 13671547 13603149 13563008 13518998 13520834 13602236 13677614 13747558 13843724
4496 13843724 13968366 14080460 14124091 14102267 14388307 14739014 14897216 15155409 15501571 15885946
4486 15885946 16287848 16762537 17373269 18146148 18994865 20047104 21446394 23030600 24938976
4477 24938976 27547912 30659079 34001714 37097578 39113742 39665948 39060225 37996784
4469 37996784 36965026 36612485 37033038 38403423 40306256 41761405 41925276 40656577 38625201
4460 38625201 36150376 34046880 32476407 31562473 31370290 31805597 32918642 34632929 36037823
4451 36037823 36850857 37172263 36846575 36163443 35493462 35074803 35257971 35805864 36445692
4442 36445692 36601940 35715055 33713817 31286578 28783700 26452984 24477133 22781814
4434 22781814 21087753 19667228 18380099 17193617 16231989 15512563 14754181 14133433 13838461
4425 13838461 13436592 13064943 12828896 12779367 12687949 12471124 12314953 12133908 11952082 11840271
4415 11840271 11731011 11690224 11800308 11891149 11846698 11704884 11437971 11181801 11069011 10897831
4405 10897831 10645265 10555608 10494318 10542079 10568751 10658105 10665499 10580532 10353724 10242191 10098552
4394 10098552 9888857 9717580 9705667 9701202 9724526 9549795 9399359 9228611 9034908 8959496
4384 8959496 8799596 8714499 8761490 8767862 8796196 8838313 8750383 8707100 8600579 8456301 8332743
4373 8332743 8169457 8010633 7913299 7759297 7686409 7699668 7630040 7634937 7509810 7449433 7497907
4362 7497907 7478475 7478435 7479994 7400507 7311127 7360738 7271889 7142448 7196075 7186497 7065019 6906966
4350 6906966 6863125 6803100 6779990 6696325 6650460 6767305 6691324 6540678 6518936 6572639 6513885
4339 6513885 6478281 6577424 6494216 6342338 6444110 6545729 6633004 6555844 6525621 6501066 6449582
4328 6449582 6434614 6315505 6280833 6313666 6383664 6339642 6329283 6375876 6357287 6269678 6233719
4317 6233719 6216938 6244587 6294361 6382026 6433972 6319262 6393207 6486682 6492004 6495665 6592882 6691173
4305 6691173 6828837 6848795 6773643 6943194 7114897 6953805 7000502 7109994 7161495 7040150
4295 7040150 6888678 6939039 7061492 7014453 7120395 7243039 7205648 7222222 7098462 7239758
4285 7239758 7259401 7288790 7297452 7297331 7351169 7312731 7338443 7358342 7367384 7432459 7491679 7482557
4273 7482557 7395293 7409427 7574581 7570180 7476586 7429880 7339852 7365893 7346135 7330007 7533387
4262 7533387 7526449 7442180 7387552 7458044 7519322 7585281 7616968 7721394 7696735 7727785 7862706
4251 7862706 7857772 7930499 7992079 8165933 8305448 8343463 8548094 8579940 8660026 8812485 8924917
4240 8924917 8924346 8938769 8907631 8718938 8617976 8605028 8659800 8539033 8517968 8499350 8647081
4229 8647081 8731144 8803578 8819745 8942220 9074140 9208275 9400586 9548612 9578942 9637048
4219 9637048 9837040 10006991 10200482 10299931 10470261 10656038 10823038 10950586 11141021 11334159
4209 11334159 11517201 11820062 12050936 12364449 12666161 12996838 13540030 13997761 14309530
4200 14309530 14687927 15147511 15740846 16215763 16779021 17460174 18213584 18876398 19642403
4191 19642403 20556692 21420650 22404646 23349700 24295507 25074119 26073619 27068869 28095855
4182 28095855 29060982 29971806 30737675 31545711 32302367 33128097 33998127 34824635 35868804
4173 35868804 36878610 37867801 38985930 40409471 41904520 43755999 45858985 48351727
4165 48351727 51061361 54138006 57632154 61694000 66333745 72151313 79456283 88452575
4157 88452575 99407796 112775291 128918903 149274425 174803337 207550025 245309314
4150 245309314 282017507 309573955 320827997 314764438 294486517 266461490 235941172
4143 235941172 207445666 181023456 157647054 137451694 120927666 108126061 97839159
4136 97839159 89437953 82335012 75790455 69480319 63724608 58581756 54148801 50294239
4128 50294239 46905838 43856428 41047380 38590548 36342891 34261257 32549945 30989716
4120 30989716 29567569 28252998 27074076 26041461 25126814 24395226 23809928 23403810 22889599
4111 22889599 22355681 21835288 21199916 20724684 20300872 19898614 19373055 18826517 18327388
4102 18327388 18082881 17790554 17481707 17164284 16894687 16597014 16301324 16100658 16016606 15753894
4092 15753894 15644013 15431130 15130648 14868777 14549137 14271875 14058902 13889728 13625081
4083 13625081 13425509 13201587 12908348 12719672 12457503 12248943 12131482 11925439 11760227
4074 11760227 11591994 11544630 11607384 11486974 11520723 11480853 11582552 11657748 11560502 11722602
4064 11722602 11928797 12331320 12803593 13352886 13786748 13917137 13700671 13315232 12690934
4055 12690934 11873314 11272355 10589817 10019921 9579824 9164905 8838955 8615375 8418994
4046 8418994 8242309 8205285 8018203 7965192 7863419 7736224 7615138 7508051 7312415 7185557
4036 7185557 7013844 6942333 6861026 6731022 6668871 6712145 6683908 6594701 6528749 6441191 6370532
4025 6370532 6293020 6266484 6222039 6185136 6107558 6027442 6088234 6095683 6106497 6198939 6228524 6227886
4013 6227886 6123370 6114232 6175397 6119434 6069314 6135816 6201067 6228761 6210047 6219719 6325027
4002 6325027 6270488 6241457 6402360 6519071 6680838 6704100 6777033 6799375 6826948 6826020 6866711
3991 6866711 7011959 7024801 7081362 7139427 7221854 7368689 7377539 7595812 7826907 8161971 8449425
3980 8449425 8743810 9138038 9520916 10066948 10593200 11303841 12077145 12926154 14051325
3971 14051325 15438863 16969036 19003495 21411041 23898222 26113419 27784482 28556061
3963 28556061 28357231 26664276 23087145 19086814 15953685 13744435 12216636 11192982
3955 11192982 10452923 9954985 9425936 8758544 8083080 7488089 6990320 6665663 6244193
3946 6244193 5785451 5564133 5383394 5236712 5106104 4985271 4665452 4484562 4410409 4410203
3936 4410203 4359338 4222111 4078730 3949253 3997654 3935502 3945148 3885483 3922592 3944975 3726722
3925 3726722 3624517 3655807 3572638 3612219 3506214 3433749 3505786 3344408 3335337 3288737 3171873
3914 3171873 3091861 3055700 3048902 3064501 3021508 3028875 2924379 2851442 2923036 3010843 2948448 2886292
3902 2886292 2880025 2831236 2863898 2788277 2701719 2695969 2636778 2633311 2644741 2646255 2616653 2706732
3890 2706732 2798691 2725837 2670502 2679235 2803014 2754544 2772907 2705509 2691790 2781843 2796030
3879 2796030 2719110 2672740 2679860 2699031 2644383 2789556 2819154 2753528 2752186 2791368 2797388 2892249
3867 2892249 3099814 3145929 3332392 3496087 3525224 3626866 3713701 3715230 3854351 3993322
3857 3993322 3992741 3766692 3598068 3506873 3342765 3217051 3098516 2975131 2827578 2768966
3847 2768966 2798397 2862665 2935023 3048597 3244621 3409419 3456599 3397175 3348805 3238697 2996544
3836 2996544 2790426 2805358 2667435 2535853 2411590 2193891 2153223 2103044 1995299 1817440
3826 1817440 1769201 1769505 1669583 1734813 1811137 1840371 1762573 1621148 1733828 1760955 1702016
3815 1702016 1665901 1643905 1693617 1593447 1623511 1575812 1521118 1480891 1496702 1526873 1445191
3804 1445191 1464383 1586506 1515534 1357999 1400119 1442048 1449134 1431315 1467552 1467238 1491024 1516964
3792 1516964 1474950 1513274 1485185 1449108 1451667 1424807 1497097 1485650 1292392 1336805 1304772
3781 1304772 1262345 1318564 1317516 1237410 1213054 1252650 1303640 1363566 1386018 1310167 1362389 1403232
3769 1403232 1251463 1340966 1297984 1288245 1230473 1138683 1173303 1118183 1040638 1074408 1048952
3758 1048952 1110620 1103516 1084131 1079288 1019081 1079077 1037377 926186 987895 1060856 1048027 981629
3746 981629 1003485 1061889 1077312 1030569 1064470 946384 824131 821712 798823 867680 910472
3735 910472 985361 928256 937752 996428 950762 960225 1022110 945839 872535 848061 964085 973765
3723 973765 1039144 1018635 902914 795841 744343 805168 806855 868532 895903 899583 874187 892402
3711 892402 779676 837649 939037 881324 774543 759546 825032 771104 865580 936015 880840
3700 880840 835382 832194 798876 807743 804785 758297 760360 799630 779486 727476 743539 686875
3688 686875 729545 766488 706173 771076 803163 768631 755780 720089 765172 672801 686342 676263
3676 676263 626763 633619 633239 611909 624520 626156 640199 705209 668280 677060 605504 566031 692825
3663 692825 839964 764755 656360 621311 668362 688021 673465 657090 634185 634132 732969 600195
3651 600195 534959 608019 603441 646318 640557 593652 568713 581127 624241 617632 577868 616092
3639 616092 644965 582245 639427 687498 660370 641118 663867 652088 641402 728157 794814 692155
3627 692155 583729 611053 612001 562571 609679 659143 660681 722017 629873 554375 514217 481346
3615 481346 475522 514260 471474 553387 550076 560613 599468 606824 645660 612565 553822 617251
3603 617251 591806 600236 529947 541104 549429 563316 536453 500241 641065 685370 657795 599084
3591 599084 516557 425488 449910 544559 542824 469747 560013 584431 640585 621325 639100 533315
3579 533315 456157 460669 481357 509874 442712 403890 429152 500908 429177 423322 399115 433781
3567 433781 513075 526101 541198 563047 437651 410865 540223 555269 507392 484817 457836
3556 457836 517479 552868 464016 455609 390528 401098 385768 362596 338445 431947 505305 514707
3544 514707 486568 511176 503707 455269 448097 446959 559642 467200 532582 533695 512134 467115
3532 467115 339144 433936 483993 465785 463017 445871 383754 415037 489506 607443 583822
3521 583822 541641 383781 383366 407118 403661 387671 388251 402816 460916 446799 501029 443646
3509 443646 392410 456737 521344 560877 636579 619511 465321 425177 418245 463387 389115 415321
3497 415321 363869 295910 394986 483959 540196 527408 565032 585045 460963 522653 485764
3486 485764 496049 528072 446095 524572 559319 474520 416147 330079 419968 452823 507729 494542
3474 494542 458678 513815 476886 374536 326830 357751 401793 417221 472495 441293 417609
3463 417609 445531 369655 451914 547051 531862 574241 505310 420409 403846 480088 495573 463013
3451 463013 567417 566900 452518 488180 492762 497628 473993 452266 454105 446626 528305 547542
3439 547542 496564 425242 466883 504605 427615 445992 469145 603370 582932 528151 466538
3428 466538 466077 359009 465048 588015 614766 610028 606807 697905 665097 680750 526295 558300
3416 558300 526929 542648 522721 547875 495547 534166 575971 597225 621947 646637 598708 495602
3404 495602 515699 558659 699756 709202 670775 610812 618479 606405 527881 674901 744421 804475
3392 804475 848782 767103 899122 1015787 1012575 1003830 983103 1015715 1015198 973516 920443 940299
3380 940299 894525 828698 758906 821475 749439 724117 742389 632694 619343 654996 633169
3369 633169 618027 661259 713623 691165 632202 620130 720149 755727 821636 791088 695324
3358 695324 756981 794644 804649 862735 843275 877196 838611 769935 810296 820933 818390 771135
3346 771135 815139 829554 770656 622769 578046 701741 716932 739657 700968 700415 788810 747126
3334 747126 825369 815469 743647 745233 802072 797909 720787 735257 835269 805701 895102 887301
3322 887301 899777 960899 1020027 959722 987892 1098803 1143392 1128201 1111265 1078720 1139413
3311 1139413 1128208 1117828 1087913 1026764 1128386 1141950 1180346 1247009 1276218 1285709 1260806
3300 1260806 1218421 1199296 1275839 1253943 1275379 1321479 1373833 1425828 1381949 1392277 1451699
3289 1451699 1568213 1668655 1739384 1854862 1946107 1967589 2030434 1967271 1980636 1938898 1870859
3278 1870859 1896802 1969262 2034505 2005569 1970341 1915738 1967694 2044154 2080334 2062146 2093482
3267 2093482 2070497 2204252 2279364 2220403 2203977 2260951 2379055 2352789 2367108 2389242 2492708
3256 2492708 2589299 2645382 2684744 2872266 2916271 2862886 2958140 3059882 3031375 3206083 3279529
3245 3279529 3323478 3418513 3503987 3662276 3721601 3790188 3891437 4012933 4072267 4172433 4385997
3234 4385997 4388324 4459367 4507089 4313096 4159889 4036670 3856086 3619730 3398666 3265877
3224 3265877 3138088 2915014 2892336 2900243 2868231 2858780 2680344 2647589 2653627 2574789 2538753
3213 2538753 2647629 2695373 2705277 2858403 2888382 2835173 2990741 2984562 2897032 2846155 2806393
3202 2806393 2806761 2764692 2818755 2825467 2653148 2465766 2289797 2222586 2197481 2044866 1994071
3191 1994071 1947553 1874729 1783349 1819874 1904970 1886317 1808082 1997756 2110777 2173386 2348561
3180 2348561 2501828 2731828 2870338 3016525 2974103 2889909 2711163 2487006 2476407 2411057
3170 2411057 2249724 2200289 2111978 2011864 1842007 1769551 1759772 1561866 1505633 1438176 1445235
3159 1445235 1279698 1185907 1209660 1269664 1245343 1321224 1264877 1194590 1304450 1358071 1376002
3148 1376002 1468129 1540640 1585478 1679485 1681857 1467161 1420809 1426064 1312239 1294704 1222591
3137 1222591 1112936 1049766 1038016 924845 884424 829788 832656 741144 756491 729361 664770
3126 664770 704495 757282 727475 617331 605954 595442 600337 652097 572390 562697 591609 504191
3114 504191 500960 426701 427393 526502 552983 604859 525663 467696 513839 436734 503370 439962
3102 439962 465211 464514 413943 337270 358220 403243 473117 569576 566173 459315 381019 442420
3090 442420 383209 403698 499154 499289 435684 495973 426190 322947 339732 330771 428853 373856
3078 373856 340925 411292 217550 185574 301361 404352 403717 345161 240477 184528 340036
3067 340036 405094 327931 357566 326945 194646 218305 226762 189938 203342 279117 311714 194114
3055 194114 131640 115061 187932 285802 273204 303165 371703 320666 275381 258403 297917 189763
3043 189763 247697 238842 242957 298383 337990 318425 373810 463449 373717 251171 206699 221496
3031 221496 84788 152592 136140 61525 168615 159377 142097 142491 193800 187305 144880 175009
3019 175009 167912 123045 195863 160833 161740 244350 245666 243972 179766 267391 342219 321226 261300
3006 261300 284648 362758 315788 223291 133162 149999 197248 290886 202147 165282 168887 204160
2994 204160 253849 214463 197408 247146 247241 209914 238403 190987 139522 223670 213629 136653
2982 136653 59366 73594 179203 268396 299987 264779 210941 166629 185002 247306 315214
2971 315214 223434 248751 340199 327159 283627 392223 308438 326177 359938 325202 285116
2960 285116 445871 391297 241503 217529 390117 372972 391549 402178 410938 340612 399003
2949 399003 447347 411875 366996 297718 262282 329021 351150 405553 429129 393485 375366 326211
2937 326211 393424 337046 466550 483214 493110 540669 554734 541105 528121 593078 653726 692635
2925 692635 757782 704171 718757 588683 701716 795265 759004 755730 719666 632509 709135
2914 709135 754584 705294 759686 728425 663633 649425 671488 824763 829802 791908 718702 749615
2902 749615 841909 891895 947382 970321 963309 990550 1098055 1158150 1238960 1297202 1324452 1224697
2890 1224697 1147576 1052689 1011173 962616 918781 860662 756843 791623 848121 832826 872894
2879 872894 765382 832150 845620 758200 720893 696243 714829 719963 775115 827285 844134 856023
2867 856023 810786 848812 880152 813506 785293 843082 822930 776641 756721 705638 635423 648116
2855 648116 639213 648092 650707 668654 519029 523027 587978 485118 569593 538234 546516 600885
2843 600885 560895 534729 518928 469959 393820 284938 357878 339386 396361 362976 357278 344290
2831 344290 333874 306134 282920 201092 235076 207825 216812 293620 320819 286510 226934 335669
2819 335669 282174 207181 268696 114452 109012 182247 162608 175593 135806 139528 185548 117957
2807 117957 103239 132287 244745 255986 196642 221661 145638 64556 53598 6177 130107
2796 130107 155851 111350 33957 38757 58937 130094 95501 20096 76013 32389 66144 28922
2784 28922 60595 23277 48513 -15908 -24761 38755 2908 9421 114266 84307 57521 -24827
2772 -24827 -8735 -65549 52688 -13636 -68861 -249 18607 75964 157488 138112 86994 77596
2760 77596 99092 27501 -14707 30721 70226 129239 -17901 -93637 -113313 -169494 -32446
2749 -32446 -53043 -149957 -85470 -155030 -71406 -31607 -13786 -72593 -134334 -58704 44263 18061
2737 18061 -85285 -32556 -3772 65320 45204 113376 65813 -20865 14139 75080 90985 -89486
2725 -89486 -74066 -85643 -122717 48884 84255 46029 -23967 -70870 -29943 7215 -20761 -20481
2713 -20481 -68700 15036 57191 -27430 -83643 -66505 -71625 40494 18712 -77366 -107432 -105503
2701 -105503 -57363 -24748 -77963 -123877 -133871 -85180 -48861 -95147 -83865 -89237 -11323 -71549
2689 -71549 -26502 -90825 -52782 46368 -31028 -110542 -125784 -126328 -101591 -92334 -66194 -171562
2677 -171562 -71599 -62136 -28381 -129242 -189174 -43450 -55872 -76900 -10672 -80351 -104595
2666 -104595 80438 -64625 -63647 -38726 -61777 -140828 -46913 -25596 -43739 -54691 -167730
2655 -167730 -140702 -121690 -34934 -131820 -143445 -132523 -127782 -97095 -100982 -62151 -13865 -36305
2643 -36305 23736 38619 1182 42087 6429 4345 53512 10989 -4520 -1660 19852 51958
2631 51958 49089 -9349 40716 35916 -8649 -81336 -8254 -22713 -44894 44027 -47038 -110175
2619 -110175 -40480 -67054 -113676 7704 -60600 -26287 -30237 -5356 -13901 -31582 37443 -29721
2607 -29721 -176538 -214063 -78196 67941 12786 -53849 -133523 -177923 -163243 -181152 -173880
2596 -173880 -98216 20235 33102 22378 -109863 -65798 -28215 -63799 -53697 -88622 -90119
2585 -90119 -86809 -99755 -77228 -82959 -172742 -148222 -82782 45352 21391 8026 -6145 18768
2573 18768 15780 -91578 -45010 -12194 -24922 -57858 4874 -90870 -53282 -62253 -68338 -48240
2561 -48240 -170978 -124634 -56175 -38494 -57778 17791 19738 -72577 -104672 -78539 -102058 -125061
2549 -125061 -147638 -204149 -217393 -144927 -83918 -53553 -30410 -29769 -31884 13869 42955 -65058
2537 -65058 -120970 -52608 -33828 -107925 -138236 -42251 -105361 -94970 501 4564 -30267 -64101
2525 -64101 -14272 -23227 -44392 -37605 -34794 94310 20915 -78404 -78532 -122086 -184773 -210897 -97225
2512 -97225 -66659 -60468 8267 -70102 -79065 -46819 -2508 -13199 -35302 -71239 -82590 -25548
2500 -25548 49854 -26927 -46890 -37352 -58630 -73798 -214967 -91386 78806 48544 -78394
2489 -78394 -31838 1536 -65731 -102453 -45826 -11052 -76766 -57177 -30715 -54615 -60451 -23393
2477 -23393 20249 384 -48474 -79234 -67386 -75102 -93022 -67691 -137223 -144905 -44557 19955
2465 19955 -41494 -68722 -20419 -87140 -86489 -34714 -136621 -139838 -73516 -21718 -458 -30412
2453 -30412 23750 101142 60131 3021 86563 18114 -79748 -174568 -110694 -24907 -79740 -126571
2441 -126571 -68515 -19117 -6095 -27309 -91355 -111243 -78901 -104605 -167405 -142639 -189778 -115981
2429 -115981 -68801 -133466 -8033 -54173 -56007 -29584 -6024 116416 64738 -2117 -4966 -58676
2417 -58676 -135613 -63771 -67781 -48598 -69370 -71045 -70189 -63480 -75707 -67093 -146341 -162063 -63688
2404 -63688 47540 76734 -44740 -36658 -144292 -100661 -119951 -108818 -90641 -108150 -101811 3757
2392 3757 21662 -108619 -57288 -47424 -78748 -96595 -76309 -61220 -96588 -66565 -8182 31604
2380 31604 76331 76541 -14552 78827 36473 -25710 -32817 16133 63026 65938 31477 26805 31417
2367 31417 26795 8037 -1112 35317 42532 -20359 12998 4006 14901 51396 6896 31228 96201
2354 96201 104769 60339 66782 56034 -11951 -62956 -33959 -71771 -74297 -72929 -20614 -40565 20669
2341 20669 21991 66433 8917 -14311 -46648 -64124 -25300 16499 29867 -4601 -8367 -61365
2329 -61365 73735 64656 -17573 64987 114542 57422 43186 11455 -7851 -12761 -68489 -25558
2317 -25558 -28895 -38133 -17937 -34667 -91189 -54791 -30489 -56585 -178082 -74833 -14080 7760
2305 7760 9413 -35346 -76326 -73439 31137 105211 145808 64739 -57844 -90651 -27144 21607
2293 21607 76459 109133 92957 71647 -23900 -25834 1070 -49770 28579 36496 36566 34673 38706
2280 38706 103518 69481 28493 73521 61219 33898 -76055 -118816 47271 120087 53885
2269 53885 102519 193982 85265 35006 2173 171745 30360 -81186 -26259 11598 14747
2258 14747 -77851 -39524 25781 24861 -10027 29743 127489 120825 39757 -17564 -53746 -1963
2246 -1963 -26382 -4584 100780 77413 -21624 67478 126359 93109 103320 34776 -27998 59415
2234 59415 95370 82458 41980 139216 153515 159634 122227 62365 21791 61849 35404 86004
2222 86004 162224 62569 144608 215679 134945 116021 76243 140776 128273 119632 59790 10545
2210 10545 81513 52262 199057 195421 183880 227721 180545 174635 149649 193025 103713 155877
2198 155877 204408 199543 224642 139500 104674 139920 202609 229524 165175 239388 285568 228547
2186 228547 186765 179065 240764 203990 234452 334255 358313 353497 279287 298190 213185 164419
2174 164419 226366 268981 240075 227866 216038 162310 189556 185128 266276 271158 233100 341048
2162 341048 342149 335774 376156 308612 386300 412116 303593 208687 285069 364249 437774 420291
2150 420291 356936 462332 472212 532640 565411 618706 628754 569306 654051 685989 661675 725282
2138 725282 758746 891541 1028602 1036452 1136449 1246876 1238475 1167101 1222543 1290517 1319076
2127 1319076 1403089 1392474 1427242 1436628 1446908 1529136 1559595 1618620 1695597 1757132 1914057
2116 1914057 2007534 2076221 2206632 2380950 2563739 2655589 2843055 2961039 3124350 3333915
2106 3333915 3614331 3937925 4400755 5010379 5759090 6649208 7689745 9134737 10894984
2097 10894984 13209525 16174972 18467906 19315199 18532337 16476982 13986365 11759839
2089 11759839 9911852 8472924 7142852 5955757 5137478 4447990 3859373 3412644 3083278
2080 3083278 2934029 2826358 2565559 2405755 2248479 2119471 1936402 1698941 1635905 1544916
2070 1544916 1437254 1266415 1250957 1199694 1191692 1087456 999225 916753 925202 893185 848534
2059 848534 714330 692827 776177 787796 742861 661582 736736 761732 809396 793368 805639
2048 805639 740233 548732 507308 538703 629058 640523 616928 604897 500952 442700 432943
2037 432943 449628 497087 556717 476040 443235 381260 408794 288935 377647 412229 309702
2026 309702 307319 303442 257518 233183 236788 299470 303935 250244 220401 235459 292733 271821
2014 271821 263049 168259 103081 152898 100157 132851 186155 151774 224349 242714 233697 150962
2002 150962 89836 179322 233714 180999 180276 184243 156874 88640 38960 162022 179942 170055
1990 170055 55061 86811 67481 147051 170178 130089 80673 24556 -25096 87890 147278
1979 147278 75628 -2072 173873 125902 92799 18210 -7895 14475 -27184 47053 85938
1968 85938 116220 6699 51371 -68279 -26926 -8291 19578 46441 66291 -70710 -17942
1957 -17942 50298 65470 14966 74214 91298 53186 33260 -132561 -72153 -103319 -80779 59023
1945 59023 82699 28200 75613 56300 47509 53042 -17564 -23403 12535 10415 -31813 -6666 37032
1932 37032 -28797 -55992 9006 74865 99186 86019 49773 -149321 -145507 -127615 -96150 -71593
1920 -71593 -33865 11948 -3922 24155 -3987 -9580 -65332 -74330 -47079 -99037 -63892 -185093
1908 -185093 -149459 -39876 -35541 -77968 -120961 -73426 -132046 -175632 -143766 -123937 -97239 -73985
1896 -73985 -178390 -214133 -192854 -157570 -136208 -172667 -66026 -69673 -75059 -61680 -12134 123285
1884 123285 81762 -66042 -93736 -21729 30616 -54501 -75138 5864 -48434 9699 20856
1873 20856 -5716 31833 -5073 16558 -8777 -92688 -116029 -86688 -89024 -21734 -13587 -136516
1861 -136516 -101991 -139416 -154941 -118198 -40112 -9478 -95389 -184411 -135105 -123396 -161377 -121525
1849 -121525 -66408 -13451 -49161 -141713 -67161 -76056 -104947 -71850 -213167 -180492 -176400 -139264
1837 -139264 -183081 -74913 -46495 -99314 -78249 -18128 -32656 42325 134468 76599 123544
1826 123544 74112 103782 57881 -31453 48994 44608 26358 38345 -34232 -168763 -87556 -4764
1814 -4764 -45733 -60511 -119579 -130541 -49017 -38506 -22877 28659 -65496 -225082 -167592 -117262
1802 -117262 -128237 -110164 -110842 -39174 -30062 25879 -62567 -109480 -61114 -105196 -182152 -17921
1790 -17921 -99630 -104930 -31085 -178102 -117026 -28661 -118649 -35346 -104954 -186319 -103752 25833
1778 25833 -36866 -99258 -24868 -64313 -141550 -10964 -32693 -77289 -108039 -202124 -121135 -121646
1766 -121646 -154977 -160945 -85396 -108663 -71987 -112451 -95456 -48472 -23988 -56639 -87649 -81985
1754 -81985 -83327 -46587 -91435 -106237 -159315 -106903 -146413 -171909 -139716 -162758 -105564 -92730
1742 -92730 -2999 40797 -81025 -128984 -92973 -120226 -69223 -151607 -165200 -96169 -138018 -19439
1730 -19439 -89626 -164323 -198166 -69099 -22846 -94592 -70917 -62388 -119839 -139608 -116818 -86348
1718 -86348 -161016 -133453 -77325 -118738 -122583 -150019 -54370 -109501 -102097 -29956 -52336 -33445
1706 -33445 70654 98175 7434 -160823 -75630 -4199 -64667 -30027 -67275 -62343 -73416 -140567
1694 -140567 -176511 -132033 -131390 -100333 -129798 -107828 -16022 -98121 -177580 -248315 -276843 -250426
1682 -250426 -181894 -154459 -94765 -67223 -26867 -66885 -134878 -155947 -114199 -216500 -210271 -120385
1670 -120385 -81574 -118356 -200938 -180946 -144563 -192910 -130024 -47448 -32886 -75766 -186338
1659 -186338 -228381 -181914 -158384 -69607 5170 -7159 -18563 -80011 -80422 -38475 -21742 -76515
1647 -76515 -161985 -49470 -155791 -157224 -121735 -96209 -61514 -140460 -233227 -151156 -114722 -138393
1635 -138393 -145614 -110858 -110686 -133979 -122034 -145517 -95916 -77785 -54467 -118897 -117646 -182910
1623 -182910 -123366 -80324 -108108 -33461 -6521 5450 6842 6465 1697 -39569 -75740 -97696
1611 -97696 -107358 -189011 -223928 -97623 -158251 -189190 -101453 -99143 -51127 -144992 -188617 -259093
1599 -259093 -219761 -95931 -58374 -70791 -87474 -106713 38277 -46888 -73413 -9082 13937
1588 13937 17923 -79464 -114468 -55006 -41030 19444 17929 -114818 -164302 -122851 -127920 -157953
1576 -157953 -71050 22700 -17720 -50469 -171531 -171277 -82394 -51191 28357 54041 -96160 -106267
1564 -106267 -115628 -165198 -84152 -92149 -119280 -84571 -89905 -63976 -65389 1170 -58181 -111582
1552 -111582 -103263 -110367 -85938 -25651 -36734 -22958 4050 -138770 -84892 -34290 -60410 -68153
1540 -68153 -36199 -63933 -112122 -46685 -101148 -75448 -96669 -49707 -88158 -125923 -65174 -126953
1528 -126953 -99275 15027 108444 -7243 -8801 -58550 58183 11726 -69972 -91381 -67203
1517 -67203 -36774 11204 29134 85789 51477 -94809 -44495 9018 -124260 -120139 -54257 -43545
1505 -43545 -96225 -93254 -39836 -58247 -113283 -116508 -195235 -189704 -108773 -163229 -192785 -37631
1493 -37631 -28995 -61139 11289 -109051 -21759 94978 37549 7269 -119466 -216191 -176751
1482 -176751 -163714 -161546 -143121 -112592 -88221 -114321 -69268 9441 -27780 -63999 -31331 -88932
1470 -88932 -73911 -3720 -74547 -85329 -135186 -119332 -28832 -105228 -7193 -27000 29314 134625
1458 134625 -36437 10715 -19584 -101046 -53840 -34216 -130783 -100020 -68810 43079 -15703
1447 -15703 -24630 -37948 -105820 -68996 -91175 -37683 -59346 -91372 -151527 -196854 -108668 -114167
1435 -114167 -76551 -41150 -94940 -85503 -109159 -52350 -131047 -96904 -95966 -119391 -75168 -140809
1423 -140809 -196642 -135808 -92643 -65599 -78383 -24545 -44962 -102349 -104647 36753 65087 -43323
1411 -43323 -112283 -148390 -59318 -89405 -77298 -30855 2172 -37604 66834 39352 -1996 -80314
1399 -80314 -114068 -141801 -52841 22637 -4126 -22882 -113002 -111832 -80161 -119625 -135759 -86818
1387 -86818 -97652 -49580 -22594 -58119 -29112 63659 -1596 -54201 -78494 -77263 -94360 -60261
1375 -60261 -16041 -66940 -154703 -98513 -33216 -99924 -165127 -123832 -61170 29170 -23358 -70040
1363 -70040 -22363 -14499 2702 -18674 -26058 -25400 -69103 -85093 -40542 -7366 27330 -22539 -33284
1350 -33284 -46641 -79531 -112746 -2439 -67276 -67136 -130869 -83236 -14638 -58659 -79150 -42050
1338 -42050 -19517 -34108 -1604 33471 -5260 -17529 42901 39166 -33747 -79056 -50333 -107825
1326 -107825 -99637 -114004 -31272 7616 -107839 -154638 -64743 -42793 -77791 -67024 -18486 -38236
1314 -38236 -6209 -37439 -149339 -161492 -133032 -92865 -144133 -99109 -51787 -112760 -87944 -56821
1302 -56821 -68246 49723 -26342 -5205 10754 -43895 -42634 -11527 -30339 -82353 -59405 -23012
1290 -23012 -29005 -52456 -147018 -225460 -171842 -164608 -124925 -33840 -71830 -197784 -144954 -33146
1278 -33146 729 -69872 3361 -34451 34983 24001 45353 -47346 20473 -34299 -71682 -19745
1266 -19745 -125670 -87572 -28742 -52622 -102922 -153934 -112700 -42908 -129170 -125382 -49775 -87088
1254 -87088 -169618 -108847 28356 -17844 -56505 -107543 -4981 -7266 -52579 -98800 -169480 -5115
1242 -5115 85629 12466 -65566 -37812 -127124 -179746 -151948 -23813 -10552 -40496 -91616 -44190
1230 -44190 132860 105138 14519 -42213 -8587 69080 -122226 -105797 -123756 -110767 -157867
1219 -157867 -139340 -67116 -45980 -101602 -32759 38300 -41903 -71969 -117546 -69406 -65742 -101961
1207 -101961 -94791 -63886 -134901 -99107 -165201 -210565 -151685 -43694 5610 -59311 -92494 -44935
1195 -44935 -6890 -32855 -4572 -19990 -137798 -106528 -15474 -57424 -103574 -66558 -51834 38098
1183 38098 -12612 -71356 -47930 -38391 -63702 -91736 -15554 -26225 -17129 -5850 -70678 -69948 85376
1170 85376 24817 9548 -8114 -73669 -73250 -41298 -45638 -64558 -48756 -21410 62211 33341
1158 33341 -18948 34268 55315 -40860 -40595 37922 -68020 -108502 -82287 -95544 -29770 -27999
1146 -27999 -3967 83899 42988 14165 -17165 -47489 -77349 -12455 -92018 -109033 17929 8535
1134 8535 25330 9988 -48859 -84926 -73647 -66101 -67176 -34484 71615 48584 31281 -4447
1122 -4447 -88439 -97696 -136339 -113712 -57547 18961 9841 -18084 -60008 -70328 -19631 -39959
1110 -39959 -118438 -161686 -58708 -92791 -47775 -51589 -53786 38703 2082 -114075 -164079 -109400
1098 -109400 -19890 15329 -152852 -137631 -111729 -77522 -24099 -14145 47030 -16930 -62393 -9262
1086 -9262 5255 -84916 16134 -92679 -76510 82456 48113 -16064 -32672 4702 62574
1075 62574 71655 -54747 -97249 23019 9200 -21628 -28867 5582 77034 69850 19430 21699
1063 21699 -20312 -65274 3783 3882 -5913 13293 -28597 -40654 27157 22307 -71006 -74377 -2098
1050 -2098 -25428 52448 13748 -45938 55601 -19034 -60902 -55290 -62166 -7678 30275 -49083
1038 -49083 -58233 19660 36796 76279 -28136 -15748 31803 66824 -4553 -38617 10037 43615
1026 43615 79128 19596 -40373 -35107 -26279 -49398 -47863 9777 21677 3314 75667 67849 67214
1013 67214 54861 -13478 -93596 -116809 -140678 -106963 61105 8577 -5410 91719 103086 133227
1001 133227 131222 52808 20325 60025 112811 116793 38209 -24161 -8103 -70912 -42608 -16282
989 -16282 -11173 25365 27947 74848 103091 185259 88762 -11150 -112126 -117625 -26635 25580
977 25580 -21591 32203 31480 46214 51295 -136775 -140386 -96699 10921 85246 -41421 -41405 42848
964 42848 4056 80653 -40434 34382 101374 84101 119333 91596 50142 40309 64408 60086
952 60086 58806 39224 -33069 28905 121032 5687 -73595 -62729 50562 62584 22544 -90166
940 -90166 -42339 -8807 -3112 -82333 -49689 25474 30652 -36032 -150316 -132766 -9610 65333
928 65333 85120 127903 47629 19050 -12089 31050 19514 129581 166772 92558 82628 -55802
916 -55802 -51820 -26563 -22632 -1130 -37880 12691 40989 -8329 -83326 -57845 -25662 -24172 -22966
903 -22966 -28500 -70357 -100061 -133667 2280 69863 85622 131219 33810 -8131 34821 -44237
891 -44237 -7275 -1089 -93312 -28432 -4140 122704 84284 -26641 -91151 -91876 -90977 6523 41147
878 41147 -1062 24627 -11705 36865 -1073 44293 186373 75893 48592 3650 8909 45518
866 45518 31173 49260 18979 -27662 108150 74932 26903 13932 -50810 35829 -36111 -72605
854 -72605 55875 101890 122717 104552 60567 84149 17159 -20964 -2438 72288 12869 7924
842 7924 -48810 -26694 -23262 30737 114464 140604 144150 86382 -65317 -82307 -46200 -37045 -58018
829 -58018 -41602 16634 50388 114833 178337 42374 -94020 -6124 -32774 94415 68021
818 68021 -87035 -74957 33861 50829 44575 -99864 -56211 -20373 -43 -29197 28520 -80798
806 -80798 -37884 6231 -13875 42359 22561 29621 48413 82137 -66918 1193 -72752 79899
794 79899 69699 7270 91344 148126 154078 144030 139811 42202 -13185 21033 3910 -15405
782 -15405 39748 91775 83287 75142 46790 27605 -23635 -4674 85361 -49831 -21891 25250
770 25250 12863 49618 58163 65766 7080 42136 171240 103977 71438 -22369 -9703 25396
758 25396 35183 110042 107452 170224 184991 128443 76157 26360 32740 50565 32336 29752 117478
745 117478 198051 183470 147852 21926 66453 98036 138067 103456 -6033 -50499 36154
734 36154 76261 52747 164258 171083 45195 22687 64439 132092 190191 139711 40989 5378
722 5378 32022 35310 19520 13990 82835 53748 48635 -38235 -141001 -65059 -24581 -24535 -45492
709 -45492 -69424 -70258 4020 105892 79884 37313 17639 9528 -87592 -50180 10836 16997 -1400
696 -1400 -47162 -62216 -74432 -48574 110594 200244 113814 92668 116152 63730 51007 93659
684 93659 54009 11158 42021 94600 65890 -12270 -69838 -87853 47944 149069 80951 11583
672 11583 29017 114136 -22631 23760 110866 26274 -40637 99592 49004 17419 32797 112965
660 112965 72881 8261 23806 66206 45535 -2446 -13546 14091 109963 98646 192682 161565
648 161565 168011 145168 121275 104021 80295 37254 43593 69740 74622 73059 108619 109828 141639
635 141639 24190 16257 87245 85303 62331 50552 64855 72946 9350 -38703 -33923 -13339
623 -13339 7972 78812 87581 101612 64379 72590 86300 72805 96061 105582 23672 105200 84587
610 84587 -19211 54723 7190 -4598 82090 115481 90540 113169 14768 75882 89708 150460
598 150460 123075 -28616 -9313 17837 54074 50960 60027 19365 -103232 49415 121776 73579
586 73579 22692 -43668 138159 79861 143625 212984 48089 55720 28947 39409 -41731 -54284
574 -54284 -6363 30206 110946 74501 72161 137807 116306 117993 87878 125187 205140 301184
562 301184 161598 88261 211249 187831 94493 68353 126019 75859 -25325 14503 67216
551 67216 18641 44471 39323 35878 72612 117922 225605 194573 111918 59914 140637 113336
539 113336 76130 70235 35398 80016 64947 121839 95321 72294 15395 6857 33850 103002
527 103002 157523 56321 106368 73003 48697 33250 100175 139655 104534 121209 140871 205649
515 205649 138620 66764 130534 162188 59617 127927 150478 137526 62996 10521 17398 -18622
503 -18622 62903 79449 95089 141553 110105 108283 117773 89112 116693 81942 93509 58519
491 58519 18134 64253 138512 136446 29390 21242 58569 5339 -45603 -56988 57501 149179
479 149179 95514 137489 101718 150540 172309 202986 146998 137867 153671 64006 -14561 -55863
467 -55863 41961 153803 157822 109903 24095 48104 58319 90275 92544 -29189 -10212 48735
455 48735 23628 -5044 -27192 -84065 -134737 -79438 -34312 27389 69381 76925 80254 92119
443 92119 115909 102053 24779 73628 109322 129932 86225 33563 150778 115418 105448 100718
431 100718 117661 82425 135381 76873 10572 54328 81958 62890 67096 88031 114255 82873
419 82873 -7626 21791 63735 98504 56659 141613 146032 200803 122719 17453 91802 74741
407 74741 10 12004 141596 183333 177049 161040 192320 282600 164079 92425 76008 91233
395 91233 160775 149762 40734 73189 79803 16485 -14703 54866 164959 223858 225504 177333
383 177333 200240 199062 181450 147064 157137 73455 88226 33237 30703 24941 101056 -8307
371 -8307 32210 42227 -11634 17012 98623 98094 106755 150930 128719 92845 108443 97300 174752
358 174752 186252 183872 228119 154736 231789 225322 199106 172190 140446 150214 22171 73597
346 73597 113590 92413 77602 137681 184001 211297 155646 53490 113148 163912 219360 162787
334 162787 193911 197368 129437 90071 158243 215749 133782 111181 211184 90618 53582 151327
322 151327 97402 88159 120762 81390 126848 52089 160204 254925 151003 152814 151854 79673
310 79673 115430 52455 10153 -10849 60328 122334 223870 199873 191185 131331 93607 108877
298 108877 29761 57520 90147 -4723 45086 195545 302824 180350 68265 91147 106471
287 106471 108284 81492 70935 81978 121198 -17697 52025 161248 134696 42632 142233 225041
275 225041 200540 170849 154529 156823 75492 98220 97715 58635 80263 58902 44289 68509
263 68509 143770 168451 162505 89725 41217 51606 38478 138906 213163 190943 215002 288681
251 288681 169313 78592 164124 126240 158011 163757 169724 145668 168655 163724 102540 73868
239 73868 112153 124391 127279 140913 217532 173791 64888 188735 211240 164039 181801 219401
227 219401 248257 278629 260075 157516 250523 274592 185692 142480 233273 255298 213023 287139
215 287139 181083 143009 165751 220358 97509 79179 114083 147276 71802 -75011 -24393
204 -24393 29832 91819 108186 59798 167674 223782 170853 67653 178891 238120 220796
193 220796 164561 105192 161976 180792 130085 36271 49474 -10099 27019 45681 97043 177749
181 177749 173927 150518 125523 89575 134748 108362 110375 62376 213799 158283 129584 129919
169 129919 123011 138237 127709 64605 102293 129589 188651 167296 183415 172720 197431 271699
157 271699 205504 173666 102728 199670 102874 52143 96132 113379 163142 191014 207220 159463
145 159463 183220 235453 148939 126500 116268 110610 44715 30753 90698 154185 95314 152908
133 152908 169368 167507 91817 107300 189873 159623 56933 88870 145479 169994 253713 216465
121 216465 263209 341978 242226 164640 170780 230094 211161 143105 164648 151197 181457 234216
109 234216 203805 169567 143330 180496 196909 188424 140029 91250 145514 144402 122861 101127
97 101127 133644 147295 77709 152471 164768 141706 120833 84145 150693 115538 86644 122724
85 122724 138662 134305 151592 239316 202478 136021 144541 153061 212658 225861 110865 135171
73 135171 165987 126739 63052 158009 190227 217963 260075 220438 185732 184557 188140 94354
61 94354 73651 112620 220701 153896 109216 182121 139105 150853 182549 181536 138581 143392
49 143392 111333 175124 179916 170257 223417 133727 116231 125167 169503 231462 264457 136443
37 136443 183263 219027 166285 159477 193459 147461 176717 133600 199166 146303 98880 80843
25 80843 155872 173264 170511 175909 182537 201364 215530 272772 268706 215695 134426 137736 153701
12 153701 140427 135490 94953 151781 132346 139949 184748 105760 198750 166085 179570 197812
0 197812
$$ Imaginary data points
##PAGE= N=2
##DATA TABLE= (X++(I..I)), XYDATA
16383 -855043 -812989 -796079 -729199 -679789 -735288 -734838 -683362 -650865 -638965 -687765 -642834 -606113
16371 -606113 -648897 -575106 -536653 -575935 -522673 -474656 -476228 -399921 -351964 -298594 -283001 -391246
16359 -391246 -436727 -391376 -384626 -266854 -244760 -294949 -259532 -244291 -291465 -200344 -155903
16348 -155903 -78606 -24573 -64148 -44972 -82735 -56923 -4236 -36673 -58819 -82796 -39917
16337 -39917 64454 77753 76798 95228 147478 197659 262042 244731 147697 157250 216387 238068
16325 238068 262358 326314 256467 281517 358178 331408 390150 425828 441834 478855 482847 503274
16313 503274 475039 469720 480856 527636 556321 574791 611489 602397 632782 664575 654518 696012
16301 696012 732435 733308 751617 785135 771067 796028 777559 866511 857910 759930 879703 824271
16289 824271 912586 964593 1007501 928827 941625 967232 895366 949267 979600 978586 1025749 995440
16277 995440 1002477 1027482 1079534 1157762 1188487 1212128 1173202 1121647 1166201 1240353 1232398 1259568
16265 1259568 1242130 1231349 1242925 1259112 1243024 1275919 1277053 1268559 1286814 1297617 1309691 1401909
16253 1401909 1292264 1262740 1315262 1330363 1314764 1390354 1421570 1448614 1485769 1438019 1469639
16242 1469639 1519744 1535584 1546884 1593888 1644950 1606475 1584659 1606820 1678358 1656347 1652305
16231 1652305 1653839 1586318 1579726 1716030 1677293 1587494 1611172 1640553 1723336 1729404 1815268 1738334
16219 1738334 1758765 1755480 1824638 1785376 1748515 1737168 1718735 1806569 1730974 1716960 1754798
16208 1754798 1819205 1820396 1799537 1788430 1781694 1848368 1885050 1772682 1771344 1877418 1953243
16197 1953243 1936464 1853899 1899730 1898995 1937609 1944727 1985883 1972170 1870650 1906777 1907193 1880294
16185 1880294 1842584 1883786 2002302 2063440 2054276 1972209 1931637 2006424 1976479 2015529 2093577
16174 2093577 2029043 1994296 2030466 2030226 2130171 2087370 2151562 2231485 2062788 2044843 2033995
16163 2033995 2052878 2030527 2121944 2133158 2184610 2208626 2142805 2131907 2033625 1984486 2041492
16152 2041492 2117888 2049702 2031907 2096576 2168986 2198750 2058339 2068286 2115441 2118572 2171192
16141 2171192 2225468 2211310 2213637 2232131 2257219 2088814 2041301 2139880 2191149 2308447 2293777
16130 2293777 2282584 2299596 2340585 2301609 2244491 2210134 2196162 2175989 2148639 2158645 2247131
16119 2247131 2248717 2219380 2299469 2234585 2254280 2233321 2220441 2157689 2172884 2158901 2197559
16108 2197559 2169592 2234111 2364396 2291412 2289746 2293623 2281918 2248206 2156006 2068182 2177673
16097 2177673 2226950 2258976 2277033 2305621 2297802 2296746 2361120 2347754 2191402 2270553 2234805
16086 2234805 2303221 2330791 2387873 2315176 2271869 2300290 2300108 2189120 2235966 2303821 2321600
16075 2321600 2301578 2318089 2288265 2258844 2279368 2293324 2303346 2335746 2302925 2236604 2212768
16064 2212768 2174510 2222100 2207332 2177715 2206068 2273918 2347702 2321829 2297200 2339657 2247123
16053 2247123 2252341 2263467 2251836 2224303 2336298 2300122 2282338 2253774 2364271 2301224 2329476
16042 2329476 2281615 2234324 2250542 2254477 2192507 2257402 2309973 2292988 2381400 2376226 2362774 2295960
16030 2295960 2231117 2333051 2334769 2270307 2265897 2450112 2472701 2442768 2417125 2397338 2377813
16019 2377813 2368265 2310931 2279759 2267851 2242641 2279949 2348500 2335123 2304044 2368764 2291471
16008 2291471 2371620 2393756 2402115 2402371 2479195 2420808 2322385 2279033 2274510 2386248 2357837 2334561
15996 2334561 2365256 2324157 2399153 2462564 2493590 2340005 2327092 2297190 2263064 2267483 2238163
15985 2238163 2347365 2389932 2348107 2304190 2172394 2208370 2283991 2344674 2361148 2249945 2155877
15974 2155877 2268454 2458148 2338806 2329529 2366154 2404307 2435882 2386851 2442833 2348807 2342887
15963 2342887 2452028 2481864 2389175 2423621 2369064 2270864 2265058 2408749 2373942 2416811 2382231
15952 2382231 2328755 2441596 2327292 2396881 2451532 2402943 2333510 2388963 2411586 2372288 2341822
15941 2341822 2409500 2434289 2478417 2460949 2411351 2411388 2386340 2423817 2408062 2395424 2358916 2344772
15929 2344772 2351435 2308313 2336468 2377174 2361333 2262255 2265003 2389837 2493300 2448942 2381093
15918 2381093 2344903 2302656 2336850 2403983 2331527 2352209 2372189 2322010 2403338 2423504 2337287
15907 2337287 2305623 2215595 2270569 2358953 2430118 2415582 2421988 2319724 2305160 2361115 2315738
15896 2315738 2303019 2341425 2275140 2280984 2447225 2403453 2457673 2424586 2403986 2407199 2414589 2371096
15884 2371096 2354763 2315098 2275372 2232868 2283007 2336415 2240065 2260930 2330142 2263414 2363924
15873 2363924 2412741 2377718 2361743 2351123 2335528 2302368 2354572 2344972 2317572 2327712 2288047
15862 2288047 2337288 2330119 2360965 2351508 2432644 2492644 2465535 2472866 2370659 2384564 2424061 2400097
15850 2400097 2434917 2346081 2342448 2421848 2466911 2462149 2336777 2366191 2334530 2327310 2290143 2356148
15838 2356148 2373353 2366590 2341411 2369153 2455220 2355836 2311559 2474938 2535003 2429385 2369009
15827 2369009 2455422 2425026 2382988 2422649 2404559 2359123 2367529 2402546 2420500 2463653 2478549
15816 2478549 2465419 2411517 2377598 2473687 2459674 2482754 2455031 2452412 2474654 2426300 2451307
15805 2451307 2491227 2401500 2404065 2467859 2455585 2414322 2393811 2401712 2380526 2352758 2381658 2401115
15793 2401115 2454536 2473164 2438129 2459904 2476588 2486008 2401371 2457102 2479787 2580002 2529217
15782 2529217 2331826 2370706 2502108 2488212 2457166 2392041 2460948 2429983 2331364 2330084 2329594
15771 2329594 2429155 2447652 2451067 2425999 2459094 2538558 2558914 2459080 2433932 2428202 2415832 2410271
15759 2410271 2342303 2382767 2394802 2472964 2499061 2420856 2413932 2352162 2353366 2414579 2467623 2525659
15747 2525659 2427610 2506173 2517368 2488090 2491371 2488290 2517329 2480299 2468826 2514733 2503691 2455354
15735 2455354 2421229 2475441 2537285 2382352 2344156 2391254 2452351 2496307 2460039 2393001 2321954
15724 2321954 2336397 2345692 2361674 2346922 2400835 2489546 2459710 2422255 2448125 2369948 2326548
15713 2326548 2365564 2443426 2482055 2487242 2477314 2543224 2574404 2544696 2472142 2376764 2369417 2423713
15701 2423713 2444860 2445091 2444589 2432887 2466278 2465421 2399204 2372114 2462199 2447370 2356396 2366592
15689 2366592 2454058 2476968 2468489 2528208 2538534 2603122 2564171 2470436 2415866 2356126 2367395
15678 2367395 2356834 2481840 2490394 2392779 2356159 2460387 2512940 2519141 2453271 2415565 2430157
15667 2430157 2393678 2433633 2470991 2437877 2401759 2383251 2450015 2396977 2436317 2513904 2535542
15656 2535542 2439230 2463356 2487539 2463100 2431360 2396002 2454429 2403830 2410166 2521823 2475816
15645 2475816 2461414 2515807 2455878 2401633 2449289 2513970 2387250 2358762 2307064 2311287 2335571
15634 2335571 2309220 2341452 2422136 2485938 2477592 2493935 2434501 2456801 2419860 2462274 2449377
15623 2449377 2437288 2530626 2495158 2489803 2454794 2426660 2472769 2518456 2473280 2479686 2488913 2453342
15611 2453342 2365654 2338759 2404942 2278390 2335554 2454376 2453685 2512302 2442016 2424742 2435662
15600 2435662 2473558 2398147 2326494 2392314 2463941 2551095 2539844 2548377 2502060 2404606 2476734
15589 2476734 2382824 2409378 2375630 2415189 2418283 2480205 2500767 2405414 2413459 2414524 2454238 2552236
15577 2552236 2541191 2388991 2422407 2494733 2563166 2465949 2474149 2522627 2529854 2501274 2389288
15566 2389288 2411460 2417008 2491973 2510320 2413644 2510440 2447216 2514159 2413817 2478792 2525466
15555 2525466 2425654 2451345 2432314 2402667 2464522 2558257 2550753 2484998 2460385 2417801 2481408
15544 2481408 2624852 2550476 2550423 2549462 2573432 2567940 2499696 2445359 2454105 2443754 2500287 2408567
15532 2408567 2409701 2427013 2428176 2477335 2424686 2386791 2375518 2427251 2509413 2522337 2497184 2453780
15520 2453780 2560752 2539608 2532334 2596735 2543855 2556005 2562812 2534677 2491538 2411396 2463142
15509 2463142 2513784 2563764 2458122 2514913 2582305 2544975 2501795 2597467 2521104 2483038 2449065
15498 2449065 2392113 2431000 2519536 2537814 2460542 2389462 2358769 2352840 2321565 2391301 2357167
15487 2357167 2493475 2413712 2459629 2470323 2430990 2398997 2486714 2464793 2451781 2487382 2446209
15476 2446209 2407866 2443410 2453473 2449469 2495671 2456004 2438176 2480211 2449784 2333469 2409767
15465 2409767 2459784 2413852 2595261 2577990 2563164 2619230 2643485 2616251 2547002 2541215 2469242
15454 2469242 2459593 2497638 2562905 2587055 2546160 2470321 2500649 2503997 2545484 2609617 2657318 2559993
15442 2559993 2452747 2521020 2523283 2394249 2490298 2572466 2603680 2585978 2488005 2555449 2496988
15431 2496988 2504490 2428300 2409329 2418323 2384038 2433056 2509491 2538957 2525161 2445187 2441241 2564580
15419 2564580 2527438 2489250 2495326 2559945 2617942 2602958 2571877 2512884 2603517 2676369 2622203
15408 2622203 2551506 2581951 2641674 2649163 2531473 2517477 2504273 2531109 2574100 2585780 2466392
15397 2466392 2431194 2472628 2554777 2540318 2498945 2580212 2631596 2583269 2520388 2545949 2474945
15386 2474945 2439434 2492112 2515871 2482097 2643037 2641316 2565831 2642667 2577428 2513593 2560505
15375 2560505 2615115 2619097 2557593 2537795 2479222 2558966 2507226 2478193 2403925 2441268 2429334
15364 2429334 2456358 2544822 2577840 2558069 2433820 2466419 2497040 2537786 2515202 2476061 2512689
15353 2512689 2497221 2514768 2441928 2328605 2457495 2484032 2449909 2601102 2540783 2540600 2612850
15342 2612850 2635236 2479051 2413839 2498559 2560530 2518565 2522773 2500660 2547079 2572723 2618365
15331 2618365 2576851 2466984 2457395 2455098 2564205 2538019 2543227 2539226 2431144 2455872 2545510
15320 2545510 2554685 2523767 2507921 2491480 2542856 2513286 2499348 2519598 2536611 2535744 2514442 2516373
15308 2516373 2600620 2532261 2454593 2528341 2471071 2482994 2473613 2450546 2453879 2531441 2554265 2553334
15296 2553334 2399109 2466922 2554086 2584443 2549043 2592906 2593208 2567685 2555265 2622170 2539033
15285 2539033 2609489 2616041 2638218 2627630 2536129 2569244 2488868 2580356 2579676 2528506 2525287 2552008
15273 2552008 2535314 2571366 2553862 2647299 2650484 2601037 2612061 2595579 2560065 2518604 2504985
15262 2504985 2421526 2566903 2745389 2692288 2577567 2544631 2477423 2463709 2542211 2579214 2512564
15251 2512564 2505642 2509746 2514776 2545271 2542687 2634476 2616973 2530500 2536809 2635045 2673385 2592196
15239 2592196 2526451 2559333 2630933 2596972 2525855 2568642 2608238 2573457 2641345 2617437 2532521
15228 2532521 2559830 2492827 2559355 2545224 2530994 2514173 2515874 2548525 2558564 2612795 2527880
15217 2527880 2600218 2584318 2547519 2470504 2470783 2532518 2586863 2515154 2521530 2557603 2560987 2542611
15205 2542611 2566344 2675705 2631630 2611971 2598227 2643187 2573975 2454360 2405288 2514283 2522548
15194 2522548 2577296 2609160 2630450 2629028 2610274 2576787 2577255 2536355 2553063 2595637 2545062 2574735
15182 2574735 2621342 2641766 2554646 2569023 2599256 2568625 2516817 2472049 2457882 2652966 2716440
15171 2716440 2592640 2581097 2524839 2499090 2605652 2695138 2553894 2625551 2660122 2574247 2568981
15160 2568981 2632516 2576430 2547565 2652984 2629966 2616076 2609022 2644870 2697407 2684159 2604641
15149 2604641 2469919 2547456 2566993 2468029 2520207 2581165 2577467 2489889 2562495 2537765 2557797
15138 2557797 2616481 2543908 2415932 2507224 2568695 2591904 2642075 2536200 2511390 2607454 2736381
15127 2736381 2641265 2649388 2610849 2664763 2629322 2576912 2547881 2586507 2648564 2634932 2652880
15116 2652880 2590669 2582696 2612525 2552195 2557099 2570948 2694655 2720608 2656667 2664890 2635965 2659261
15104 2659261 2644282 2648013 2626176 2615385 2660809 2707256 2710338 2689961 2621624 2722683 2599248
15093 2599248 2558157 2633242 2672465 2585334 2635148 2649289 2744633 2691001 2610294 2697306 2629136
15082 2629136 2638842 2723621 2655941 2585646 2648408 2689962 2726935 2648841 2703694 2707946 2652935 2726863
15070 2726863 2606016 2597266 2690055 2672627 2764886 2722688 2682176 2746045 2744223 2625651 2576135
15059 2576135 2531819 2475806 2509366 2545035 2664226 2759697 2712235 2616801 2577171 2648380 2753803
15048 2753803 2825338 2734633 2595843 2594643 2604464 2593269 2598565 2552088 2508160 2463304 2548111 2581688
15036 2581688 2591984 2704685 2768884 2707819 2606792 2629460 2544146 2541688 2602841 2531622 2609496
15025 2609496 2687160 2661911 2593741 2536289 2571331 2525607 2560182 2601198 2597449 2673145 2694862
15014 2694862 2628417 2661106 2731200 2682774 2781661 2792584 2840147 2835066 2775490 2707843 2703503 2740986
15002 2740986 2632890 2582914 2693814 2721544 2691645 2732119 2756439 2595589 2564132 2545625 2558557
14991 2558557 2593869 2633359 2644161 2632360 2624839 2646528 2725062 2725021 2644871 2604763 2705028 2657390
14979 2657390 2651749 2590514 2706973 2847636 2796425 2665006 2646192 2521957 2574199 2633848 2643719
14968 2643719 2696067 2737741 2773551 2678520 2699282 2787096 2732884 2744982 2676547 2736473 2717360
14957 2717360 2733536 2681432 2520071 2698326 2762678 2716024 2768879 2698993 2682514 2646346 2703394
14946 2703394 2716118 2716415 2683529 2719087 2799808 2763483 2671322 2676318 2755144 2707869 2698844 2604205
$$ [...]
##END NTUPLES=NMR SPECTRUM
##END=
