##TITLE=1H_TG-2340-Vb
 CDCl3
 8 sc, 
 10.5.2023
##JCAMPDX= 6.0         $$ Bruker NMR JCAMP-DX V2.0
##DATA TYPE= NMR SPECTRUM
##DATA CLASS= NTUPLES
##ORIGIN= UXNMR, Bruker Analytische Messtechnik GmbH
##OWNER= root
$$ XWIN-NMR		Version 3.5
$$ Wed May 10 13:55:13 2023 Russian Standard Time (UT+4h)  she@DPX200
##.OBSERVE FREQUENCY= 200.13135
##.OBSERVE NUCLEUS= ^1H
##.ACQUISITION MODE= SIMULTANEOUS
##.ACQUISITION SCHEME= undefined
##.AVERAGES= 8
##.DIGITISER RES= 18
##SPECTROMETER/DATA SYSTEM= spect
##.PULSE SEQUENCE= zg30
##.SOLVENT NAME= CDCl3
##.SHIFT REFERENCE= (INTERNAL, CDCl3, 0, 15.7326)
##AUDIT TRAIL= $$ (NUMBER, WHEN, WHO, WHERE, WHAT)
$$ ##TITLE= Audit trail, XWIN-NMR		Version 3.5
$$ ##JCAMPDX= 5.01
$$ ##ORIGIN= Bruker BioSpin GmbH
$$ ##OWNER= she
$$ F:/spectra/data/she/nmr/H-F/1/pdata/1/auditp.txt
$$ ##AUDIT TRAIL=  $$ (NUMBER, WHEN, WHO, WHERE, WHAT)
(   1,<2023-05-10 13:53:13.51 +0400>,<she>,<DPX200>,
      <created by zg, POWCHK disabled, PULCHK disabled
       configuration hash MD5:
       00 E9 B6 7A A2 85 ED C7 34 08 36 98 17 FE 4E 26
       data hash MD5: 16K
       00 3A 34 8F 58 9D AE 4A 29 F0 BC 1D 6C BF ED 57>)
(   2,<2023-05-10 13:53:16.18 +0400>,<she>,<DPX200>,
      <Start of raw data processing
       efp BC_mod = 2 LB = 0.24 FT_mod = 6 PKNL = 1 PHC0 = -19840.47 PHC1 = 26.2008 SI = 16K 
       data hash MD5: 16K
       3D 53 24 08 09 DA 02 0F 68 B0 33 03 2D B1 A5 A9>)
(   3,<2023-05-10 13:53:33.12 +0400>,<she>,<DPX200>,
      <pk PHC0 = 19.26301 PHC1 = -7.400001 
       data hash MD5: 16K
       1E F8 84 61 7D DD FF 68 9D DD FB 08 F6 FC 1A 39>)
(   4,<2023-05-10 13:53:36.73 +0400>,<she>,<DPX200>,
      <abs ABSG = 5 
       data hash MD5: 16K
       E3 B5 05 18 3B 2B 8E 5A 36 0A AE 09 38 B5 DC 26>)
$$ ##END=
$$ 
$$ hash MD5
$$ A1 2B 3B 50 C7 C7 D0 6E 28 B8 D4 33 AE 9F 27 B0
##$RELAX= 
##$RELAX= 
##$RELAX= 
##$RELAX= 
##$RELAX= 
##$RELAX= 
$$ Bruker specific parameters
$$ --------------------------
##$DU= <F:/spectra>
##$EXPNO= 1
##$NAME= <H-F>
##$PROCNO= 1
##$TYPE= <nmr>
##$USER= <she>
##$AMP= (0..31)
100 100 100 100 100 100 100 100 100 100 100 100 100 100 100 100 100 100 
100 100 100 100 100 100 100 100 100 100 100 100 100 100 
##$AQSEQ= 0
##$AQ_mod= 1
##$AUNM= <au_zg>
##$AUTOPOS= <>
##$BF1= 200.13
##$BF2= 200.13
##$BF3= 200.13
##$BF4= 200.13
##$BF5= 200.13
##$BF6= 200.13
##$BF7= 200.13
##$BF8= 200.13
##$BYTORDA= 1
##$CFDGTYP= 0
##$CFRGTYP= 5
##$CHEMSTR= <none>
##$CNST= (0..31)
1 1 145 1 1 1 1 1 1 1 1 1 1 1 1 1 1 1 1 1 1 1 1 1 1 1 1 1 1 1 1 1 
##$CPDPRG= <>
##$CPDPRG1= <>
##$CPDPRG2= <>
##$CPDPRG3= <>
##$CPDPRG4= <mlev>
##$CPDPRG5= <mlev>
##$CPDPRG6= <mlev>
##$CPDPRG7= <mlev>
##$CPDPRG8= <mlev>
##$CPDPRGB= <>
##$CPDPRGT= <>
##$D= (0..31)
0 1.2 0 0 0 0 0 0 0 0.06 0 0.03 0 0 0 0 0.0002 0 0 0 0 0 0 0 0 0 0 0 0 
0 0 0 
##$DATE= 1683712393
##$DBL= (0..7)
120 120 120 120 120 120 120 120 
##$DBP= (0..7)
150 150 150 150 150 150 150 150 
##$DBP07= 0
##$DBPNAM0= <>
##$DBPNAM1= <>
##$DBPNAM2= <>
##$DBPNAM3= <>
##$DBPNAM4= <>
$$ [...]
##$SUBNAM3= <"">
##$SUBNAM4= <"">
##$SUBNAM5= <"">
##$SUBNAM6= <"">
##$SUBNAM7= <"">
##$SUBNAM8= <"">
##$SUBNAM9= <"">
##$SW= 18.05172834244
##$SWIBOX= (0..15)
0 0 2 0 0 0 0 0 0 0 0 0 0 0 0 0 
##$SW_h= 3612.71676300578
##$TD= 16384
##$TD0= 1
##$TE= 0
##$TE2= 300
##$TE3= 300
##$TEG= 300
##$TL= (0..7)
0 120 120 120 120 120 120 120 
##$TP= (0..7)
150 150 150 150 150 150 150 150 
##$TP07= 0
##$TPNAME0= <>
##$TPNAME1= <>
##$TPNAME2= <>
##$TPNAME3= <>
##$TPNAME4= <>
##$TPNAME5= <>
##$TPNAME6= <>
##$TPNAME7= <>
##$TPOAL= (0..7)
0.5 0.5 0.5 0.5 0.5 0.5 0.5 0.5 
##$TPOFFS= (0..7)
0 0 0 0 0 0 0 0 
##$TUNHIN= 0
##$TUNHOUT= 0
##$TUNXOUT= 0
##$USERA1= <user>
##$USERA2= <user>
##$USERA3= <user>
##$USERA4= <user>
##$USERA5= <user>
##$V9= 5
##$VALIST= <valist>
##$VCLIST= <CCCCCCCCCCCCCCC>
##$VD= 0
##$VDLIST= <DDDDDDDDDDDDDDD>
##$VPLIST= <PPPPPPPPPPPPPPP>
##$VTLIST= <TTTTTTTTTTTTTTT>
##$WBST= 1024
##$WBSW= 4
##$XGAIN= (0..3)
0 0 0 0 
##$XL= 0
##$YL= 0
##$YMAX_a= 195873
##$YMIN_a= -213831
##$ZGOPTNS= <>
##$ZL1= 120
##$ZL2= 120
##$ZL3= 120
##$ZL4= 120
##$ABSF1= 15.73036
##$ABSF2= -2.321489
##$ABSG= 5
##$ABSL= 3
##$ALPHA= 0
##$AQORDER= 0
##$ASSFAC= 0
##$ASSFACI= 0
##$ASSFACX= 0
##$ASSWID= 0
##$AUNMP= <proc_1d>
##$AZFE= 0.1
##$AZFW= 0.1
##$BCFW= 0
##$BC_mod= 2
##$BYTORDP= 0
##$COROFFS= 0
##$CY= -3
##$DATMOD= 1
##$DC= 0
##$DFILT= <>
##$DTYPP= 0
##$F1P= 0
##$F2P= 0
##$FCOR= 1
##$FTSIZE= 16384
##$FT_mod= 6
##$GAMMA= 0
##$GB= 0
##$INTBC= 1
##$INTSCL= 3.70164e-10
##$ISEN= 128
##$LB= 0.24
##$LEV0= 0
##$LPBIN= 0
##$MAXI= 10000
##$MC2= 0
##$MEAN= 0
##$ME_mod= 0
##$MI= 1.114404
##$NCOEF= 0
##$NC_proc= -6
##$NLEV= 6
##$NOISF1= 3.799351
##$NOISF2= 2.8
##$NSP= 0
##$NTH_PI= 0
##$NZP= 0
##$OFFSET= 15.73257
##$PC= 1
##$PHC0= -19821.21
##$PHC1= 18.8008
##$PH_mod= 1
##$PKNL= yes
##$PPARMOD= 0
##$PSCAL= 0
##$PSIGN= 0
##$REVERSE= no
##$SF= 200.13000779918
##$SI= 16384
##$SIGF1= 3
##$SIGF2= 2
##$SINO= 5.538805
##$SIOLD= 16384
##$SREGLST= <1H.CDCl3>
##$SSB= 0
##$STSI= 16384
##$STSR= 0
##$SW_p= 3612.71676300578
##$SYMM= 0
##$S_DEV= 0
##$TDeff= 16384
##$TDoff= 0
##$TI= <>
##$TILT= no
##$TM1= 0
##$TM2= 0
##$TOPLEV= 0
##$USERP1= <user>
##$USERP2= <user>
##$USERP3= <user>
##$USERP4= <user>
##$USERP5= <user>
##$WDW= 1
##$XDIM= 16384
##$YMAX_p= 377506444
##$YMIN_p= -437129
$$ End of Bruker specific parameters
$$ ---------------------------------
##NTUPLES= NMR SPECTRUM
##VAR_NAME=  FREQUENCY,     SPECTRUM/REAL,   SPECTRUM/IMAG
##SYMBOL=    X,             R,               I
##VAR_TYPE=  INDEPENDENT,   DEPENDENT,       DEPENDENT
##VAR_FORM=  AFFN,          ASDF,            ASDF
##VAR_DIM=   16384,         16384,           16384
##UNITS=     HZ,            ARBITRARY UNITS, ARBITRARY UNITS
##FACTOR=    0.220516191357247, 1,           1
##FIRST=     3148.55929566524, 0,            0
##LAST=      -464.157467340541, 0,           0
##MIN=       -464.157467340541, -437129,     0
##MAX=       3148.55929566524, 377506444,    0
$$ Real data points
##PAGE= N=1
##DATA TABLE= (X++(R..R)), XYDATA
$$ [...]
7163E290808J61379K2284J80784R4770K03120L50966L40029L51123L86563L42432
7153G724258L20813L40412K79763M76606O27354N68428P12948N83496O20489N75912
7143A2830479O26927P69496R17027R08161R37227J071360J202917J433280J755675
7134B2452549K023907K275470K748680L331713L933231M841603O064938P693191
7126E5365282R700028J1907451J3638962J3371909R104461K957457l986247j0050785
7118A02008518j2991048j4088740j3364089j1243851q892879o507503m998165
7111B9922243l789022k992136k494892k026223j779324j526365j320622r82882
7103A3010777q75337p61634p78324o92735m51726m62772k88802n8788m01914j40568
$$ y = [5290808, 5452187, 5474471, 5655255, 5750025, 5953145, 6304111, 6644140, 6995263, 7381826, 7724258, 8045071, 8385483, 8665246, 9141852, 9769206, 10337634, 11050582, 11634078, 12254567, 12830479, 13457406, 14226902, 15143929, 16052090, 16989317, 18060677, 19263594, 20696874, 22452549, 24476456, 26751926, 29500606, 32832319, 36765550, 41607153, 47672091, 55365282, 65065310, 76972761, 90611723, 103983632, 113088093, 116045550, 112059303, 102008518, 89017470, 74928730, 61564641, 50320790, 41427911, 34920408, 29922243, 26133221, 23141085, 20646193, 18619970, 16840646, 15314281, 13993659, 13010777, 12135440, 11373806, 10595482, 9902747, 9451021, 8988249, 8699447, 8640659, 8238745, 8098177]
7093H098177k63683j97221l05814l21676k27190l66239j89567l19297l02160j13672
7083E491658j18663j97975j05221j33015j50214K0928K17205J01292n7382P6708
7073E145321j25452l09071m29525l70500k70792l85690k01375j93457j79021j7167
7063B663271r0959j52003j8647o5601n4841o2166k11911q965K6299r0635m2087
7052A891755m955j41952J34540k20476o7844N1837q7471l8894M3418j61234j67187
7041A231537j36536n8809l9552J54790M7697j82588q3559K2552O9846N0972m3893
7030A032457L428M2992j68336L9416R6969n9971j07556K5942N6638j13800m3488
7019H04691J02884K5154L8449j45380p6432r4261N8227N918j06901J06802j56117
$$ y = [8098177, 7834494, 7637273, 7331459, 7009783, 6782593, 6416354, 6226787, 5907490, 5605330, 5491658, 5372995, 5175020, 5069799, 4936784, 4786570, 4807498, 5024703, 5125995, 5068613, 5145321, 5019869, 4710798, 4281273, 3910773, 3639981, 3254291, 3052916, 2859459, 2680438, 2663271, 2572312, 2420309, 2401662, 2336061, 2281220, 2219054, 2007143, 1998178, 2024477, 1933842, 1891755, 1886800, 1744848, 1879388, 1658912, 1591068, 1642905, 1555434, 1516540, 1559958, 1398724, 1231537, 1095001, 1036192, 996640, 1151430, 1199127, 1016539, 932980, 955532, 1025378, 1076350, 1032457, 1035885, 1078877, 910541, 949957, 1046926, 986955, 879399, 905341, 961979, 848179, 804691, 907575, 932729, 971178, 825798, 749366, 655105, 713332, 719250, 612349, 719151, 563034]
7008E63034l1820J58370q4083j41872R9735l6250j91363J89739N8987Q7260m5481
6997F26256p2832Q1651J0652j36490Q9377k8469L7098M8643j78316k7638J25809
6986E75741k4762l8705N4373j18607j000n6655K5741j8615J8950K0918k0001J4847
6974D32225k2900r7536n3297O7747l4136O2953j15071o9352n9192q272l6584K15703
6962B82288J4231o7287L5321o9559L0409Q9569j63551J93065R1217k4378P7778
6951D89103m1153M6240j16992l2534N26O1586j8469j5048J6632P0636n5923O6205
6939D70809J1198j13188j8225L6900J21341m1782j64553P1583J26583P1583k09982
6928C62267J9991r7306q2239K8552p1855M3763J8453J9441j4055N6663m590J25367
$$ y = [563034, 531214, 689584, 605501, 463629, 563364, 527114, 335751, 525490, 584477, 671737, 626256, 553424, 635075, 645727, 509237, 598614, 570145, 607243, 655886, 477570, 449932, 575741, 550979, 512274, 566647, 448040, 447040, 390385, 416126, 397511, 416461, 437379, 417378, 432225, 409325, 311789, 258492, 326239, 292103, 355056, 239985, 170633, 111441, 103169, 66585, 282288, 296519, 229232, 264553, 194994, 225403, 314972, 151421, 344486, 435703, 411325, 489103, 447950, 494190, 377198, 344664, 345190, 406776, 388307, 373259, 389891, 460527, 404604, 470809, 482007, 368819, 350594, 387494, 508835, 467053, 302500, 374083, 500666, 572249, 362267, 382258, 284952, 202713, 231265, 159410, 203173, 221626, 241067, 227012, 283675, 279085, 404452]
6916D04452p4404p5944j6045K2509J6698J8526J07941q3212j0456j5511K4869
6905C19423M2734n9333n279r2654P4603J3872l5080k5253o808k3149P9951M8795
6893C31822k744Q2871j02488N5745O1952Q4745Q9484j36361j23874j5191J6826
6882C42787m4351J01132p9040j316r0111j62418l847L2083K32178r9904l6824
6871A90369Q8416O9371k148O2006o7523Q2861j50106n3834J72796j8359n2782
6860C21067J5612o8324J0054j8495N9255l976k2963J17383n1354p9971q3836P0444
6848B64896R7122J9504L3042n8604m9477r737J28626J7359j32691M8924J5650
6837C74614q5141N57J043j24227M0065O4282j9544P4900M1313j52875l2399M29
$$ y = [404452, 330048, 254104, 238059, 260568, 277266, 295792, 403733, 320521, 310065, 294554, 319423, 362157, 302824, 297545, 204891, 279494, 293366, 258286, 233033, 226225, 203076, 283027, 331822, 329078, 411949, 309461, 365206, 427158, 511903, 601387, 465026, 341152, 325961, 342787, 298436, 399568, 320528, 319212, 229101, 66683, 62836, 94919, 327097, 227193, 190369, 278785, 348156, 346008, 408014, 340491, 423352, 273246, 219412, 392208, 373849, 321067, 336679, 268355, 278409, 259914, 319169, 315193, 292230, 409613, 358259, 278288, 194452, 264896, 362018, 381522, 414564, 355960, 306483, 296746, 425372, 442731, 310040, 358964, 374614, 289473, 290030, 291073, 166846, 206911, 271193, 251649, 326549, 367862, 214987, 182588, 183017]
6825A83017j14171Q1798k9249l0823M2026J27596L8596n537j39048k4460r018
6814A20727j04676J08925J5333J8269j178J08475l4945Q2581N700n779j03058
6803B10374O2770J8297j3424j07373m4274P6610M8710L1522o3066l4408L383O4773
6791B53894O4480r3385k22101K2401J59439M3241N9974m2518O0207j6244o7494
6780B21894N4350r4529q8563l0331K4110K904L5602L4858K8111L1515l0543j32940
6768E6438N909j03533J3717J23630L3365j21658j3417J16419o7093n7814L4203
6757B0166R3566q9125K3552L2465j12238K5772l5185K6402P2272p9126O2562R1084
6745A32167q5143m0689J2065Q8130j079J1448J01319j02186n4773l416P5064m0452
$$ y = [183017, 68846, 150644, 121395, 90572, 132598, 260194, 298790, 293253, 154205, 129745, 120727, 16051, 124976, 140309, 158578, 157400, 265875, 230930, 313511, 319211, 313432, 210374, 273144, 291441, 278017, 170644, 126370, 202980, 251690, 283212, 220146, 185738, 189121, 253894, 318374, 224989, 2888, 25289, 184728, 227969, 287943, 245425, 305632, 289388, 221894, 276244, 181715, 93152, 62821, 86931, 89835, 125437, 160295, 188406, 219921, 189378, 56438, 62347, -41186, -27469, 96161, 129526, 7868, -5549, 110870, 43777, -14037, 20166, 113732, 24607, 48159, 80624, -31614, -5842, -41027, -14625, 57647, -21479, 41083, 132167, 47024, 6335, 18400, 106530, 105451, 116899, 218218, 116032, 61259, 57843, 132907, 92455]
6733I2455m747l944Q489J57805l8476O8568O7814J53212l7389J04369l6728L7864
6721E69292R5841J5971J07349p8080j98472j99105Q7551k6915l6974p4608p687
6710B54163J4558j93569j1289p896l7009L059O5169K8509Q4736l3240j30304N2236
6698H9123M0620K1606l6022j1138o6821r1362L4053M9201n2824k2209j11155Q7689
6686f9239Q7519M771J8666R8850j9342k7476n8678J4934J0865M0533l481o7115
6674C0807L5459l911m9240J42013j16670j66020J61980O9213p1233J07331m3873
6663I5856n4653q1592K500J06753q5183j42979Q7129N6000j08471J45901m3201
6652b1940P58K0189M9432j8023Q9078n4630l4067Q240o0116m9926J6591Q7426
$$ y = [92455, 87708, 83764, 92253, 250058, 211582, 280150, 347964, 501176, 463787, 568156, 531428, 569292, 665133, 681104, 788453, 710373, 511901, 312796, 400347, 373432, 336458, 261850, 254163, 268721, 75152, 63863, 55967, 18958, 22017, 87186, 115695, 200431, 167191, 36887, 89123, 129743, 151349, 115327, 104189, 37368, -53994, -19941, 29260, -23564, -45773, -156928, -69239, 18280, 23051, 41717, 140567, 121225, 93749, 35071, 50005, 60870, 101403, 97922, 30807, 66266, 62355, 13115, 155128, 38458, -127562, 34418, 103631, 32398, 139729, 95856, 41203, -40389, -37889, 68864, -16319, -159298, -72169, -16169, -124640, 21261, -21940, -21182, -993, 48439, 30416, 119494, 64864, 30797, 39037, -21079, -71005, -54414, 33012]
6640C3012K9075o6875m2442O7261o3765n2441N8406j6556j14725O6873Q2006k8937
6628d9108P70L9077J1192P5134N837J8155k4102J8568j01448l5298J54445K6590
6616A39812K0347j37613o6156L8081P5247j38455M3760k9829J44133j7385p6587
6605d645j43540J7684J80073J06505l6956j14692J19303q1693q2059J28681J71278
6594B59939j890j22036q9692o1955q894O9723J2552J3480Q026o7154p8265M9496
6582a6670M3447L0649q0559N8999J37871L8286j0926M7054J20851m2135p3576
6571B53291j6417K8677q8040m7625L0893M6169K7128o6922P7231Q4903P9868N3218
6559D62374R907O5256L5022Q053j39918j6113m3403j16902k9519j2836q6096J04852
$$ y = [33012, 62087, -4788, -47230, 20031, -43734, -96175, -37769, -54325, -169050, -102177, -20171, -49108, -48338, -9261, 1931, 77065, 82902, 101057, 76955, 95523, -5925, -41223, 113222, 139812, 160159, 22546, -43610, -5529, 69718, -68737, -24977, -54806, 89327, 71942, -4645, -148185, -130501, 49572, 156077, 119121, 4429, 123732, 42039, -40020, 88661, 259939, 258049, 136013, 46321, -15634, -24528, 45195, 57747, 71227, 79253, 12099, -66166, -16670, 26777, 57426, -23133, 35866, 173737, 212023, 201097, 248151, 369002, 326867, 253291, 236874, 265551, 177511, 129886, 160779, 206948, 234076, 167154, 244385, 329288, 409156, 462374, 472281, 537537, 572559, 580612, 440694, 424581, 381178, 264276, 234757, 221921, 135825, 240677]
6547B40677M2993n883L9662j7267p4900o0607k8892k9458J9109J4831N2500o0836
6535A31929m0138l3174L1553j08349J23901q0264N648R1111o0821n4225J23388
6524A30559q610J388J34383l9091o945M2864l1638n0186n2562k6728R0060L7092
6512B20586j47088L5333R3878j9758l8742r5582J5317n893j84123M6700M2043
6501c7329Q2036K8581j05138k0649L810J05825N6258O821k0129m0055J37969n8224
6489A39776q5272j12583q08Q0032o4045J5415L8475R5367k1117n4417O5609j4161
6477H2271K7582P3445n1732q826m7095l2001Q6278l8550p2938L3571J304R9521
6465A52830N0043j19054j43151J9561R463m5299N6934O6078l5442J00709l7946
$$ y = [240677, 283670, 277787, 317449, 300182, 225282, 164675, 135783, 106325, 125434, 140265, 192765, 131929, 91791, 58617, 90170, -18179, 105722, 25458, 31106, 122217, 61396, 7171, 130559, 121949, 123337, 257720, 218629, 211684, 254548, 222910, 172724, 120162, 93434, 183494, 220586, 73498, 108831, 202709, 182951, 144209, 48627, 63944, 58051, -126072, -79372, -37329, 44707, 73288, -31850, -52499, -48689, 57136, 113394, 120215, 100086, 60031, 198000, 139776, 54504, -58079, -58887, 21145, -42900, -27485, 10990, 106357, 85240, 30823, 96432, 82271, 109853, 183298, 131566, 122740, 75645, 43644, 129922, 91372, 18434, 52005, 53309, 152830, 202873, 83819, -59332, -39771, -30308, -75607, -18673, 47405, 11963, 112672, 74726]
6454G4726j1628j16745R9231K4484j8120P7985J2217j7970n7246J8705r9086R2278
6442G8831J0236k4635N2442M5355l7217p1553k6445L0065N0436N9124O3382o8021
6430A62000K3391R3160p3673j09361n0362k2733M6707P5480J40840q1937M6754
6419B50266j6029o3823q858n3058J20989M4829r5897P5514M3012k23089L612J83185
6407B60653N0609M1812p8131M8023n5326o4059O9064K919n3187J0778m8306P0684
6395B55533p811m2129j49104o6662j0435J80047R1495r2618k9089o5414J9350
6384H3163J37905J09343L5259j82207q2216J60806j63856m4500P565J43655O7007
6373B71924J7171n475K8331K2505M3746J62093j7249j67648l8573Q4443m937L5362
$$ y = [74726, 63098, -53647, 45584, 70068, 51948, 129933, 142150, 124180, 66934, 85639, -13447, 78831, 89067, 64432, 116874, 162229, 125012, 53459, 27014, 57079, 107515, 166639, 230021, 162000, 185391, 278551, 204878, 95517, 45155, 22422, 69129, 144609, 285449, 203512, 250266, 234237, 170414, 161556, 108498, 229487, 274316, 178419, 253933, 296945, 73856, 77468, 260653, 311262, 353074, 274943, 322966, 267640, 203581, 272645, 275564, 222377, 233155, 184849, 255533, 247722, 205593, 56489, -10173, -20608, 159439, 250934, 158316, 129227, 63813, 83163, 221068, 330411, 365670, 183463, 101247, 262053, 98197, 53697, 61262, 204917, 271924, 289095, 283620, 311951, 334456, 378202, 540295, 523046, 355398, 316825, 401268, 396331, 431693]
6361D31693K4178k1199O943k2346J5150l3016K7190p58l0269n094J57184m8546
6349E01110j36992O8176J20191j08466n5r0109J5669r3136R0939J4040p1954J32478
6337D41891m7342j3858L6555p5501n8091N4277j59653m1437P1598R9280O1789
6326C69508m7042K6579q6525m1066P9524K37463J438l2567J07353n6496n4166
6315E04003J0405j5328l03j56024p3667K2904J07173L4769j32870J90451p8952
6304D12561j39758J18035M0116m2923M9695r5920J2824l0800Q9566k2987j56677
6293B33732J36225K9762m728J5405N9052K1420m0991K5232j39635j26833J25123
6282C33764m4800K953N6020j7774Q739O0207K7248r3458Q8198r728J3873j35414
$$ y = [431693, 455871, 434672, 441615, 419269, 434419, 401403, 428593, 427835, 397566, 392472, 549656, 501110, 364118, 432294, 552485, 444019, 443964, 353855, 369524, 276388, 367327, 381367, 309413, 441891, 394549, 380691, 417246, 341745, 283654, 337931, 178278, 136841, 208439, 307719, 369508, 322466, 349045, 262520, 221454, 300978, 538441, 539879, 507312, 614665, 558169, 504003, 514408, 499080, 498777, 342753, 269086, 291990, 399163, 433932, 301062, 491513, 412561, 272803, 390838, 430954, 388031, 437726, 341806, 354630, 323830, 413396, 390409, 233732, 369957, 399719, 394991, 410396, 469448, 490868, 449877, 475109, 335474, 208641, 333764, 288964, 291917, 347937, 330163, 338902, 399109, 426357, 332899, 421097, 411369, 425242, 289828]
6270B89828n3066R6524L0553N9104R1585M1744q2873J11883l7045p2342Q72Q7288
6258E64055o9822p5608j1842J01201R6536q5349N9714j26394M6876o0418p3598
6247C65351R9204Q8857L335O2224Q0593j38116J6400k51N9661N5582j7262r888
6235F65690M5105j50934l3329J46254M0209J1008j3184j07774r0310K41037q2722
6224F71050l9530j4699o790j8587L5835Q2002p3961K3330k4845O3284k3673l6672
6212F36744M3120L4658J49861k4536n7132L595k2918n1532R0724J70532p10m4108
6200I28298k0671O416R0634J9165J7716R1340N4051m7550p598n7166J3002P5649
6188A163286L5804Q8405J898o4725Q4734k2168n0701N8965M8785k5n9716m9355
$$ y = [289828, 236762, 333286, 363839, 422943, 514528, 556272, 473399, 585282, 548237, 475895, 476767, 564055, 494233, 418625, 406783, 507984, 604520, 519171, 578885, 452491, 499367, 438949, 365351, 464555, 553412, 556747, 618971, 699564, 561448, 577848, 577597, 637258, 692840, 675578, 665690, 710795, 559861, 526532, 672786, 712995, 724003, 710819, 603045, 512735, 753772, 671050, 631520, 616821, 610031, 591444, 627279, 709281, 635320, 658650, 633805, 697089, 673416, 636744, 679864, 714522, 864383, 839847, 782715, 786310, 763392, 711860, 802584, 973116, 972406, 928298, 907627, 914043, 1004677, 1023842, 1041558, 1132898, 1186949, 1139399, 1131801, 1074635, 1087637, 1163286, 1199090, 1287495, 1289393, 1224668, 1309402, 1287234, 1236533, 1295498, 1344283, 1344258, 1284542, 1235187]
6176A235187J13625Q3640K2073j5012J49984P2746N3184m551p9572J03590k8377
6165A706517L5089J00711P2368j02106P8189J39668J11281K8318k3222n6117k2132
6154B068564K0005J24668P2902q6733R1523L2524K959L8884Q8486n2654l7381
6143B363747K00942J47691M0314k1247J60117J01571O808j9584J27337J18532
6133C226228q3429j7241K98623j407J00371J56949O0033N8166J39265K09965J97209
6122D344732J75752O3438R4067J13798O9652K12132K54325L22876J93289J60672
6112F004733L54405K14965K33304K19318K67093L78597M55137N33676M95410M97974
6102I654612N46980Q18600J025430J055587J306329J610538J822633K119001K617815
$$ y = [1235187, 1348812, 1432452, 1454525, 1439513, 1589497, 1662243, 1715427, 1710876, 1631304, 1734894, 1706517, 1741606, 1842317, 1914685, 1812579, 1890768, 2030436, 2141717, 2170035, 2146813, 2090696, 2068564, 2088569, 2213237, 2286139, 2199406, 2290929, 2323453, 2326412, 2365296, 2453782, 2401128, 2363747, 2564689, 2712380, 2752694, 2731447, 2891564, 2993135, 2999943, 2980359, 3107696, 3226228, 3142799, 3125558, 3424181, 3422774, 3523145, 3680094, 3740127, 3798293, 3937558, 4147523, 4344732, 4520484, 4583922, 4677989, 4791787, 4861439, 5073571, 5327896, 5650772, 5844061, 6004733, 6359138, 6574103, 6807407, 7026725, 7293818, 7672415, 8127552, 8661228, 9156638, 9654612, 10201592, 11020192, 12045622, 13101209, 14407538, 16018076, 17840709, 19959710, 22577525]
6093B2577525L412389L869857L160520J158683p55577j625841j981083j888666
6085B7927807j659980q24407J58752J139743J892038K600482K584074R55912j272774
6076C3501647k628479k976482l244594l198660k727419k004631j556180j110094
6068A4055108r29141p32770m86268k25742j64110j33432k4673m4005R0175L9440
6058A1444582K8972M7581J87643L27337M93748M89675N18907P21665Q15997J010575
6048A6086682J281376J483890J777170K162428K627875L283629M132681M887922
6040C7723653M823051K648453k16692j950735k569658k838752k573782j911961
6032C3133577n80712P45736J943331L140913L605338K109818o75999l029981m105653
$$ y = [22577525, 25989914, 29859771, 33020291, 34178974, 33423397, 31797556, 29816473, 27927807, 26267827, 25443420, 25602172, 26741915, 28633953, 31234435, 33818509, 34774421, 33501647, 30873168, 27896686, 24652092, 21453432, 18726013, 16721382, 15165202, 14055108, 13125967, 12393197, 11906929, 11681187, 11517077, 11383645, 11358972, 11314967, 11405142, 11444582, 11473554, 11521135, 11708778, 12036115, 12529863, 13019538, 13538445, 14260110, 15076107, 16086682, 17368058, 18851948, 20629118, 22791546, 25419421, 28703050, 32835731, 37723653, 42546704, 45195157, 44978465, 43027730, 40458072, 37619320, 35045538, 33133577, 32552865, 33298601, 35241932, 38382845, 41988183, 44098001, 43422002, 40392021, 36286368]
6023C6286368m351278m580610m337368l407189k602721k094658j442295j303512
6015A2166737j183006p98873o68783n53838n63036n17610l93732k74637k58022
6006F955200l27368l81110k94493r8376j26513j07540j85948j40195q4375r5837
5996E113445j62817j83402j57530m1212p4597n8438j30937k3379N6260J0135O443
5985D353971j35124j37601o3951l7453k62538k00140j77515q6350j10117l357
5975C139825j08800q5020Q2293q0662p5056J2829k6299J7968K5916K1006k5474
5964B898526j10578l2089J16373k8880N2322q9216L6327J51450k0113P0770R8340
5953C143232L2032m1320j80j82721j46658q5075j44127j07117j02349j11134p6030
$$ y = [36286368, 31935090, 27354480, 23017112, 19609923, 17007202, 14912544, 13470249, 12166737, 10983731, 10184858, 9516075, 8962237, 8399201, 7881591, 7487859, 7213222, 6955200, 6627832, 6246722, 5952229, 5853853, 5727340, 5619800, 5433852, 5293657, 5209282, 5113445, 4950628, 4767226, 4609696, 4568484, 4493887, 4435449, 4304512, 4281133, 4337393, 4347528, 4353971, 4218847, 4081246, 4017295, 3979842, 3717304, 3517164, 3339649, 3253299, 3143182, 3139825, 3031025, 2946005, 3028298, 2947636, 2872580, 2885409, 2859110, 2877078, 2902994, 2924000, 2898526, 2787948, 2755859, 2872232, 2843352, 2895674, 2806458, 2842785, 2994235, 2974122, 3044892, 3143232, 3175264, 3133944, 3133764, 2951043, 2804385, 2719310, 2575183, 2468066, 2365717, 2254583, 2178553]
5942B178553j8911n8540m8924J95550m3943j16956p2940k0963P0642J70552p0873
5931B163247L9327q8050J36417L7304k1679j1653J3980K3006K15729R5451o257
5920B596822l4870L3417j23024j0412P70j93580p455k0342N3095j17127L4505
5909B211799M5037K9887o438J3645N9271P0007J83590J17654K3141m1435j00773
5898B605385o9165j25694j51255j6696m366o5575k3071L9383k7605j33956k0023
5887B007362O4950J29489J61240P646j77080J4064N8050L8201J4837Q2838l7356
5876B364241O9960K80362K51367J85656J86322J63980J78900L4242n2546p2621
5866C589863j42614j64073j79253j84745o9625m5814j4818R9257j6396p9044M4399
$$ y = [2178553, 2159642, 2101102, 2052178, 2247728, 2203785, 2086829, 2013889, 1992926, 2063568, 2234120, 2163247, 2202574, 2114524, 2250941, 2288245, 2266566, 2254913, 2268893, 2291899, 2507628, 2603079, 2596822, 2561952, 2595369, 2472345, 2461933, 2462703, 2269123, 2261668, 2241326, 2294421, 2177294, 2211799, 2256836, 2286723, 2280285, 2293930, 2353201, 2423208, 2606798, 2724452, 2747593, 2706158, 2605385, 2536220, 2410526, 2259271, 2242575, 2238209, 2172634, 2149563, 2188946, 2161341, 2027385, 2007362, 2072312, 2201801, 2363041, 2370687, 2193607, 2207671, 2265721, 2303922, 2318759, 2401597, 2364241, 2434201, 2714563, 2965930, 3151586, 3337908, 3501888, 3680788, 3715030, 3662484, 3589863, 3447249, 3283176, 3103923, 2919178, 2849553, 2803739, 2788921, 2888178, 2871782, 2792738, 2837137]
5855B837137O8038M4012L5361L8380j41135M8098O2775K8873M1434N5326J77846
5844C296145J72707J66462J83497J75907K32033K95584J2439k6533p4913q8414
5834D344914k43904k46017o5189j03747n219j47032j07925J74548J64046j43396
5824C621079k3515J40051r5951n7773L06L9629J50931n779P1590O5211P9498L3912
5812D019189J27587l2184J08327J55940P5354K93543J34711J09156Q8388J09823
5802E189834O6353P2672N0539J59705K17493J07962Q4952J53486L01462J21295
5792F525753J63072K27315K16980J46979L15847L17270K64234L24401L34521L20196
5782I156568M69284N26510M97635O90878P14316Q87304J044704J361340J651504
$$ y = [2837137, 2905175, 2949187, 2984548, 3022928, 2881793, 2929891, 2992666, 3021539, 3062973, 3118299, 3296145, 3468852, 3635314, 3818811, 3994718, 4226751, 4522335, 4534774, 4508241, 4433328, 4344914, 4101010, 3854993, 3789804, 3686057, 3680838, 3533806, 3425881, 3600429, 3764475, 3621079, 3597564, 3737615, 3641664, 3583891, 3584197, 3623826, 3774757, 3768978, 3840568, 3905779, 3985277, 4019189, 4146776, 4114592, 4222919, 4378859, 4454213, 4747756, 4882467, 4991623, 5080011, 5189834, 5256187, 5328859, 5379398, 5539103, 5756596, 5864558, 5949510, 6102996, 6404458, 6525753, 6688825, 6916140, 7133120, 7280099, 7595946, 7913216, 8177450, 8501851, 8836372, 9156568, 9625852, 10152362, 10649997, 11340875, 12055191, 12942495, 13987199, 15348539, 17000043]
5773A7000043K055568K405258K881528L849980M846021M510800K514161q47163
5765C9216196k393359k816745l391779l652711l413061k599064j891940j250642
5757A7806895q60884n63336l08932j27603l9475K36196M75130O20710J046461
5748A8285162J366995J696456J893523K475172L388792M379936M975277M057646
5740D2518959J164536k003939k941127l409608l916066m046108l647245k740294
5732B0979108j939613j299073j024486q23282m63207k12197j19905J65128N02109
5723A5764582O70512Q91268J338863J601346K326824K960528L282810K371256
5715C1207989J73964j598018k027849k322703k608501k619684k345503j672389
$$ y = [17000043, 19055611, 21460869, 24342397, 28192377, 33038398, 37549198, 40063359, 39216196, 36822837, 34006092, 30614313, 26961602, 23548541, 20949477, 19057537, 17806895, 16946011, 16382675, 16073743, 15946140, 15906665, 16142861, 16617991, 17238701, 18285162, 19652157, 21348613, 23242136, 25717308, 29106100, 33486036, 38461313, 42518959, 43683495, 41679556, 38738429, 35328821, 31412755, 27366647, 23719402, 20979108, 19039495, 17740422, 16715936, 15892654, 15429447, 15217250, 15097345, 15262473, 15764582, 16435094, 17326362, 18665225, 20266571, 22593395, 25553923, 28836733, 31207989, 31381953, 29783935, 27756086, 25433383, 22824882, 20205198, 17859695, 16187306]
5707A6187306j297535r31511m60158n31467l67895j05245o4925J01874L43327
5698A2873771N43463Q12998R24464J226958J490811J975390K803021L484340L550923
5689B9686139J851633p98222k304368k566739k971569l274552l155042k451232
5681A4016048j868156j381413j137199r05828p69102n70924n91096l08169m61620
5672F022541l52151l05035l51466j66708j01250j44643k18376j73326q1846o2161
5662D065579o6268j0646o1004o878j7611j63851j89689j80212o5443J4771j34455
5651C184293n9830j11170j06641m0327j61029m581L1651l5450j26732j1208J20784
5640B679760o1448l9177J1635r1333j47488m3J43261q2726n4301J4341P489j3881
$$ y = [16187306, 14889771, 13958260, 13498102, 12966635, 12598740, 12493495, 12428570, 12530444, 12873771, 13417234, 14230232, 15154696, 16381654, 17872465, 19847855, 22650876, 26135216, 29686139, 31537772, 30739550, 28435182, 25868443, 22896874, 19622322, 16467280, 14016048, 12147892, 10766479, 9629280, 8723452, 7954350, 7383426, 6792330, 6484161, 6022541, 5670390, 5365355, 5013889, 4847181, 4745931, 4601288, 4382912, 4209586, 4127740, 4065579, 3999311, 3988665, 3927661, 3920783, 3903172, 3739321, 3549632, 3369420, 3303977, 3318748, 3184293, 3124463, 3013293, 2906652, 2866325, 2705296, 2700715, 2732366, 2696916, 2570184, 2558976, 2679760, 2618312, 2579135, 2590770, 2499437, 2351949, 2351906, 2495167, 2412441, 2358140, 2372481, 2379970, 2366089]
5628B366089q0106r0711P6379o3947P3254n5827o4319N721R1827r1812k04231
5617A962317K5045j06390L5182j3145N7467n151k8849q7338O0218m8257J31635
5606A982734o0586k4413L879j39410o5901R0349K6011p0628Q2468O7543l6145
5595A855901l6111P0294K1328Q6430M1399l0121j8664q1779J0718l3752L8391
5584A924034l4647L4992J40908J766j4613K2681M6452l9185j5987P6882m3122
5573B100161J5738J84270n9745K2948J08661L7681M0759N4029K2221J48417J42110
5562B817250m108K98030L02916J06634M6922m1435J83194O1285r8002p3389k41222
5551C358075p9649q2790l7301j59486J6347n8993J10217J35055N4012J64238J39248
$$ y = [2366089, 2285983, 2195272, 2271651, 2207704, 2280958, 2225131, 2160812, 2166533, 2258360, 2166548, 1962317, 1987362, 1880972, 1916154, 1903009, 1960476, 1955325, 1926476, 1839138, 1899356, 1851099, 1982734, 1922148, 1897735, 1901614, 1762204, 1696303, 1786652, 1812663, 1742035, 1824503, 1892046, 1855901, 1819790, 1890084, 1911412, 1997842, 2039241, 2009120, 1990456, 1908677, 1919395, 1885643, 1924034, 1889387, 1924379, 2065287, 2067053, 2052440, 2075121, 2121573, 2082388, 2066401, 2143283, 2100161, 2115899, 2300169, 2240424, 2263372, 2372033, 2409714, 2450473, 2504502, 2526723, 2675140, 2817250, 2813142, 3111172, 3414088, 3520722, 3567644, 3526209, 3709403, 3770688, 3672686, 3599297, 3358075, 3278426, 3195636, 3158335, 2998849, 3015196, 2956203, 3066420, 3201475, 3255487, 3419725, 3558973]
5540C558973K17214K44719K61543k4370m2241j26790k86848k46510j97059k72045
5530C086586r3342k56928j1167p5815n8803q4178j07029o000j50426j0016M0007
5519B272889q3225J14770J80534j82392n0250J5105J70923P5099j30694l8699
5509B344060q6225L7962L9132l0815l4402J001M6443N5558r1892j08185J0439
5498B183076o5232N8988k5990M9662J81969K024j8186J2799l218R4461J73167
5487B643520M0725J56536j49286l8926q9070k0235J68992p1468K7447j21652j26569
5476B420014N4214R0219o7650L6706M9416J44482L7510J0316N2117R5658L8732
5465B961734J08090K56115Q9430j02724K04k2260j686k2974k1342r4288m6585
$$ y = [3558973, 3776187, 4020906, 4282449, 4258079, 4215838, 4089048, 3802200, 3555690, 3358631, 3086586, 2993244, 2736316, 2725149, 2649334, 2590531, 2506353, 2399324, 2393324, 2242898, 2232882, 2272889, 2189664, 2304434, 2484968, 2302576, 2252326, 2267431, 2438354, 2513453, 2382759, 2344060, 2257835, 2295797, 2334929, 2304114, 2269712, 2270713, 2317156, 2372714, 2280822, 2172637, 2183076, 2117844, 2176832, 2150842, 2200504, 2382473, 2384497, 2366311, 2379110, 2375892, 2470353, 2643520, 2684245, 2840781, 2691495, 2652569, 2563499, 2543264, 2712256, 2640788, 2668235, 2546583, 2420014, 2474228, 2564447, 2496797, 2533503, 2582919, 2727401, 2764911, 2775227, 2827344, 2923002, 2961734, 3069824, 3325939, 3415369, 3312645, 3312849, 3290589, 3288903, 3265929, 3244587, 3150299, 3103714]
5454C103714j223q4262r963J7160N2526j39256J03584M9392J9506J04618J42670
5443C358466L598n5824J08853j3982j6981K0205J79110K2613J1518J53009L3514
5432C804099N985M792J45529Q2498J55894J65424J70963J95621J71890n4737n3978
5421D793980L0n0161q2098j10155k42807K3744n8660L7405J27141J86838Q3124
5410D708381R4963M9930J10006J89104J17538j1642r2517O2162K770J11554q6813
5399E255436j78758k31816l4828j72937k78628j13991j05524j98791j9493p7219
5389C843451r7325m0624O7756q6081o0276L2945m2112q5815L3935j17903O0728
5378C508679j20916j38601p5645k1900o9622j02080j14430j38663j65132m7152
$$ y = [3103714, 3102491, 3018229, 3008266, 3025426, 3077952, 2938696, 3042280, 3091672, 3111178, 3215796, 3358466, 3362064, 3306240, 3415093, 3401111, 3384130, 3404335, 3583445, 3606058, 3617576, 3770585, 3804099, 3810084, 3814876, 3960405, 4042903, 4198797, 4364221, 4535184, 4730805, 4902695, 4847958, 4793980, 4794010, 4743849, 4661751, 4551596, 4308789, 4332533, 4273873, 4311278, 4438419, 4625257, 4708381, 4803344, 4853274, 4963280, 5152384, 5269922, 5258280, 5165763, 5227925, 5230695, 5342249, 5255436, 5076678, 4844862, 4810034, 4637097, 4358469, 4244478, 4138954, 3940163, 3920670, 3843451, 3746126, 3705502, 3773258, 3687177, 3626901, 3659846, 3617734, 3531919, 3565854, 3447951, 3508679, 3387763, 3249162, 3173517, 3151617, 3081995, 2979915, 2865485, 2726822, 2561690, 2514538]
5368B514538J73471N7408m3290Q6124J00185p1474n3612j45802o1093O9194O6178
5357B691827J01229J20795m1342r8957o4680m028j10776K7219N992q2458K6576
5346B571397m272k1494l2379k4550J64413L4995j46061j57572K9362P2146J34271
5335B620256n975k3704Q9918Q4498j9073N2800J44010J04997p9650q3859N5758
5324B939976j0901M0834K6031N5206r9731k8147N084J248J52422N9118P6615R218
5312C226973J5557K49836J33860M4553K6928L4072J69689J36060J55638J11905
5302D305071M9549j40025K7675J6889l1319j9479r2785j44232J4210L1158M8198
5291D064910n3417Q2981J04874J34450K42795R9163L5978K43864L19942K49827
$$ y = [2514538, 2688009, 2745417, 2702127, 2788251, 2888436, 2816962, 2763350, 2617548, 2556455, 2625649, 2691827, 2793056, 2913851, 2872509, 2773552, 2708872, 2704844, 2594068, 2621287, 2627279, 2544821, 2571397, 2567125, 2545631, 2513252, 2488702, 2653115, 2688110, 2542049, 2384477, 2413839, 2485985, 2620256, 2614281, 2590577, 2680495, 2764993, 2745920, 2798720, 2942730, 3047727, 2968077, 2884218, 2939976, 2929075, 2969909, 2995940, 3051146, 2951415, 2923268, 2928352, 2929600, 3082022, 3141140, 3217755, 3226973, 3242530, 3492366, 3626226, 3670779, 3697707, 3731779, 3901468, 4037528, 4193166, 4305071, 4354620, 4214595, 4242270, 4259159, 4227840, 4208361, 4115576, 3971344, 3985554, 4016712, 4064910, 4011493, 4094474, 4199348, 4333798, 4576593, 4675756, 4711734, 4955598, 5275540, 5525367]
5281E525367K72568J88523J65033J05696J74337J84881Q6588j96572j70551k08813
5271F127057k27621j24515j30904r9187q5628J21072Q7804R6275O9391j17618
5261E716126K75115J52523J71772L32750K82668K44561N20681L20824J24810k8613
5251H113217j30852j264j23857j76703l07591k55843k66074j61012j13007j94882
5241F382132j24690O5459J47952q8748J42231K16210K26107J34401M8831O9036
5231G218921L06501K65547J51417K45406J28606J5957j50676j67075k15097J553
5221G801060k55076k63347j65975n0218O7035j2155J3452O867J54846J83284J19557
5210G599330L97125J58126J89848K32347J73168J69094M830Q66M8457o6199K5357
$$ y = [5525367, 5797935, 5986458, 6151491, 6257187, 6431524, 6616405, 6702993, 6506421, 6335870, 6127057, 5899436, 5774921, 5644017, 5544830, 5459202, 5580274, 5668078, 5764353, 5833744, 5716126, 5991241, 6143764, 6315536, 6648286, 6930954, 7175515, 7696196, 8017020, 8141830, 8113217, 7982365, 7981101, 7857244, 7680541, 7372950, 7117107, 6851033, 6690021, 6577014, 6382132, 6257442, 6322901, 6470853, 6382105, 6524336, 6740546, 6966653, 7101054, 7149885, 7218921, 7525422, 7790969, 7942386, 8187792, 8316398, 8332355, 8181679, 8014604, 7799507, 7801060, 7545984, 7282637, 7116662, 7066444, 7133479, 7121324, 7134776, 7141643, 7296489, 7479773, 7599330, 7996455, 8154581, 8344429, 8576776, 8749944, 8919038, 8923868, 8924734, 8973191, 8906992, 8932349]
5199H932349J71818k6201m8937J36095K95863K20727L31068K93958K03697L09630
5189A0820067L80606M39560N48957N45183O74681O84548Q17502Q57525J393915
5180A7162544J507090J437460Q49176J76713J53871L10496J48195K94157P58445
5171B2798147J149864J435381K010409K737029K670672J638532K92521K09171
5163C4941726L92162M17857N68362R72689Q59764N43863J252314J779928K035103
5154D3763768K048606J911383K238612K166327K384198L304144M041163L547189
5146F5405390K879855K776164K198863R54107k3494l53985r11938k649203l526634
5137F6749125l346816k892164l114845k637887j978259k152283j810010j008404
$$ y = [8932349, 9104167, 9077966, 9029029, 9165124, 9460987, 9681714, 10012782, 10306740, 10510437, 10820067, 11200673, 11640233, 12189190, 12734373, 13409054, 14093602, 14911104, 15768629, 17162544, 18669634, 20107094, 20956270, 21132983, 21286854, 21597350, 21745545, 22039702, 22798147, 23948011, 25383392, 27393801, 30130830, 32801502, 34440034, 34732555, 34941726, 35333888, 35751745, 36320107, 37292796, 38152560, 38696423, 39948737, 41728665, 43763768, 45812374, 47723757, 49962369, 52128696, 54512894, 57817038, 61858201, 65405390, 68285245, 71061409, 73260272, 74214379, 74190885, 73836900, 72924962, 70275759, 66749125, 63402309, 60510145, 57395300, 54757413, 52779154, 50626871, 48816861, 47808457]
5129D7808457l56902p7955j09156O7176P64549J436110J892276K369439J780447
5120E5574441l75673j637193k430935l175441l634065l661568l487761k956227
5112C4215578k288187j688344j254517q98322j391167j844823j743844j708235
5104B1398139j523203j424953j029711j000129q44336p41094m99585m80160n63714
5095A3291254o02890n76513m84052n74435m69581k65819k00845l50274k29184
5086I537661k20453k35191r1056j24946k55172k49789q5341N5531q0629j44648
5076H105967k06223q2130L3309l0150J7268o0660O2787j18332j37631p6029p634
5065G500542q3210p4756N481r5329N3623N7098N971K52056P2634j2982J4771j81560
$$ y = [47808457, 47451555, 47373600, 47264444, 47331620, 48096169, 49532279, 51424555, 53793994, 55574441, 55198768, 53561575, 51130640, 47955199, 44321134, 40659566, 37171805, 34215578, 31927391, 30239047, 28984530, 28086208, 26695041, 24850218, 23106374, 21398139, 19874936, 18449983, 17420272, 16420143, 15575807, 14834713, 14335128, 13854968, 13291254, 12688364, 12111851, 11627799, 11053364, 10583783, 10317964, 10117119, 9766845, 9537661, 9317208, 9082017, 8990961, 8866015, 8610843, 8361054, 8275713, 8331244, 8250615, 8105967, 7899744, 7817614, 7850923, 7820773, 7838041, 7777381, 7840168, 7721836, 7584205, 7508176, 7500542, 7417332, 7342576, 7348057, 7252728, 7306351, 7363449, 7369420, 7621476, 7694110, 7681128, 7695899, 7514339]
5053G514339o8039p8573j44814j90657j01379o5365j21744p4604O5729P1864j2070
5042F794687J323M3176j01494o6415o8961r5749o5826N1488O286j06741o3193
5031F328581r8394J15402O6879j00799j2164j19493j49937j80659j30k16458j76115
5020E456713l12187n4324j27605k25474r9086l1513k3201k7860l3123l6929j9903
5009D465508m144O9874j89091n6347o2583K0710m3287L0552q8847r2582K0419
4998D070182k56904q7648J2976j54367k1247j70547K0525J10454k2320j51811
4988C349293m0476j75229r7128l0220q6574k41210R8517J22034j36063Q4895N0474
4977B898313j15361j6261M0444r7198j53362o3791R0728M6849j222j18833P2676
$$ y = [7514339, 7446300, 7367727, 7222913, 7032256, 6930877, 6865512, 6743768, 6669164, 6734893, 6806757, 6794687, 6796010, 6839186, 6737692, 6671277, 6602316, 6506567, 6440741, 6492229, 6498515, 6391774, 6328581, 6230187, 6345589, 6412468, 6311669, 6299505, 6180012, 6030075, 5849416, 5849286, 5632828, 5456713, 5144526, 5090202, 4962597, 4737123, 4638037, 4606524, 4583323, 4555463, 4522340, 4485411, 4465508, 4461364, 4531238, 4342147, 4285800, 4223217, 4243927, 4200640, 4231192, 4142345, 4049763, 4070182, 3813278, 3725630, 3738606, 3584239, 3562992, 3392445, 3412970, 3523424, 3501104, 3349293, 3308817, 3133588, 3036460, 3006240, 2919666, 2678456, 2776973, 2899007, 2762944, 2847839, 2898313, 2782952, 2766691, 2807135, 2709937, 2556575, 2492784, 2583512, 2630361, 2629139, 2510306, 2582982]
4966B582982k6035j08302k2657j21876m3995Q0629q1838j37949j099O1707o1606
4955B119961M0777n6570l9796J7210Q150m5945p4749Q5907J0881j37806O2934
4944A990954L489L6177r3118k1325N4790j36108j9256P7999j05009n3107O2344
4933A797830p9755j32463M4598N8584J6724J0694R0142L5055l6245J7079J08719
4922A930962m4641J20751J30094m9677p6448k8926M9702J3307l0195J4502K4930
4911B054361r256J80478M1070J1592N6085J15727r4284n8203o6991j96562l3002
4900B001015o5845j54333N6267l7155p842o63J22900O8967j4796j10906K04840
4889B062449M6193L088n6499K1646N350J19226K35462J8432j1755J18827J26618
$$ y = [2582982, 2556947, 2448645, 2425988, 2304112, 2260117, 2340746, 2258908, 2120959, 2119860, 2181567, 2119961, 2160738, 2104168, 2064372, 2081582, 2089732, 2043787, 1969038, 2054945, 2065826, 1928020, 1990954, 1994443, 2030620, 1937502, 1916177, 1970967, 1834859, 1815603, 1893602, 1788593, 1735486, 1797830, 1718075, 1585612, 1630210, 1688794, 1705518, 1716212, 1806354, 1841409, 1805164, 1822243, 1930962, 1886321, 2007072, 2137166, 2087489, 2011041, 1982115, 2031817, 2045124, 2014929, 2029431, 2054361, 2045105, 2225583, 2266653, 2278245, 2334330, 2450057, 2355773, 2297570, 2230579, 2034017, 2001015, 1935170, 1780837, 1837104, 1799949, 1792107, 1791444, 1914344, 1983311, 1968515, 1857609, 2062449, 2108642, 2111730, 2055231, 2076877, 2082227, 2201453, 2436915, 2455347, 2443592, 2562419, 2689037]
4878B689037j34849j35023j23829k51444j5025q6288p5998j1609M8448J64501
4868B067921p1107r2017j6837J24437K163o222r0274n2980J5435N1709j6498k029
4856A913701N3270l6848r3204L8987n0099Q0653J7189J77639R2140j62226l9218
4845A991984L1306J33177n2182Q6600l5645o0241J7204P0871k1756n2901N3031
4834B161448R5324J32035P8849K2075K1679J57964j04435m6666Q4820j2249N2103
4823B642947J16990J87614P7862R412j09748k1765J43980N4788L9974J02270J42579
4812C386903m8041J32413K112O7377M3892J64677J8230M0699Q2016K0104R8114
4801D008496Q245m3568J52269R0124p1312N3915m436J40457J17799m210L2488
$$ y = [2689037, 2554188, 2419165, 2295336, 2043892, 2028867, 1942579, 1866581, 1854972, 1903420, 2067921, 1996814, 1904797, 1887960, 2012397, 2014560, 2008338, 1918064, 1865084, 1880519, 1932228, 1915730, 1913701, 1966971, 1930123, 1836919, 1875906, 1825807, 1906460, 1923649, 2101288, 2193428, 2031202, 1991984, 2023290, 2156467, 2104285, 2190885, 2155240, 2094999, 2112203, 2183074, 2161318, 2108417, 2161448, 2256772, 2388807, 2467656, 2489731, 2511410, 2669374, 2564939, 2518273, 2603093, 2590844, 2642947, 2759937, 2947551, 3025413, 3034825, 2925077, 2903312, 3047292, 3102080, 3142054, 3244324, 3386903, 3338862, 3471275, 3473387, 3540764, 3584656, 3749333, 3767563, 3808262, 3890278, 3910382, 4008496, 4016741, 3973173, 4125442, 4215566, 4144254, 4198169, 4193733, 4334190, 4451989, 4447779, 4480267]
4790D480267J21052J68243J78099L5854J73692J44279O0827J44773P6738J02535
4780E686359K89710L32506J47612K03887J82284K94133K47632K64626J23652J90296
4770G962697L12951N39813L12587M88231P18046N17542O44663P71787Q86864J414753
4760A4569934J571539J594814K059422K482791L387297M087722M840037L510598
4752C8104154n2637j859388j910360k429986k909716k484098j589708r43269k13433
4743B3711559L91188R32573J429113J863949K536878L347673M464593N850747
4735D4528273O627480O218446M145872L432432J271008l547463o094854n833708
4727E0747486n779739n889907n017454l684034k550614j536595j022301l38315
$$ y = [4480267, 4601319, 4769562, 4947661, 4983515, 5157207, 5301486, 5362313, 5507086, 5583824, 5686359, 5976069, 6308575, 6456187, 6660074, 6842358, 7136491, 7384123, 7648749, 7772401, 7962697, 8275648, 8815461, 9128048, 9616279, 10334325, 10851867, 11496530, 12268317, 13155181, 14569934, 16141473, 17736287, 19795709, 22278500, 25665797, 29753519, 34593556, 38104154, 38051517, 36192129, 34281769, 31851783, 28942067, 26457969, 24868261, 23924992, 23711559, 24102747, 25035320, 26464433, 28328382, 30865260, 34212933, 38677526, 44528273, 51155753, 57374199, 61520071, 64952503, 66223511, 62676048, 56581194, 50747486, 44967747, 39077840, 34060386, 30376352, 27825738, 26289143, 25266842, 24928527]
4719B4928527L17241P54530J358482J900666K936467M174049M547814K322579
4711D3240355j594367l398596l526523m009856m508900l974022l056327k230674
4703A6941090j759399j299840r92668r59868p56023o40512m48921n61061k96443
4694I226355k70061l38690m98008m81856j78136l16245k46003n3121j72240j22979
4684F549016j24729j53912j54861j57464r3578n5247j45055P6903K07134m7695
4674E900512j78484j55782k10893J55525j13218k38867j47826j30740K2588L6576
4664D939391l5908j07806J12756Q4942n5079J1908j10169r0702k3260K2996Q6832
4653D835901q4666L3196J15957J34672j8721j07705N0157k1008o1107p0189O9810
$$ y = [24928527, 25245768, 26000298, 27358780, 29259446, 32195913, 36369962, 40917776, 43240355, 41645988, 38247392, 34720869, 30711013, 26202113, 22228091, 19171764, 16941090, 15181691, 13881851, 12889183, 11929315, 11173292, 10532780, 10083859, 9522798, 9226355, 8956294, 8617604, 8119596, 7637740, 7459604, 7143359, 6897356, 6844235, 6671995, 6549016, 6424287, 6270375, 6115514, 5958050, 5864472, 5809225, 5664170, 5741073, 5948207, 5900512, 5722028, 5566246, 5355353, 5510878, 5397660, 5158793, 5010967, 4880227, 4902815, 4939391, 4903483, 4795677, 4908433, 4993375, 4938296, 4950204, 4840035, 4749333, 4726073, 4749069, 4835901, 4751235, 4784431, 4900388, 5035060, 5016339, 4908634, 4958791, 4937783, 4876676, 4806487, 4876297]
4642D876297J48122N8398J9113m6071J236J37320L0929O6892J90439M3619j15579
4631E410715K3738K00564N9996m1411Q6180K25394K28740K05236N9921K2712K44541
4620F726326K15158J40328K60010K48678K32911J04679L34059M03660L07804L68565
4610I342178L46736L53188L40912M44003M75455O94567R20828Q62804Q47287J037518
4600A5665476J294833J560455K007970K167163K681874L282496M133868N280768
4592C8074903N486019L905425Q28294j442765k036723k190215k307797j829834
4584C8487307p00274P87736K475899L787240M205315K575922m48043j911385k314998
4575D6944719k667196k497901j640089j30390J439063K141749J144684r91894
$$ y = [4876297, 5024419, 5082817, 5101930, 5055859, 5057095, 5194415, 5225344, 5292236, 5482675, 5526294, 5410715, 5434453, 5635017, 5695013, 5653602, 5739782, 5965176, 6193916, 6399152, 6459073, 6481785, 6726326, 6941484, 7081812, 7341822, 7590500, 7823411, 7928090, 8262149, 8665809, 8973613, 9342178, 9688914, 10042102, 10383014, 10827017, 11302472, 11997039, 12917867, 13780671, 14627958, 15665476, 16960309, 18520764, 20528734, 22695897, 25377771, 28660267, 32794135, 38074903, 43560922, 47466347, 48294641, 46851876, 44815153, 42624938, 40317141, 38487307, 37787033, 38574769, 41050668, 44837908, 49043223, 51619145, 51171102, 49259717, 46944719, 44277523, 41779622, 40139533, 40009143, 41448206, 43589955, 44734639, 43742745]
4567D3742745k212452k573704k666343k549998k055213j057096M1739J153498
4559C1823176J957881K201227J107932j266875k674331l104579l377448l499443
4551B3167540l107260k616046j968328j530478j241544j002551q82666o71498
4543A0147169n21773n12958m69578l23750l40719l60940m21335j59901k67841
4534F768374k44342j24398r8301k49155j61564j29138k13959n6626j72272k59416
4524E059203j28399l7113p3050j53755p5387j48273j37292l1041q4139j25662
4514D065092l7815j61193j36175k8584l3700r6710n5598q4717R5387N9415j21746
4503C463656j14855L5730r3297K6095k7960P6660m247j42273R1745j03167j21759
$$ y = [43742745, 41530293, 38956589, 36290246, 33740248, 31685035, 30627939, 30669678, 31823176, 33781057, 35982284, 37090216, 35823341, 33149010, 30044431, 26666983, 23167540, 20060280, 17444234, 15475906, 13945428, 12703884, 11701333, 10818667, 10147169, 9625396, 9112438, 8642860, 8319110, 7978391, 7617451, 7196116, 7036215, 6768374, 6524032, 6399634, 6301333, 6052178, 5890614, 5761476, 5547517, 5490891, 5318619, 5059203, 4930804, 4893691, 4820641, 4666886, 4591499, 4443226, 4305934, 4274893, 4190754, 4065092, 4027277, 3866084, 3729909, 3701325, 3667625, 3570915, 3515317, 3430600, 3525987, 3585402, 3463656, 3348801, 3384531, 3291234, 3317329, 3289369, 3366029, 3361782, 3219509, 3311254, 3208087, 3086328]
4492C086328m9824Q674n4122k3476j07071O8589o8732J30179j3901k3163o962
4481B946519r9416r4920j4727n1694o5911M4771K3533J22787L2160n8722R3178
4470B877558q943Q1700l0840l2922m0213n5056J51401L5542R0012K18518K37075
4459C523832N8881J53243K93263J49012J03702L4465j66044l04704k56325l08051
4449C281274j23158j85923j32016p98j13355j17493j16307l0124o7265r4707q9053
4438B211075j28912l8513p9289q4151J83427j174l6810O9787P2062p2254j43988
4427A951260j11094j5414R1118K6463L9351n7209n2577n0386J52225J52298j12544
4416B013491J02060J3738m5120j30841P7668M0054M360R6541R7380j05166l1416
$$ y = [3086328, 3036504, 3045178, 2991056, 2967580, 2860509, 2929098, 2860366, 2990545, 2976644, 2953481, 2946519, 2847103, 2752183, 2737456, 2685762, 2619851, 2664622, 2688155, 2810942, 2843102, 2784380, 2877558, 2868615, 2950315, 2919475, 2886553, 2846340, 2791284, 2942685, 2978227, 3068239, 3286757, 3523832, 3582713, 3735956, 4029219, 4178231, 4281933, 4316398, 4150354, 3845650, 3589325, 3281274, 3158116, 2972193, 2840177, 2839379, 2726024, 2608531, 2492224, 2462100, 2394835, 2300128, 2211075, 2082163, 2043650, 1964361, 1880210, 2063637, 2062463, 2025653, 2095440, 2167502, 2095248, 1951260, 1840166, 1824752, 1915870, 1942333, 1981684, 1924475, 1871898, 1821512, 1973737, 2126035, 2013491, 2115551, 2129289, 2084169, 1953328, 2030996, 2071050, 2075410, 2171951, 2269331, 2164165, 2132749]
4405B132749M941j18994p6342m9332m1674j3107l6345q7492k9060O720J89266
4394A881330K060j61679J13560J3125J04237O2098k07315j18567r1944j9766P8536
4383A655675N8690N1164k902r5944O6653J94138l5503m0692l3295K0345N4690
4372A893019j60303q4298J18597M7411o4767k0724o2408K3257j2656N9996n5419
4361A681705q4967J66964L2152L5515O3743k3535k05922q110P6846P3567M2120
4350A850078m4896k3466R4641L6229j8937q1477M7496k9035J43486K37521k3648
4339B187992N8113J23537N9907k2880N0528K07918J06664p4964J98942J14804
4329C010561J9201K6814P1460K1249k6945q4842Q8999j6234N4423m4843J9141
$$ y = [2132749, 2137690, 2018696, 1942354, 1893022, 1851348, 1838241, 1801896, 1714404, 1685344, 1692064, 1881330, 1883390, 1721711, 1835271, 1848396, 1952633, 2014731, 1807416, 1688849, 1596905, 1577139, 1655675, 1714365, 1765529, 1762627, 1666683, 1733336, 1927474, 1891971, 1851279, 1817984, 1838329, 1893019, 1732716, 1648418, 1767015, 1814426, 1749659, 1728935, 1666527, 1689784, 1677128, 1737124, 1681705, 1596738, 1763702, 1795854, 1831369, 1895112, 1871577, 1665655, 1657545, 1734391, 1807958, 1850078, 1805182, 1781716, 1876357, 1912586, 1893649, 1812172, 1859668, 1830633, 1974119, 2211640, 2187992, 2246105, 2369642, 2429549, 2406669, 2457197, 2665115, 2771779, 2696815, 2895757, 3010561, 3029762, 3056576, 3128036, 3149285, 3122340, 3037498, 3126497, 3110263, 3164686, 3119843, 3138984]
4318C138984O1313M765k7774O7839j7659m05j7379R280N1312j06749k5703N8653
4306C196477j37810q6563P9412J78904L903n813Q8222J76926N9926J38008J17159
4295C808751Q1658N8667o176o0800J47451j7340Q5853J99547J24072M4531J06419
4284D572633Q508m47p306n6414J40855o8421J74695Q6110M3886P4284J41029J51031
4272E260443Q7464K26161L9576J15916J27497J35489K69936O8841J33529J72872
4262F637724J69742N6420J26631o8141J38053K66548Q6115O112J61593Q1902J58789
4251G821488N8737L6827N8108K25346P3563J00230R3186J02741K15713J96414
4241H982353J7161K16422J67951J66917J50463J73339L7477p0968M4068J76118
$$ y = [3138984, 3200297, 3205062, 3177288, 3245127, 3227468, 3227063, 3209684, 3218964, 3270276, 3163527, 3137824, 3196477, 3058667, 2972104, 3051516, 3230420, 3234323, 3228510, 3316732, 3493658, 3553584, 3691592, 3808751, 3890409, 3949076, 3942900, 3882100, 4029551, 4012211, 4098064, 4297611, 4421683, 4466214, 4572633, 4581141, 4580694, 4573388, 4516974, 4657829, 4589408, 4764103, 4850213, 4894099, 4968383, 5109412, 5260443, 5347907, 5574068, 5613644, 5729560, 5857057, 5992546, 6262482, 6331323, 6464852, 6637724, 6807466, 6863886, 6990517, 6922376, 7060429, 7326977, 7413092, 7419204, 7580797, 7662699, 7821488, 7880225, 7917052, 7975160, 8200506, 8274069, 8374299, 8467485, 8570226, 8785939, 8982353, 8999514, 9215936, 9383887, 9550804, 9701267, 9874606, 9912083, 9841115, 9885183, 10061301]
4231A0061301J39051J94665J60765P6732L26487J60607J36211J71854K47995K16430
4221A1892098J60889J34560K24822K96476L47976M03015N85140L81105M30742
4212A4856823N24669M13134K94080N41112O30788N56900P00331Q06143R49047
4203B0273027R74020R87949J239258J193508J232889J067168J252969J525222
4195B9746010J545539J836027J842189K140844K106288K169730K225998K323176
4187D5935801K661144L096520L122686L725552M022076M744092N613420O586509
4179G9507800P879840R566402J1665800J4580583J7533781K1736566K6957591
4172A89428363L4280343M2769123N0686183M2424311J7918121r479536l3006680
$$ y = [10061301, 10200352, 10395017, 10555782, 10632514, 10959001, 11119608, 11255819, 11427673, 11675668, 11892098, 12052987, 12187547, 12412369, 12708845, 13056821, 13459836, 14044976, 14426081, 14856823, 15381492, 15794626, 16088706, 16629818, 17260606, 17817506, 18517837, 19323980, 20273027, 21247047, 22234996, 23474254, 24667762, 25900651, 26967819, 28220788, 29746010, 31291549, 33127576, 34969765, 37110609, 39216897, 41386627, 43612625, 45935801, 48596945, 51693465, 54816151, 58541703, 62563779, 67307871, 72921291, 79507800, 87387640, 96954042, 108619842, 123200425, 140734206, 162470772, 189428363, 223708706, 266477829, 317164012, 359588323, 377506444, 368026908, 335020228]
4165C35020228m1648604m5349542m4677551l7102556k7523243k0119165j4907275
4158A03692292j1856540r771806q333281p008997n927477m889910m343586l799494
4150D7761201l444500k918861k586914k271196k099948j793928j554661j142212
4142B9948981r28991q13069p29882j050352r60355j138824r37059j161822j076195
4133B1152432r30215r05068q92749q99254p79386p03396p32339o71622n83315
4124A4055088n54298n75386l37533k18499l69871l27094l10856m20483l78521
4115A0562547k64008l96739l82929j72716q1019k48187l19147k43240j47865j71087
4105H135610j05591k09698k20719j85697j33941k1230j67677j28154l39690k13015
$$ y = [335020228, 293371624, 248022082, 203344531, 166241975, 138718732, 118599567, 103692292, 91835752, 82063946, 73730665, 66721668, 60794191, 55904281, 51560695, 47761201, 44316701, 41397840, 38810926, 36539730, 34439782, 32645854, 31091193, 29948981, 29019990, 28206921, 27477039, 26426687, 25466332, 24327508, 23390449, 22228627, 21152432, 20222217, 19317149, 18424400, 17525146, 16745760, 16042364, 15310025, 14638403, 14055088, 13500790, 12925404, 12587871, 12369372, 11999501, 11672407, 11361551, 10941068, 10562547, 10298539, 9901800, 9518871, 9346155, 9265136, 9016949, 8697802, 8454562, 8306697, 8135610, 8030019, 7820321, 7599602, 7413905, 7279964, 7258734, 7091057, 6962903, 6623213, 6410198]
4095F410198j29654j43478k16598m4904k15403j80476j32516j53699m6188j15257
4085E032025j45648j269j54575m5294j49770j50798J70q0737j33728k2361L6837
4074D184852j16667p1536j62643m0778p7018n3264j5982n2035j12960L0249j07518
4063C404700j42323r3499j05549O4010n1443j50777j59585R2787P336l9660K1343
4052B847340q2133q3895P4497j09411K6008J23386m976k20670j1241M6082o3697
4041B541290N8881L5052j5635j88955J464J21606q2592Q3353l3805j77851j9727
4030B323081k4023J877L3039P661n4198o7089N6756R9397q5706R4427O9342N248
4018B459812J55092J97075L171o2664M6453k73198k74512k87855j54755k2089
$$ y = [6410198, 6280544, 6137066, 5920468, 5875564, 5660161, 5479685, 5347169, 5193470, 5147282, 5032025, 4886377, 4885108, 4730533, 4685239, 4535469, 4384671, 4384841, 4304104, 4170376, 4148015, 4184852, 4068185, 3996649, 3834006, 3793228, 3716210, 3662946, 3646964, 3594929, 3481969, 3512218, 3404700, 3262377, 3168878, 3063329, 3127339, 3075896, 2925119, 2765534, 2858321, 2865657, 2825997, 2847340, 2765207, 2681312, 2755809, 2646398, 2672406, 2795792, 2790816, 2570146, 2558905, 2604987, 2541290, 2600171, 2635223, 2619588, 2430633, 2432097, 2553703, 2471111, 2554464, 2520659, 2342808, 2323081, 2299058, 2300935, 2333974, 2341635, 2287437, 2220348, 2277104, 2376501, 2290795, 2385222, 2454564, 2459812, 2614904, 2811979, 2815150, 2752486, 2798939, 2525741, 2251229, 1963374, 1808619, 1786530]
4008A786530l9945M0546O832j5965O335K1115r5942L2135R5482L1937J7501J2853
3996A899414N1776M9289K9288J57790J9368k783k837J5512o3969k9520J57852
3985B281180J10061J2043o4235o1929n6491j09771Q8771j18087j36744j18123
3975A826675k2960L420K7933Q0088k27337N57J37168J22598J2477N6726Q8820
3964B106165k6418J04335J97624P8476n1453o8259M0347N5098o3700j56392k8676
3953B187147n0576o0486m4542n9644m4613M3049k4890j44732L3395n7641q6600
3942A689867Q3227J20553o3070r9140j22755J35286o7872j92313m9174K5574J37244
3931A597427n1890j03273J11150M6805Q7289j25314j35833j2829J45528m6325
$$ y = [1786530, 1746585, 1787131, 1793963, 1777998, 1784333, 1805448, 1709506, 1741641, 1837123, 1869060, 1886561, 1899414, 1951190, 2000479, 2029767, 2187557, 2206925, 2204142, 2201305, 2216817, 2152848, 2123328, 2281180, 2391241, 2403284, 2339049, 2277120, 2220629, 2110858, 2199629, 2081542, 1944798, 1826675, 1803715, 1807135, 1835068, 1915156, 1687819, 1688376, 1825544, 1948142, 1960619, 2017345, 2106165, 2079747, 2184082, 2381706, 2460182, 2408729, 2340470, 2380817, 2435915, 2372215, 2215823, 2187147, 2136571, 2076085, 2031543, 1971899, 1927286, 1970335, 1945445, 1800713, 1834108, 1776467, 1689867, 1773094, 1893647, 1830577, 1731437, 1608682, 1743968, 1676096, 1483783, 1434609, 1460183, 1597427, 1545537, 1442264, 1553414, 1600219, 1687508, 1562194, 1426361, 1413532, 1559060, 1512735]
3921A512735p9721m5332j63587p7764J95788J97586l6695j627N036J98107l6875
3910A667651O6694l5341j4018K4042j36209q2837O6246r0471l9329l1660j6810
3899A377958J67113L062K0742M7103N3331q8255J25523J56439M6587M0707J9959
3888A970269N3456N6997R3641M8768J6394J16700J48267J61150L15549K70569
3878C251760J72937N436j0305l20140l33014j72193j80366j00622j18395m0671
3868B154427o3774j40656l9336j95079k8636k0560O1497o6459r2251K7722q8741
3857A508154r2929J9969l806N6721J13999R4739n3507m1681k355K7413P1961j31563
3845A567115M3525P6396j777J29109N266r363J443l8538L967R233J87002k5042
$$ y = [1512735, 1433014, 1387682, 1224095, 1146331, 1342119, 1539705, 1503010, 1501383, 1506419, 1704526, 1667651, 1734345, 1699004, 1684986, 1709028, 1572819, 1489982, 1556228, 1465757, 1426428, 1394768, 1377958, 1545071, 1548133, 1568875, 1615978, 1669309, 1581054, 1706577, 1863016, 1909603, 1950310, 1970269, 2023725, 2080722, 2174363, 2223131, 2239525, 2356225, 2504492, 2665642, 2981191, 3251760, 3424697, 3430133, 3419828, 3099688, 2766674, 2594481, 2414115, 2313493, 2195098, 2154427, 2090653, 1949997, 1910661, 1715582, 1686946, 1666386, 1727883, 1661424, 1569173, 1596895, 1508154, 1415225, 1435194, 1431388, 1488109, 1602108, 1696847, 1643340, 1601659, 1599304, 1626717, 1698678, 1567115, 1610640, 1687036, 1685259, 1814368, 1819634, 1810271, 1811714, 1773176, 1777143, 1786376, 1973378, 1948336]
3833A948336k6798K07276k4310N2373J27944o6095R2269Q2878O5408J01641R5874
3822B656796R9202L08180K33952L22637L14124J03420J94889K23500K50696J56250
3812D863646K56095M67066K25602L73495O38677P37699P95648R59469N74382J82254
3802A0074033J63339M07826L01461j14434n17514n80044m61350l88325k31282
3793H653710k96212k57845m41330n93508o93326o03090o05934l73614l59316k74741
3783D154794j15055j62220j15560j42200k92439l1143K2131r0104j81936j54437
3773B891831j38935k53663j10220j08930k09720p7000j18056k26218K2293l7943
3763A633439k7289J33823r1603j51824J27217j25265r1072M604q2360P132P9142
$$ y = [1948336, 1921538, 2128814, 2104504, 2156877, 2284821, 2218726, 2310995, 2393873, 2459281, 2560922, 2656796, 2755998, 3064178, 3298130, 3620767, 3934891, 4038311, 4233200, 4456700, 4707396, 4863646, 5119741, 5586807, 5812409, 6185904, 6824581, 7562280, 8357928, 9317397, 9891779, 10074033, 10237372, 10645198, 10946659, 10832225, 10314711, 9734667, 9273317, 8884992, 8653710, 8357498, 8099653, 7658323, 7064815, 6371489, 5768399, 5162465, 4788851, 4429535, 4154794, 4039739, 3877519, 3761959, 3619759, 3327320, 3296177, 3318308, 3228204, 3046268, 2891831, 2752896, 2499233, 2389013, 2280083, 2070363, 1993363, 1875307, 1649089, 1671382, 1633439, 1606150, 1739973, 1648370, 1496546, 1623763, 1498498, 1407426, 1412030, 1329670, 1336802, 1415944]
3752A415944j05086p4761N0837J3039j05288n5433l6408O2163J75516K5413j27106
3741A238830j7849n8467M5463j35081l9449M3982L6354J6516r8088J398L1827
3730A065436n729j09514N2901r2436J6221j55133j6591j8641R9685R9726O1577
3719I97502o6475q5524L1360o9450p2308o4170O9214J71298Q6924o7473j3369
3708I17529q8784o4523J28998R8639p6078k2674O6999k9229M113l6885j11938
3697G86167P9169Q5273k5898k8894R2620q001j67285j13815Q6178m3123l5378
3686G07013R6711l3115L185Q9623K2063n378p9104p0138m496K4575j2993J2845
3674G50791M6300K7478N7479P94J6964n3023K1884k2566Q9244j01182m4290m1401
$$ y = [1415944, 1310858, 1236097, 1286934, 1299973, 1194685, 1139252, 1102844, 1165007, 1340523, 1365936, 1238830, 1220981, 1162514, 1207977, 1072896, 1033447, 1077429, 1113783, 1130299, 1032211, 1033609, 1065436, 1059707, 950193, 1003094, 910658, 926879, 771746, 755155, 736514, 836199, 935925, 997502, 931027, 845503, 876863, 807413, 735105, 670935, 740149, 911447, 998371, 930898, 917529, 828745, 764222, 893220, 991859, 915781, 893107, 960106, 930877, 934990, 898105, 786167, 865336, 950609, 924711, 895817, 988437, 980436, 813151, 699336, 785514, 742391, 707013, 803724, 770609, 773794, 863417, 885480, 880102, 800998, 730860, 726364, 750939, 737946, 750791, 797091, 824569, 882048, 882842, 899806, 846783, 868667, 846101, 935345, 834163, 789873, 748472]
3662G48472J28199q231m4950J00849p9053O012m5174P5353M9894j61281r3117
3651F76973L1530N2180N7507M3897l7579L264Q272M7257J6133l8295J47501N2902
3639A061542l0853p7350m6233Q1728J6921n9682K6335M5346R2039Q9432j57356
3628A041869m9060J00325k8821Q2209o4015q9481j06345K7804J11714O9826o7245
3617A028780K2454j14887j16320P1124J22504j33080q928P2805n8036l1236M6263
3606I01443O872K973Q0260q0310m3992M7051L0192j9461P8145N3140j13313q018
3594I34982P5114j35064L9849k7724p5990J11506P2335n3650J6061r1709m7872
3583H17838N1573m9278m0762r9261N7675P8533Q0111o0735j7840M4496j3913k9679
$$ y = [748472, 876671, 868440, 823490, 924339, 845286, 851298, 806124, 881477, 931371, 770090, 676973, 708503, 760683, 818190, 862087, 824508, 827772, 836044, 883301, 899434, 861139, 1008640, 1061542, 1030689, 953339, 907106, 988834, 1005755, 946073, 972408, 1017754, 1109793, 1199225, 1041869, 992809, 1093134, 1064313, 1146522, 1082507, 993026, 886681, 914485, 1026199, 1096025, 1028780, 1051234, 936347, 820027, 891151, 1013655, 880575, 871647, 944452, 886416, 855180, 901443, 908315, 911288, 991548, 911238, 867246, 914297, 944489, 925028, 1003173, 1056313, 943000, 934982, 1010096, 875032, 914881, 887157, 811167, 922673, 995008, 941358, 957419, 865710, 817838, 869411, 820133, 779371, 680110, 737785, 816318, 896429, 835694, 817854, 862350, 848437, 818758]
3571H18758j3508o8700O5450L285l1075R7664j2848J0355O0026l0208K1120j8925
3559I01394o3671O3017j04901n3555Q821J20706m6048r6854L8493N7386J01264
3548I26052j06288n6806n8344J51592N0906l9781P2134r8522j07219K3353L2446
3537G89523J7003O0833j43347J0453M3974P5073J9395j1651k430p7223p8756L9315
3525G42162J4125R547l614J26625K9931p8430k6076K8879J6584K2468L1727K9090
3513I43018K5019J41603O885Q4941n5920k5834Q8938p3509J27117J76232M6477
3502A484967l1693n6258j00343r3819j001j7431j0301q8233j32816J8194J77276
3491A148542m0225p5126M6796K6276J7678p1183J8432k2466K1001k8874o8397
$$ y = [818758, 805250, 736550, 802000, 805285, 774210, 871874, 859026, 869381, 929407, 899199, 920319, 901394, 837723, 900740, 795839, 742284, 751105, 871811, 825763, 728909, 767402, 824788, 926052, 819764, 762958, 704614, 856206, 907112, 867331, 939465, 840943, 733724, 757077, 789523, 806526, 867359, 724012, 734465, 778439, 853512, 872907, 861256, 858826, 781603, 702847, 742162, 756287, 765834, 762220, 888845, 918776, 840346, 814270, 843149, 859733, 882201, 913928, 943018, 968037, 1109640, 1116525, 1201466, 1145546, 1119712, 1208650, 1135141, 1262258, 1438490, 1484967, 1453274, 1397016, 1296673, 1202854, 1201853, 1184422, 1174121, 1085888, 953072, 971266, 1148542, 1108317, 1033191, 1079987, 1106263, 1123941, 1052758, 1071190, 1048724, 1069725, 1040851, 972454]
3480I72454J3681R5803O4593n3814L1265n3072m8085l9290o3281j2531j1595J30926
3468A027054N4546m9928N2159j9501m6666P2595P5549Q6154l0740J12032n430
3457A327824q3658q1018J19415k6231M2700J64365j42703L9865l2220m1564r125
3446A277650R1203K16579R4190J94852J67673K56725K56440K38241J52628j20407
3436B825774j97460k40918k76812k38756j00771j8579r9515R9725q5002j00831
3426A566855R7653R8105r3398m2113Q0077J02834J10848p2217q72P4335R7009
3415B019116K99735J88189L5963K53889L17697M42719L73473M34779K48520r2486
3405D521594j85236l32310k38643l58511l24367k25698j72357j50143r4835k593
$$ y = [972454, 986135, 1081938, 1146531, 1092717, 1123982, 1070910, 1022825, 983535, 920254, 907723, 896128, 1027054, 1081600, 1031672, 1083831, 1064330, 1017664, 1090259, 1165808, 1251962, 1221222, 1333254, 1327824, 1244166, 1163148, 1282563, 1256332, 1299032, 1463397, 1320694, 1360559, 1328339, 1286775, 1277650, 1368853, 1585432, 1679622, 1874474, 2042147, 2298872, 2555312, 2793553, 2946181, 2825774, 2628314, 2387396, 2110584, 1871828, 1771057, 1752478, 1652963, 1752688, 1667686, 1566855, 1664508, 1762613, 1669215, 1627102, 1707179, 1810013, 1920861, 1848644, 1847772, 1922107, 2019116, 2318851, 2507040, 2543003, 2796892, 3114589, 3557308, 3930781, 4365560, 4614080, 4521594, 4336358, 4004048, 3765405, 3406894, 3082527, 2856829, 2684472, 2534329, 2439494, 2436901]
3395B436901m0938p4871m7298k5730j00121j6479m6582l4339J17930J15170M8625
3384B332268p6943J429m3815L0165J05445J26706K25086K95120J77453K08077
3374C380991o3778q0952j90524j97585j20295k46548j00016q8262j01069k0734
3364B171228O9918j5759M4104r9267M0069K5085j86014K0868J45789k5046J8220
3353B209195J566K6275L4336n908N8942l6037J4296Q3624j22046M5207J12404
3342B421854M3347R2912J00856M1177J34807J88718Q6978J34743N5102K0006J81714
3331C502214P3291J5411m1643j54391k3050Q919j06028N3181L3778J1794J93536
3320C567012K19613k4826N1346K9073j8057O2854K07372K0306K93861K77347K14366
$$ y = [2436901, 2395963, 2321092, 2273794, 2248064, 2147943, 2131464, 2084882, 2050543, 2168473, 2283643, 2332268, 2255325, 2256754, 2212939, 2243104, 2348549, 2475255, 2700341, 2995461, 3172914, 3380991, 3317213, 3236261, 3045737, 2848152, 2727857, 2481309, 2381293, 2293031, 2191962, 2171228, 2241146, 2225387, 2269491, 2170224, 2210293, 2235378, 2049364, 2070232, 2216021, 2190975, 2209195, 2210761, 2237036, 2271372, 2265464, 2324406, 2288369, 2302665, 2386289, 2264243, 2309450, 2421854, 2465201, 2558113, 2658969, 2700146, 2834953, 3023671, 3110649, 3245392, 3300494, 3320500, 3502214, 3575505, 3590916, 3549273, 3394882, 3371832, 3380751, 3274723, 3327904, 3361682, 3373476, 3567012, 3786625, 3761799, 3813145, 3842218, 3824161, 3887015, 4094387, 4114693, 4408554, 4685901, 4900267]
3309D900267L50553K77186K11747J02301j25977P2884K67160J89727J138j648
3299F245338j37554j74192j74843o4200k4965r776j18156r4226n8690n0530P9980
3288E418186K01592J28891R5450K91707K63559K68540L64990L72766L37013P8841
3278G821535k5134k6048k34592J0892k72435N2362Q5573J61564P7375R1343k9431
3267G713004P293R6939O2473N7956K52876P7563J86959K15895J61156J83984K92631
3256I308729L82862K27020L07578M94761M84587N88328O77812O37806L54150J86460
3246A3650093J80810J24305j87344l63432k90495m97528o70317p85909p21406
3237A0438777n35680m44197n20883m98750m48193k15750k56498j2835j52466j67016
$$ y = [4900267, 5250820, 5528006, 5739753, 5842054, 5716077, 5788961, 6056121, 6245848, 6246986, 6245338, 6107784, 5933592, 5758749, 5694549, 5669584, 5659808, 5541652, 5447426, 5388736, 5338206, 5418186, 5619778, 5748669, 5844119, 6135826, 6399385, 6667925, 7032915, 7405681, 7742694, 7821535, 7796401, 7770353, 7535761, 7546653, 7274218, 7326580, 7412153, 7573717, 7651092, 7742435, 7713004, 7720297, 7817236, 7879709, 7937665, 8190541, 8268104, 8455063, 8670958, 8832114, 9016098, 9308729, 9691591, 9918611, 10226189, 10720950, 11205537, 11793865, 12471677, 13109483, 13463633, 13650093, 13830903, 13955208, 13767864, 13404432, 13113937, 12616409, 11946092, 11160183, 10438777, 9903097, 9458900, 8938017, 8439267, 7991074, 7775324, 7518826, 7505991, 7353525, 7186509]
3227G186509o4291k01486j38918j22197n8270j06022p9462j21506Q9513R3980
3217F477850M1894o3789j62835j64665k32494j95317k80396l21048k28605j54880
3207D715715k54215r0481j44026J802p8832J7661m4039o0979Q5787j6439J7630
3196D149584j8599o831m1365l4197j40209j06084m1843j35827j73340J7926l16
3185C468899l1774j01474j45842m7798l7618k01275j18654j56896q6365j6145
3175B525058L674k0432J0996j19872p3362K209o0386J20891m7416o6180L2745
3164B307925m6386q7312N5694j0423k5515o3967j3818j20383k3387K4165j7118
3153A979475k6156j51905r2528Q2958Q8692j50000r9074J9979r75J15471j38844
$$ y = [7186509, 7122218, 6920732, 6781814, 6659617, 6601347, 6495325, 6415863, 6294357, 6383870, 6477850, 6519744, 6455955, 6293120, 6128455, 5895961, 5700644, 5420248, 5099200, 4870595, 4715715, 4461500, 4371019, 4226993, 4228795, 4149963, 4167624, 4123585, 4062606, 4148393, 4131954, 4149584, 4130985, 4124154, 4082789, 4048592, 3908383, 3802299, 3760456, 3624629, 3451289, 3469215, 3468899, 3437125, 3335651, 3189809, 3142011, 3104393, 2903118, 2784464, 2627568, 2541203, 2525058, 2528732, 2508300, 2519296, 2399424, 2326062, 2328271, 2267885, 2388776, 2341360, 2275180, 2307925, 2261539, 2174227, 2229921, 2219498, 2193983, 2130016, 2116198, 1995815, 1972428, 1996593, 1979475, 1953319, 1801414, 1708886, 1791844, 1880536, 1730536, 1631462, 1651441, 1650466, 1765937, 1627093]
3142A627093n2805J45827n2271j40911o4552O1548j23381p7984O1293r7878L4289
3131A320268N6992P3572q602j64316j8320o7509l4173K0973O5852J46296p0524
3120A320509p4405k7841J145n9866P1368l6051L4513R3163n1061K2703n1173r8917
3108A144087j3893K9424n5297o4550k0821P6074K0439M8138m6772k6519l0168
3097A060142J49671J7024n7829K92j977j9401j30970K189k6756n0910p1612J01647
3085I71510M1352l5998O4998p8470l3707O5295j36115P8894n3917P1373J3426
3074I68641q2477N3404j07205m8262J3897J81320j3439k9616r2558n402n98O8656
3062I06361P5771R6342l2704q290m3839o0528Q2208q0689m5808j6837o2325j13349
$$ y = [1627093, 1574288, 1720115, 1667844, 1526933, 1462381, 1523929, 1400548, 1322564, 1383857, 1285979, 1320268, 1377260, 1450832, 1442230, 1277914, 1259594, 1192085, 1157912, 1178885, 1244737, 1391033, 1320509, 1246104, 1218263, 1219408, 1159542, 1230910, 1194859, 1229372, 1322535, 1271474, 1294177, 1243004, 1144087, 1130194, 1159618, 1104321, 1039771, 1018950, 1095024, 1115463, 1163601, 1116829, 1090310, 1060142, 1209813, 1226837, 1169008, 1169300, 1167323, 1147922, 1016952, 1019141, 992385, 941475, 869863, 971510, 1012862, 976864, 1041862, 963392, 929685, 994980, 858865, 937759, 883842, 955215, 968641, 886164, 939568, 832363, 784101, 797998, 979318, 965879, 936263, 843705, 838303, 837705, 906361, 982132, 1078474, 1045770, 1037480, 993641, 933113, 1015321, 934632, 888824, 871987, 809662, 696313]
3050F96313J52504R6867m0500j11793J18105J8542r5603Q622j7958k520m814O064
3038H23829O2084m5067M9728J1674l5415K960K4845j5200o9975J2924k3883J7242
3026H15746K4810Q183K7531Q5664j36743N9902j7089L903J6987M3274l5061K9832
3014I26939l938M8020L2653N559m7140m3176o3139l6992J04682J23810l4968r5705
3002I16605K3538K6194J27076j53195N0917m0764j45950O5591L7682J18339N8582
2991A084615m1058L598N2622k2511J9880j40630M5593R3186n465O761O577J00934
2979A204102N9699l5453K1792N330L9173K5070j06875r9546K7440K8114N5349
2968A224195j27192M44R1003m7831N8734k7742o676O758M9544M2230J29697j25991
$$ y = [696313, 848817, 945684, 905184, 793391, 911496, 930038, 834435, 843057, 825099, 822579, 817765, 823829, 885913, 840846, 890574, 902248, 866833, 869793, 894638, 879438, 809463, 822387, 798504, 815746, 840556, 848739, 876270, 961934, 825191, 885093, 868004, 871907, 888894, 932168, 897107, 926939, 923001, 971021, 1003674, 1009233, 962093, 918917, 855778, 818786, 923468, 1047278, 1012310, 916605, 940143, 966337, 1093413, 940218, 991135, 950371, 804421, 870012, 907694, 1026033, 1084615, 1043557, 1047155, 1099777, 1077266, 1097146, 956516, 1002109, 1095295, 1089830, 1096591, 1103168, 1204102, 1263801, 1228348, 1250140, 1255470, 1294643, 1319713, 1212838, 1113292, 1140732, 1168846, 1224195, 1097003, 1097447, 1188450, 1140619, 1199353, 1171611, 1164935, 1171693, 1221237, 1263467, 1393164, 1267173]
2956A267173L6473J32662j5979j16639m283Q9380Q5202K1490K8950Q3100m8173
2945A559356O7868K8643j2683J17231L8004L3946O3339Q4561J3354q3028J2976
2934A923567Q8471N7014J12897k6265L7841q4729j1522Q7483l3998n927M0613
2923B185445r1357P9856K0818q634J25835J36940M3897n791J7665L7106P624J85724
2911B735128J16952J22099O6666K04440J66623N640M7742j18088K7460m2911n1280
2900C280471j53105n7464k80443j32097n5541o5292r083j0237O2307n1293l7990
2889B490233o8018K9170J45990J12415O3103j45911J6370n0041P4095K33916j17998
2878B783324R4006P7321l9369o0953o0971M5740j40075k49169n8911N1355j68452
$$ y = [1267173, 1303646, 1436308, 1420329, 1303690, 1299407, 1388787, 1473989, 1495479, 1524429, 1607529, 1559356, 1627224, 1655867, 1643184, 1760415, 1798419, 1832365, 1895704, 1980265, 1993619, 1910591, 1923567, 2012038, 2069052, 2181949, 2155684, 2193525, 2108796, 2097274, 2184757, 2150759, 2144832, 2185445, 2094088, 2173944, 2194762, 2186128, 2311963, 2448903, 2492800, 2487009, 2504674, 2541780, 2549404, 2735128, 2852080, 2974179, 3040845, 3245285, 3411908, 3417548, 3465290, 3347202, 3374662, 3331751, 3280471, 3127366, 3069902, 2789459, 2657362, 2601821, 2536529, 2527446, 2517209, 2579516, 2528223, 2490233, 2422215, 2451385, 2597375, 2709790, 2772893, 2626982, 2643352, 2593311, 2667406, 2901322, 2783324, 2877330, 2954651, 2915282, 2854329, 2793358, 2839098, 2699023, 2449854, 2390943, 2442298, 2273846]
2867B273846k00884j32147N7362K335p5644K2409M6869p6076K1331R9278o0104
2856A978575n486n8642r6455q2457p7283R8944q1128K3940j45936j62280O2364
2845A454156L8870j01979l7485q9506J8787j87969j48890J4911Q0941L8055J8429
2834A098320q0261j57541j0958l485J9956j5026Q3116N437Q3968j32865K4445
2823I15106m1185p804j9174K7334j34718Q1171o8705n5194j3470L6061j21594
2812E97828r3879K28190K9620O386m7671j69407j60K8094l026j9261k1352R5351
2800F30713J08388j12031o1030J59090p0582j41878k7629P6274l4668l6870l0355
2789D59422J09411l4327j5307K8507j0713K2333o9132j22648P2297j27396L1631
$$ y = [2273846, 2072962, 1940815, 1998177, 2000512, 1924868, 1947277, 1994146, 1918070, 1939401, 2038679, 1978575, 1973089, 1914447, 1817992, 1735535, 1658252, 1757196, 1676068, 1700008, 1554072, 1391792, 1454156, 1493026, 1391047, 1353562, 1264056, 1282843, 1094874, 945984, 960895, 1041836, 1079891, 1098320, 1018059, 860518, 849560, 846075, 866031, 851005, 934121, 939558, 1023526, 890661, 915106, 873921, 866117, 846943, 874277, 739559, 820730, 752025, 696831, 683361, 719422, 597828, 503949, 732139, 761759, 768145, 720474, 551067, 550907, 579001, 575975, 556714, 535362, 630713, 739101, 627070, 566040, 725130, 654548, 512670, 485041, 561315, 526647, 489777, 459422, 568833, 534506, 519199, 547706, 536993, 559326, 490194, 367546, 439843, 312447, 344078]
2778C44078K6515j17563k7950J60147L4555j12570N2056N2566m2293j11179q1494
2767A76868J46683O2603q5553J9824Q5424P473m0234m23l377j4846o2048K9828
2755C22222K5368m5059p4135o114L9930k1844N0872O4431o604p469m5462j01190
2743A94946j26128K14410J16392p6411K8583o9534j17542p6853P8622O4170N4738
2732B85393Q587p1402N5242l8876m2349M241Q9118m4119j16318J45777L232p1208
2720B07318R9370K6191J21792j76632j38868j5305r1273J09577p5130L1822J03562
2709B02424J7911p9189j6502J57017r9319p7736o9755M0091p9377l0363K5682
2698i116R1213r9108O081P4822J16307K4253K4791r6762J4550M9861J28278q7151
$$ y = [344078, 370593, 253030, 225080, 385227, 419782, 307212, 359268, 411834, 369541, 258362, 176868, 323551, 386154, 300601, 320425, 405849, 413322, 373088, 372665, 369288, 354442, 292394, 322222, 347590, 302531, 228396, 222282, 262212, 240368, 291240, 355671, 349067, 341598, 296136, 194946, 68818, 283228, 399620, 323209, 351792, 282258, 164716, 87863, 166485, 230655, 285393, 293980, 222578, 277820, 238944, 196595, 200836, 289954, 245835, 129517, 275294, 278526, 207318, 306688, 332879, 454671, 278039, 139171, 123866, 32593, 142170, 67040, 98862, 202424, 220335, 141146, 124644, 281661, 182342, 104606, 34851, 74942, -4435, -34798, -9116, 82097, -17011, -10930, 63892, 180199, 204452, 229243, 132481, 147031, 196892, 325170, 238019]
2686B38019q9584P5434p4531J5679l8814M6770r2557J17510Q2390n0961q6297
2675A43058q1456n1496M0031q1044L5890j702K1745j31925J6220J34851N7763
2664A01935Q211j21977P0195Q6052o4083M6345J6429o705l2342o8767P5947Q7986
2652A99226q3423J12363j7947k6596o0869M6206J61402r6124j14461R3595K7641
2641B41013l8789k4062o1649o0590O3113O0158j7477n5801K5361p1303k5444J14190
2629A48720K5565L5209R0764j10718l1177N0680o9947J4518L9311p3506k2066
2618I7353Q2102n5947l6663J6363k5327m0286l0158q0057N7000Q5836j137l3427
2606C5652j08807o5792O6993J22520Q168p3562L9474j00175Q1821m5321o1950
$$ y = [238019, 148435, 223869, 149338, 165017, 126203, 172973, 80416, 197926, 280316, 229355, 143058, 61602, 10106, 50137, -30907, 4983, 3281, 25026, -106899, -90679, 44172, 101935, 110146, -11831, 58364, 144416, 80333, 126678, 143107, 136402, 104060, 35293, 111240, 199226, 115803, 228166, 210219, 183623, 122754, 168960, 330362, 234238, 119777, 213372, 241013, 202224, 178162, 116513, 55923, 119036, 179194, 161717, 105916, 131277, 59974, 34530, 148720, 174285, 209494, 300258, 189540, 158363, 209043, 139096, 153614, 192925, 119419, 97353, 179455, 123508, 86845, 103208, 77881, 37595, 7437, -72620, -15620, 70216, 69079, 35652, -73155, -138947, -71954, 50566, 58734, -14828, 24646, -75529, 6292, -39029, -100979]
2595a00979O8211P3004L9930L779R1293l8902j80872J88462O8663j56435k6949
2584B9205J3048M0222l5180n3562J9470o616O2286n6340k6631M0231P4231J07392
2572B07756k82889P3579J22285j0345j53600n5055J97765r8469p6141J5540R9771
2561D0197J17350n9282J4699L7880j33941n3298l8053P8344P7996k537l2606L4116
2549H0865j04226m933N0509L2013M3394K3687L8184j6144j72071n6420R7558n7156
2537d4740K4510M3344L1140O357m9010K2223J5792n1325k7133J06006o907r100
2525F1157p5213K56m5295P4017j03796J9071J14344K4030n7304o7914R985j8100
2513f4762R3330R6055Q8859j38339L6422m5992j4939j1107P3126O725m3225r8437
$$ y = [-100979, -32768, 40236, 80166, 83945, 175238, 136336, -44536, 143926, 212589, 56154, 29205, 42253, 82475, 47295, -6267, 13203, 6587, 68873, 12533, -14098, 26133, 100364, 207756, -75133, -1554, 120731, 110386, -43214, -98269, 99496, 1027, -75114, -59574, 40197, 157547, 98265, 112964, 150844, 16903, -36395, -74448, 3896, 81892, 79355, 46749, 80865, -23361, -28294, 22215, 54228, 97622, 121309, 159493, 143349, -28722, -85142, 12416, -44740, -20230, 23114, 54254, 60611, 11601, 33824, 49616, -1709, -28842, 77164, 70257, 61157, -14056, -13800, -59095, 14922, -88874, -69803, 44541, 68571, 11267, -56647, -46662, -64762, 28568, 124623, 213482, 75143, 111565, 65573, 50634, 39527, 112653, 119378, 76153, -22284]
2501b2284M5420O6406M370J1631j0277k0170L4145l7250p7502p3483J6907P3794
2489A1707j19369m8627J03729N4909J296J2723o8175k2533q586M9016J52065j02493
2477A5662n1431J16816o564n8637K079J4232O694M1158J41n7115j6472R7485J34646
2464B38694j23945j47110L1965P6400m4741O2075l3944n1026K2508o2305n7352
2453h8781j34153J02562J45979k9406N493P6247N575O5569p1826l2903O7715j9800
2441I2271m0949k2939J15416K6298Q2270j37626j76884J65861K8246r4661Q5497
2430A22800l9904j53711P485O1009l079Q1677l2670l6026P5919N620j42847R9053
2418D5326p7199q614J4846p2022L7665O0423P9649J1480r0304q1891J43103j1588
$$ y = [-22284, 23136, 89542, 93912, 105543, 95266, 75096, 109241, 71991, -5511, -78994, -62087, 11707, -107662, -156289, -52560, 2349, 3645, 16368, -51807, -74340, -82926, -33910, 118155, 15662, -35769, 81047, 74483, 15846, 17925, 32157, 38851, 80009, 80150, 23035, 6563, 104048, 238694, 114749, -32361, -396, 76004, 31263, 93338, 59394, 8368, 30876, -31429, -88781, -222934, -120372, 25607, -3799, 1694, 77941, 83516, 149085, 77259, 44356, 112071, 92271, 51322, 28383, 143799, 170097, 252367, 114741, -62143, 103718, 131964, 37303, 122800, 82896, -70815, -63330, -2321, -5400, 76277, 43607, 7581, 83500, 89120, -53727, 45326, -31873, -40487, -25641, -97663, -59998, 425, 80074, 91554, 1250, -80641, 62462, 50874]
2406E0874K2973M3268K8918N8676m4959o2898j2549j9255k3546l5864L9134l5991
2394H781K7005n1016n7216J06497n1790m8761N1791o554n1539N6678J5816l7675
2382c7983Q3944J7663M2313n3148R2597N6997n6959L8463N406K1594M4111Q5525
2370C40523L6159o6140o7160j13970l1240K7744P6452j76006n0309k6648J73703
2359A23108j01850M9422M5534p3597K2252K5813O4992r0800o2041P554M1502P5381
2347A27270J9012o2910q4349l3275O8371j52106J14867Q440J3790j00600j2372
2336i3862J84194j2920N0816k3982j53046n3885J1300q9311M8018J39701Q8549
2325I5572l8697j0873m0505R862j64794R4403K3287k2182K26402r5148j84376
$$ y = [50874, 73847, 117115, 146033, 204709, 159750, 96852, 84303, 65048, 41502, 5638, 44772, 8781, 35786, -15230, -72446, 34051, -17739, -66500, -14709, -21263, -72802, -16124, -308, -37983, 45961, 63624, 105937, 52789, 145386, 202383, 145424, 183887, 189293, 210887, 254998, 340523, 376682, 310542, 243382, 129412, 98172, 125916, 202368, 26362, -23947, -50595, 123108, 21258, 70680, 116214, 42617, 64869, 90682, 155674, 64874, 2833, 10387, 51889, 127270, 146282, 83372, -977, -34252, 34119, -117987, -3120, 5320, 19110, -81490, -93862, 90332, 77412, 128228, 104246, -48800, -102685, -91385, -180696, -132678, 7023, 95572, 56875, 46002, 5497, 15359, -149435, -55032, -31745, -53927, 172475, 77327, -107049]
2314a07049J31130m6266l7377J03662N6850J9963q8697J9582L2670o825J73560
2303B51203j1655j34912k0532n5023l5446p4283Q2589O8519K3185M6382J362Q0642
2291B22031R7794k70092n7375n0257l6413K1917K4392j7874J67227J9220J0265
2280A30835k8675P6811m5670q7059r5321M8263J02347J83932l592r4442n396N607
2268A87640k1807j9248n9383J13616O5920q3476r7330Q3641L4071K1713J36874
2257C62231q1647q0843n2225J75391o4073j9038Q1599q8618j5500J0211o1159
2246A66329j5022j07141l5752J44573O7692J5467M001m393K5694M2074r655K1990
2234C15857j86416l4366J67469o0235j6896J31117L8978j60612Q337Q9210J10057
$$ y = [-107049, 24081, -22185, -59562, 44100, 100950, 120913, 32216, 51798, 84468, 77643, 251203, 239548, 104636, 84104, 29081, -6365, -80648, 1941, 70460, 93645, 140027, 141389, 222031, 319825, 49733, -7642, -57899, -94312, -72395, -48003, -65877, 101350, 120570, 130835, 102160, 178971, 133301, 46242, -49079, -816, 101531, 285463, 281871, 187429, 182033, 187640, 165833, 146585, 87202, 200818, 266738, 183262, 85932, 169573, 203644, 225357, 362231, 280584, 199741, 147516, 322907, 258834, 239796, 321395, 232777, 217277, 227488, 166329, 151307, 44166, 8414, 152987, 220679, 236146, 240147, 235754, 261448, 303522, 293867, 315857, 129441, 95075, 262544, 202309, 185413, 316530, 355508, 194896, 203233, 292443, 402500]
2223D02500l8768n3685k2374K3293k6139Q9414j5563q712R5324J798k9973j15548
2211C01567K6245P7596p9064L6605J43891j0361j0118M8173L4208N117J5738J90
2199E89787k7835K6751l8620J07231J0387N9034J3950r1883N7138j679q820k7722
2187F67719k3400J22338K712L3762J10556K4047o2836j3254O2045M2357j8233
2176I47813j01333J3822J14723l6454R203R18J6272l8212R7950N4258n1460R0737
2164A118237p7233o423j7064R890J9791R1409J62264j09628k1692J32904J4827
2153A317282N0202l783J3292R7538L6069M9357N8869Q9405P968J21564K28073
2142B065836m0219Q9317J40994P0989K21326N4745K17789J74666O7979J95424
$$ y = [402500, 363732, 310047, 287673, 310966, 284827, 374241, 358678, 349966, 445290, 447088, 417115, 301567, 327812, 405408, 326344, 362949, 506840, 496479, 486361, 534534, 568742, 573859, 589597, 589787, 561952, 588703, 550083, 657314, 667701, 726735, 740685, 648802, 705940, 704261, 695441, 667719, 644319, 766657, 769369, 803131, 913687, 937734, 874898, 861644, 923689, 966046, 947813, 846480, 860302, 975025, 938571, 947774, 948692, 964964, 926752, 1024702, 1078960, 1027500, 1118237, 1041004, 1034581, 1017517, 1027407, 1047198, 1138607, 1300871, 1191243, 1169551, 1302455, 1317282, 1367484, 1363701, 1376993, 1474531, 1510600, 1559957, 1618826, 1708231, 1716199, 1837763, 2065836, 2025617, 2114934, 2255928, 2326917, 2548243, 2602988, 2820777, 2995443, 3063422, 3258846]
2132C258846K60824J08703J22934J14713L03197L26944L85055L63936L17248M78254
2122F040654N08226M50079N80335N18290N28345O18408P87751Q39138J150241
2113A2021467J537099K135710K466005L022378L915177N170388O375309Q399343
2105D5042876M950512l612070m565271n048232o889032o131941m526721l142309
2097A6077812k277309j724278j240637j023836q82676p49507m63117m11020n23756
2088F781676m48353m85425n52877l28183l37350k69199k56702j91349q0369l7195
2078C794674k45689j83766r7940L0112j25457k28429j07288k37920j63324j76204
2068B258769M1404m7007j21879o0645k29053j07198J05201j22205j31947l0876
$$ y = [3258846, 3519670, 3628373, 3751307, 3866020, 4169217, 4496161, 4881216, 5245152, 5562400, 6040654, 6548880, 6998959, 7579294, 8097584, 8625929, 9244337, 10032088, 10871226, 12021467, 13558566, 15694276, 18160281, 21182659, 25097836, 30268224, 36643533, 45042876, 49993388, 46381318, 41816047, 36767815, 29878783, 23746842, 19220121, 16077812, 13800503, 12076225, 10835588, 9811752, 8929076, 8179569, 7716452, 7305432, 6781676, 6333323, 5847898, 5295021, 4966838, 4629488, 4360289, 4103587, 3912238, 3831869, 3794674, 3548985, 3365219, 3267279, 3297391, 3171934, 2943505, 2836217, 2598297, 2434973, 2258769, 2300173, 2253166, 2131287, 2070642, 1841589, 1734391, 1839592, 1717387, 1585440, 1554564]
2058A554564j03722L3772r6220P9996k1420k16179l9535p1567n4391L5607P1364
2047A172269n0799o9558n8884p6053k1387j3511l2654l670p4635P3158J24970
2036I69246o9067l6319k3117r2661n3822N7613J7789j23314J27r2437J31791o873
2024F78956j63130O7111M8901N3299M5533k9966j04614n5681n1539J9749k0651
2013D87968j24436k3981N6425J63727L5963L3599j5192p6474j72590r1821L6418
2002C09606k896J1447L8924O9088q9601R3509K8527l1469R705m4196M0446j25701
1990C07389Q4168m1946n1239j6557J16552j8825p5512J07379k4290n9731r3894
1979B33494R2982j9746J46933m577j59907j08290m0675J10662o0354K2324J02574
$$ y = [1554564, 1450842, 1484614, 1388394, 1468390, 1446970, 1230791, 1191256, 1119689, 1065298, 1100905, 1172269, 1121470, 1051912, 993028, 916975, 895588, 882077, 849423, 845753, 771118, 844276, 969246, 900179, 863860, 840743, 748082, 694260, 751873, 769662, 646348, 646475, 554038, 685829, 678956, 515826, 582937, 631838, 685137, 730670, 700704, 596090, 540409, 488870, 508619, 487968, 363532, 339551, 395976, 559703, 595666, 629265, 614073, 537599, 365009, 273188, 309606, 306710, 318157, 357081, 426169, 336568, 430077, 458604, 427135, 436840, 392644, 433090, 307389, 391557, 349611, 298372, 281815, 398367, 379542, 304030, 411409, 387119, 327388, 233494, 326476, 306730, 453663, 449086, 289179, 180889, 140214, 250876, 190522, 212846, 315420]
1968C15420N7869j23300n6776M7925O9108p187l3149n9189Q1273J6517l5940L2290
1956C04861j32812j07113J36808J908K8402k3531n8439l7334R5650K7790j0437
1945B25753o1448r6963K8567l654R280j9235J4852N7290n8920L4839m007q7752
1933C8602J04008j2777L6474J41265N3755p2750j31571m6253J26843j24232l9485
1922G3879J24904L4159J5499k3763M3043O0542j25175Q4717l4080j81742K9382
1911A01365R7601j9739p4475M6558l2210K8247K2847p7518K4640l5730r586N7004
1899A29004j2259L8309J4356l2269n6272J5815R9257J4119K6520j06672L7309
1888A67217j13622m9111J19903K1873o9117R1105P3267k1519m1987j8797o9333
$$ y = [315420, 373289, 249989, 193213, 241138, 310246, 303059, 269910, 210721, 291994, 308511, 272571, 304861, 172049, 64936, 201744, 203652, 232054, 208523, 150084, 112750, 208400, 236190, 225753, 164305, 67342, 95909, 92255, 101535, 82300, 97152, 154442, 95522, 130361, 126354, 38602, 142610, 129833, 166307, 307572, 361327, 288577, 157006, 110753, 237596, 113364, 73879, 198783, 232942, 248441, 224678, 267721, 328263, 203088, 287805, 253725, 71983, 101365, 198966, 179227, 104752, 151310, 119100, 147347, 170194, 92676, 117316, 81586, 72000, 129004, 116745, 155054, 169410, 137141, 80869, 96684, 195941, 210060, 236580, 129908, 167217, 53595, 4484, 124387, 146260, 77143, 168248, 241515, 219996, 178009, 159212, 89879]
1877H9879O9272j2012n6646K0345M3156r5529N1047K1142l2286M1585q7621l4414
1865A7918L7086Q0806M2437r9061p2888J08476l536k241k9244J12344j09951N2435
1853A34581o7345r5564Q5860Q0215o183Q1968K5559j05471M4854j9441k8864j22219
1841G950J13446J28224j6118O187j22363L3506J06870P5979l7433l9619l099p3626
1829A79904J5785N6518q5179O5888K1702r5919J0410k3381K9662n0151n4777O1450
1817A31912N0673j29052l8319J1911k4239J30249O0119n7203j12279Q2599J9791
1806A26162q1197O1691k4579j06521J00504N6844o3103K0824l7663q5917N2576
1795A9621Q3866l1277q7645P876M827M1461J53k5629J64315k5647j13687R354
$$ y = [89879, 159151, 147139, 90493, 110838, 153994, 58465, 109512, 130654, 98368, 139953, 52332, 17918, 55004, 135810, 178247, 79186, 6298, 114774, 111238, 108997, 79753, 192097, 82146, 134581, 67236, -28328, 57532, 137747, 131564, 213532, 239091, 133620, 178474, 159033, 130169, 7950, 121396, 249620, 233502, 239689, 117326, 150832, 257702, 333681, 296248, 256629, 253530, 179904, 195689, 252207, 167028, 232916, 254618, 158699, 169109, 145728, 175390, 125239, 70462, 131912, 182585, 53533, 15214, 27125, 2886, 133135, 193254, 136051, 23772, 106371, 126162, 44965, 106656, 82077, -24444, 76060, 132904, 69801, 90625, 52962, -32955, 19621, 103487, 72210, -15435, -7559, -2732, 38729, 38882, 13253, 177568, 151921, 38234, 47588]
1783D7588q0091r0676Q1055K6801N9310l6953p074k5230L6635p9115m874J70203
1771I7579j9574N4318n2541J18501m1048J4375O5854k9211O2986j36851j82824
1760d8436o2247m4403J03824R3788Q3291M6491j57708p5739J41541L6156k63468
1749a46910P2979J19143q129l4745L4924n2051m8054K8285Q6153M0104j8042R9634
1737A73291l9987j57106Q2010j27646O2121J42827n0867n75o0358J07760m3422
1726H8048k5543m7446k2148P5430Q4005n1022n3003k1767p8721N9364j5259l7882
1714d5944R3424K8834p3452j28758K8269J13293J5847k5515l8836J5350P7676
1703F0188q76O3517j19998P7244n9713o3296M0430K7048n4080l1835O8008j7033
$$ y = [47588, -32503, -123179, -42124, -15323, 43987, 7034, -40, -25270, 11365, -67750, -72624, 97579, 78005, 132323, 79782, 198283, 157235, 171610, 237464, 208253, 271239, 134388, -48436, -110683, -155086, -51262, 42526, 125817, 172308, 14600, -61139, 80402, 116558, -146910, -73931, 45212, 37083, 2338, 37262, -14789, -62843, -34558, 51595, 91699, 73657, 173291, 133304, -23802, 58208, -69438, -7317, 135510, 84643, 84068, 23710, 131470, 88048, 62505, 15059, -7089, 68341, 152346, 101324, 48321, 26554, -52167, 7197, -8062, -45944, 47480, 76314, 2862, -125896, -97627, 15666, 31513, 5998, -32838, -17488, 60188, 59312, 122829, 2831, 80075, 20362, -42934, -2504, 24544, -29536, -61371, 6637, -10396]
1691a0396q4647M195R4062J59583o968j28809K504K457k9459N5169j248j96815
1679a40372m6522J8850J06815J23432J46171n0844j67292m5211N1868P508M696
1668I099k9472J42713l820j16523N5876K3087p5723J0861O5442p2849l7196O5516
1656C7011M4682l8285M554N1252j1846L0005K776p2852k730p9844r3367O4133
1644f4511p0207J21667j935N4611K4469r1958k65j00074k7353J52893n3114n5581
1632a11358N3600M5216L1666R130P6583n422J00681o9581j22271n0470j61923
1621b04149K5313J28568k5087j5961M9852m9732l3741R1543M6177k577q1947P226
1609f4515Q5776r979L059k4657K6417L6632j71374O422K74947Q1438j32491r9624
$$ y = [-10396, -95043, -90848, 3214, 162797, 155829, 27020, 29524, 31981, 2522, 57691, 56443, -140372, -186894, -168044, -61229, 62203, 208374, 157530, -9762, -54973, -3105, 4403, 9099, -20373, 122340, 118520, 1997, 57873, 80960, 5237, 16098, 81540, 8691, -28505, 37011, 81693, 43408, 47962, 99214, 87368, 117373, 120149, 47297, 44567, -35277, -128644, -64511, -134718, -13051, -14986, 39625, 64094, -27864, -28129, -128203, -155556, -2663, -55777, -111358, -57758, -12542, 19124, 28254, 104837, 99415, 200096, 130515, 8244, -42226, -204149, -178836, -50268, -75355, -91316, -41464, -91196, -124937, -33394, 12783, 10206, -71741, -64515, 21261, 11282, 14341, -10316, 16101, 52733, -118641, -112219, 162728, 244166, 111675, 12051]
1597A2051M4085j14729m1074Q0197Q476l4621R1460l1900j17240J40379M6974
1586H4058o1761M0087m4981p4972k3095P0978J48232j23221n1675L0797P6031
1575G0478L6508J9947K640m2368j01343l8680J9153j06191m9869J10400J01235
1564B1910K5204l3536j4642n0958N3604M1412o4836l1976J14486k1850o692m0007
1552g881l4608P0217Q040o9242J6133J4756P2887O703K4277l578m5973r4881J1165
1539c1985j7219k8755K0215L9060K4177k609N4074n6752J187j4669k7744p2745
1527a13765J5537J12089L5558k2566n7803n9654P2927L4781M5396k4365R0828
1516A28963j39015o0642j9013N6862J00248M4828O4372o6993j5048p0359K3278
$$ y = [12051, 56136, -58593, -99667, -19470, -10994, -45615, 45845, 13945, -103295, 37084, 84058, 22297, 62384, 17403, -57569, -80664, -9686, 138546, 15325, -36350, -5553, 70478, 106986, 126933, 129573, 87205, -14138, -52818, -33665, -139856, -189725, -79325, 21910, 47114, 13578, -1064, -52022, 1582, 42994, -21842, -53818, 60668, 38818, 32126, -7881, -42489, 27728, 35768, -33474, -17341, -2585, 70302, 77005, 101282, 97704, 51731, -43150, -31985, -49204, -77959, -57744, -18684, 5493, 2884, 56958, 206, 1393, -13276, -41020, -113765, -98228, 13861, 49419, 26853, -30950, -90604, -17677, 17104, 62500, 38135, 128963, -10052, -70694, -89707, -32845, 67403, 112231, 176603, 109610, 94562, 24203, 47481]
1505D7481k433q6555J3115n8622K060p0170K7760J69759L9863l7366j05576Q2468
1493B1784L3899n0231k6101M6132L0582k6235K586p811P7918m2371j2567m2823
1481D762j1381j7071l0146l7342J7479L6434N4108J74123j29054m0985L0082r8848
1469d7839P427p3812J2706J43126k9530l3960K0217R086o8957p3659J26985L0564
1457B2354j42974j16439N1778M2099J23998L8104j16705p0494L0597J4774M8544
1446g4364M2691l6874p7179O8771J5780j54001J63314P2563K9701r7858k6749
1435g4205J6639P8953J3479j19384J18509K228q8830l3603Q9185q4199J08671
1424B7443O7170q6811K6325k899j54494N3093J15426l7703P0776M9808j03209
$$ y = [47481, 45048, -41507, -28392, -87014, -84954, -155124, -127364, 42395, 82258, 44892, -60684, 21784, 55683, 5452, -20649, 25483, 56065, 29830, 32416, 24605, 102523, 60152, 47585, 4762, -6619, -23690, -53836, -91178, -73699, -37265, 16843, 190966, 61912, 20927, 51009, -47839, -40412, -114224, -101518, 41608, 12078, -21882, -1665, 7421, -61536, -135195, -8210, 22354, -120620, -237059, -185281, -143182, -19184, 18920, -97785, -168279, -137682, -122908, -74364, -31673, -68547, -145726, -76955, -61175, -215176, -51862, 20701, 50402, -47456, -74205, -57566, 21387, 34866, -84518, 33991, 36219, -52611, -86214, 2971, -81228, 27443, 94613, 7802, 34127, 31228, -123266, -70173, 45253, 7550, 78326, 128134, 24925]
1413B4925j0524K7558j5140k2990j36230k0152J33271P8082j47851L0643L5606
1402b2802m9149j6841K6575n1708O2575K4604M111k520J88831Q06k9351o5444
1390F9687j0522k5784J3957j10940M5064o7944N609P9143j6767o8883k3770P9739
1378c1411p6029L5897J05115p1660l7471j6596j1288M6988M431N7315n6547M2308
1366h948q7155M0872J4384N4998k1120j8806l3802r544O9049n7874J4931k9840
1354g2855j4799K8075o5938J07785q185J625o9103n4484j9036O0556M5530P4572
1342A3743j7078n4058m2948L3491n4033O9320J9336L6203P2254m4266j51468j2347
1330a31851j4670R4248J16434l321n3807L5813j5629m0024n7132j9723Q0578n0558
$$ y = [24925, 14401, 41959, 26819, 3829, -132401, -152553, -19282, 58800, -89051, -58408, -22802, -71951, -88792, -62217, -113925, -51350, -26746, -22635, -25155, 163676, 164482, 135131, 69687, 59165, 33381, 47338, -63602, -18538, -86482, -80873, -1730, -18497, -87380, -111150, -31411, -107440, -71543, 33572, -38088, -75559, -92155, -103443, -56455, -52024, 5291, -51256, -8948, -96103, -55231, -40847, 14151, -6969, -25775, -59577, -69121, -72, -57946, -43015, -72855, -87654, -59579, -125517, -17732, -25917, -24292, -93395, -147879, -166915, -106359, -60829, 13743, -3335, -57393, -100341, -66850, -120883, -51563, -32227, 3976, 76230, 31964, -119504, -131851, -146521, -52273, 64161, 60840, 7033, 42846, 27217, -12807, -69939, -89662, -9084, -59642]
1318e9642J12752k8873r1616j31931P8829K10662J2339j41847r0942M4346L4293
1307e1630O9872M8539p9223M1290j08560j20273O6104Q6064j28209Q3943j0177
1296a02260J29816n5669r4287K7190m1817J07577J49183q4565K321J04970j08678
1285C3781p1568k1185J27484M5469J7910k8511j15841q536L9253j7879J8371n4549
1273c5801Q8043q518j2535l4582l8376M2566N4691n9594J4767J3910o5085J07728
1261F7214J938o9326j00598o452J25877M1448k38275p9604J35118P8763J41025
1250I7128m4585j76012P6062q5797j24675Q3134O481q0761N5527J26690R9696
1239C2888j10633M7706P803L2232j9698j00698n1573J15515J52266o4376P75r8063
$$ y = [-59642, 53110, 24237, -67379, -199310, -120481, 90181, 102520, -39327, -130269, -85923, -51630, 18242, 66781, -12442, 28848, -79712, -199985, -133881, -47817, -176026, -92083, -102260, 27556, -28113, -122400, -95210, -137027, -29450, 119733, 35168, 37489, 142459, 33781, -37787, -58972, 68512, 113981, 131891, 103380, -12461, -20997, 18256, 377, 18748, -35801, 52242, 43724, 31189, -3393, -41769, 797, 55488, -4106, 10661, 24571, -40514, 67214, 69152, -174, -100772, -107224, 18653, 60101, -178174, -257778, -122660, -43897, 97128, 52543, -123469, -47407, -133204, -257879, -174745, -168264, -249025, -193498, -66808, 32888, -77745, -30039, -22236, 9996, -9702, -110400, -161973, -46458, 105808, 41432, 42207, -55856]
1227e5856J03802J15486j23584n8227l5816R769K18884o7101N6542j02278k381
1216E9240r6649j12506J13387k112N6133P6730m8666l585R9784j92047l0709M0489
1204d0511O9220j14770R9617l2664n9782J61932p5958n127l0519l5968J40571
1193G6041M4345j6683o9959m8697K1142j34540m6372Q748M7753Q9585K3738J6086
1181A1187p9186j02167J16644l3802p2298Q3292J0779K668R7088K2182r9066m8695
1169i1374J7626n595M8767k7287O8999K6773m4044J5569Q8237R906n1646N0916
1157A06847J10033k41550Q1386J30081k20328m4022j0364j6773j3518K8973J0499
1146g8736Q5844R4539j0009k8865K7946j21387R5505m1878k3919l7390N587L9045
$$ y = [-55856, 47946, 163432, 39848, -18379, -54195, -44426, 174458, 107357, 163899, 61621, 59240, -37409, -149915, -36528, -38640, 17493, 94223, 45557, 41972, 141756, -50291, -81000, -40511, 28709, -86061, 13556, -19108, -78890, 83042, 7084, 1957, -28562, -64530, 76041, 120386, 103703, 33744, -14953, 6189, -128351, -174723, -165975, -118222, -28637, -4899, 11187, -67999, -170166, -53522, -87324, -159622, -76330, -65551, -62883, 34205, 56387, -42679, -91374, -73748, -79343, -30576, -57863, 11136, 37909, -6135, 9434, 97671, 107577, 55931, 106847, 216880, -24670, 56716, 186797, -33531, -77553, -87917, -104690, -118208, -89235, -78736, 7108, 101647, 91638, 62773, 90719, -30668, 64837, 22959, -960, -38350, -32763, 6282]
1134F282l6498L9650L2358N3484k8316l1246N1563k8335n7853J358N4240l8759
1122A7928j24756O0541J3478l6824J9938K8170j5846J05874J31403j63032j17653
1111h0779J9161k9311N5426k6979j0390R6370m5944k355P2785l3739M7979l2447
1099B9777j06516P3690p4041n259k7069R5947J7540o475l1853j17462K0378m695
1087a36038J28918L3506r7700l798O6670R2010o998p1060M5322P2249m734j33387
1075a5040O8909J865O1193M098J4908k7903k8307j08554J1465j63925k232J70706
1063a2817J7412n5404J6716l4939k7310l586q169J24387m7865l1034j4092J60299
1051H3598L6973k09996J76358K5857p5009K0061o6311j04382Q8302Q8709r4748
$$ y = [6282, -30216, 9434, 41792, 95276, 66960, 35714, 87277, 58942, 1089, 2447, 56687, 17928, -106828, -46287, -32809, -69633, -49695, -21525, -37371, 68503, 199906, 36874, -80779, -61618, -90929, -35503, -62482, -72872, 23498, -22446, -24801, 47984, 14245, 62224, 29777, -76739, -3049, -77090, -82349, -109418, -13471, 4069, -2406, -34259, -151721, -131343, -136038, -7120, 26386, -71314, -75112, -8442, 83568, 76570, 5510, 50832, 123081, 118347, -15040, 53869, 55734, 116927, 121025, 135933, 108030, 79723, -28831, -17366, -181291, -183523, -12817, 4595, -50809, -34093, -69032, -96342, -99928, -108097, 16290, -31575, -62609, -76701, 83598, 120571, -89425, 86933, 112790, 37781, 57842, -8469, -112851, -24549, 64160, -30588]
1040c0588O5205r7118O6717j0949p77j37984L7983L7126M9288N857j5757N0105
1028A9108J09447k579o7860o5669o2122J0904J07944O7413j13181K403M8046o2536
1016h682j24711j5646L7492P8071o2242l9149O0884k9312L3612L7713J1657M0039
1004A9726O1260J4840p7258M4586M6501j40174l1270n5633K3481j5514N512J0362
992i3581q9393J30239j7779j06575P7743J19089n6498n6548l5708k722K2938O6351
980d2444M3611j1170n4581l1148Q2915m2006O1773M0518L3546p5495o9721M9782
968a4420K5255p5094o6268N0508J1413K2214j1617J8668n1802P6920j44333l5539
956a94095J18690J39572K8279k18136q6137K3269P2951J3306J05679m6140j14851
$$ y = [-30588, 34617, -62501, 4216, -6733, -7510, -145494, -107511, -70385, -21097, -15240, -30997, 19108, 128555, 125976, 58116, -7553, -69675, -58771, 49173, 116586, 3405, 5808, 53854, -8682, -133393, -149039, -111547, -33476, -95718, -134867, -73983, -103295, -69683, -31970, -20313, 19726, 80986, 95826, 18568, 63154, 109655, -30519, -61789, -117422, -93941, -109455, -103943, -93581, -182974, -52735, -70514, -177089, -99346, 19743, -36755, -93303, -129011, -131733, -108795, -42444, 1167, -10003, -64584, -95732, -12817, -54823, 6950, 47468, 81014, 5519, -64202, -14420, 10835, -64259, -130527, -80019, -68606, -46392, -58009, -39341, -91143, -14223, -158556, -194095, -75405, 64167, 92446, -125690, -211827, -188558, -115607, -102301, 3378, -42762, -157613]
945a57613P9722L6283j2925J21092O890p2659j6746j19618M1546J42281m5325
$$ y = [-157613, -77891, -41608, -54533, 66559, 73449, 790, -15956, -135574, -94028, 48253, 2928]
$$ [...]
##END NTUPLES=NMR SPECTRUM
##END=
