##TITLE=1H_TG-2340-VIa
 CDCl3
 8 sc, 
 19.5.2023
##JCAMPDX= 6.0         $$ Bruker NMR JCAMP-DX V2.0
##DATA TYPE= NMR SPECTRUM
##DATA CLASS= NTUPLES
##ORIGIN= UXNMR, Bruker Analytische Messtechnik GmbH
##OWNER= root
$$ XWIN-NMR		Version 3.5
$$ Fri May 19 13:56:58 2023 Russian Standard Time (UT+4h)  she@DPX200
##.OBSERVE FREQUENCY= 200.13135
##.OBSERVE NUCLEUS= ^1H
##.ACQUISITION MODE= SIMULTANEOUS
##.ACQUISITION SCHEME= undefined
##.AVERAGES= 8
##.DIGITISER RES= 18
##SPECTROMETER/DATA SYSTEM= spect
##.PULSE SEQUENCE= zg30
##.SOLVENT NAME= CDCl3
##.SHIFT REFERENCE= (INTERNAL, CDCl3, 0, 15.7469)
##AUDIT TRAIL= $$ (NUMBER, WHEN, WHO, WHERE, WHAT)
$$ ##TITLE= Audit trail, XWIN-NMR		Version 3.5
$$ ##JCAMPDX= 5.01
$$ ##ORIGIN= Bruker BioSpin GmbH
$$ ##OWNER= she
$$ F:/spectra/data/she/nmr/H-F/1/pdata/1/auditp.txt
$$ ##AUDIT TRAIL=  $$ (NUMBER, WHEN, WHO, WHERE, WHAT)
(   1,<2023-05-19 13:55:34.73 +0400>,<she>,<DPX200>,
      <created by zg, POWCHK disabled, PULCHK disabled
       configuration hash MD5:
       00 E9 B6 7A A2 85 ED C7 34 08 36 98 17 FE 4E 26
       data hash MD5: 16K
       7C 4C C0 CD 9B 27 A4 DC 80 80 E1 D7 AD FC A8 E3>)
(   2,<2023-05-19 13:55:37.01 +0400>,<she>,<DPX200>,
      <Start of raw data processing
       efp BC_mod = 2 LB = 0.24 FT_mod = 6 PKNL = 1 PHC0 = -19899.18 PHC1 = 8.452719 SI = 16K 
       data hash MD5: 16K
       04 89 54 76 AF 73 8D E4 2A 0B 00 BB DD 59 93 4D>)
(   3,<2023-05-19 13:55:58.53 +0400>,<she>,<DPX200>,
      <pk PHC0 = -1.730093 PHC1 = 1.6 
       data hash MD5: 16K
       15 CC 52 27 F7 2E F4 54 81 B0 1A 2A 6D 3B F8 28>)
(   4,<2023-05-19 13:56:01.62 +0400>,<she>,<DPX200>,
      <abs ABSG = 5 
       data hash MD5: 16K
       48 44 65 6D 92 37 96 D6 45 30 67 B3 7D 82 70 F0>)
$$ ##END=
$$ 
$$ hash MD5
$$ 11 29 0B F9 E5 B5 A9 FB CB D1 C5 BA 63 21 A9 C4
##$RELAX= 
##$RELAX= 
##$RELAX= 
##$RELAX= 
##$RELAX= 
##$RELAX= 
$$ Bruker specific parameters
$$ --------------------------
##$DU= <F:/spectra>
##$EXPNO= 1
##$NAME= <H-F>
##$PROCNO= 1
##$TYPE= <nmr>
##$USER= <she>
##$AMP= (0..31)
100 100 100 100 100 100 100 100 100 100 100 100 100 100 100 100 100 100 
100 100 100 100 100 100 100 100 100 100 100 100 100 100 
##$AQSEQ= 0
##$AQ_mod= 1
##$AUNM= <au_zg>
##$AUTOPOS= <>
##$BF1= 200.13
##$BF2= 200.13
##$BF3= 200.13
##$BF4= 200.13
##$BF5= 200.13
##$BF6= 200.13
##$BF7= 200.13
##$BF8= 200.13
##$BYTORDA= 1
##$CFDGTYP= 0
##$CFRGTYP= 5
##$CHEMSTR= <none>
##$CNST= (0..31)
1 1 145 1 1 1 1 1 1 1 1 1 1 1 1 1 1 1 1 1 1 1 1 1 1 1 1 1 1 1 1 1 
##$CPDPRG= <>
##$CPDPRG1= <>
##$CPDPRG2= <>
##$CPDPRG3= <>
##$CPDPRG4= <mlev>
##$CPDPRG5= <mlev>
##$CPDPRG6= <mlev>
##$CPDPRG7= <mlev>
##$CPDPRG8= <mlev>
##$CPDPRGB= <>
##$CPDPRGT= <>
##$D= (0..31)
0 1.2 0 0 0 0 0 0 0 0.06 0 0.03 0 0 0 0 0.0002 0 0 0 0 0 0 0 0 0 0 0 0 
0 0 0 
##$DATE= 1684490134
##$DBL= (0..7)
120 120 120 120 120 120 120 120 
##$DBP= (0..7)
150 150 150 150 150 150 150 150 
##$DBP07= 0
##$DBPNAM0= <>
##$DBPNAM1= <>
##$DBPNAM2= <>
##$DBPNAM3= <>
##$DBPNAM4= <>
$$ [...]
##$SUBNAM3= <"">
##$SUBNAM4= <"">
##$SUBNAM5= <"">
##$SUBNAM6= <"">
##$SUBNAM7= <"">
##$SUBNAM8= <"">
##$SUBNAM9= <"">
##$SW= 18.05172834244
##$SWIBOX= (0..15)
0 0 2 0 0 0 0 0 0 0 0 0 0 0 0 0 
##$SW_h= 3612.71676300578
##$TD= 16384
##$TD0= 1
##$TE= 0
##$TE2= 300
##$TE3= 300
##$TEG= 300
##$TL= (0..7)
0 120 120 120 120 120 120 120 
##$TP= (0..7)
150 150 150 150 150 150 150 150 
##$TP07= 0
##$TPNAME0= <>
##$TPNAME1= <>
##$TPNAME2= <>
##$TPNAME3= <>
##$TPNAME4= <>
##$TPNAME5= <>
##$TPNAME6= <>
##$TPNAME7= <>
##$TPOAL= (0..7)
0.5 0.5 0.5 0.5 0.5 0.5 0.5 0.5 
##$TPOFFS= (0..7)
0 0 0 0 0 0 0 0 
##$TUNHIN= 0
##$TUNHOUT= 0
##$TUNXOUT= 0
##$USERA1= <user>
##$USERA2= <user>
##$USERA3= <user>
##$USERA4= <user>
##$USERA5= <user>
##$V9= 5
##$VALIST= <valist>
##$VCLIST= <CCCCCCCCCCCCCCC>
##$VD= 0
##$VDLIST= <DDDDDDDDDDDDDDD>
##$VPLIST= <PPPPPPPPPPPPPPP>
##$VTLIST= <TTTTTTTTTTTTTTT>
##$WBST= 1024
##$WBSW= 4
##$XGAIN= (0..3)
0 0 0 0 
##$XL= 0
##$YL= 0
##$YMAX_a= 318978
##$YMIN_a= -354481
##$ZGOPTNS= <>
##$ZL1= 120
##$ZL2= 120
##$ZL3= 120
##$ZL4= 120
##$ABSF1= 15.73739
##$ABSF2= -2.31446
##$ABSG= 5
##$ABSL= 3
##$ALPHA= 0
##$AQORDER= 0
##$ASSFAC= 0
##$ASSFACI= 0
##$ASSFACX= 0
##$ASSWID= 0
##$AUNMP= <proc_1d>
##$AZFE= 0.1
##$AZFW= 0.1
##$BCFW= 0
##$BC_mod= 2
##$BYTORDP= 0
##$COROFFS= 0
##$CY= -3
##$DATMOD= 1
##$DC= 0
##$DFILT= <>
##$DTYPP= 0
##$F1P= 0
##$F2P= 0
##$FCOR= 1
##$FTSIZE= 16384
##$FT_mod= 6
##$GAMMA= 0
##$GB= 0
##$INTBC= 1
##$INTSCL= 3.70164e-10
##$ISEN= 128
##$LB= 0.24
##$LEV0= 0
##$LPBIN= 0
##$MAXI= 10000
##$MC2= 0
##$MEAN= 0
##$ME_mod= 0
##$MI= 1.114404
##$NCOEF= 0
##$NC_proc= -5
##$NLEV= 6
##$NOISF1= 3.799351
##$NOISF2= 2.8
##$NSP= 0
##$NTH_PI= 0
##$NZP= 0
##$OFFSET= 15.74689
##$PC= 1
##$PHC0= -19900.91
##$PHC1= 10.05272
##$PH_mod= 1
##$PKNL= yes
##$PPARMOD= 0
##$PSCAL= 0
##$PSIGN= 0
##$REVERSE= no
##$SF= 200.130004933935
##$SI= 16384
##$SIGF1= 3
##$SIGF2= 2
##$SINO= 5.538805
##$SIOLD= 16384
##$SREGLST= <1H.CDCl3>
##$SSB= 0
##$STSI= 16384
##$STSR= 0
##$SW_p= 3612.71676300578
##$SYMM= 0
##$S_DEV= 0
##$TDeff= 16384
##$TDoff= 0
##$TI= <>
##$TILT= no
##$TM1= 0
##$TM2= 0
##$TOPLEV= 0
##$USERP1= <user>
##$USERP2= <user>
##$USERP3= <user>
##$USERP4= <user>
##$USERP5= <user>
##$WDW= 1
##$XDIM= 16384
##$YMAX_p= 294377653
##$YMIN_p= -374790
$$ End of Bruker specific parameters
$$ ---------------------------------
##NTUPLES= NMR SPECTRUM
##VAR_NAME=  FREQUENCY,     SPECTRUM/REAL,   SPECTRUM/IMAG
##SYMBOL=    X,             R,               I
##VAR_TYPE=  INDEPENDENT,   DEPENDENT,       DEPENDENT
##VAR_FORM=  AFFN,          ASDF,            ASDF
##VAR_DIM=   16384,         16384,           16384
##UNITS=     HZ,            ARBITRARY UNITS, ARBITRARY UNITS
##FACTOR=    0.220516191357247, 1,           1
##FIRST=     3151.42518701382, 0,            0
##LAST=      -461.291575991962, 0,           0
##MIN=       -461.291575991962, -374790,     0
##MAX=       3151.42518701382, 294377653,    0
$$ Real data points
##PAGE= N=1
##DATA TABLE= (X++(R..R)), XYDATA
$$ [...]
$$ plain form
7191 1065947 1092139 1160598 1162964 1201668 1318782 1309757 1339485 1410605 1443537 1476654 1521833 1553962
7179 1553962 1619866 1617630 1662784 1692025 1733792 1815240 1846523 1867897 1900704 1942704 2003162 2065112
7167 2065112 2177293 2200982 2270832 2340879 2386425 2406628 2480846 2563994 2585833 2647661 2676286
7156 2676286 2709070 2759975 2779609 2880615 2983699 3075839 3177330 3267897 3381478 3465870 3542281
7145 3542281 3666154 3795622 3902354 3980360 4129839 4263620 4412274 4619627 4807105 4984415
7135 4984415 5208016 5501692 5757126 6010645 6285625 6565022 6875190 7078280 7346726 7684087
7125 7684087 8035518 8434822 8838514 9299833 9755808 10253957 10812428 11499716 12331123 13315783
7115 13315783 14414233 15739249 17273970 18983982 20931528 23251500 26169562 29792740
$$ packed form
7191A065947K6192O8459K366L8704J17114r025K9728P1120L2932L3117M5179L2129
7179A553962O5904k236M5154K9241M1767Q1448L1283K1374L2807M2000O0458O1950
7167B065112J12181K3689O9850P0047M5546K0203P4218Q3148K1839O1828K8625
7156B676286L2784N0905J9634J01006J03084R2140J01491R0567J13581Q4392P6411
7145C542281J23873J29468J06732P8006J49479J33781J48654K07353J87478J77310
7135D984415K23601K93676K55434K53519K74980K79397L10168K03090K68446L37361
7125G684087L51431L99304M03692M61319M55975M98149N58471O87288Q31407R84660
7115A3315783J098450J325016J534721J710012J947546K319972K918062L623178
$$ plain form
7107 29792740 34420433 40450907 48247968 58163104 69545296 80126650 86559820 86694193
7099 86694193 80264862 69290067 57026104 46104244 37328229 30755403 25979226 22371637
7091 22371637 19572141 17343563 15512547 13960296 12747236 11711258 10727963 9901624
7083 9901624 9223025 8588655 8034398 7559761 7114458 6837265 6557028 6274104 6067843 5772494
7073 5772494 5533856 5291199 5052492 4920147 4762062 4603026 4437560 4261272 4197442 4110492
7063 4110492 4011446 3959914 3966956 3946900 3955879 4000178 4097414 4205680 4313700 4383194 4523694
7052 4523694 4712640 4949974 5260385 5624213 5966451 6221223 6316397 6187646 5772818 5217379
7042 5217379 4664449 4129888 3657776 3182462 2863375 2587561 2363753 2232518 2148176 2055548
$$ packed form
7107B9792740M627693O030474P797061R915136J1382192J0581354O433170J34373
7099H6694193o429331j0974795j2263963j0921860q776015o572826m776177l607589
7091B2371637k799496k228578j831016j552251j213060j035978r83295q26339
7083I901624o78599o34370n54257m74637m45303k77193k80237k82924k06261k95349
7073E772494k38638k42657k38707j32345j58085j59036j65466j76288o3830q6950
7063D110492r9046n1532P042k0056Q979M4299R7236J08266J08020O9494J40500
7052D523694J88946K37334L10411L63828L42238K54772R5174j28751m14828n55439
7042E217379n52930n34561m72112m75314l19087k75814k23808j31235q4342r2628
$$ plain form
7032 2055548 1935945 1838013 1735669 1658021 1549129 1437625 1432668 1398499 1360507 1325106 1269845
7021 1269845 1234478 1160297 1129967 1112153 1074536 1001339 962277 938488 957739 929976 890575
7010 890575 862292 824986 789299 790902 811627 783956 746110 673551 631472 699659 709165 712259
6998 712259 722324 617760 589298 588809 559252 545752 566586 550879 561701 554678 543353 573184
6986 573184 614193 595300 600384 591592 584901 549876 576748 550201 491897 451359 452031 483139 450955
6973 450955 402695 369445 358220 358818 349206 328681 361940 364447 363172 330184 379510 374877 357760
6960 357760 339310 293417 268075 294100 330850 343147 328446 275617 257183 291584 278637 231005
6948 231005 210664 208467 248599 254557 251418 288590 246892 218102 218476 219142 248943 198555 197590
$$ packed form
7032B055548j19603r7932j02344p7648j08892j11504m957l4169l7992l5401n5261
7021A269845l5367p4181l0330j7814l7617p3197l9062k3789J9251k7763l9401
7010H90575k8283l7306l5687J603K0725k7671l7846p2559m2079O8187R506L094
6998G12259J0065j04564k8462m89k9557j3500K0834j5707J0822p023j1325K9831
6986E73184M1009j8893N084q792o691l5025K6872k6547n8304m0538O72L1108l2184
6973D50955m8260l3250j1225N98r612k0525L3259K507j275l2988M9326m633j7117
6960C57760j8450m5893k5342K6025L6750J2297j4701n2829j8434L4401j2947m7632
6948B31005k0341k197M0132N958l139L7172m1698k8790L74O66K9801n0388r65
$$ plain form
6935 197590 215558 217463 219089 271557 268074 183984 186305 196023 173931 218599 209336 235325 237545
6922 237545 234183 267820 275147 255087 238756 252020 217458 193625 174660 162935 111354 107993
6910 107993 155307 129142 152741 148290 118954 162821 163760 142273 118865 114220 114190 191363 180948
6897 180948 189754 147015 87166 127394 140810 121833 78664 116318 138867 137313 140255 147537
6885 147537 185147 195713 225523 220719 173321 145542 141249 162169 174692 146015 120883 105188
6873 105188 117831 129623 163584 222596 206458 157561 133316 170340 172111 172594 139443 153412
6861 153412 155202 92179 131360 142701 106090 149645 153436 230511 251328 211232 155458 144221
6849 144221 154870 128319 140653 134646 194037 175389 181140 230690 198515 184581 160397 105640
$$ packed form
6935A97590J7968J905J626N2468l483q4090K321R718k2092M4668r263K5989K220
6922B37545l362L3637P327k0060j6331J3264l4562k3833j8965j1725n1581l361
6910A07993M7314k6165K3599m451k9336M3867R39k1487k3408m645l0P7173j0415
6897A80948Q806m2739n9849M0228J3416j8977m3169L7654K2549j554K942P282
6885A47537L7610J0566K9810m804m7398k7779m293K0920J2523k8677k5132j5695
6873A05188J2643J1792L3961N9012j6138m8897k4245L7024J771M83l3151J3969
6861A53412J790o3023L9181J1341l6611M3555L791P7075K0817m0096n5774j1237
6849A44221J0649k6551J2334o007N9391j8648N751M9550l2175j3934k4184n4757
$$ plain form
6837 105640 115385 142934 187353 235189 232538 227416 198858 176950 152416 95514 120890 159142
6825 159142 199364 160503 124882 112394 161609 182722 205943 178265 165503 130400 96359 77886
6813 77886 146221 117189 105886 119067 100288 107114 169356 166025 139306 146429 82470 98263
6801 98263 143272 123788 114132 119228 96946 93445 97276 144045 117039 103943 113948 158165 160726
6788 160726 124280 73101 116859 106210 93536 113704 177770 163506 98120 62544 70469 65358
6776 65358 92562 90003 66360 55193 66382 83100 102168 60643 104068 94232 54368 105876
6764 105876 112724 107227 111424 130795 130380 125190 168454 123641 110413 96071 124804 115758 39335
6751 39335 22983 54365 105443 82611 106047 60269 56680 93721 49507 47822 53838 19727
$$ packed form
6837A05640R745K7549M4419M7836k651n122k8558k1908k4534n6902K5376L8252
6825A59142M0222l8861l5621j2488M9215K1113K3221k7678j2762l5103l4041j8473
6813G7886O8335k9032j1303J3181j8779O826O2242l331k6719P123o3959J5793
6801I8263M5009j9484r656N096k2282l501L831M6769k7006j3096J0005M4217K561
6788A60726l6446n1179M3758j0649j2674K0168O4066j4264o5386l5576P925n111
6776F5358K7204k559k3643j1167J1189J6718J9068m1525M3425r836l9864N1508
6764A05876O848n497M197J9371m15n190M3264m4813j3228j4342K8733r046p6423
6751C9335j6352L1382N1078k2832K3436m5778l589L7041m4214j685O016l4111
$$ plain form
6739 19727 8693 8559 37312 96751 55384 13679 -9211 37709 79131 84022 34002 52405
6727 52405 40765 36736 69108 60363 34582 39123 75220 105844 101346 106885 95477 116057 147005
6714 147005 129318 132252 73339 119288 117148 122344 84297 182702 225641 237214 310805 383154
6702 383154 426693 450184 431616 462157 476164 412687 375172 313096 240322 231925 217465 212452
6690 212452 146366 134212 115774 125590 99624 115531 119339 61429 70042 74109 62372 76716
6678 76716 52198 57578 76353 104282 118574 107663 101752 92938 57786 37980 13908 17231 38572
6665 38572 53344 69299 65183 44226 43807 50280 19371 42882 50474 69429 13991 19046 30052
6652 30052 43920 22408 30747 33435 1588 21434 7718 -8193 21918 55470 68481 103484
$$ packed form
6739A9727j1034j34K8753N9439m1367m1705k2890M6920M1422M891n0020J8403
6727E2405j1640m029L2372q745k5781M541L6097L0624m498N539j1408K0580L0948
6714A47005j7687K934n8913M5949k140N196l8047R8405M2939J1573P3591P2349
6702C83154M3539K3491j8568L0541J4007o3477l7515o2076p2774q397j4460n013
6690B12452o6086j2154j8438R816k5966J5907L808n7910Q613M067j1737J4344
6678G6716k4518N380J8775K7929J4292j0911n911q814l5152j9806k4072L323K1341
6665C8572J4772J5955m116k0957m19O473l0909K3511P592J8955n5438N055J1006
6652C0052J3868k1512Q339K688l1847J9846j3716j5911L0111L3552J3011L5003
$$ plain form
6640 103484 100592 70490 51933 65916 61906 59668 54848 22283 51020 56075 44564 40952 9681
6627 9681 -21123 -5801 -54732 3032 35996 34685 38624 43707 84500 80597 85358 54242 56498
6614 56498 37230 4736 15893 49568 60323 38840 27443 42704 81007 26234 -7104 42892
6602 42892 44136 46385 20377 -12944 70851 43963 17749 20892 32833 6227 27490 3515
6590 3515 58460 66995 18305 45757 62317 103992 66912 44912 37944 32323 7060 -10256 -5094
6577 -5094 42144 77975 81321 83585 63750 -24146 10324 43239 46333 63349 72623 101612 108294
6564 108294 116010 115467 87079 76504 96805 56325 105146 98210 56443 66327 86495 119499 130874
6551 130874 138179 75505 64166 44766 89883 87098 106461 117950 78549 90399 73162 112056
$$ packed form
6640A03484k892l0102j8557J3983m010k238m820l2565K8737N055j1511l612l1271
6627I681l0804J5322m8931N7764L2964j311L939N083M0793l903M761l1116K256
6614E6498j9268l2494J1157L3675J0755k1483j1397J5261L8303n4773l3338M9996
6602D2892J244K249k6008l3321Q3795k6888k6214L143J1941k6606K1263k3975
6590C515N4945Q535m8690K7452J6560M1675l7080k2000o968n621k5263j7316N162
6577e094M7238L5831L346K264j9835q7896L4470L2915L094J7016R274K8989O682
6564A08294P716n43k8388j0575K0301m0480M8821o936m1767R884K0168L3004J1375
6551A30874P305o2674j1339j9400M5117k785J9363J1489l9401J1850j7237L8894
$$ plain form
6539 112056 112333 147591 192344 191178 208739 212473 162358 117118 92934 82277 69658 93319
6527 93319 98976 74147 103796 129607 68764 14806 70305 87758 92560 81394 115130 145980
6515 145980 79431 74564 90898 40179 68443 57599 37369 30275 39871 86346 89487 59939
6503 59939 95097 123551 119547 87723 102504 111125 89617 80735 111500 77807 38669 24399
6491 24399 31046 53765 29329 48095 26417 67743 36794 7313 31742 54601 25410 70832
6479 70832 106413 83994 119219 146411 166566 166396 104147 76181 137167 109330 102995 95116 92012
6466 92012 111976 70307 43886 20649 80581 95779 53567 92717 92398 93147 96923 141640 129097
6453 129097 87536 84812 90512 123889 151630 133250 118669 123772 126978 169543 156042 185798
$$ packed form
6539A12056K77L5258M4753j166J7561L734n0115m5240k4184j0657j2619K3661
6527I3319N657k4829K9649K5811o0843n3958N5499J7453M802j1166L3736L0850
6515A45980o6549m867J6334n0719K8264j0844k0230p094R596M6475L141k9548
6503E9939L5158K8454m004l1824J4781Q621k1508q882L0765l3693l9138j4270
6491B4399O647K2719k4436J8766k1678M1326l0949k9481K4429K2859k9191M5422
6479G0832L5581k2419L5225K7192K0155j70o2249k7966O0986k7837o335p879l104
6466I2012J9964m1669k6421k3237N9932J5198m2212L9150l19P49L776M4717j2543
6453A29097m1561k724N700L3377K7741j8380j4581N103L206M2565j3501K9756
$$ plain form
6441 185798 155290 115373 89143 92657 109514 130463 99292 129320 121843 123201 134193 133324 154731
6428 154731 87017 146407 162079 177937 198360 169282 155816 179275 185011 139731 156259 185534
6416 185534 187861 152385 159792 146909 156222 191303 171260 180190 124447 107978 121536 121265 102386
6403 102386 150663 160787 168751 194406 227867 213188 194056 252655 258267 213232 192396 255610
6391 255610 251177 233498 222798 202965 256974 327207 313794 284666 308101 293619 297182 264786
6379 264786 249479 219867 182748 192659 184676 187836 203769 179007 173076 157640 193005 190507 146089
6366 146089 200347 222630 185448 142116 171381 175085 206389 217036 180514 143201 141798 181096
6354 181096 201050 215664 243274 213655 213488 228222 249699 263584 239693 255468 295119 290385
$$ packed form
6441A85798l0508l9917k6230L514J6857K0949l1171L0028p477J358J0992q69K1407
6428A54731o7714N9390J5672J5858K0423k9078j3466K3459N736m5280J6528K9275
6416A85534K327l5476P407j2883R313L5081k0043Q930n5743j6469J3558k71j8879
6403A02386M8277J0124P964K5655L3461j4679j9132N8599N612m5035k0836O3214
6391B55610m433j7679j0700j9833N4009P0233j3413k9128K3435j4482L563l2396
6379B64786j5307k9612l7119R911p983L160J5933k4762n931j5436L5365k498m4418
6366A46089N4258K2283l7182m3332K9265L704L1304J0647l6522l7313j403L9298
6354A81096J9954J4614K7610k9619j67J4734K1477J3885k3891J5775L9651m734
$$ plain form
6342 290385 272610 242515 239497 230269 239867 266474 224947 253471 257273 270197 308215 311172 344868
6329 344868 344583 297231 285336 230150 216083 204120 204535 239655 289803 292169 268933 292740 276813
6316 276813 287478 254222 239095 267672 242033 224914 190572 207647 242037 264306 262540 301872
6304 301872 319684 270710 249466 276605 304690 283139 311169 313610 340915 304359 299110 325522
6292 325522 329626 296721 259209 262441 256496 248363 296785 247020 286121 275142 256222 262882 257872
6279 257872 227771 220278 237080 241288 293205 336390 288224 260394 325040 351721 334185 310334
6267 310334 352510 376096 358847 325709 366149 354286 346492 341063 348736 324540 343262 359618
6255 359618 391279 353992 359734 385759 400990 391013 334837 337745 403866 443076 412248 378994
$$ packed form
6342B90385j7775l0095l018r228R598K6607m1527K8524L802J2924L8018K957L3696
6329C44868k85m7352j1895n5186j4067j1963M15L5120N0148K366k3236K3807j5927
6316B76813J0665l3256j5127K8577k5639j7119l4342J7075L4390K2269j766L9332
6304C01872J7812m8974k1244K7139K8085k1551K8030K441K7305l6556n249K6412
6292C25522M104l2905l7512L232n945q133M8422m9765L9101j0979j8920O660n010
6279B57872l0101p493J6802M208N1917M3185m8166k7830O4646K6681j7536k3851
6267C10334M2176K3586j7249l3138M0440j1863p794n429P673k4196J8722J6356
6255C59618L1661l7287N742K6025J5231r977n6176K908O6121L9210l0828l3254
$$ plain form
6243 378994 389198 416938 447375 444463 448336 447396 394912 423320 466475 482099 460871 429915
6231 429915 453282 423974 430302 456758 453418 453119 465540 437774 456815 458280 450971 481198 479372
6218 479372 486419 486535 478376 469965 494020 490488 502316 502051 491462 486865 522851 512045 494981
6205 494981 485517 508765 492953 503270 534132 502370 483951 546993 530895 542879 565502 533822
6193 533822 566272 541150 573632 567577 605633 641670 594599 570735 544398 580810 613881 592271
6181 592271 609672 619043 640208 705528 659397 649191 686867 651810 704783 767133 793218 769458
6169 769458 721385 750031 770861 769843 758470 815100 799087 729567 765484 785602 775530 779709
6157 779709 788170 814495 853316 961885 949538 891950 919144 957235 947161 962533 991017 982850
$$ packed form
6243C78994J0204K7740L0437k912L873r40n2484K8408M3155J5624k1228l0956
6231D29915K3367k9308O328K6456l340k99J2421k7766J9041J465p309L0227j826
6218D79372P047J16q159q411K4055l532J1828k65j0589m597L5986j0806j7064
6205D94981r464K3248j5812J0317L0862l1762j8419O3042j6098J1984K2623l1680
6193E33822L2450k5122L2482o055L8056L6037m7071k3864k6337L6412L3071k1610
6181E92271J7401R371K1165O5320m6131j0206L7676l5057N2973O2350K6085k3760
6169G69458m8073K8646K0830j018j1373N6630j6013o9520L5917K0118j0072M179
6157G79709Q461K6325L8821J08569j2347n7588K7194L8091j0074J5372K8484q167
$$ plain form
6145 982850 1014480 1067361 1103380 1124217 1164498 1217794 1232817 1247081 1295458 1240989 1254655 1277014
6133 1277014 1297891 1347597 1381294 1423680 1487266 1516715 1577241 1585598 1598894 1588045 1647077 1735589
6121 1735589 1758595 1740232 1763954 1792208 1832797 1887012 2000728 2081773 2067874 2132068 2188796
6110 2188796 2185756 2198971 2268547 2316991 2429809 2528065 2576783 2607747 2716933 2797574 2945272
6099 2945272 3075540 3099749 3197702 3281134 3378625 3533547 3618157 3734692 3869871 4021058
6089 4021058 4185706 4362616 4557750 4732517 4923738 5137267 5417085 5740712 6085570 6445566
6079 6445566 6886936 7359401 7878233 8520789 9306937 10345812 11505660 12972802 14876626
6070 14876626 17397183 20484144 23547489 25529877 25487261 23722590 21404798 19422224
$$ packed form
6145I82850L1630N2881L6019K0837M0281N3296J5023J4264M8377n4469J3666K2359
6133A277014K0877M9706L3697M2386O3586K9449O0526Q357J3296j0849N9032Q8512
6121A735589K3006j8363K3722K8254M0589N4215J13716Q1045j3899O4194N6728
6110B188796l040J3215O9576M8444J12818R8256M8718L0964J09186Q0641J47698
6099B945272J30268K4209R7953Q3432R7491J54922Q4610J16535J35179J51187
6089D021058J64648J76910J95134J74767J91221K13529K79818L23627L44858L59996
6079F445566M41370M72465N18832O42556P86148J038875J159848J467142J903824
6070A4876626K520557L086961L063345J982388m2616j764671k317792j982574
$$ plain form
6062 19422224 18111296 17454248 17523918 18264178 19696750 21802209 24233105 25854414 25513032
6053 25513032 23298267 20164838 17193272 14772946 12913360 11619911 10652975 9856699
6045 9856699 9278683 8779034 8429140 8165699 7919909 7762839 7642418 7576892 7549771 7564497
6035 7564497 7687632 7821379 8002172 8190058 8392062 8699312 9105464 9498120 9972864 10574950
6025 10574950 11317657 12241888 13333772 14654549 16337233 18492097 21364494 25029407
6017 25029407 29171224 32569631 33668443 32230909 29274998 26220340 23920268 22531391
6009 22531391 22065582 22505921 23827882 26145719 29198906 31947383 32706318 30708738 26854220
6000 26854220 22522635 18710272 15714748 13413941 11686679 10384546 9333682 8449226
$$ packed form
6062A9422224j310928o57048O9670P40260J432572K105459K430896J621309l41382
6053B5513032k214765l133429k971566k420326j859586j293449r66936p96276
6045I856699n78016m99649l49894k63441k45790j57070j20421o5526k7121J4726
6035G564497J23135J33747J80793J87886K02004L07250M06152L92656M74744O02086
6025A0574950P42707R24231J091884J320777J682684K154864K872397L664913
6017B5029407M141817L398407J098812j437534k955911l054658k300072j388877
6009B2531391m65809M40339J321961K317837L053187K748477P58935j997580l854518
6000B6854220m331585l812363k995524k300807j727262j302133j050864q84456
$$ plain form
5992 8449226 7741048 7104497 6572010 6133841 5764326 5447594 5175753 4910612 4664719 4426536
5982 4426536 4233603 4098925 3957624 3811393 3677678 3587068 3438313 3329609 3220744 3149645
5972 3149645 3076883 2997709 2900924 2818971 2784132 2735151 2721730 2630969 2612185 2613207 2521201 2443226
5960 2443226 2377949 2321789 2206416 2181254 2166105 2114889 2049780 2001992 1987314 1991201 1936614
5949 1936614 1880409 1865687 1828727 1789465 1787315 1777471 1714597 1685371 1706294 1672193 1657602 1644258
5937 1644258 1679623 1680690 1673357 1742713 1761342 1768802 1802231 1831009 1799716 1750441 1714734 1655286
5925 1655286 1563241 1540276 1525933 1512394 1489062 1455881 1432388 1407232 1380046 1384895 1394713 1404496
5913 1404496 1437899 1370747 1406105 1433063 1374279 1392887 1391882 1374394 1359692 1415666 1433189 1479881
$$ packed form
5992H449226p08178o36551n32487m38169l69515l16732k71841k65141k45893k38183
5982D426536j92933j34678j41301j46231j33715r0610j48755j08704j08865p1099
5972C149645p2762p9174r6785q1953l4839m8981j3421r0761j8784J022r2006p7975
5960B443226o5277n6160j15373k5162j5149n1216o5109m7788j4678L887n4587
5949A936614n6205j4722l6960l9262k150r844o2874k9226K0923l4101j4591j3344
5937A644258L5365J067p333O9356J8629P460L3429K8778l1293m9275l5707n9448
5925A655286r2045k2965j4343j3539k3332l3181k3493k5156k7186M849R818R783
5913A404496L3403o7152L5358K6958n8784J8608j005j7488j4702N5974J7523M6692
$$ plain form
5901 1479881 1491415 1517213 1525354 1531602 1579606 1602375 1523695 1495767 1509031 1502099 1464590 1446336
5889 1446336 1518511 1515478 1455234 1454311 1478220 1493021 1511850 1594066 1653224 1669053 1703348 1683734
5877 1683734 1626813 1632251 1619173 1606091 1633136 1652482 1622982 1674854 1712342 1738427 1748585 1720274
5865 1720274 1714581 1678448 1670398 1674344 1678220 1639333 1676992 1701589 1703670 1686956 1688473 1667890 1708929
5852 1708929 1732650 1744159 1735024 1841227 1955391 1919593 1923028 1932911 1925155 1885548 1826807 1824872
5840 1824872 1854389 1870389 1906895 1899650 1909957 2002457 2041283 2107233 2190289 2248458 2331647 2354494
5828 2354494 2335603 2360359 2430519 2537473 2623521 2721776 2836689 2914868 3044697 3164343 3260937
5817 3260937 3384114 3489733 3541927 3534156 3527312 3559352 3565937 3702303 3789422 3826398 3841071
$$ packed form
5901A479881J1534K5798Q141O248M8004K2769p8680k7928J3264o932l7509j8254
5889A446336P2175l033o0244r23K3909J4801J8829Q2216N9158J5829L4295j9614
5877A683734n6921N438j3078j3082K7045J9346k9500N1872L7488K6085J0158k8311
5865A720274n693l6133q050L946L876l8887L7659K4597K081j6714J517k0583M1039
5852A708929K3721J1509r135J06203J14164l5798L435R883p756l9607n8741j935
5840A824872K9517J6000L6506p245J0307R2500L8826O5950Q3056N8169Q3189K2847
5828B354494j8891K4756P0160J06954Q6048R8255J14913P8179J29829J19646R6594
5817C260937J23177J05619N2194p771o844L2040O585J36366Q7119L6976J4673
$$ plain form
5806 3841071 3851061 3920117 3930903 4010759 4111750 4245988 4458744 4727011 5049437 5401212
5796 5401212 5734812 6036789 6173924 6145417 5989072 5786257 5516346 5235376 5031465 4849426
5786 4849426 4812654 4736596 4676687 4746180 4816853 4845940 4958944 5165028 5388217 5666149 5996163
5775 5996163 6398067 6866754 7347968 7817505 8146416 8195534 8023161 7738533 7408379 7092743
5765 7092743 6802516 6531600 6310718 6168382 6099091 6083050 6089214 6188889 6263517 6390931 6581823
5754 6581823 6753579 6966179 7277316 7613838 7998040 8498456 9052876 9718056 10459065 11392739
5744 11392739 12547777 13946332 15645067 17915844 20879910 24346557 27672005 29690537
5736 29690537 29403857 27169316 24037217 20957481 18321423 16272645 14723548 13634327
$$ packed form
5806C841071R990O9056J0786P9856J00991J34238K12756K68267L22426L51775
5796E401212L33600L01977J37135k8507j56345k02815k69911k80970k03911j82039
5786D849426l6772p6058n9909O9493P0673K9087J13004K06084K23189K77932L30014
5775E996163M01904M68687M81214M69537L28911M9118j72373k84628l30154l15636
5765G092743k90227k70916k20882j42336o9291j6041O164R9675P4628J27414J90892
5754F581823J71756K12600L11137L36522L84202N00416N54420O65180P41009R33674
5744A1392739J155038J398555J698735K270777K964066L466647L325448K018532
5736B9690537k86680k234541l132099l079736k636058k048778j549097j089221
$$ plain form
5728 13634327 12876625 12292383 11882443 11645154 11558854 11626967 11883491 12256481 12779505 13411784
5718 13411784 14266745 15405946 16870549 18768062 21181365 24311754 27967999 31144104
5710 31144104 32556136 31453244 28599456 25150275 21866558 19098190 16891649 15261546
5702 15261546 14016951 13103336 12471632 11980458 11722227 11544925 11521610 11636049 12005762
5693 12005762 12509555 13200039 14108934 15374640 17148693 19312709 21711865 23690816 24230802
5684 24230802 23025282 20741692 18305008 16144696 14267079 12813133 11750420 10997124
5676 10997124 10367461 9953500 9715107 9534482 9432407 9455593 9553725 9754301 10050515 10533820
5666 10533820 11173904 12013950 13124521 14709106 16780714 19311518 21940458 23784930
$$ packed form
5728A3634327p57702n84242m09940k37289q6300O8113K56524L72990N23024O32279
5718A3411784Q54961J139201J464603J897513K413303L130389L656245L176105
5710C1144104J412032j102892k853788l449181l283717k768368k206541j630103
5702A5261546j244595r13615o31704m91174k58231j77302k3315J14439L69713
5693A2005762N03793O90484R08895J265706J774053K164016K399156J978951N39986
5684B4230802j205520k283590k436684k160312j877617j453946j062713p53296
5676A0997124o29663m13961k38393j80625j02075K3186R8132K00576K96214M83305
5666A0533820O40084Q40046J110571J584585K071608K530804K628940J844472
$$ plain form
5658 23784930 23785257 21981751 19283248 16454829 14046523 11946084 10296294 9139439 8221972
5649 8221972 7432039 6815370 6302898 5838572 5521587 5241222 4954475 4713073 4558276 4404541
5639 4404541 4228898 4119734 3955319 3811510 3685793 3567686 3461509 3373495 3344031 3280927
5629 3280927 3242682 3182410 3127536 3024269 3017629 3018494 3035844 2985709 2975340 3003412 3045793 3081275
5617 3081275 3048312 3052383 2944630 2871108 2757394 2719004 2658538 2606369 2569293 2481814 2446985
5606 2446985 2419055 2418172 2399016 2430055 2479384 2478953 2499089 2505590 2608939 2650429 2775858 2891887
5594 2891887 2956257 2970134 2989100 2969670 2855953 2704827 2629661 2564095 2441098 2411630 2395935
5583 2395935 2375453 2359769 2377685 2427332 2489488 2495509 2506649 2547899 2586335 2526611 2541434 2583948
$$ packed form
5658B3784930L27j803506k698503k828419k408306k100439j649790j156855r17467
5649H221972p89933o16669n12472m64326l16985k80365k86747k41402j54797j53735
5639D404541j75643j09164j64415j43809j25717j18107j06177q8014k9464o3104
5629C280927l8245o0272n4874j03267o640Q65J7350n0135j0369K8072M2381L5482
5617C081275l2963M071j07753p3522j13714l8390o0466n2169l7076q7479l4829
5606B446985k7930q83j9156L1039M9329m31K0136O501J03349M1490J25429J16029
5594B891887O4370J3877J8966j9430j13717j51126p5166o5566j22997k9468j5695
5583B395935k0482j5684J7916M9647O2156O021J1140M1250L8436n9724J4823M2514
$$ plain form
5571 2583948 2675160 2742535 2756791 2784739 2724163 2627146 2562136 2514723 2444219 2382516 2258088
5560 2258088 2206950 2191061 2126273 2111112 2096517 2122816 2178524 2188466 2257131 2319353 2385842 2425711
5548 2425711 2481205 2536940 2600753 2574540 2536866 2469049 2455785 2419514 2335398 2310213 2283299
5537 2283299 2278755 2234916 2280841 2301485 2365956 2366346 2439604 2472247 2463844 2561681 2559211 2563965 2618598
5524 2618598 2547991 2516713 2529456 2490439 2439916 2415841 2418053 2388311 2405660 2469796 2477521 2540577
5512 2540577 2593736 2630697 2698001 2690897 2656677 2645718 2619677 2568200 2522695 2469208 2477263 2524593
5500 2524593 2512148 2471822 2462853 2481810 2468682 2463613 2411249 2382577 2338784 2279828 2258498 2227851
5488 2227851 2228666 2242695 2253712 2228745 2264849 2250695 2198548 2205992 2184153 2124256 2120126 2047797
$$ packed form
5571B583948R1212O7375J4256K7948o0576r7017o5010m7413p0504o1703j24428
5560B258088n1138j5889o4788j5161j4595K6299N5708R942O8665O2222O6489L9869
5548B425711N5494N5735O3813k6213l7674o7817j3264l6271q4116k5185k6914
5537B283299m544m3839M5925K0644O4471L90P3258L2643q403R7837k470M754N4633
5524B618598p0607l1278J2743l9017n0523k4075K212k9742J7349O4136P725O3056
5512B540577N3159L6961O7304p104l4220j0959k6041n1477m5505n3487Q055M7330
5500B524593j2445m0326q969J8957j3128n069n2364k8672m3793n8956k1330l0647
5488B227851Q15J4029J1017k4967L6104j4154n2147P444k1839n9897m130p2329
$$ plain form
5476 2047797 1967440 1978559 1964094 1980077 2002122 1979534 1986437 1976569 1943027 1967747 1957521 1913047
5464 1913047 1937893 1940359 1941909 1937126 1968224 1993270 1962071 1982560 2000119 2007727 1998243 1979334
5452 1979334 1933401 1854742 1874818 1904004 1860991 1879331 1855622 1831585 1865920 1856064 1892778 1892605
5440 1892605 1882303 1849316 1820632 1818534 1824681 1878177 1863718 1850370 1830615 1853390 1842270 1888343
5428 1888343 1943945 1959331 1962159 1955226 1897496 1897958 1889312 1894663 1885669 1868038 1886208 1901685 1898211
5415 1898211 1938476 1969563 1967839 2044271 2040467 2032584 2011306 2004290 1981577 1957835 1990590 2054615
5403 2054615 2102245 2090875 2080043 2077841 2121817 2158544 2100710 2109012 2124586 2132773 2161704 2216916
5391 2216916 2170684 2155418 2180777 2173248 2219734 2304034 2389608 2443052 2528894 2635703 2735566
$$ packed form
5476B047797q0357J1119j4465J5983K2045k2588O903r868l3542K4720j0226m4474
5464A913047K4846K466J550m783L1098K5046l1199K0489J7559P608r484j8909
5452A979334m5933p8659K0076K9186m3013J8340k3709k4037L4335r856L6714j73
5440A892605j0302l2987k8684k098O147N3496j4459j3348j9755K2775j1120M6073
5428A888343N5602J5386K828o933n7730M62q646N351q994j7631J8170J5477l474
5415A898211M0265L1087j724P6432l804p883k1278p016k2713k3742L2755O4025
5403B054615M7630j1370j0832k202M3976L6727n7834Q302J5574Q187K8931N5212
5391B216916m6232j5266K5359p529M6486Q4300Q5574N3444Q5842J06809R9863
$$ plain form
5380 2735566 2883961 3057696 3279628 3507223 3755461 3873568 3923479 3803345 3616529 3443435
5370 3443435 3221055 3058324 2930371 2822463 2748657 2669566 2684403 2726940 2740465 2717238 2758930
5359 2758930 2859986 2926461 3006274 3171447 3387974 3573115 3775565 3935823 4016645 4017950
5349 4017950 3909641 3719243 3541155 3306246 3133692 2995346 2876590 2737397 2659993 2651972
5339 2651972 2616374 2576677 2579315 2500831 2445160 2441708 2517776 2515400 2513029 2504433 2468838 2459681 2459558
5326 2459558 2477716 2439343 2393622 2322073 2262215 2239503 2199662 2144240 2136910 2079938 2032688 1996598
5314 1996598 1991392 2016645 2002819 2015130 2030443 1993295 2005772 2015643 2040985 2152109 2232175 2284045
5302 2284045 2410032 2520500 2567001 2558073 2503400 2385715 2300077 2275857 2187530 2167155 2129148
$$ packed form
5380B735566J48395J73735K21932K27595K48238J18107M9911j20134j86816j73094
5370C443435k22380j62731j27953j07908p3806p9091J4837M2537J3525k3227M1692
5359B758930J01056O6475P9813J65173K16527J85141K02450J60258Q0822J305
5349D017950j08309j90398j78088k34909j72554j38346j18756j39193p7404q021
5339B651972l5598l9697K638p8484n5671l452P6068k376k371q596l5595r157j23
5326B459558J8158l8373m5721p1549n9858k2712l9841n5422p330n6972m7250l6090
5314A996598n206K5253j3826J2311J5313l7148J2477R871K5342J11124Q0066N1870
5302B284045J25987J10468M6501q928n4673j17685q5638k4220q8327k0375l8007
$$ plain form
5291 2129148 2118625 2185708 2205961 2265228 2240129 2223462 2289954 2391404 2489466 2616198 2734502
5280 2734502 2766304 2847958 2815691 2704568 2625327 2567031 2554041 2521809 2508758 2598598 2718284
5269 2718284 2757209 2787931 2814240 2810378 2778426 2807804 2823958 2799291 2836163 2897597 2998202
5258 2998202 3088990 3119358 3115921 3057106 2956907 2811981 2701515 2636025 2603712 2566236 2509795
5247 2509795 2552253 2620025 2604834 2611485 2608536 2672400 2802258 2877581 2959382 3080744 3181834
5236 3181834 3210793 3295230 3257077 3212628 3267263 3253152 3220737 3166334 3121581 3136269 3068830
5225 3068830 3070348 3076697 3083806 3048674 3096583 3131012 3176292 3166330 3204505 3274043 3313925 3421936
5213 3421936 3490491 3558889 3686799 3852825 3983064 4069367 4066301 4094982 4047334 4020304 3991738
$$ packed form
5291B129148j0523O7083K0253N9267k5099j6667O6492J01450R8062J26732J18304
5280B734502L1802Q1654l2267j11123p9241n8296j2990l2232j3051Q9840J19686
5269B718284L8925L0722K6309l862l1952K9378J6154k4667L6872O1434J00605
5258B998202R0788L0368l437n8815j00199j44926j10466o5490l2313l7476n6441
5247B509795M2458O7772j5191O651k949O3864J29858P5323Q1801J21362J01090
5236C181834K8959Q4437l8153m4449N4635j4111l2415n4403m4753J4688o7439
5225C068830J518O349P109l5132M7909L4429M5280r962L8175O9538L9882J08011
5213C421936O8555O8398J27910J66026J30239Q6303l066K8681m7648k7030k8566
$$ plain form
5202 3991738 3945396 3933887 3888267 3845430 3854159 3900191 3909878 3945190 4030616 4112507 4158118 4207806
5190 4207806 4322116 4400073 4488729 4622303 4703257 4794361 4915655 5051559 5138539 5186064 5244688
5179 5244688 5278792 5338015 5352011 5376177 5410522 5508043 5585253 5620365 5744019 5883878 5976185
5168 5976185 6124500 6261997 6405807 6645545 6869363 7069051 7347758 7599379 7832990 8113903
5158 8113903 8436873 8795125 9218180 9753792 10363346 11182088 12209299 13248399 14187538
5149 14187538 14560109 14476009 14179722 14044970 14118276 14432801 15070334 15957134 17238894 18920470
5139 18920470 20799086 22478379 23182519 22887086 22298129 21913015 22035053 22532932 23234217
5130 23234217 23660212 23893400 24286473 24984858 26007330 26918626 27618350 28177020 28548606
$$ packed form
5202C991738m6342j1509m5620m2837Q729M6032R687L5312Q5426Q1891M5611M9688
5190D207806J14310P7957Q8656J33574Q0954R1104J21294J35904Q6980M7525N8624
5179E244688L4104N9223J3996K4166L4345R7521P7210L5112J23654J39859R2307
5168E976185J48315J37497J43810K39738K23818J99688K78707K51621K33611K80913
5158H113903L22970L58252M23055N35612O09554Q18742J027211J039100R39139
5149A4187538L72571q4100k96287j34752P3306L14525O37533Q86800J281760J681576
5139A8920470J878616J679293P04140k95433n88957l85114J22038M97879P01285
5130B3234217M25995K33188L93073O98385J022472R11296O99724N58670L71586
$$ plain form
5121 28548606 29023224 29784443 30404574 30139420 29044123 27814861 27091007 26991606 27638153
5112 27638153 28803852 29888455 30243812 30150034 30023160 30111496 30050568 29794546 29376725 28563714
5102 28563714 27708417 27209093 27301575 27617477 27913948 28303623 29000019 29985771 31092014
5093 31092014 31996616 32092748 30750063 28462892 26072492 23923672 22165505 20969657 20202547
5084 20202547 19916169 19975207 20396699 20986573 21435901 21463127 21198294 21035033 21238158 21791531
5074 21791531 22705290 23594944 24127281 24407080 24488225 24419595 24017496 23077735 22087130 21273938
5064 21273938 20574662 19995904 19414043 18920575 18549118 18246734 18172790 18259300 18510828 18987874
5054 18987874 19683508 20584393 21740459 23378994 25562196 28158647 30767122 32730478
$$ packed form
5121B8548606M74618P61219O20131k65154j095297j229262p23854r9401O46547
5112B7638153J165699J084603L55357r3778j26874Q8336o0928k56022m17821q13011
5102B8563714q55297m99324R2482L15902K96471L89675O96396R85752J106243
5093C1092014R04602R6132j342685k287171k390400k148820j758167j195848p67110
5084B0202547k86378N9038M21492N89874M49328K7226k64833j63261K03125N53373
5074B1791531R13759Q89654N32337K79799Q1145o8630m02099r39761r90605q13192
5064B1273938o99276n78758n81861m93468l71457l02384p3944Q6510K51528M77046
5054A8987874O95634R00885J156066J638535K183202K596451K608475J963356
$$ plain form
5046 32730478 33686612 34321497 34887929 35096890 34457834 33469905 32880539 32812522 32846456 32262762
5036 32262762 31136085 30068082 29372843 29270690 29820411 31208142 33123196 35111938 36594049
5027 36594049 38053981 39944815 42424772 44615548 46141722 47158006 48745539 51124312
5019 51124312 54212908 56348605 57175011 57406185 57158957 56689209 55877537 54523874 52481839
5010 52481839 50159272 46919063 43314398 39073633 34921039 31404236 28873478 27209311
5002 27209311 26375927 26286628 26803320 27610916 28176256 28195445 27362589 26212656 25299291 24624306
4992 24624306 23716003 22975980 22572538 22376292 21917403 21092707 20208957 19490796 19033219
4983 19033219 18708049 17985655 16727278 15452989 14375647 13598501 13054110 12891411 13018826
$$ packed form
5046C2730478R56134O34885N66432K08961o39056r87929n89366o8017L3934n83694
5036C2262762j126677j068003o95239j02153N49721J387731J915054J988742J482111
5027C6594049J459932J890834K479957K190776J526174J016284J587533K378773
5019E1124312L088596K135697Q26406K31174k47228m69748q11672j353663k042035
5010E2481839k322567l240209l604665m240765m152594l516803k530758j664167
5002B7209311q33384q9299N16692Q07596N65340J9189q32856j149933r13365o74985
4992B4624306r08303p40023m03442j96246m58889q24696q83750p18161m57577
4983A9033219l25170p22394j258377j274289j077342p77146n44391j62699J27415
$$ plain form
4974 13018826 13407820 13921412 14253474 13724411 12676883 11540562 10572630 9768277 9215399
4965 9215399 8681036 8255156 7954833 7683416 7389229 7148295 6929551 6740174 6627393 6469412
4955 6469412 6307402 6161999 6022710 5858863 5789111 5797525 5738228 5680517 5681792 5636900 5646709
4944 5646709 5673783 5628080 5606592 5609775 5619525 5674587 5650539 5675946 5668204 5617696 5651199 5724991
4932 5724991 5747753 5791456 5849881 5871270 5929014 6047049 6162400 6272921 6350490 6462311 6585448
4921 6585448 6717357 6851530 7120989 7398180 7644181 8027785 8431023 8946260 9544325 10308593
4911 10308593 11225634 12464136 14057515 16002458 17860799 19435317 21111737 22997201
4903 22997201 24287084 23979965 22169371 19429208 16664914 14349917 12649305 11506252
$$ packed form
4974A3018826L88994N13592L32062n29063j047528j136321r67932q04353n52878
4965I215399n34363m25880l00323k71417k94187k40934k18744j89377j12781j57981
4955F469412j62010j45403j39289j63847o9752Q414n9297n7711J275m4892R809
4944E646709K7074m5703k1488L183R750N5062k4048K5407p742n0508L3503P3792
4932E724991K2762M3703N8425K1389N7744J18035J15351J10521P7569J11821J23137
4921F585448J31909J34173K69459K77191K46001L83604M03238N15237N98065P64268
4911A0308593R17041J238502J593379J944943J858341J574518J676420J885464
4903B2997201J289883l07119j810594k740163k764294k314997j700612j143053
$$ plain form
4895 11506252 10689701 10064454 9597651 9232066 8974148 8833652 8772760 8710485 8749781 8885778
4885 8885778 9050296 9210124 9439625 9704883 10043245 10455361 11013612 11802428 12740845 13532566
4875 13532566 13899717 13914660 14019217 14322281 14976284 16066236 17626595 19580796 21582040
4866 21582040 23502411 25964426 29271516 31874698 31366155 28254220 24828232 22141296
4858 22141296 20468165 19609907 19165460 18988632 19139694 19640121 20385863 21707065 24044242
4849 24044242 27130252 29225472 28444551 25665996 22687933 20208955 18083357 16282536
4841 16282536 14750723 13531935 12662635 12108792 11872410 11789369 11460792 10834751 10208385
4832 10208385 9630012 9227872 8932155 8736444 8621444 8529680 8457901 8459031 8400453 8340799
$$ packed form
4895A1506252q16551o25247m66803l65585k57918j40496o0892o2275L9296J35997
4885H885778J64518J59828K29501K65258L38362M12116N58251P88816R38417P91721
4875A3532566L67151J4943J04557L03064O54003J089952J560359J954201K001244
4866B1582040J920371K462015L307090K603182n08543l111935l425988k686936
4858B2141296j673131q58258m44447j76828J51062N00427P45742J321202K337177
4849B4044242L086010K095220p80921k778555k978063k478978k125598j800821
4841A6282536j531813j218788q69300n53843k36382q3041l28577o26041o26366
4832A0208385n78373m02140k95717j95711j15000r1764p1779J130n8578n9654
$$ plain form
4822 8340799 8382996 8498867 8606330 8751248 8892156 9098958 9359664 9770459 10262755 10771438
4812 10771438 11470904 12438759 13728259 14977812 15723867 15857640 15645634 15398788 15234286
4803 15234286 15198307 15409908 15955968 16933145 18424300 20401723 22651609 24323008 24612345
4794 24612345 24375453 24229481 24554459 24741243 24372541 23345282 22118310 21204458 20690579
4785 20690579 20726459 21397383 22673472 24389612 26085312 27446206 28700468 29968091 31715539
4776 31715539 34127707 36461235 36869142 35121756 32739228 30821556 29527929 28268799
4768 28268799 27192185 26339176 25583222 24552874 23672339 23273355 23339100 23441147 23219057
4759 23219057 23108624 23342836 23643534 23638023 23732244 23978943 23737947 22152173 19950071 17875314
$$ packed form
4822H340799M2197J15871J07463J44918J40908K06802K60706M10795M92296N08683
4812A0771438O99466R67855J289500J249553P46055J33773k12006k46846j64502
4803A5234286l5979K11601N46060R77177J491155J977423K249886J671399K89337
4794B4612345k36892j45972L24978J86784l68702j027259j226972r13852n13879
4785B0690579L5880O70924J276089J716140J695700J360894J254262J267623J747448
4776C1715539K412168K333528M07907j747386k382528j917672j293627j259130
4768B8268799j076614q53009p55954j030348q80535l98984O5745J02047k22090
4759B3219057j10433K34212L00698n511R4221K46699k40996j585774k202102k074757
$$ plain form
4749 17875314 16204106 14811612 13769811 13101652 12613546 12228450 11887117 11597708 11422411
4740 11422411 11238996 11171059 11138618 11182968 11381297 11587726 11895876 12306244 12842824 13480500
4730 13480500 14236436 15097086 16241164 17682100 19603706 22145551 25252112 28513990
4722 28513990 30758463 30429454 28194913 25445558 22986254 20959877 19542792 18734036
4714 18734036 18381026 18387934 18708501 19467943 20498243 21948701 23850461 26453845 29910614
4705 29910614 34333067 39338365 43996968 47133469 48747927 48508524 45254693 40031010
4697 40031010 34575964 29822550 26034504 23110134 21057344 19685554 18812166 18390662
4689 18390662 18358696 18666873 19296389 20383195 22104137 24614322 27822571 31031328 32698813
$$ packed form
4749A7875314j671208j392494j041801o68159m88106l85096l41333k89409j75297
4740A1422411j83415o7937l2441M4350J98329K06429L08150M10368N36580O37676
4730A3480500P55936Q60650J144078J440936J921606K541845L106561L261878
4722B8513990K244473l29009k234541k749355k459304k026377j417085q08756
4714A8734036l53010O908L20567P59442J030300J450458J901760K603384L456769
4705B9910614M422453N005298M658603L136501J614458k39403l253831n223683
4697D0031010n455046m753414l788046k924370k052790j371790q73388m21504
4689A8390662l1966L08177O29516J086806J720942K510185L208249L208757J667485
$$ plain form
4680 32698813 31308466 27875034 23962304 20360207 17354277 14941622 13120453 11815706
4672 11815706 10689557 9812733 9144103 8518298 8043812 7643086 7221187 6890243 6590733
4663 6590733 6301791 6077814 5850378 5651870 5480267 5348609 5172251 5050719 4979233 4916546
4653 4916546 4876486 4752351 4694913 4651767 4630195 4594921 4598373 4510369 4426688 4412244 4364404
4642 4364404 4277523 4226281 4221330 4243117 4232187 4229170 4181539 4059981 4086716 4048000 4026463 4033061
4630 4033061 4025591 4028579 4065592 4110358 4133597 4172119 4268831 4309461 4390460 4389248 4452282 4494992
4618 4494992 4540984 4560942 4625394 4791033 4824572 4796402 4852728 4849721 4786649 4756286 4761446 4793539
4606 4793539 4825307 4873681 4906683 4979424 5081358 5175549 5313340 5405079 5535848 5683689 5833185
$$ packed form
4680C2698813j390347l433432l912730l602097l005930k412655j821169j304747
4672A1815706j126149q76824o68630o25805m74486m00726m21899l30944k99510
4663F590733k88942k23977k27436j98508j71603j31658j76358j21532p1486o2687
4653D916546m0060j24135n7438m3146k1572l5274L452q8004q3681j4444m7840
4642D364404q6881n1242m951K1787j0930l017m7631j21558K6735l8716k1537O598
4630D033061p470K988L7013M4766K3239L8522R6712M0630Q0999j212O3034M2710
4618D494992M5992J9958O4452J65639L3539k8170N6326l007o3072l0363N160L2093
4606D793539L1768M8374L3002P2741J01934R4191J37791R1739J30769J47841J49496
$$ plain form
4595 5833185 5925606 6090867 6256564 6409102 6543322 6666586 6764225 6890752 6989843 7083748
4585 7083748 7190169 7335997 7527923 7789310 8095907 8377236 8721956 9102015 9521066 9965442
4575 9965442 10470816 10991951 11595846 12379279 13258435 14286349 15444248 16821876 18598056
4566 18598056 20878067 23807379 27440160 31609591 35318639 37179939 36508478 34180857
4558 34180857 31565829 29436433 28184470 27847559 28485189 30097553 32639605 35745067
4550 35745067 38371285 39214255 37749320 34935539 32029576 29818314 28595914 28542963 29609477
4541 29609477 31478900 33194185 33535106 32044812 29502978 26826788 24666240 23236329
4533 23236329 22542088 22606364 23449317 24991741 26936832 28392960 28395301 26573582 23685150
$$ packed form
4595E833185R2421J65261J65697J52538J34220J23264R7639J26527R9091R3905
4585G083748J06421J45828J91926K61387L06597K81329L44720L80059M19051M44376
4575I965442N05374N21135O03895P83433Q79156J027914J157899J377628J776180
4566A8598056K280011K929312L632781M169431L709048J861300o71461k327621
4558C4180857k615028k129396j251963l36911O37630J612364K542052L105462
4550C5745067K626218Q42970j464935k813781k905963k211262j222400n2951J066514
4541B9609477J869423J715285L40921j490294k541834k676190k160548j429911
4533B3236329o94241O4276Q42953J542424J945091J456128K341j821719k888432
$$ plain form
4524 23685150 20614593 17883445 15677100 14031073 12783417 11759547 10921954 10208147
4516 10208147 9599741 9121713 8767213 8516865 8184769 7955522 7779166 7627960 7484799
4507 7484799 7389212 7325245 7262850 7251293 7234054 7167412 7161643 7176955 7125339 7157153 7178070 7202587
4495 7202587 7220355 7243536 7281963 7330185 7411536 7532775 7700279 7879656 8112726 8321007
4485 8321007 8459493 8694968 8950925 9379349 9790150 10259464 10819088 11479080 12295791 13238302
4475 13238302 14433217 15776700 17484745 19810641 22794540 26379107 29952270 32337382
4467 32337382 32647178 30937594 28702048 26907232 26077261 26308610 27786526 30404277 33397606
4458 33397606 34622707 32631675 29218259 26010687 23493221 21832097 21186670 21290250
$$ packed form
4524B3685150l070557k731148k206345j646027j247656j023870q37593p13807
4516A0208147o08406m78028l54500k50348l32096k29247j76356j51206j43161
4507G484799r5587o3967o2395j1557j7239o6642n769J5312n1616L1814K0917K4517
4495G202587J7768K3181L8427M8222Q1351J21239J67504J79377K33070K08281
4485H321007J38486K35475K55957M28424M10801M69314N59624O59992Q16711R42511
4475A3238302J194915J343483J708045K325896K983899L584567L573163K385112
4467C2337382L09796j709584k235546j794816q29971K31349J477916K617751K993329
4458C3397606J225101j991032l413416l207572k517466j661124o45427J03580
$$ plain form
4450 21290250 22165944 23782408 26004440 28057966 29215682 29106875 28194207 27100915 25887833
4441 25887833 25106192 25219411 26303528 27721077 28747287 28375747 26055224 22743042 19412056
4432 19412056 16561505 14264044 12553136 11242540 10266603 9362536 8639066 8005640 7485501
4423 7485501 7056340 6712062 6345738 6093535 5888924 5711188 5557420 5371308 5229002 5090813
4413 5090813 4936814 4809077 4721346 4711422 4686647 4631696 4479114 4329810 4167922 4007726
4403 4007726 3882703 3744971 3676708 3647534 3626887 3605655 3669769 3624052 3544773 3458626 3374753
4392 3374753 3249808 3087379 2992713 2950862 2954230 2961668 2914391 2765780 2688091 2639260 2553145
4381 2553145 2514066 2428142 2427144 2452905 2467931 2452150 2417598 2432013 2407395 2366859 2287937 2193323
$$ packed form
4450B1290250Q75694J616464K222032K053526J157716j08807r12668j093292j213082
4441B5887833p81641J13219J084117J417549J026210l71540k320523l312182l330986
4432A9412056k850551k297461j710908j310596r75937r04067p23470o33426n20139
4423G485501m29161l44278l66324k52203k04611j77736j53768j86112j42306j38189
4413E090813j53999j27737q7731r924k4775n4951j52582j49304j61888j60196
4403D007726j25023j37732o8263k9174k0647k1232O4114m5717p9279q6147q3873
4392C374753j24945j62429r4666m1851L368P438m7277j48611p7689m8831q6115
4381B553145l9079q5924r98K5761J5026j5781l4552J4415k4618m0536p8922r4614
$$ plain form
4369 2193323 2119435 2105245 2099571 1990316 1981743 1958310 1927944 1895160 1898789 1879668 1868470 1844649
4357 1844649 1801114 1751383 1753112 1738544 1750329 1802150 1813593 1766340 1741337 1696604 1695750 1681756
4345 1681756 1663795 1659002 1661739 1608857 1629802 1666527 1657594 1609535 1609354 1647506 1635036 1586117
4333 1586117 1572228 1541012 1536440 1540674 1589899 1550676 1556631 1571322 1595287 1639291 1664048 1717278
4321 1717278 1757118 1849577 1936604 1996703 1994636 1962876 1926706 1925683 1917206 1922919 1960299 1995273
4309 1995273 2040991 2084466 2083714 2052428 1996714 2043971 2059699 2038208 2040815 2073927 2129712 2207186
4297 2207186 2217050 2230969 2213541 2202426 2152122 2162317 2180468 2174295 2167049 2141235 2145307 2137394
4285 2137394 2172611 2193317 2249101 2292579 2285668 2286202 2312320 2355735 2444030 2501070 2509450 2464488
$$ packed form
4369B193323p3888j4190n674j09255q573k3433l0366l2784L629j9121j1198k3821
4357A844649m3535m9731J729j4568J1785N1821J1443m7253k5003m4733q54j3994
4345A681756j7961m793K737n2882K0945L6725q933m8059j81L8152j2470m8919
4333A586117j3889l1216m572M234M9225l9223N955J4691K3965M4004K4757N3230
4321A717278L9840R2459Q7027O0099k067l1760l6170j023q477N713L7380L4974
4309A995273M5718M3475p52l1286n5714M7257J5728k1491K607L3112N5785P7474
4297B207186R864J3919j7428j1115n0304J0195J8151o173p246k5814M072p913
4285B137394L5217K0706N5784M3478o911N34K6118M3415Q8295N7040Q380m4962
$$ plain form
4273 2464488 2456040 2481618 2522967 2602682 2605527 2665591 2678688 2577568 2589546 2634132 2632094 2645776
4261 2645776 2663128 2661367 2639332 2724134 2787695 2858660 2898168 2940199 3023860 3020256 3030060 3082821
4249 3082821 3161528 3271689 3307443 3360429 3431275 3485343 3582372 3663886 3774666 3944111 4042831
4238 4042831 4121579 4249690 4360560 4476535 4596177 4743972 4860030 4962369 5063965 5144279
4228 5144279 5264146 5371483 5488120 5649042 5768164 5885831 6003197 6163133 6384016 6561762
4218 6561762 6679367 6802354 6983392 7108557 7284245 7435796 7590352 7730694 7934925 8162404
4208 8162404 8339798 8502318 8667609 8848436 9046914 9212442 9351691 9502991 9818004 10127994
4198 10127994 10464645 10790691 11089240 11450392 11771668 12059326 12446467 12819682 13207724
$$ packed form
4273B464488q448K5578M1349P9715K845O0064J3097j01120J1978M4586k038J3682
4261B645776J7352j761k2035Q4802O3561P0965L9508M2031Q3661l604R804N2761
4249C082821P8707J10161L5754N2986P0846N4068R7029Q1514J10780J69445R8720
4238D042831P8748J28111J10870J15975J19642J47795J16058J02339J01596Q0314
4228E144279J19867J07337J16637J60922J19122J17667J17366J59936K20883J77746
4218F561762J17605J22987J81038J25165J75688J51551J54556J40342K04231K27479
4208H162404J77394J62520J65291J80827J98478J65528J39249J51300L15013L09990
4198A0127994L36651L26046K98549L61152L21276K87658L87141L73215L88042
$$ plain form
4189 13207724 13636925 14067201 14467368 14882349 15424651 16029304 16672321 17449441 18229401
4180 18229401 19116037 20095137 21084475 22021014 23054653 24009249 24873242 25834330 26876808
4171 26876808 28050282 29355518 30767873 32251928 33926900 35866816 38133726 40727915
4163 40727915 43717175 47125623 50913572 55311489 60480435 66484403 73703214 82430646
4155 82430646 93088769 106253659 122931084 144487247 173178390 210547800 252941237
4148 252941237 285563323 294377653 275431144 237842079 196725932 160627861 131646788
4141 131646788 109618262 93159514 80318973 70017760 61634981 54824836 49305052
4134 49305052 44829764 41143329 38050942 35192803 32623249 30261342 28179113 26376160
$$ packed form
4189A3207724M29201M30276M00167M14981N42302O04653O43017P77120P79960
4180A8229401Q86636R79100R89338R36539J033639R54596Q63993R61088J042478
4171B6876808J173474J305236J412355J484055J674972J939916K266910K594189
4163D0727915K989260L408448L787949M397917N168946O003968P218811Q727432
4155H2430646J0658123J3164890J6677425K1556163K8691143L7369410M2393437
4148B52941237L2622086Q814330j8946509l7589065m1116147l6098071k8981073
4141A31646788k2028526j6458748j2840541j0301213q382779o810145n519784
4134D9305052m475288l686435l092387k858139k569554k361907k082229j802953
$$ plain form
4126 26376160 24852737 23493630 22324448 21273871 20256369 19262823 18315868 17427925 16633868
4117 16633868 15976224 15216360 14466368 13824597 13321211 12759757 12159714 11675668 11192858
4108 11192858 10801357 10405451 10081996 9754968 9427221 9104593 8851145 8616265 8382814
4099 8382814 8164123 7886021 7683158 7432371 7115717 6860308 6624716 6370863 6175572 5895586
4089 5895586 5699130 5520554 5368676 5180700 5009000 4880341 4766534 4655071 4503162 4418184
4079 4418184 4302614 4172690 4034689 3993351 3886451 3816946 3730779 3658195 3591297 3533158 3460311
4068 3460311 3408219 3332389 3245252 3194042 3082910 3011194 2907628 2817814 2781520 2794014 2708439
4057 2708439 2712357 2626999 2571336 2514475 2424865 2427117 2399623 2354150 2300627 2276017 2257888 2247674
$$ packed form
4126B6376160j523423j359107j169182j050577j017502r93546r46955q87943p94057
4117A6633868o57644p59864p49992o41771n03386n61454o00043m84046m82810
4108A1192858l91501l95906l23455l27028l27747l22628k53448k34880k33451
4099H382814k18691k78102k02863k50787l16654k55409k35592k53853j95291k79986
4089E895586j96456j78576j51878j87976j71700j28659j13807j11463j51909q4978
4079D418184j15570j29924j38001m1338j06900o9505q6167p2584o6898n8139p2847
4068C460311n2092p5830q7137n1210j11132p1716j03566q9814l6294J2494q5575
4057B708439L918q5358n5663n6861q9610K252k7494m5473n3523k4610j8129j0214
$$ plain form
4045 2247674 2240734 2157807 2086829 2051296 2032307 2136514 2144329 2116338 2128380 2115965 2097165 2042553
4033 2042553 1993954 1932591 1937248 1910121 1867939 1935633 1884254 1885527 1901180 2007671 2037984 2021824
4021 2021824 2008339 1976940 1889655 1790352 1791013 1714758 1677783 1650887 1611450 1630125 1662977 1656493
4009 1656493 1662304 1613504 1614165 1624513 1614774 1695633 1699456 1732515 1732603 1741604 1745032 1741342 1780711 1784159
3995 1784159 1837578 1900474 1940971 2024496 2008795 1972177 1903074 1843998 1815122 1855484 1872013
3984 1872013 1963263 2017109 2110760 2208580 2434811 2629389 2841900 3082328 3401193 3796189
3974 3796189 4245005 4561356 4793841 5099330 5425348 5597463 5554597 5481268 5356139 5176018
3964 5176018 4881756 4599493 4409899 4432680 4561739 4450269 4187109 4035338 3933801 3685369
$$ packed form
4045B247674o940q2927p0978l5533j8989J04207P815k7991J2042j2415j8800n4612
4033B042553m8599o1363M657k7127m2182O7694n1379J273J5653J06491L0313j6160
4021B021824j3485l1399q7285r9303O61p6255l6975k6896l9437J8675L2852o484
4009A656493N811m8800O61J0348r739Q0859L823L3059Q8R001L428l690L9369L448
3995A784159N3419O2896M0497Q3525j5701l6618o9103n9076k8876M0362J6529
3984A872013R1250N3846R3651R7820K26231J94578K12511K40428L18865L94996
3974C796189M48816L16351K32485L05489L26018J72115m2866p3329j25129j80121
3964E176018k94262k82263j89594K2781J29059j11470k63160j51771j01537k48432
$$ plain form
3954 3685369 3303991 3002504 2746119 2533108 2316268 2226588 2103990 1897145 1746110 1686022
3944 1686022 1548063 1435295 1363270 1314403 1226972 1207847 1127515 1065421 1029041 983135 1024356
3933 1024356 1007805 979820 998465 968300 922951 900106 907005 899010 884947 916157 938972 857072
3921 857072 894853 885429 829359 794718 746735 701253 642540 619012 688145 635093 643841 614314
3909 614314 630508 606126 538146 547767 560575 559264 575055 559382 548947 531269 533075 504612
3897 504612 506576 510955 501402 539315 520600 504136 509922 535403 586656 569248 560231 510822 502053
3884 502053 464919 501616 481808 509358 564262 575347 624760 616594 634969 660505 690364 687137
3872 687137 709063 699319 734592 724230 788707 838212 900934 973041 1086487 1214151 1392050
$$ packed form
3954C685369l81378l01487k56385k13011k16840q9680j22598k06845j51035o0088
3944A686022j37959j12768p2025m8867q7431j9125q0332o2094l6380m5906M1221
3933A024356j6551k7985J8645l0165m5349k2845O899p995j4063L1210K2815q1900
3921H57072L7781r424n6070l4641m7983m5482n8713k3528O9133n3052Q748k9527
3909F14314J6194k4382o7980R621J2808j311J5791j5673j0435j7678J806k8463
3897E04612J964M379r553L7913j8715j6464N786K5481N1253j7408r017m9409q769
3884E02053l7134L6697j9808K7550N4904J1085M9413q166J8375K5536K9859l227
3872F87137K1926r744L5273j0362O4477M9505O2722P2107J13446J27664J77899
$$ plain form
3861 1392050 1570562 1841039 2094314 2267286 2234394 2094186 1901324 1674641 1436546 1190861
3851 1190861 1006311 947234 814444 758041 722812 709192 626689 551376 527531 497950 459725
3840 459725 472795 471201 428229 425753 426412 417229 410385 400487 400957 394977 378226 360355 311504 277623
3826 277623 276301 311904 325921 265936 260767 318576 282973 251305 255012 218001 214116 229600
3814 229600 217170 229462 240010 205839 164342 171316 150503 140376 159339 186905 217871 211877
3802 211877 216179 191944 152183 124115 128074 141425 124983 131232 157368 138486 119815 155856
3790 155856 202251 164195 132000 174173 164080 192327 190300 240630 300082 253329 215082 171795
3778 171795 166177 154803 159545 205406 208109 194083 127156 150137 180879 186441 201311 197317 147676
$$ packed form
3861A392050J78512K70477K53275J72972l2892j40208j92862k26683k38095k45685
3851A190861j84550n9077j32790n6403l5229j3620q2503p5313k3845k9581l8225
3840D59725J3070j594m2972k476O59r183o844r898M70n980j6751j7871m8851l3881
3826B77623j322L5603J4017n9985n169N7809l5603l1668L707l7011l885J5484
3814B29600j2430J2292J0548l4171m1497O974k0813j0127J8963K7566L0966n994
3802B11877M302k4235l9761k8068L959J3351j6442O249K6136j8882j8671L6041
3790A55856M6395l8056l2195M2173j0093K8247k027N0330N9452m6753l8247m3287
3778A71795n618j1374M742M5861K703j4026o6927K2981L0742N562J4870l994m9641
$$ plain form
3765 147676 150119 156355 117873 155875 112092 96247 116108 134419 172609 224427 211751 224952
3753 224952 217570 206829 198805 159537 140769 140590 155237 145469 142533 133776 101161 74249 116138
3740 116138 143364 168128 153733 102724 118081 140156 81535 105763 96609 118220 139569 71202
3728 71202 80514 90832 73920 108544 67614 144510 174386 164625 166078 136060 116684 110662 123275
3715 123275 131071 78751 75825 71380 81508 109564 60619 82417 124090 97280 48495 67268
3703 67268 40599 35572 49813 58832 16891 52828 75361 62610 79268 99063 87013 72567
3691 72567 45206 16956 83325 87232 83699 115179 74258 48772 94573 100339 142346 102921
3679 102921 117087 59374 30576 73770 103889 103983 63668 24746 7160 8674 17678 21994 7041
$$ packed form
3765A47676K443O236l8482L8002m3783j5845J9861J8311L8190N1818j2676J3201
3753B24952p382j0741q024l9268j8768j79J4647r768k936q757l2615k6912M1889
3740A16138K7226K4764j4395n1009J5357K2075n8621K4228r154K1611K1349o8367
3728G1202R312J0318j6912L4624m0930P6896K9876r761J453l0018j9376o022J2613
3715A23275P796n2320k926m445J0128K8056m8945K1798M1673k6810m8785J8773
3703F7268k6669n027J4241R019m1941L5937K2533j2751J6658J9795j2050j4446
3691G2567k7361k8250O6369L907l533L1480m0921k5486M5801N766M2007l9425
3679A02921J4166n7713k8798M3194L0119R4m0315l8922j7586J514R004M316j4953
$$ plain form
3666 7041 15274 -1641 38758 62154 45442 28324 79676 88439 65114 33740 52590 80028
3654 80028 84683 72548 37992 58198 86283 82107 99036 46426 10291 59285 38212 -3860
3642 -3860 -14460 8962 73363 71179 90965 61910 47124 72666 116875 103212 95775 76282
3630 76282 59791 65572 40563 67357 46207 31598 83023 81496 63972 98407 47303 35157
3618 35157 85861 89684 82694 131459 150656 143775 138309 103834 64478 89395 87439 83587 146571
3605 146571 140742 124623 102937 66014 70258 108925 158597 112479 64694 29115 43813 63074
3593 63074 17153 4265 3535 60477 55454 89705 50171 53577 92786 31135 30889 27304 28574
3580 28574 52474 96994 101042 21359 24299 65547 66799 35978 34784 41018 42868 79472 55204
$$ packed form
3666G041Q233j6915M0399K3396j6712j7118N1352Q763k3325l1374J8850K7438
3654H0028M655j2135l4556K0206K8085m176J6929n2610l6135M8994k1073m2072
3642c860j0600K3422O4401k184J9786k9055j4786K5542M4209j3663p437j9493
3630G6282j6491N781k5009K6794k1150j4609N1425j527j7524L4435n1104j2146
3618C5157N0704L823o990M8765J9197o881n466l4475l9356K4917j956l852O2984
3605A46571n829j6119k1686l6923M244L8667M9672m6118m7785l5579J4698J9261
3593F3074m5921j2888p30N6942n023L4251l9534L406L9209o1651k46l585J270
3580B8574K3900M4520M048p9683K940M1248J252l0821j194O234J850L6604k4268
$$ plain form
3567 55204 14173 15337 48449 73576 103063 43884 32317 106602 60526 28180 53234 44313
3555 44313 38323 52740 43898 35167 65352 55211 41865 80199 76254 34715 41137 46730 47635
3542 47635 72683 70093 59902 121264 112515 54555 25309 43832 63958 88079 97889 81498
3530 81498 63135 34303 30543 66682 67320 110325 128525 100867 77452 42291 54005 55317 44764
3517 44764 27158 106290 105327 51505 89136 92725 120694 110353 120177 114288 92761 72820 69445
3504 69445 70588 44931 130121 142181 133240 93309 65714 22181 65693 82093 112189 158872
3492 158872 173999 184952 170852 139904 127044 158908 205235 245846 240672 235491 176416 186865
3480 186865 130654 139757 188964 187637 144319 110368 101340 93064 100769 141874 130938 98371 138585
$$ packed form
3567E5204m1031J164L3112K5127K9487n9179j1567P4285m6076l2346K5054q921
3555D4313n990J4417q842q731L0185j0141j3346L8334l945m1539O422N593R05
3542D7635K5048k590j0191O1362q749n7960k9246J8523K0126K4121R810j6391
3530H1498j8363k8832l760L6139O38M3005J8200k7658k3415l5161J1714J312j0553
3517D4764j7606P9132r63n3822L7631L589K7969j0341R824n889k1527j9941l375
3504F9445J143k5657Q5190J2060q941l9931k7595m3533M3512J6400L0096M6683
3492A58872J5127J0953j4100l0948j2860L1864M6327M0611n174n181n9075J0449
3480A86865n6211R103M9207j327m3318l3951r028q276P705M1105j0936l2567M0214
$$ plain form
3467 138585 133598 68290 54680 85579 68836 39452 100258 162706 95673 81267 87310 123687
3455 123687 102562 166727 168471 178976 182939 187629 157467 152470 215458 220850 201702 190078 198392
3442 198392 176095 150917 108430 169312 157159 137412 142608 178181 156068 171428 185208 186305
3430 186305 173456 144853 180279 189804 202784 275299 282485 299176 295505 351022 353710 356697 385470
3417 385470 444288 488339 477971 445484 394711 363774 349957 301249 284298 295946 281734 226892
3405 226892 236774 260677 235770 290294 290485 301112 351606 334902 320455 373558 433330 402072
3393 402072 394017 418562 420598 493840 551264 615844 676749 787711 911853 953043 892996 776791
3381 776791 696259 618006 553198 515859 545803 591389 581484 468227 432683 400875 397615 411784
$$ packed form
3467A38585m987o5308j3610L0899j6743k9384O0806O2448o7033j4406O043L6377
3455A23687k1125O4165J744J0505L963M690l0162m997O2988N392j9148j1624Q314
3442A98392k2297k5178m2487O0882j2153j9747N196L5573k2113J5360J3780J097
3430A86305j2849k8603L5426R525J2980P2515P186J6691l671N5517K688K987K8773
3417C85470N8818M4051j0368l2487n0773l0937j3817m8708j6951J1648j4212n4842
3405B26892R882K3903k4907N4524J91J0627N0494j6704j4447N3103N9772l1258
3393D02072q055K4545K036P3242N7424O4580O0905J10962J24142M1190o0047j16205
3381G76791q0532p8253o4808l7339K9944M5586r905j13257l5544l1808l260J4169
$$ plain form
3369 411784 377080 388200 368832 316219 338629 406597 421487 410061 421058 479420 508584 527445
3357 527445 505573 556199 540367 620130 710174 771823 735912 697889 622617 601053 585979 563922
3345 563922 530277 514995 543644 557920 525055 482087 486616 534877 563862 539821 514099 506120
3333 506120 497998 513720 503319 534927 560323 530471 589909 579558 624545 645914 628205 665282
3321 665282 672661 675857 699336 761247 816526 788709 854386 948022 951575 974562 1017911 966120
3309 966120 928374 913298 898963 895128 959849 992790 973782 934030 909008 887444 888351 946881
3297 946881 944957 968560 1030614 1083655 1131434 1147988 1225343 1315702 1376308 1387442 1416069 1503723
3285 1503723 1518533 1584066 1610589 1681165 1797901 1855805 1833694 1765755 1663576 1629766 1608612
$$ packed form
3369D11784l4704J1120j9368n2613K2410O7968J4890j1426J0997N8362K9164J8861
3357E27445k1872N0626j5832P9763R0044O1649l5911l8023p5272k1564j5074k2057
3345E63922l3645j5282K8649J4276l2865m2968M529M8261K8985k4041k5722p979
3333E06120q122J5722j0401L1608K5396k9852N9438j0351M4987K1369j7709L7077
3321F65282P379L196K3479O1911N5279k7817O5677R3636L553K2987M3349n1791
3309I66120l7746j5076j4335l835O4721L2941j9008l9752k5022k1564R07N8530
3297I46881j924K3603O2054N3041M7779J6554P7355R0359O0606J1134K8627Q7654
3285A503723J4810O5533K6523P0576J16736N7904k2111o7939j02179l3810k1154
$$ plain form
3274 1608612 1574133 1549662 1522009 1505798 1529430 1516514 1504647 1584345 1623986 1688636 1753233
3263 1753233 1796737 1860370 1929805 1955934 2038775 2019378 1986880 2009436 2014397 2033472 2072550 2094778
3251 2094778 2202136 2298123 2366703 2395601 2430527 2442818 2448280 2530264 2513804 2504907 2597030 2637586
3239 2637586 2777610 2887594 2927503 3062498 3181864 3297968 3414229 3516876 3597953 3571594
3229 3571594 3492868 3364951 3167864 2925411 2724200 2580569 2398327 2298185 2190772 2121082
3219 2121082 2072861 2041401 1972871 1966472 1950734 1886864 1861176 1869021 1899685 1990734 2015550 2007226
3207 2007226 2042397 2133275 2178715 2182500 2102308 2028899 1999137 1934471 1910770 1891339 1870735 1834263
3195 1834263 1827957 1746340 1651281 1519011 1450840 1369729 1320133 1259779 1265862 1270240 1261276 1273279
$$ packed form
3274A608612l4479k4471k7653j6211K3632j2916j1867P9698L9641O4650O4597
3263A753233M3504O3633O9435K6129Q2841j9397l2498K2556M961J9075L9078K2228
3251B094778J07358R5987O8580K8898L4926J2291N462Q1984j6460q897R2123M0556
3239B637586J40024J09984L9909J34995J19366J16104J16261J02647Q1077k6359
3229C571594p8726j27917j97087k42453k01211j43631j82242j00142j07413o9690
3219B121082m8221l1460o8530o399j5738o3870k5688P845L0664R1049K4816q324
3207B007226L5171R0878M5440L785q0192p3409k9762o4666k3701j9431k0604l6472
3195A834263o306q1617r5059j32270o8171q1111m9596o0354O083M378q964J2003
$$ plain form
3183 1273279 1287393 1320924 1351939 1375942 1454145 1554700 1601368 1692720 1840205 2068194 2201302
3172 2201302 2219017 2081175 1860306 1704519 1552967 1438240 1333990 1266929 1168940 1081539
3162 1081539 1051064 1024133 994617 952428 877363 852007 817421 785779 791667 800403 784913 813167
3150 813167 822714 818029 810141 857755 875616 885188 971795 988011 1112923 1167289 1096910 1051491
3138 1051491 935523 826614 762823 721567 630459 575905 553237 502269 487832 482593 467661
3127 467661 396995 398509 436012 450046 426157 387401 336850 338871 357520 374539 325133 312492
3115 312492 332630 353920 376730 344298 320410 308214 292424 233219 271042 300892 257161 226421
3103 226421 208396 228886 265837 262208 245961 241830 229433 239660 181114 187636 226925 201160
$$ packed form
3183A273279J4114L3531L1015K4003P8203J00555M6668R1352J47485K27989J33108
3172B201302J7715j37842k20869j55787j51552j14727j04250o7061r7989q7401
3162A081539l0475k6931k9516m2189p5065k5356l4586l1642N888Q736j5490K8254
3150H13167R547m685p888M7614J7861R572Q6607J6216J24912N4366p0379m5419
3138A051491j15968j08909o3791m1256r1108n4554k2668n0968j4437n239j4932
3127D67661p0666J514L7503J4034k3889l8756n0551K021J8649J7019m9406j2641
3115C12492K0138K1290K2810l2432k3888j2196j5790n9205L7823K9850m3731l0740
3103B26421j8025K0490L6951l629j6247m131j2397J0227n8546O522L9289k5765
$$ plain form
3091 201160 164556 115938 142608 188269 132938 131172 149668 169115 166308 181830 134805 166756
3079 166756 171754 163233 119548 159430 112788 118013 135848 150491 132196 140297 156290 117308
3067 117308 99768 94576 103601 126802 132486 100819 76741 98783 162944 116388 139615 125935
3055 125935 147665 118771 143893 150609 129498 108109 108395 86976 128236 153113 126172 81984
3043 81984 61604 34853 76636 122228 29866 -20029 51395 64607 84392 127427 73030 119187
3031 119187 138615 127066 105489 120898 147655 88046 62506 108412 103219 80612 99446 105191
3019 105191 101797 84301 104362 86134 111111 88000 65617 47840 54029 55509 38048 63604
3007 63604 116568 101086 78359 126007 77252 47014 80713 64402 109665 161935 171653 166502
$$ packed form
3091B01160l6604m8618K6670M5661n5331j766J8496J9447k807J5522m7025L1951
3079A66756M998q521m3685L9882m6642N225J7835J4643j8295Q101J5993l8982
3067A17308j7540n192R025K3201N684l1667k4078K2042O4161m6556K3227j3680
3055A25935K1730k8894K5122O716k1111k1389K86k1419M1260K4877k6941m4188
3043H1984k0380k6751M1783M5592r2362m9895P1424J3212J9785M3035n4397M6157
3031A19187J9428j1549k1577J5409K6757n9609k5540M5906n193k2607J8834N745
3019A05191l394j7496K0061j8228K4977k3111k2383j7777O189J480j7461K5556
3007F3604N2964j5482k2727M7648m8755l0238L3699j6311M5263N2270R718n151
$$ plain form
2995 166502 125461 152101 221919 167881 148963 157483 154226 140453 151512 161333 135594 106086
2983 106086 77552 101721 84955 143110 157996 123187 79148 51261 86079 75992 59949 128070
2971 128070 154211 160875 141262 102899 164545 203422 132757 205531 237397 223025 261177 211972
2959 211972 262684 244546 204419 196705 220417 176421 185521 208274 220603 197857 138675 157285
2947 157285 139339 106429 121495 191272 190009 183659 185393 176404 227945 215248 232728 212586
2935 212586 211011 221539 182852 193642 222483 238347 253212 268805 255618 245732 293913 290333
2923 290333 296898 318195 269186 307376 366274 315574 334696 353207 363157 326164 276683 341050
2911 341050 402960 399981 368382 367745 363398 387097 341514 360805 452319 459312 418809 419639 363470
$$ packed form
2995A66502m1041K6640O9818n4038j8918Q520l257j3773J1059R821k5739k9508
2983A06086k8534K4169j6766N8155J4886l4809m4039k7887L4818j0087j6043O8121
2971A28070K6141O664j9613l8363O1646L8877p0665P2774L1866j4372L8152m9205
2959B11972N0712j8138m0127p714K3712m3996R100K2753J2329k2746n9182J8610
2947A57285j7946l2910J5066O9777j263o350J734q989N1541j2697J7480k0142
2935B12586j575J0528l8687J0790K8841J5864J4865J5593j3187r886M8181l580
2923B90333O565K1297m9009L8190N8898n0700J9122J8511R950l6993m9481O4367
2911C41050O1910k979l1599o37m347K3699m5583J9291R1514O993m0503Q30n6169
$$ plain form
2898 363470 373821 423307 424425 487661 474850 459937 517906 499666 555704 561076 522800 523117
2886 523117 529708 527022 529989 515109 473839 486925 451147 426691 406263 423903 434120 415831
2874 415831 438508 449891 474476 470873 484325 439231 430902 481516 549392 540956 507726 477678
2862 477678 516932 504153 498907 430626 427716 417647 405219 380099 412225 375929 310189 310438
2850 310438 348391 333170 345225 345428 297500 283404 264176 297014 322680 325890 310122 313651
2838 313651 320100 339330 296338 210668 228259 231111 218137 220167 159144 192539 201359 231268
2826 231268 211746 176782 136930 99780 123163 104227 108751 107885 113610 122221 145234 153703 166540
2813 166540 115515 106945 163991 142886 153472 119637 91403 90457 74420 21430 -16923 -14334
$$ packed form
2898C63470J0351M9486J118O3236j2811j4913N7969j8240N6038N372l8276L17
2886E23117O591k686K967j4880m1270J3086l5778k4456k0428J7640J0217j8289
2874D15831K2677J1383K4585l603J3452m5094q329N0614O7876q436l3230l0048
2862D77678L9254j2779n246o8281k910j0069j2428k5120L2126l6296o5740K49
2850C10438L7953j5221J2055K03m7928j4096j9228L2838K5666L210j5768L529
2838C13651O449J9230m2992q5670J7591K852j2974K030o1023L3395Q820K9909
2826B31268j9522l4964l9852l7150K3383j8936M524q66N725Q611K3013Q469J2837
2813A66540n1025q570N7046k1105J0586l3835k8234r46j6037n2990l8353K589
$$ plain form
2801 -14334 38000 48978 70065 31314 45944 48368 28949 -9058 54727 16816 68283 96314
2789 96314 90210 54063 38520 43813 58812 55211 35611 95786 51239 37452 14465 -1843
2777 -1843 14128 -3416 -56109 -61398 -32355 -5203 20263 9925 -13063 16420 -20261 -21031 -1734
2764 -1734 -30511 -65379 -100463 -28949 -18926 -3718 -296 -10435 -11892 -441 6677 29225 155
2751 155 -43980 -16286 43616 24586 -16237 16204 -57322 -67883 -11841 -10499 -13914 -24520 -11912
2738 -11912 -2308 10208 -23870 -27259 2296 -77368 -92559 -49702 -61112 -56009 -62635 -33488 -4446
2725 -4446 -30789 -27357 -249 -30729 -20975 -18979 -8858 -4061 -8517 -7136 10759 -17753 -49074
2712 -49074 -46300 -75272 -92972 -47037 -62997 -102099 -110072 -83684 -27901 -75465 -108796 -75027
$$ packed form
2801a4334N2334J0978K1087l8751J4630K424j9419l8007O3785l7911N1467K8031
2789I6314o104l6147j5543N293J4999l601j9600O0175m4547j3787k2987j6308
2777a843J5971j7544n2693n289K9043K7152K5466j0338k2988K9483l6681p70J9297
2764a734k8777l4868l5084P1514J0023J5208L422j0139j457J1451P118K2548k9070
2751A55m4135K7694N9902j9030m0823L2441p3526j0561N6042J342l415j0606J2608
2738a1912R604J2516l4078l389K9555p9664j5191M2857j1410N103o626K9147K9042
2725d446k6343L432K7108l0480R754J996J0121M797m456J381J7895k8512l1321
2712d9074K774k8972j7700M5935j5960l9102p973K6388N5783m7564l3331L3769
$$ plain form
2700 -75027 -65621 -42981 -62837 -72180 -104337 -93471 -63313 -83880 -30924 -49908 -33733 -53100
2688 -53100 -49154 -34989 -23229 -63287 -27292 -58024 -48531 -25630 -30307 -17474 -13585 -37116 -31734
2675 -31734 -45487 -16572 -13071 5456 -36635 -57691 -37035 -17626 -2107 -12449 -3420 -4257 -58030
2662 -58030 -59343 -48658 -36185 -47876 -68064 -35116 -11348 -20240 -51013 -72901 -70435 -64704 -31635
2649 -31635 -8718 -41912 -75418 -79049 -133269 -116613 -122498 -103386 -38352 -35761 -9973 28508
2637 28508 2942 -89260 -75680 -64814 -78398 -36777 7683 -29742 -42665 -59852 -71929 -55834
2625 -55834 -74881 -95067 -85210 -25583 -41137 -65221 -44110 -48727 -32550 -47818 -60018 -35811
2613 -35811 -46825 -36813 -44908 -41476 -78000 -60810 -39056 -54057 960 5013 11916 5467 15446
$$ packed form
2700g5027R406K2640j9856r343l2157J0866L0158k0567N2956j8984J6175j9367
2688e3100L946J4165J1760m0058L5995l0732R493K2901m677J2833L889k3531N382
2675c1734j3753K8915L501J8527m2091k1056K0656J9409J5519j0342R029q37n3773
2662e8030j313J0685J2473j1691k0188L2948K3768q892l0773k1888K466N731L3069
2649c1635K2917l3194l3506l631n4220J6656n885J9112O5034K591K5788L8481
2637B8508k5566r2202J3580J0866j3584M1621M4460l7425j2923j7187j2077J6095
2625e5834j9047k0186R857N9627j5554k4084K1111m617J6177j5268j2200K4207
2613c5811j1014J0012q095L432l6524J7190K1754j5001N5017M053O903o449R979
$$ plain form
2600 15446 20546 13870 -11327 -19255 -40151 -40428 -61339 -26058 -14796 -16884 -46076 -85451 -72018
2587 -72018 -75197 -115426 -75510 -59899 -46915 -21373 -18840 6907 -19928 -45284 -38690 -19392
2575 -19392 -27948 2973 2323 -24146 51086 32183 -42322 -47848 -6015 -65342 -70237 -56379 -87898
2562 -87898 -46978 -14608 -50960 -25230 -9031 -4201 -43986 -12934 -6822 -76831 -57304 -38281
2550 -38281 -84683 -64318 -41237 -41200 -41164 -18354 -15231 -61584 -52095 -70187 -85819 -3121 -14594
2537 -14594 24290 1883 -17372 -15803 -50122 -94514 -115554 -91112 -86930 -77595 -68380 -47911 -80657
2524 -80657 -71353 -57610 -36119 -37472 -78427 -78152 -25092 14347 27794 -31727 -14373 -8410 -15911
2511 -15911 -43614 -47828 -12058 -929 -33903 -45112 -70690 -116608 -106434 -30112 -47229 -86640
$$ packed form
2600A5446N100o676k5197p928k0896k77k0911L5281J1262k088k9192l9375J3433
2587g2018l179m0229L9916J5611J2984K5542K533K5747k6835k5356O594J9298
2575a9392q556L0921o50k6469P5232j8903p4505n526M1833n9327m895J3858l1519
2562h7898M0920L2370l6352K5730J6199M830l9785L1052O112p0009J9527J9023
2550c8281m6402K0365K3081L7L6K2810L123m6353R489j8092j5632Q2698j1473
2537a4594L8884k2407j9255J569l4319m4392k1040K4442M182R335R215K0469l2746
2524h0657R304J3743K1491j353m0955K75N3060L9439J3447n9521J7354N963p501
2511a5911k7703m214L5770J1129l2974j1209k5578m5918J0174P6322j7117l9411
$$ plain form
2499 -86640 -52397 -59200 -72274 -108721 -26765 -6062 -85 -37855 -25236 -44786 -73721 -62492
2487 -62492 -71292 -53896 -71013 -68125 -58808 -45555 -79658 -117575 -92513 -104652 -36443 12680
2475 12680 -36628 -30550 -58360 -85392 -109466 -99767 -108606 -41815 -48951 -63834 -54228 -15495 -29165
2462 -29165 -67954 -24584 -14327 -46060 -11271 -41773 -45159 -63635 -67574 -107665 -104607 -85324
2450 -85324 -28003 -33404 -65104 -63636 -45441 -65912 -61393 -58634 -32644 -54431 -31691 -35264 -32411
2437 -32411 40485 20751 29673 -14334 -42823 -37431 -77254 -58599 -65029 -39148 14106 15300 -13670
2424 -13670 -21973 -25194 -59553 -50201 -5172 14156 -16405 -19168 -50268 -92237 -92443 -96972 -44649
2411 -44649 -74881 -94981 -23438 -29436 -21007 -9363 -25810 -97438 -70924 -58005 -45051 -25875
$$ packed form
2499h6640L4243o803j3074l6447Q1956K0703N977l7770J2619j9550k8935J1229
2487f2492q800J7396j7117K888R317J3253l4103l7917K5062j2139O8209M9123
2475A2680m9308O078k7810k7032k4074R699q839O6791p136j4883R606L8733j3670
2462b9165l8789M3370J0257l1733L4789l0502l386j8476l939m0091L058J9283
2450h5324N7321n401l1700J468J8195k0471M519K759K5990k1787K2740l573K853
2437c2411P2896j9734Q922m4007k8489N392l9823J8655o430K5881N3254J194k8970
2424a3670q303l221l4359R352M5029J9328l0561k763l1100m1969k06m529N2323
2411d4649l0232k0100P1543n998Q429J1644j6447p1628K6514J2919J2954J9176
$$ plain form
2399 -25875 -68288 -81955 -69231 -30643 -24284 885 3389 -15713 -8521 -10328 -11773 -21461 -48724
2386 -48724 -31771 -3299 -22040 -41512 -71918 -71844 -38307 -2487 15050 16514 -3429 -59263 -84055
2373 -84055 -67468 -54299 -48429 -64899 -31301 -46114 -43757 -50185 16324 -8045 26069 26098 91783
2360 91783 128022 98483 44714 44534 13009 7275 10104 4598 -171 -2541 -16772 -1445 -33457
2347 -33457 -13652 19589 -52725 -30247 -16697 -7698 -5928 -16261 24558 11190 9063 -4796
2335 -4796 -22094 -31639 -43440 11624 -30672 -39754 -166 -3893 -3579 -12282 -26808 -32388 11839
2322 11839 -18561 15640 42435 36755 23480 -52133 -44294 -7898 -8653 -26535 -24771 -53121 -55401
2309 -55401 -43583 -12812 -5579 32362 -10199 1982 -12035 -20603 -20356 -35311 10629 -20293 -8742
$$ packed form
2399b5875m2413j3667J2724L8588O359K5169K504j9102P192j807j445r688k7263
2386d8724J6953K8472j8741j9472l0406P4L3537L5820J7537J464j9943n5834k4792
2373h4055J6587J3169N870j6470L3598j4813K357o428O6509k4369L4114K9O5685
2360I1783L6239k9539n3769j80l1525n734K829n506m769k370j4231J5327l2012
2347c3457J9805L3241p2314K2478J3550Q999J770j0333M0819j3368k127j3859
2335d796j7298r545j1801N5064m2296r082L9588l727L14q703j4526n580M4227
2322A1839l0400L4201K6795n680j3275p5613P839L6396p55j7882J764k8350k280
2309e5401J1818L0771P233L7941m2561J2181j4017q568K47j4955M5940l0922J1551
$$ plain form
2296 -8742 -18815 -44485 -7549 -23587 6 32918 29467 15057 -44781 -40957 -8627 -58780
2284 -58780 7503 -21838 -7164 -1486 9674 39314 18883 24274 6352 -11368 -3516 -60715
2272 -60715 -35412 -64985 -40332 -28851 -18416 -14944 -44881 -41188 428 22337 12735 -18119
2260 -18119 -5283 34317 12063 26110 62090 61271 63969 78719 62791 50742 34031 62564
2248 62564 27340 -9770 9658 32937 -17728 -18608 -44308 -4972 60335 58982 64456 54629 -23926
2235 -23926 -15129 13575 8851 -17231 20712 10075 17738 14431 36407 54885 61085 56199 49091
2222 49091 28156 27028 27426 26174 65281 59553 56677 38285 64953 84188 52158 68752 87720
2209 87720 37054 49344 59446 88592 106651 87129 88762 91352 75807 67197 88064 113072
$$ packed form
2296h742j0073k5670L6936j6038K3593L2912l451j4410n9838L824L2330n0153
2284e8780O6283k9341J4674N678J1160K9640k0431N391j7922j7720P852n7199
2272f0715K5303k9573K4653J1481J0435L472k9937L693M1616K1909r602l0854
2260a8119J2836L9600k2254J4047L5980q19K698J4750j5928j2049j6711K8533
2248F2564l5224l7110J9428K3279n0665q80k5700L9336O5307j353N474r827p8555
2235b3926Q797K8704m724k6082L7943j0637P663l307K1976J8478O200m886p108
2222D9091k0935j128L98j252L9107n728k876j8392K6668J9235l2030J6594J8968
2209H7720n0666J2290J0102K9146J8059j9522J633K590j5545q610K0867K5008
$$ plain form
2197 113072 103249 69070 91184 111170 88001 124346 73753 106899 92163 98403 136128 174289
2185 174289 165719 177632 193592 161602 188749 162555 179854 174793 157820 224581 220818 213819
2173 213819 223873 254211 239920 243085 279625 290449 280168 269927 235724 257101 288011 312103
2161 312103 310481 330475 330243 370409 393633 401424 420556 413136 416077 435218 454061 440812 432881
2148 432881 405744 437140 456816 513888 516364 491806 527903 575424 570789 573333 565104 636908
2136 636908 653421 619963 704656 744081 716055 733162 752435 848132 858920 957913 957895 988395
2124 988395 1075168 1161086 1233947 1289106 1303342 1352758 1443685 1538767 1564098 1592877 1705159
2113 1705159 1872917 1964288 2089457 2259692 2411046 2646952 2955605 3116312 3261193 3454108
$$ packed form
2197A13072r823l4179K2114J9986k3169L6345n0593L3146j4736O240L7725L8161
2185A74289q570J1913J5960l1990K7147k6194J7299n061j6973O6761l763o999
2173B13819J0054L0338j4291L165L6540J0824j0281j0241l4203K1377L0910K4092
2161C12103j622J9994k32M0166K3224P791J9132p420K941J9141J8843j3249p931
2148D32881k7137L1396J9676N7072K476k4558L6097M7521m635K544q229P1804
2136F36908J6513l3458Q4693L9425k8026J7107J9273R5697J0788R8993j8L0500
2124I88395Q6773Q5918P2861N5159J4236M9416R0927R5082K5331K8779J12282
2113A705159J67758R1371J25169J70235J51354K35906L08653J60707J44881J92915
$$ plain form
2103 3454108 3763329 4136331 4532703 5062650 5739754 6715994 7972666 9531310 11678550
2094 11678550 14777550 18711237 20574258 18380828 14541065 11209500 8726850 7069689
2086 7069689 5919419 4970504 4344737 3791188 3339733 3011979 2771872 2572503 2489231 2369130
2076 2369130 2193278 1961338 1778642 1632973 1491120 1383450 1328981 1290047 1228924 1151731
2066 1151731 1067587 1068682 1048682 942903 869983 811022 792598 735892 742865 691984 648681 604740
2054 604740 574049 547699 526009 516139 500280 436685 412262 438925 432751 405885 359086 380021
2042 380021 406864 384584 354888 377938 329426 320054 279840 238919 243006 222037 257462 264473
2030 264473 242176 250798 274071 217634 204672 178955 236894 232740 188839 217771 237316 209719
$$ packed form
2103C454108L09221L73002L96372N29947O77104R76240J256672J558644K147240
2094A1678550L099000L933687J863021k193430l839763l331565k482650j657161
2086G069689j150270r48915o25767n53549m51455l27754k40107j99369q3272j20101
2076B369130j75852k31940j82696j45669j41853j07670n4469l8934o1123p7193
2066A151731q4144J095k0000j05779p2920n8961j8424n6706O973n0881m3303m3941
2054F04740l0691k6350k1690r870j5859o3595k4423K6663o174k6866m6799K0935
2042C80021K6843k2280k9696K3050m8512r372m0214m0921M087k0969L5425P011
2030B64473k2297Q622K3273n6437j2962k5717N7939m154m3901K8932J9545k7597
$$ plain form
2018 209719 180740 138196 81699 126824 140148 175204 143541 147730 162843 143281 141313 126721
2006 126721 42191 77160 89559 48533 44511 89505 81858 50657 56947 109502 102197 80877
1994 80877 64017 57055 42979 66223 143052 63032 18523 32141 65767 22367 27408 44616
1982 44616 15015 67154 97604 36326 42566 48795 86893 52116 69920 46934 57741 33784
1970 33784 44421 70631 27575 64955 66260 33904 46 7040 30862 66452 -18461 -31852
1958 -31852 -24603 -17121 -7420 30628 7234 -6402 -2285 10694 -1093 6775 -9379 -46768 21370
1945 21370 27581 -4368 -14925 -14203 -1181 665 -34127 -19037 21382 916 -2348 -31915 -22928
1932 -22928 -31716 -25894 -65631 -49029 -16555 -61290 -41904 8873 -13050 -8859 15372 -11636
$$ packed form
2018B09719k8979m2544n6497M5125J3324L5056l1663M189J5113j9562j968j4592
2006A26721q4530L4969J2399m1026m022M4994p647l1201O290N2555p305k1320
1994H0877j6860o962j4076K3244P6829q0020m4509J3618L3626m3400N041J7208
1982D4616k9601N2139L0450o1278O240O229L8098l4777J7804k2986J0807k3957
1970C3784J0637K6210m3056L7380J305l2356l3858O994K3822L5590q4913j3391
1958c1852P249P482R701L8048k3394j3636M117J2979j1787P868j6154l7389O8138
1945B1370O211l1949j0557P22J3022J846l4792J5090M0419k0466l264k9567Q987
1932b2928q788N822l9737J6602L2474m4735J9386N0777k1923M191K4231k7008
$$ plain form
1920 -11636 -33618 -59545 -67888 2497 25791 -24752 14965 22172 -24795 -38242 24758 14281
1908 14281 8088 27535 -12426 -32800 -14647 -30106 7827 15833 38674 40715 10831 27888
1896 27888 -18352 -6376 -21131 -30405 14074 -7553 -48713 -57636 -17212 -24520 -9977 -59643
1884 -59643 -46724 -28214 2257 -3013 -18470 14693 -29976 -78491 -30029 661 -4421 -9296
1872 -9296 -27268 -56502 -48787 -15109 -39254 -44036 -63987 -29794 -18270 -11601 -80659 -81481 -40098
1859 -40098 -21227 13458 21940 -14720 6258 -1924 -19514 -7332 -21287 -63502 -53351 -24427
1847 -24427 -1079 15843 46829 30374 14787 -13049 -13280 -29433 -28794 -55229 -40967 37925 49000
1834 49000 -8123 -1487 13185 -904 -19070 -16942 -1322 -42077 -28836 20059 38061 65815
$$ packed form
1920a1636k1982k5927q343P0385K3294n0543L9717P207m6967j3447O3000j0477
1908A4281o193J9447l9961k0374J8153j5459L7933Q006K2841K041k9884J7057
1896B7888m6240J1976j4755r274M4479k1627m1160q923M0424p308J4543m9666
1884e9643J2919J8510L0471n270j5457L3163m4669m8515M8462L0690n082m875
1872i296j7972k9234P715L3678k4145m782j9951L4193J1524O669o9058q22M1383
1859d0098J8871L4685Q482l6660K0978q182j7590J2182j3955m2215J0151K8924
1847b4427K3348J6922L0986j6455j5587k7836k31j6153O39k6435J4262P8892J1075
1834D9000n7123O636J4672j4089j8166K128J5620m0755J3241M8895J8002K7754
$$ plain form
1822 65815 127811 101296 18762 32653 53592 23966 36595 58273 24248 -12795 -2808 -32919
1810 -32919 -29060 -17713 -504 -2584 24961 19866 23615 23579 39272 -5799 -16657 18838 -16052
1797 -16052 -54300 -13437 -17706 19713 44323 7341 -72954 -69984 -23907 -21341 -36507 -37648 -8322
1784 -8322 -7273 -30244 -56101 -28097 -7255 -40391 13955 8984 869 -32084 -73519 -42415 -71912
1771 -71912 -87580 -37122 -4428 8310 -43243 -47919 -24623 -36510 -22659 -31066 20481 -637
1759 -637 -31461 -14713 -18467 -9658 2990 -19430 -8044 -2239 19125 19331 -22433 -12189 -20484
1746 -20484 -28352 -50463 -25258 -8030 4893 -34480 -35495 -32603 -57071 -71517 -68125 -41870 -52361
1733 -52361 -41527 -55611 -53401 -56121 -74964 -93376 -90763 -78858 -11678 -9972 -34305 -33917 -6864
$$ packed form
1822F5815O1996k6515q2534J3891K0939k9626J2629K1678l4025l7043R987l0111
1810c2919L859J1347J7209k080K7545n095L749l6J5693m5071j0858L5495l4890
1797a6052l8248M0863m269L7419K4610l6982q0295K970M6077K566j5166j141K9326
1784h322J049k2971k5857K8004K0842l3136N4346m971q115l2953m1435L1104k9497
1771g1912j5668N0458L2694J2738n1553m676K3296j1887J3851q407N1547k1118
1759f37l0824J6748l754Q809J2648k2420J1386N805K1364K06m1764J0244q295
1746b0484p868k2111K5205J7228J2923l9373j015K892k4468j4446L392K6255j0491
1733e2361J0834j4084K210k720j8843j8412K613J1905O7180J706k4333L88K7053
$$ plain form
1720 -6864 -30975 -51316 -52617 -20797 -25586 -40129 -37587 -32895 -15728 -14441 -9393 -22308 -65646
1707 -65646 -44399 -41688 14694 1703 -10606 -25986 -23811 -51551 -44038 12411 -19447 12999
1695 12999 10903 -17494 -19413 13652 -57977 -27769 -11415 -34099 -93707 -85596 -55429 -2667
1683 -2667 -23050 5249 582 -57410 -26692 -51854 -38892 -40596 -3676 -23966 -11131 -38128
1671 -38128 -1299 -11951 -62258 -35389 21424 23563 43025 9101 -27961 8750 -24614 -56977
1659 -56977 -13383 -51160 -21581 -4890 53232 98777 23450 3447 -22386 3388 48764 7062
1647 7062 -36904 -13081 -35633 -44646 -76075 -8799 -10878 1311 18454 -23333 -4808 2455 -4159
1634 -4159 -36763 -49956 -35935 -15652 -38016 -15661 -27094 -69880 -61786 -63340 -49309 -34917
$$ packed form
1720f864k4111k0341j301L1820m789j4543K542M692J7167J287N048j2915m3338
1707f5646K1247K711N6382j2991j2309j5380K175k7740P513N6449l1858L2446
1695A2999k096k8397j919L3065p1629L0208J6354k2684n9608Q111L0167N2762
1683b667k0383K8299m667n7992L0718k5162J2962j704L6920k0290J2835k6997
1671c8128L6829j0652n0307K6869N6813K139J9462l3924l7062L6711l3364l2363
1659e6977M3594l7777K9579J6691N8122M5545p5327k0003k5833K5774M5376m1702
1647G062m3966K3823k2552r013l1429O7276k079J2189J7143m1787J8525P263o614
1634d159l2604j3193J4021K0283k2364K2355j1433m2786Q094j554J4031J4392
$$ plain form
1622 -34917 -24223 -27724 -67585 -45602 -230 -33215 -26849 -11797 -49575 -5477 -10006 -64027
1610 -64027 -57175 -49490 -1784 -1775 -41689 -44368 -3520 3428 13100 -13142 -19558 -11175 -46017 -13199
1596 -13199 14004 -57557 -46883 -30869 -22255 -10708 -55145 -45625 -73423 -75683 -71188 -59670 -85465
1583 -85465 -88423 -68592 -87604 -47105 -27939 -36386 29706 50456 22554 -5468 -43100 258
1571 258 12945 15010 -63407 -65696 -66323 -31554 12960 -8621 14211 14609 41740 19639 -20487
1558 -20487 -48809 -85300 -41603 -33494 -42287 -3492 -12926 -74359 -48176 -29470 8349 10629 17545
1545 17545 -4722 -24848 -39659 -38440 -48685 -58997 -52423 -63115 -42067 -28230 -94621 -86697
1533 -86697 -78849 -108493 -105733 -123998 -76625 -28109 -62470 -99876 -37817 3556 -31907 -34054
$$ packed form
1622c4917J0694l501l9861K1983M5372l2985O366J5052l7778M4098m529n4021
1610f4027O852P685M7706Rl9914k679M0848O948R672k6242o416Q383l4842L2818
1596a3199K7203p1561J0674J6014Q614J1547m4437R520k7798k260M495J1518k5795
1583h5465k958J9831j9012M0499J9166q447O6092K0750k7902k8022l7632M3358
1571B58J2687K065p8417k289o27L4769M4514k1581K2832L98K7131k2101m0126
1558b0487k8322l6491M3697Q109q793L8795r434o1433K6183J8706L7819K280O916
1545A7545k2267k0126j4811J219j0245j0312O574j0692K1048J3837o6391P924
1533h6697P848k9644K760j8265M7373M8516l4361l7406O2059M1373l5463k147
$$ plain form
1521 -34054 -4490 -45384 -13350 -58820 -46652 2589 -40949 -31050 20139 -16696 -10134 -14422
1509 -14422 31136 -2532 -22850 -2446 10057 -43216 -56954 35142 29261 15758 -23740 -29074
1497 -29074 -18516 -45697 -11414 15685 5001 5167 9506 58570 21073 -5800 21283 -210
1485 -210 -9060 -15953 -19963 -51054 -13500 -49334 -32871 -21659 -9607 -25875 -15643 12160 28660
1472 28660 46712 -35649 -72890 -57921 -44438 -11129 16403 58990 21308 -29592 -41434 5386
1460 5386 -4918 -47676 -57639 -34361 -38747 -70891 -30372 -44379 -9735 -27044 -21730 -74636 -62709
1447 -62709 -44240 -67338 -64022 -55824 -82444 -17356 -14069 -21711 -18198 -5746 6 -49397 -31855
1434 -31855 12771 24011 -17988 -48055 -48200 -68265 -74988 -47950 -86886 -66967 -34477 -89092
$$ packed form
1521c4054K9564m0894L2034m5470J2168M9241m3538R899N1189l6835O562m288
1509a4422M5558l3668k0318K0404J2503n3273j3738R2096n881j3503l9498n334
1497b9074J0558k7181L4283K7099j0684J66M339M9064l7497k6873K7083k1493
1485b10q850o893m010l1091L7554l5834J6463J1212J2052j6268J0232K7803J6500
1472B8660J8052q2361l7241J4969J3483L3309K7532M2587l7682n0900j1842M6820
1460E386j0304m2758r963K3278m386l2144M0519j4007L4644j7309N314n2906J1927
1447f2709J8469k3098L316Q198k6620O5088L287p642L513J2452N752m9403J7542
1434c1855M4626J1240m1999l0067j45k0065o723K7038l8936J9919L2490n4615
$$ plain form
1422 -89092 -61899 -58888 -30949 -9267 4261 49394 17643 20984 10771 2501 -12542 -79438
1410 -79438 -95568 -53647 -20933 -14654 -6354 774 -34171 -39840 -17245 2134 -10576 -8234 -11003
1397 -11003 -61698 -63560 -48989 8314 25679 33113 35318 18302 -58157 -77030 -45009 -48295 -52719
1384 -52719 -30546 -32291 -65582 -30147 -10863 52260 66036 -14264 -38163 -4908 -32314 -69645
1372 -69645 -40819 -17403 -17895 -17143 15400 -8008 31263 33380 4412 -54459 -41020 5526 38730
1359 38730 23306 1500 -10269 -22476 -29394 -49722 2107 -29959 -15207 6151 63439 25980
1347 25980 -664 24734 1125 -68157 -44819 -31373 -52204 -53197 -58472 -77120 -57447 -33730
1335 -33730 -31853 -56840 -40006 -41637 -11952 -19133 -8324 -50686 -77914 -46964 -827 47826
$$ packed form
1422h9092K7193L011K7939K1682J3528M5133l1751L341j0213q270j5043o6896
1410g9438j6130M1921L2714O279Q300P128l4945n669K2595J9379j2710K342k769
1397a1003n0695j862J4571N7303J7365P434K205j7016p6459j8873L2021l286m424
1384e2719K2173j745l3291L5435J9284O3123J3776q0300k3899L3255k7406l7331
1372f9645K8826K3416m92P52L2543k3408L9271K117k8968n8871J3439M6546L3204
1359C8730j5424k1806j1769j2207o918k0328N1829l2066J4752K1358N7288l7459
1347B5980k6644K5398k3609o9282K3338J3446k0831r93n275j8648J9673K3717
1335c3730J877k4987J6834j631K9685p181J0809m2362k7228L0950M6137M8653
$$ plain form
1323 47826 21986 -2181 -26187 -34552 5840 8057 16969 -19490 -6961 -13176 -67637 10600 26930
1310 26930 -10723 -29013 -22280 -2692 16354 3917 29483 -14110 -21122 -15641 -49532 671
1298 671 11822 31556 -21252 391 36230 -15070 -33953 -85031 -55943 -9576 -69614 -67250
1286 -67250 6455 -38106 -63536 -36327 -15193 -11410 -24639 -39041 -27014 -55616 -75174 -75766
1274 -75766 1604 -305 -17696 -12261 8591 -6059 -15213 -6197 -388 4902 10517 -27338 32642
1261 32642 27159 6685 19660 32908 -22325 -48463 -19074 -14896 -35519 -25867 -17698 -29846 -35643
1248 -35643 -27984 -29755 -36538 -74151 -80104 -94129 -94831 -56243 -30673 -66950 -77542 -45459 -25155
1235 -25155 9285 -26330 -3784 -39238 -50708 -47961 -21488 -59151 -68637 -74088 -62692 -18024
$$ packed form
1323D7826k5840k4167k4006q365M0392K217Q912l6459J2529o215n4461P8237J6330
1310B6930l7653j8290O733J9588J9046j2437K5566m3593p012N481l3891N0203
1298F71J1151J9734n2808K1643L5839n1300j8883n1078K9088M6367o0038K364
1286f7250P3705m4561k5430K7209K1134L783j3229j4402J2027k8602j9558n92
1274g5766P7370j909j7391N435K0852j4650r154R016N809N290N615l7855N9980
1261C2642n483k0474J2975J3248n5233k6138K9389M178k0623R652Q169j2148n797
1248c5643P659j771o783l7613n953j4025p02L8588K5570l6277j0592L2083K0304
1235b5155L4440l5615K2546l5454j1470K747K6473l7663r486n451J1396M4668
$$ plain form
1223 -18024 -50862 -58836 -63102 -48419 685 -33209 9820 12139 -33877 -42902 -12296 -10221 12831
1210 12831 3359 -11490 27038 -4453 -30405 19936 -2058 -8264 -21901 -41863 -59697 -26944
1198 -26944 -20621 26134 65195 32896 17608 23002 11479 -42910 18036 6580 -27444 -36493
1186 -36493 -57116 1771 15621 -3643 35994 -5414 -17655 -32417 9680 923 -2378 -23987
1174 -23987 -63484 -48630 -53517 5211 65657 53021 1044 19574 -95 35802 62067 51121
1162 51121 72983 59460 7189 4435 16248 59260 46990 -9003 -25909 217 28831 11440
1150 11440 12658 11782 6643 41236 7188 -41354 -1358 64009 27335 25036 12838 -32572 -43176
1137 -43176 -29302 -46625 -5553 40870 6328 20028 -23098 -21554 -25361 -32497 -24110 8572 34961
$$ packed form
1223a8024l2838p974m266J4683M9104l3894M3029K319m6016r025L0606K075K3052
1210A2831r472j4849L8528l1491k5952N0341k1994o206j3637j9962j7834L2753
1198b6944O323M6755L9061l2299j5288N394j1523n4389O0946j1456l4024r049
1186c6493k0623N8887J3850j9264L9637m1408j2241j4762M2097q757l301k1609
1174b3987l9497J4854m887N8728O0446j2636n1977J8530j9669L5897K6265j0946
1162E1121K1862j3523n2271k754J1813M3012j2270n5993j6906K6126K8614j7391
1150A1440J218q76n139L4593l4048m8542L9996O5367l6674k299j2198m5410j0604
1137d3176J3874j7323M1072M6423l4542J3700m3126J544l807p136Q387L2682K6389
$$ plain form
1124 34961 2459 17270 33314 44814 -10207 -15610 -3185 -58436 -59970 -35345 -30463 -45756
1112 -45756 -11583 13657 64072 18741 -26571 768 12453 -7024 -45699 -69397 15452 -21412
1100 -21412 -35974 -18017 32372 12641 -33469 -15995 -20525 3286 5122 46925 24228 9420
1088 9420 -8848 3420 29417 -11050 16900 15963 28090 63071 71920 63201 15073 10211 -1876
1075 -1876 8214 32501 20746 59326 53373 -21392 9239 11406 9176 24571 -21028 -45015 -15054
1062 -15054 20995 45561 25438 6191 -2461 -28693 12052 -17903 -15063 4517 -45253 -36220
1050 -36220 -32463 -6029 -24273 -5740 7907 -46967 -8736 -39630 -81720 -12791 -48487 -52272
1038 -52272 -10872 -36187 -32826 -26196 25922 27457 32012 18383 13588 -6483 33957 7083 -39567
$$ packed form
1124C4961l2502J4811J6044J1500n5021n403J2425n5251j534K4625M882j5293
1112d5756L4173K5240N0415m5331m5312K7339J1685j9477l8675k3698Q4849l6864
1100b1412j4562J7957N0389j9731m6110J7474m530K3811J836M1803k2697j4808
1088I420j8268J2268K5997m0467K7950r37J2127L4981Q849q719m8128m862j2087
1075a876J0090K4287j1755L8580n953p4765L0631K167k230J5395m5599k3987K9961
1062a5054L6049K4566k0123j9247q652k6232M0745k9955K840J9580m9770R033
1050c6220L757K6434j8244J8533J3647n4874L8231l0894m2090O8929l5696l785
1038e2272M1400k5315L361O630N2118J535M555j3629m795k0071M0440k6874m6650
$$ plain form
1025 -39567 -39911 -23344 25315 20900 25572 22320 4697 -16129 -7308 -32827 -29832 -75808 -105439
1012 -105439 -36638 30037 34417 34866 1968 -7790 -50752 -25239 5540 -31273 -45010 -64617
1000 -64617 -34844 21384 15538 12711 -17954 -2741 -50451 -33195 -37018 -36050 -23 -14592 -10151
987 -10151 10847 30953 -14391 18109 31572 58518 19422 2366 41193 28336 29638 49205
975 49205 36235 -7370 -28331 44103 3629 -9555 3552 -20340 -36858 -24220 7623 6458
963 6458 84421 80547 26194 15094 -33645 -60729 -27820 -19009 11254 35022 -911 -20186 -50582
950 -50582 -10743 25971 -10214 -9995 51643 14426 -31853 21879 46053 33386 32052 31623 5902
937 5902 -15491 -48247 -7466 16808 18764 -7206 25222 34396 6383 23893 20547 11251 -11934
$$ packed form
1025c9567l44J6567M8659m415M672l252j7623k0826Q821k5519K995m5976k9631
1012a05439O8801O6675M380M49l2898r758m2962K5513L0779l6813j3737j9607
1000f4617K9773N6228n846k827l0665J5213m7710J7256l823R68L6027j4569M441
987a0151K0998K0106m5344L2500J3463K6946l9096j7056L8827j2857J302J9567
975D9205j2970m3605k0961P2434m0474j3184J3107k3892j6518J2638L1843j165
963F458P7963l874n4353j1100m8739k7084L2909Q811L0263K3768l5933j9275l0396
950e0582L9839L6714l6185K19O1638l7217m6279N3732K4174j2667j334m29k5721
937E902k1393l2756M0781K4274J956k5970L2428R174k8013J7510l346r296k3185
$$ plain form
924 -11934 -39045 -5722 25293 13637 38119 69839 73801 70891 50274 28907 9607 13196 15829
911 15829 -23104 -21979 -12449 -4548 30950 33383 32565 -73514 -55367 48772 46855 -30452 -36342
898 -36342 -29975 -12487 -34924 -56350 -21366 -3161 -12318 29367 57936 47175 22650 -8263
886 -8263 -1663 -12149 -26120 -68573 -30338 26922 57895 20924 70757 15991 24535 50105 87730
873 87730 100149 61055 24366 3106 32008 -15048 -47482 -17541 19916 45310 45748 25749
861 25749 9637 -13048 -15449 26114 32233 54225 7056 -39478 -39220 -22433 14321 -11073 -25898
848 -25898 10180 36714 -1477 13395 -2257 15075 326 -49960 -5650 -5911 9015 -12790
836 -12790 -48059 -1299 20194 1841 -21589 -46236 -18754 -9729 -55064 -46467 -4438 19935
$$ packed form
924a1934k7111L3323L1015j1656K4482L1720L962k910k0617k1367j9300L589K633
911A5829l8933J125R530P901L5498K433q18j06079J8147J04139j917p7307n890
898c6342O367J7488k2437k1426L4984J8205r157M1685K8569j0761k4525l0913
886h263O600j0486j3971m2453L8235N7260L0973l6971M9833n4766Q544K5570L7625
873H7730J2419l9094l6689k1260K8902m7056l2434K9941L7457K5394M38j9999
861B5749j6112k2685k401M1563O119K1992m7169m6534K58J6787L6754k5394j4825
848b5898L6078K6534l8191J4872j5652J7332j4749n0286M4310k61J4926k1805
836a2790l5269M6760K1493j8353k3430k4647K7482R025m5335Q597M2029K4373
$$ plain form
824 19935 -9118 -40180 -1441 -15957 30443 52185 58169 31215 15496 43988 26204 27712
812 27712 41351 35645 -1415 15713 -6642 -39305 -54685 -9042 27213 -16800 -29081 -9332
800 -9332 24170 33078 3191 4102 6877 -12457 13727 32124 6791 -36640 -42882 18902 11930
787 11930 -13895 -7374 2480 15064 9892 40355 661 -58798 7381 43091 14824 33207 21135
774 21135 -27941 -1363 -8645 18337 22770 34836 35145 8988 -4421 9953 51242 70118 78299
761 78299 65478 7407 22317 -435 8969 12840 26761 31420 15399 13849 -32613 -29898 -25878
748 -25878 -11973 -10918 28970 -1787 -40360 -7592 -4664 -3478 -28446 -75483 -78168 -47297 -8398
735 -8398 -38854 -28900 -47567 -27020 28612 -24270 -27526 -17695 16061 46523 -6377 -16982 36758
$$ packed form
824A9935k9053l1062L8739j4516M6400K1742N984k6954j5719K8492j7784J508
812B7712J3639n706l7060J7128k2355l2663j5380M5643L6255m4013j2281J9749
800i332L3502Q908k9887R11K775j9334K6184J8397k5333m3431o242O1784o972
787A1930k5825O521R854J2584n172L0463l9694n9459O6179L5710k8267J8383j2072
774B1135m9076K6578p282K6982M433J2066L09k6157j3409J4374M1289J8876Q181
761G8299j2821n8071J4910k2752R404L871J3921M659j6021j550m6462K715M020
748b5878J3905J055L9888l0757l8573L2768K928J186k4968m7037k685L0871L8899
735h398l0456R954j8667K0547N5632n2882l256R831L3756L0462n2900j0605N3740
$$ plain form
722 36758 36452 4 12612 39208 22689 27194 9076 15058 25609 66599 81927 9830 -7812
709 -7812 -23020 8875 13619 -14968 -19424 -27989 -5487 11872 -7193 -24710 9963 56304 104765
696 104765 58892 66489 86897 52297 44200 64103 -4382 -24639 -8608 20857 26601 32708 31822
683 31822 6108 26984 16544 26290 53271 53646 -5981 9833 3388 -4794 -25851 14822 38631
$$ packed form
722C6758l06l6448J2608K6596j6519M505j8118N982J0551M0990J5328p2097j7642
709g812j5208L1895M744k8587m456q565K2502J7359j9065j7517L4673M6341M8461
696A04765m5873P597K0408l4600q097J9903o8485k0257J6031K9465N744O107q86
683C1822k5714K0876j0440R746K6981L75n9627J5814o445q182k1057M0673K3809
$$ [...]
##END NTUPLES=NMR SPECTRUM
##END=
