##TITLE=1H_TG-2340-VI
 CDCl3
 8 sc, 
 18.5.2023
##JCAMPDX= 6.0         $$ Bruker NMR JCAMP-DX V2.0
##DATA TYPE= NMR SPECTRUM
##DATA CLASS= NTUPLES
##ORIGIN= UXNMR, Bruker Analytische Messtechnik GmbH
##OWNER= root
$$ XWIN-NMR		Version 3.5
$$ Thu May 18 14:03:29 2023 Russian Standard Time (UT+4h)  she@DPX200
##.OBSERVE FREQUENCY= 200.13135
##.OBSERVE NUCLEUS= ^1H
##.ACQUISITION MODE= SIMULTANEOUS
##.ACQUISITION SCHEME= undefined
##.AVERAGES= 8
##.DIGITISER RES= 18
##SPECTROMETER/DATA SYSTEM= spect
##.PULSE SEQUENCE= zg30
##.SOLVENT NAME= CDCl3
##.SHIFT REFERENCE= (INTERNAL, CDCl3, 0, 15.7458)
##AUDIT TRAIL= $$ (NUMBER, WHEN, WHO, WHERE, WHAT)
$$ ##TITLE= Audit trail, XWIN-NMR		Version 3.5
$$ ##JCAMPDX= 5.01
$$ ##ORIGIN= Bruker BioSpin GmbH
$$ ##OWNER= she
$$ F:/spectra/data/she/nmr/H-F/1/pdata/1/auditp.txt
$$ ##AUDIT TRAIL=  $$ (NUMBER, WHEN, WHO, WHERE, WHAT)
(   1,<2023-05-18 14:01:54.18 +0400>,<she>,<DPX200>,
      <created by zg, POWCHK disabled, PULCHK disabled
       configuration hash MD5:
       00 E9 B6 7A A2 85 ED C7 34 08 36 98 17 FE 4E 26
       data hash MD5: 16K
       7B C4 17 F5 21 F4 47 D3 6C BB 0A 0E 93 41 66 F5>)
(   2,<2023-05-18 14:02:18.48 +0400>,<she>,<DPX200>,
      <Start of raw data processing
       efp BC_mod = 2 LB = 0.24 FT_mod = 6 PKNL = 1 PHC0 = -19905.26 PHC1 = 18.85272 SI = 16K 
       data hash MD5: 16K
       91 2F B1 45 37 C3 73 E7 32 B4 C0 1F B5 D3 D7 7B>)
(   3,<2023-05-18 14:02:41.98 +0400>,<she>,<DPX200>,
      <pk PHC0 = 7.55552 PHC1 = -12.4 
       data hash MD5: 16K
       99 54 C0 32 07 67 AC 2B F2 CA 61 4C 71 12 FE 9C>)
(   4,<2023-05-18 14:02:45.40 +0400>,<she>,<DPX200>,
      <abs ABSG = 5 
       data hash MD5: 16K
       7D 7F A0 5E 23 AD FD AC AA 04 48 48 64 19 28 2F>)
$$ ##END=
$$ 
$$ hash MD5
$$ 86 1C 32 99 00 6D DD C8 20 CB DA CA AE 01 E1 E5
##$RELAX= 
##$RELAX= 
##$RELAX= 
##$RELAX= 
##$RELAX= 
##$RELAX= 
$$ Bruker specific parameters
$$ --------------------------
##$DU= <F:/spectra>
##$EXPNO= 1
##$NAME= <H-F>
##$PROCNO= 1
##$TYPE= <nmr>
##$USER= <she>
##$AMP= (0..31)
100 100 100 100 100 100 100 100 100 100 100 100 100 100 100 100 100 100 
100 100 100 100 100 100 100 100 100 100 100 100 100 100 
##$AQSEQ= 0
##$AQ_mod= 1
##$AUNM= <au_zg>
##$AUTOPOS= <>
##$BF1= 200.13
##$BF2= 200.13
##$BF3= 200.13
##$BF4= 200.13
##$BF5= 200.13
##$BF6= 200.13
##$BF7= 200.13
##$BF8= 200.13
##$BYTORDA= 1
##$CFDGTYP= 0
##$CFRGTYP= 5
##$CHEMSTR= <none>
##$CNST= (0..31)
1 1 145 1 1 1 1 1 1 1 1 1 1 1 1 1 1 1 1 1 1 1 1 1 1 1 1 1 1 1 1 1 
##$CPDPRG= <>
##$CPDPRG1= <>
##$CPDPRG2= <>
##$CPDPRG3= <>
##$CPDPRG4= <mlev>
##$CPDPRG5= <mlev>
##$CPDPRG6= <mlev>
##$CPDPRG7= <mlev>
##$CPDPRG8= <mlev>
##$CPDPRGB= <>
##$CPDPRGT= <>
##$D= (0..31)
0 1.2 0 0 0 0 0 0 0 0.06 0 0.03 0 0 0 0 0.0002 0 0 0 0 0 0 0 0 0 0 0 0 
0 0 0 
##$DATE= 1684404113
##$DBL= (0..7)
120 120 120 120 120 120 120 120 
##$DBP= (0..7)
150 150 150 150 150 150 150 150 
##$DBP07= 0
##$DBPNAM0= <>
##$DBPNAM1= <>
##$DBPNAM2= <>
##$DBPNAM3= <>
##$DBPNAM4= <>
$$ [...]
##$SUBNAM3= <"">
##$SUBNAM4= <"">
##$SUBNAM5= <"">
##$SUBNAM6= <"">
##$SUBNAM7= <"">
##$SUBNAM8= <"">
##$SUBNAM9= <"">
##$SW= 18.05172834244
##$SWIBOX= (0..15)
0 0 2 0 0 0 0 0 0 0 0 0 0 0 0 0 
##$SW_h= 3612.71676300578
##$TD= 16384
##$TD0= 1
##$TE= 0
##$TE2= 300
##$TE3= 300
##$TEG= 300
##$TL= (0..7)
0 120 120 120 120 120 120 120 
##$TP= (0..7)
150 150 150 150 150 150 150 150 
##$TP07= 0
##$TPNAME0= <>
##$TPNAME1= <>
##$TPNAME2= <>
##$TPNAME3= <>
##$TPNAME4= <>
##$TPNAME5= <>
##$TPNAME6= <>
##$TPNAME7= <>
##$TPOAL= (0..7)
0.5 0.5 0.5 0.5 0.5 0.5 0.5 0.5 
##$TPOFFS= (0..7)
0 0 0 0 0 0 0 0 
##$TUNHIN= 0
##$TUNHOUT= 0
##$TUNXOUT= 0
##$USERA1= <user>
##$USERA2= <user>
##$USERA3= <user>
##$USERA4= <user>
##$USERA5= <user>
##$V9= 5
##$VALIST= <valist>
##$VCLIST= <CCCCCCCCCCCCCCC>
##$VD= 0
##$VDLIST= <DDDDDDDDDDDDDDD>
##$VPLIST= <PPPPPPPPPPPPPPP>
##$VTLIST= <TTTTTTTTTTTTTTT>
##$WBST= 1024
##$WBSW= 4
##$XGAIN= (0..3)
0 0 0 0 
##$XL= 0
##$YL= 0
##$YMAX_a= 320647
##$YMIN_a= -351377
##$ZGOPTNS= <>
##$ZL1= 120
##$ZL2= 120
##$ZL3= 120
##$ZL4= 120
##$ABSF1= 15.74909
##$ABSF2= -2.302759
##$ABSG= 5
##$ABSL= 3
##$ALPHA= 0
##$AQORDER= 0
##$ASSFAC= 0
##$ASSFACI= 0
##$ASSFACX= 0
##$ASSWID= 0
##$AUNMP= <proc_1d>
##$AZFE= 0.1
##$AZFW= 0.1
##$BCFW= 0
##$BC_mod= 2
##$BYTORDP= 0
##$COROFFS= 0
##$CY= -3
##$DATMOD= 1
##$DC= 0
##$DFILT= <>
##$DTYPP= 0
##$F1P= 0
##$F2P= 0
##$FCOR= 1
##$FTSIZE= 16384
##$FT_mod= 6
##$GAMMA= 0
##$GB= 0
##$INTBC= 1
##$INTSCL= 3.70164e-10
##$ISEN= 128
##$LB= 0.24
##$LEV0= 0
##$LPBIN= 0
##$MAXI= 10000
##$MC2= 0
##$MEAN= 0
##$ME_mod= 0
##$MI= 1.114404
##$NCOEF= 0
##$NC_proc= -6
##$NLEV= 6
##$NOISF1= 3.799351
##$NOISF2= 2.8
##$NSP= 0
##$NTH_PI= 0
##$NZP= 0
##$OFFSET= 15.74579
##$PC= 1
##$PHC0= -19897.71
##$PHC1= 6.452721
##$PH_mod= 1
##$PKNL= yes
##$PPARMOD= 0
##$PSCAL= 0
##$PSIGN= 0
##$REVERSE= no
##$SF= 200.130005154115
##$SI= 16384
##$SIGF1= 3
##$SIGF2= 2
##$SINO= 5.538805
##$SIOLD= 16384
##$SREGLST= <1H.CDCl3>
##$SSB= 0
##$STSI= 16384
##$STSR= 0
##$SW_p= 3612.71676300578
##$SYMM= 0
##$S_DEV= 0
##$TDeff= 16384
##$TDoff= 0
##$TI= <>
##$TILT= no
##$TM1= 0
##$TM2= 0
##$TOPLEV= 0
##$USERP1= <user>
##$USERP2= <user>
##$USERP3= <user>
##$USERP4= <user>
##$USERP5= <user>
##$WDW= 1
##$XDIM= 16384
##$YMAX_p= 535280355
##$YMIN_p= -806851
$$ End of Bruker specific parameters
$$ ---------------------------------
##NTUPLES= NMR SPECTRUM
##VAR_NAME=  FREQUENCY,     SPECTRUM/REAL,   SPECTRUM/IMAG
##SYMBOL=    X,             R,               I
##VAR_TYPE=  INDEPENDENT,   DEPENDENT,       DEPENDENT
##VAR_FORM=  AFFN,          ASDF,            ASDF
##VAR_DIM=   16384,         16384,           16384
##UNITS=     HZ,            ARBITRARY UNITS, ARBITRARY UNITS
##FACTOR=    0.220516191357247, 1,           1
##FIRST=     3151.20493937285, 0,            0
##LAST=      -461.511823632931, 0,           0
##MIN=       -461.511823632931, -806851,     0
##MAX=       3151.20493937285, 535280355,    0
$$ Real data points
##PAGE= N=1
##DATA TABLE= (X++(R..R)), XYDATA
$$ [...]
$$ plain form
7030 3744877 3654375 3573374 3404861 3184937 2982354 2798596 2792940 2682386 2540895 2455850
7020 2455850 2358307 2300957 2215266 2207169 2256508 2249473 2178877 2230977 2234419 2224369 2161107 2181349
7008 2181349 2232244 2221745 2204620 2176191 2078146 2118058 2160895 2138061 2112540 2178474 2106528
6997 2106528 2087779 2104624 2188638 2204294 2295981 2265900 2304627 2533989 2654074 2841631 3084547
6986 3084547 3370620 3624473 3907197 4041908 4053995 3881178 3666140 3387782 2938044 2521365
6976 2521365 2236331 1948215 1697731 1683375 1603043 1556079 1527365 1482659 1481909 1434108 1404375
6965 1404375 1362087 1377266 1325412 1313430 1281351 1231393 1220794 1126523 1029344 996602 925409
6954 925409 986179 986495 995726 940735 901449 871464 876895 960378 979309 908557 831385 752752
$$ packed form
7030C744877r0502q1001j68513k19924k02583j83758n656j10554j41491q5045
7020B455850r7543n7350q5691q097M9339p035p0596N2100L442j0050o3262K0242
7008B181349N0895j0499j7125k8429r8045L9912M2837k2834k5521O5934p1946
6997B106528j8749J6845Q4014J5656R1687l0081L8727K29362J20085J87557K42916
6986C084547K86073K53853K82724J34711J2087j72817k15038k78358m49738m16679
6976B521365k85034k88116k50484j4356q0332m6964k8714m4706p50m7801k9733
6965A404375m2288J5179n1854j1982l2079m9958j0599r4271r7179l2742p1193
6954I25409O0770L16R231n4991l9286k9985N431Q3483J8931p0752p7172p8633
$$ plain form
6942 752752 914401 1016830 931798 863539 887879 857398 885657 929377 827444 809960 807025
6931 807025 758011 711776 698605 639232 548570 615449 561479 567014 602378 621253 552377 684486
6919 684486 750476 583983 564965 454762 435988 399512 430325 479383 440060 450159 445575
6908 445575 377655 389305 372152 431495 403252 476266 400368 421613 353124 179065 252680
6897 252680 322326 290912 273436 275612 365531 341603 317946 230520 208080 203414 300995 350268
6885 350268 294275 374669 358024 262071 189975 215875 169529 257693 223408 176762 226709 310359
6873 310359 234235 170036 105108 62651 145607 256101 281975 196426 225473 279416 320336
6862 320336 276298 308702 313765 255340 149615 230181 224390 169393 258742 353817 280896 192152
$$ packed form
6942G52752J61649J02429q5032o8259K4340l0481K8259M3720j01933j7484k935
6931H07025m9014m6235j3171n9373r0662O6879n3970N535L5364J8875o8876J32109
6919F84486O5990j66493j9018j10203j8774l6476L0813M9058l9323J0099m584
6908D45575o7920J1650j7153N9343k8243P3014p5898K1245o8489j74059P3615
6897B52680O9646l1414j7476K176Q9919k3928k3657q7426k2440m666R7581M9273
6885C50268n5993Q0394j6645r5953p2096K5900m6346Q8164l4285m6646M9947Q3650
6873C10359p6124o4199o4928m2457Q2956J10494K5874q5549K9047N3943M0920
6862C20336m4038L2404N063n8425j05725Q0566n791n4997Q9349R5075p2921q8744
$$ plain form
6850 192152 273205 338424 210300 221265 275784 225662 304661 328237 285189 246911 289993
6839 289993 290922 276590 266842 303987 277610 332895 389231 139894 123927 189946 201892 236861
6827 236861 176878 203097 272929 280922 237855 238734 214928 204590 273552 122631 111196 153970
6815 153970 234005 232883 97797 205633 227851 166329 129796 222371 261132 144748 177039
6804 177039 213690 144549 157018 22571 103679 108258 94512 128639 105181 13654 133811
6793 133811 186738 159642 231534 274659 257746 175567 70338 83538 190722 321584 301296
6782 301296 332191 342901 230803 211733 217578 169273 232873 157092 141599 165202 177810 120740
6770 120740 86289 39813 37097 154228 230871 228231 176695 193151 163625 209989 180799 157621
$$ packed form
6850A92152Q1053O5219j28124J0965N4519n0122P8999K3576m3048l8278M3082
6839B89993R29j4332r748L7145k6377N5285N6336k49337j5967O6019J1946L4969
6827B36861n9983K6219O9832P993m3067Q79k3806j0338O8962j50921j1435M2774
6815A53970Q0035j122j35086J07836K2218o1522l6533R2575L8761j16384L2291
6804A77039L6651o9141J2469j34447Q1108M579j3746L4127k3458r1527J20157
6793A33811N2927k7096P1892M3125j6913q2179j05229J3200J07184J30862k0288
6782C01296L0895J0710j12098j9070N845m8305O3600p5781j5493K3603J2608n7070
6770A20740l4451m6476k716J17131P6643k640n1536J6456k9526M6364k9190k3178
$$ plain form
6758 157621 192527 119720 43815 104587 91254 79763 85688 86817 73803 86398 78459 40306
6746 40306 20827 81987 96287 67960 18410 -20350 -63809 -50876 -4232 54397 120654 82626
6734 82626 74765 90796 74155 37016 172920 240166 110819 177122 37193 50493 87355
6723 87355 103240 63223 53480 -1161 126245 137744 90918 190676 237890 233735 219940 212777
6711 212777 293754 317320 339842 404047 297564 410497 514140 615552 713425 718999 762940
6700 762940 826971 795681 735832 626209 566484 445031 293516 235810 157146 169970 197038
6689 197038 218765 108029 90053 158531 206326 165125 41518 41059 -21294 7702 64557 54214
6677 54214 -51992 -84368 -7125 40856 -13697 57209 14072 11340 -17636 58711 97790 63546
$$ packed form
6758A57621L4906p2807p5905O0772j3333j1491N925J129j3014J2595p939l8153
6746D0306j9479O1160J4300k8327m9550l8760m3459J2933M6644N8629O6257l8028
6734H2626p861J6031j6641l7139J35904O7246j29347O6303j39929J3300L6862
6723H7355J5885m0017r743n4641J27406J1499m6826R9758M7214m155j3795p163
6711B12777Q0977K3566K2522O4205j06483J12933J03643J01412R7873N574M3941
6700G62940O4031l1290n9849j09623n9725j21453j51515n7706p8664J2824K7068
6689A97038K1727j10736j7976O8478M7795m1201j23607m59o2353K8996N6855j0343
6677E4214j06206l2376P7243M7981n4553P0906m3137k732k8976P6347L9079l4244
$$ plain form
6665 63546 194 -107069 7024 19219 5998 78024 73643 105986 119699 47380 99588 110758
6653 110758 50403 50730 102704 58113 118300 57823 -43608 -54127 107520 176403 159002 170338
6641 170338 156350 81248 47879 77807 84343 -29599 -5291 76416 105348 61795 22920 30442
6629 30442 33606 4528 71517 99245 -12826 -16547 -1050 61096 37114 -2149 110592 153000
6617 153000 200523 17547 132 -49411 70914 96699 776 60309 33778 123902 31879
6606 31879 34447 39678 -10700 811 121148 53745 -19520 40668 11006 9307 -1654 -46381
6594 -46381 59436 25747 47471 105121 174546 104384 112333 60048 113913 90806 30955 49372
6582 49372 161107 30136 70313 168338 243866 209256 123885 106799 77826 71295 139673 217729
$$ packed form
6665F3546o3352j07263J14093J2195j3221P2026m381L2343J3713p2319N2208J1170
6653A10758o0355L27N1974m4591O0187o0477j01431j0519J61647O8883j7401J1336
6641A70338j3988p5102l3369K9928O536j13942K4308Q1707K8932m3553l8875P522
6629C0442L164k9078O6989K7728j12071l721J5497O2146k3982l9263J12741M2408
6617A53000M7523j82976j7415m9543J20325K5785r5923N9533k6531R0124r2023
6606C1879K568N231n0378J1511J20337o7403p3265O0188k9662j699j0961m4727
6594d6381J05817l3689K1724N7650O9425p0162P949n2285N3865k3107n9851J8417
6582D9372J11735j30971M0177R8025P5528l4610q5371j7086k8973o531O8378P8056
$$ plain form
6570 217729 172506 105759 41709 101119 137943 36858 -32524 79468 155798 61579 102018
6559 102018 67504 -29767 -34611 180935 174753 137045 125587 60956 22384 48543 177412 220362
6547 220362 195556 226083 256580 191305 263486 225116 168732 112620 183843 184521 288539 275589
6535 275589 281211 326899 371496 241476 206911 150990 46613 51508 58946 85750 82593 207236
6523 207236 293530 233710 193038 247485 182040 123040 110244 73751 124317 201330 179757 86890
6511 86890 103083 114713 186177 119154 76908 4016 32343 -32638 -77665 41340 111151 107935
6499 107935 136868 140438 186832 205783 180219 248533 273888 273388 222920 205961 155844 61096
6487 61096 106790 138857 125975 204009 134156 211439 225682 89698 141133 192184 302936
$$ packed form
6570B17729m5223o6747o4050N9410L6824j01085o9382J11992P6330r4219M0439
6559A02018l4514r7271m844K15546o182l7708j1458o4631l8572K6159J28869M2950
6547B20362k4806L0527L0497o5275P2181l8370n6384n6112P1223O78J04018j2950
6535B75589N622M5688M4597j30020l4565n5921j04377M895P438K6804l157J24643
6523B07236Q6294n9820m0672N4447o5445n9000j2796l6493N0566P7013k1573r2867
6511H6890J6193J1630P1464o7023m2246p2892K8327o4981m5027J19005O9811l216
6499A07935K8933L570M6394J8951k5564O8314K5355n00n0468j6959n0117r4748
6487F1096M5694L2067j2882P8034o9853P7283J4243j35984N1435N1051J10752
$$ plain form
6476 302936 318323 317143 306376 334257 193739 151141 128939 256607 284174 252273 213576
6465 213576 118773 127813 165988 126983 100761 176441 295596 332696 214430 211552 166036 159391
6453 159391 171598 200533 238923 254083 303550 328526 155622 123271 256672 230299 170679
6442 170679 129168 146312 103293 202053 287751 261347 304320 267681 224884 145912 242748 248132
6430 248132 178611 202059 172514 133966 199730 259681 339817 419033 370881 405559 422039 348466
6418 348466 388286 343704 335472 349802 371732 389588 335938 398058 485075 430377 383039 344877
6406 344877 344201 383641 470488 439775 399091 412696 418971 445026 478074 478689 646953 627517
6394 627517 496656 416814 484967 444214 443794 435323 548846 456913 409420 565347 614890 612539
$$ packed form
6476C02936J5387j180j0767K7881j40518m2598k2202J27668K7567l1901l8697
6465B13576r4803R040L8175l9005k6222P5680J19155L7100j18266k878m5516o645
6453A59391J2207K8935L8390J5160M9467K4976j72904l2351J33401k6373n9620
6442A70679m1511J7144m3019R8760Q5698k6404M2973l6639m2797p8972R6836N384
6430B48132o9521K3448k9545l8548O5764N9951Q0136P9216m8152L4678J6480p3573
6418C48466L9820m4582q232J4330K1930J7856n3650O2120Q7017n4698m7338l8162
6406C44877o76L9440Q6847l0713m0684J3605O275K6055L3048O15J68264j9436
6394F27517j30861p9842O8153m0753m20q471J13523r1933m7493J55927M9543k351
$$ plain form
6382 612539 566698 494928 488390 467458 426502 429624 382550 326026 333678 342659 403058 507712
6370 507712 439646 374516 385994 414578 490417 485068 455401 475922 468151 402527 352971 354357
6358 354357 352488 426164 438913 397727 419514 426588 476859 592038 581200 626712 675451 769046
6346 769046 776005 580667 566483 661034 607714 635539 683119 616074 594924 666710 635689 588399
6334 588399 614287 784406 806447 812867 672625 599108 541897 526687 509654 553531 552517 553992
6322 553992 618755 592586 594407 598022 585967 570982 569450 547152 553202 465376 393548 439792
6310 439792 506815 529991 525715 553780 541608 589516 564029 546759 537530 588408 715804 628790
6298 628790 609706 620533 644351 659583 629155 613890 625892 652293 514221 490932 521772
$$ packed form
6382F12539m5841p1770o538k0932m0956L122m7074n6524P652Q981O0399J04654
6370E07712o8066o5130J1478K8584P5839n349k9667K0521p771o5624m9556J386
6358C54357j869P3676J2749m1186K1787P074N0271J15179j0838M5512M8739R3595
6346G69046O959j95338j4184R4551n3320K7825M7580o7045k1150P1786l1021m7290
6334E88399K5888J70119K2041O420j40242p3517n7211j5210j7033M3877j014J475
6322E53992O4763k6169J821L615j2055j4985j532k2298O050q7826p1828M6244
6310D39792O7023K3176m276K8065j2172M7908k5487j7270r229N0878J27396q7014
6298F28790j9084J0827K3818J5232l0428j5265J2002K6401j38072k3289L0840
$$ plain form
6287 521772 545819 518980 561821 600725 611959 642923 551495 566662 514538 625562 767512
6276 767512 651313 570562 614159 616684 571099 729333 724728 697894 821919 752275 754530 763925
6264 763925 696228 723610 709875 718668 662013 681563 753131 813368 838903 905247 779059 728042
6252 728042 710228 619179 706190 730196 781513 816931 895491 912884 870088 883925 968502 943778
6240 943778 924412 849521 794600 886255 911677 905742 865577 778510 881986 880306 884124 879454
6228 879454 940854 976999 829924 893464 1026550 962002 876020 898082 911458 1026707 923757
6217 923757 901339 900385 842448 925251 896752 933639 971923 885013 864391 977896 1015501 1031345
6205 1031345 1017009 1000177 1027002 1008833 1014105 1006723 1071057 987557 1020122 1069277 987073 981260
$$ packed form
6287E21772K4047k6839M2841L8904J1234L0964r1428J5167n2124J11024J41950
6276G67512j16199q0751M3597K525m5585J58234m605k6834J24025o9644K255R395
6264G63925o7697K7382j3735Q793n6655J9550P1568O0237K5535O6344j26188n1017
6252G28042j7814r1049Q7011K4006N1317L5418P8560J7393m2796J3837Q4577k4724
6240I43778j9366p4891n4921R1655K5422n935m0165q7067J03476j680L818m670
6228H79454O1400L6145j47075O3540J33086o4548q5982K2062J3376J15249j02950
6217I23757k2418r54n7937Q2803k8499L6887L8284q6910k0622J13505L7605J5844
6205A031345j4336j6832K6825j8169N272p382O4334q3500L2565M9155q2204n813
$$ plain form
6193 981260 1020961 1062344 1038580 1082767 1006813 1003420 1008509 1011262 970848 1067315 1036055 1138544
6181 1138544 1183637 1181224 1140766 1078553 1197711 1252292 1418242 1342586 1321907 1390977 1461205
6170 1461205 1462767 1390636 1436558 1401539 1369864 1360482 1474176 1500964 1488451 1496659 1578230 1595895
6158 1595895 1697398 1703505 1754184 1809357 1807535 1812396 1925817 1944830 1918118 1988484 2052150 2132333
6146 2132333 2168318 2233116 2172303 2242506 2289279 2430446 2481576 2422418 2523973 2625353 2665792
6135 2665792 2723711 2815923 2863749 2893809 3011934 3082357 3102845 3113263 3272643 3366276 3326363
6124 3326363 3284703 3462979 3489163 3552055 3617080 3729004 3774139 3760176 3821044 3956597 4102686
6113 4102686 4197417 4311357 4356820 4501710 4639597 4760740 4940466 5069170 5316052 5543789
$$ packed form
6193I81260L9701M1383k3764M4187p5954l393N089K753m0414R6467l1260J02489
6181A138544M5093k413m0458o2213J19158N4581J65950p5656k0679O9070P0228
6170A461205J562p2131M5922l5019l1675r382J13694K6788j2513Q208Q1571J7665
6158A595895J01503O107N0679N5173j822M861J13421J9013k6712P0366O3666Q0183
6146B132333L5985O4798o0813P0203M6773J41167N1130n9158J01555J01380M0439
6135B665792N7919R2212M7826L0060J18125P0423K0488J0418J59380R3633l9913
6124C326363m1660J78276K6184O2892O5025J11924M5135j3963O0868J35553J46089
6113D102686R4731J13940M5463J44890J37887J21143J79726J28704K46882K27737
$$ plain form
6103 5543789 5601239 5832571 5966226 6151135 6379135 6540772 6766445 7015570 7227835 7323252
6093 7323252 7476968 7819542 8152462 8470323 8676574 8991917 9329668 9790668 10251066 10631779
6083 10631779 11163796 11860582 12624468 13425820 14371179 15499744 16787028 18376605 20289091
6074 20289091 22678347 25881721 29690743 33912654 38290894 42318853 44833993 45098162
6066 45098162 42767857 38825580 35095934 32676949 31978646 32687315 34589608 37337155
6058 37337155 40329583 43149543 44856738 44266920 40928983 35730617 30221489 25643968
6050 25643968 22451756 20206386 18621939 17432805 16393905 15769507 15257331 14833272 14503380
6041 14503380 14244323 14113952 14101093 14084300 14178229 14301413 14673740 14995988 15297641 15797535
$$ packed form
6103E543789N7450K31332J33655J84909K28000J61637K25673K49125K12265R5417
6093G323252J53716L42574L32920L17861K06251L15343L37751M61000M60398L80713
6083A0631779N32017O96786P63886Q01352R45359J128565J287284J589577J912486
6074B0289091K389256L203374L809022M221911M378240M027959K515140K64169
6066D5098162k330305l942277l729646k418985o98303P08669J902293K747547
6058C7337155K992428K819960J707195n89818l337937n198366n509128m577521
6050B5643968l192212k245370j584447j189134j038900o24398n12176m24059l29892
6041A4503380k59057j30371j2859j6793R3929J23184L72327L22248L01653M99894
$$ plain form
6031 15797535 16331569 17081598 17895208 18877497 19961227 21413508 23239101 25526151 28442924
6022 28442924 32024900 36528165 41929540 47666688 53127459 57399829 58970201 57105713
6014 57105713 52536917 47240614 42873418 40711801 40686215 42195277 45103677 48762183
6006 48762183 52524285 55270265 55773484 52895864 46774276 39060022 31940440 26515605
5998 26515605 22597495 19909153 17724043 15948738 14486483 13200110 12242044 11429669
5990 11429669 10844689 10327123 9758369 9250747 8861342 8489874 8094691 7842780 7600751
5981 7600751 7280660 6893547 6675172 6541152 6361089 6204267 6045586 5972695 5907700 5808293
5971 5808293 5683158 5573318 5510154 5420513 5380064 5332170 5180873 5091265 5040110 5025332 4856272
$$ packed form
6031A5797535N34034P50029Q13610R82289J083730J452281J825593K287050K916773
6022B8442924L581976M503265N401375N737148N460771M272370J570372j864488
6014E7105713m568796n296303m367196k161617k5586J509062K908400L658506
6006D8762183L762102K745980N03219k877620o121588p714254p119582n424835
5998B6515605l918110k688342k185110j775305j462255j286373r58066q12375
5990A1429669n84980n17566n68754n07622l89405l71468l95183k51911k42029
5981G600751l20091l87113k18375j34020j80063j56822j58681p2891o4995r9407
5971E808293j25135j09840o3164q9641m0449m7894j51297q9608n1155j4778j69060
$$ plain form
5960 4856272 4731911 4594457 4465673 4420487 4364570 4347443 4296109 4270231 4236325 4141943 4055702
5949 4055702 3894698 3847849 3792753 3783558 3782196 3845583 3893993 3857507 3820133 3843453 3938654 3917278
5937 3917278 3916498 3978010 4115857 4170544 4147120 4061348 3904125 3908777 3975499 3917127 3719818
5926 3719818 3691281 3688381 3691440 3710533 3717839 3628850 3656145 3649509 3724938 3786503 3694322 3805666
5914 3805666 3887918 3952318 3979087 3963165 3960514 3934276 3864127 3803969 3822334 3866432 3902267 4045602
5902 4045602 4147976 4173439 4260877 4280726 4412549 4365139 4354063 4373052 4366807 4299858 4343532
5891 4343532 4390807 4395151 4391349 4390246 4353377 4352177 4398015 4542547 4678879 4826089 4898865 4887567
5879 4887567 4934807 4811753 4855724 4849867 4976573 5063701 5277190 5359419 5358908 5371991 5397349
$$ packed form
5960D856272j24361j37454j28784m5186n5917j7127n1334k5878l3906r4382q6241
5949D055702j61004m6849n5096r195j362O3387M8410l6486l7374K3320R5201k1376
5937C917278p80O1512J37847N4687k3424q5772j57223M652O6722n8372j97309
5926C719818k8537k900L059J9093P306q8989K7295o636P5429O1565r2181J11344
5914C805666Q2252O4400K6769j5922k651k6238p0149o0158J8365M4098L5835J43335
5902D045602J02374K5463Q7438J9849J31823m7410j1076J8989o245o6949M3674
5891D343532M7275M344l802j103l6869j200M5838J44532J36332J47210P2776j1298
5879D887567M7240j23054M3971n857J26706Q7128K13489Q2229n11J3083K5358
$$ plain form
5868 5397349 5418902 5551024 5699403 5747530 5608999 5724826 5799774 5894794 6012095 6000384
5858 6000384 6048570 6049441 5970545 6015727 5966472 5957234 6014748 5966184 6146352 6143741 6111895 6229489
5846 6229489 6178868 6268784 6315707 6258341 6279815 6459743 6467104 6535488 6740367 6904784 7029121
5835 7029121 7168320 7300569 7558989 7825194 8050266 8183669 8524096 8819696 9050470 9280826
5825 9280826 9576918 10084168 10549003 11110665 11657173 12012862 12321920 12816064 13286622 13659285
5815 13659285 13906209 14143490 14461095 14777556 15093818 15229952 15360576 15551547 15462712 15585407
5805 15585407 15800291 16154564 16673897 17309652 18175670 19020566 19582803 19999927 20147490
5796 20147490 20009331 19402507 18450058 17600880 16786686 16045390 15449073 15048383 14963243 14812713
$$ packed form
5868E397349K1553J32122J48379M8127j38531J15827P4948R5020J17301j1711
5858F000384M8186Q71p8896M5182m9255r238N7514m8564J80168k611l1846J17594
5846F229489n0621Q9916M6923n7366K1474J79928P361O8384K04879J64417J24337
5835G029121J39199J32249K58420K66205K25072J33403L40427K95600K30774K30356
5825I280826K96092N07250M64835N61662N46508L55689L09058M94144M70558L72663
5815A3659285K46924K37281L17605L16461L16262J36134J30624J90971q8835J22695
5805A5585407K14884L54273N19333O35755Q66018Q44896N62237M17124J47563
5796B0147490j38159o06824r52449q49178q14194p41296n96317m00690q5140j50530
$$ plain form
5786 14812713 14775964 14961523 15287424 15611237 16212242 16906892 17726143 18798738 19967376
5777 19967376 21043795 22146096 22898877 23227256 23077691 22360082 21358488 19934519 18249901
5768 18249901 16906101 15878643 15120750 14643101 14371608 14195656 13916713 13818799 13884803
5759 13884803 13954953 14086147 14230069 14565311 15057553 15505255 15893741 16596768 17481179 18359476
5749 18359476 19482724 20820812 22341084 24287058 26627157 29521396 33203501 37549989
5741 37549989 42144128 46513040 50352011 52989883 53151534 50581326 46101671 40449691
5733 40449691 35116081 31078579 28363594 26615943 25373805 24523574 23875591 23476586 23428171
5724 23428171 23600558 24090889 24749842 25780799 27148280 28898375 31247550 34259670 38126642
$$ packed form
5786A4812713l6749J85559L25901L23813O01005O94650Q19251J072595J168638
5777A9967376J076419J102301P52781L28379j49565p17609j001594j423969j684618
5768A8249901j343800j027458p57893m77649k71493j75952k78943r7914O6004
5759A3884803P0150J31194J43922L35242M92242M47702L88486P03027Q84411Q78297
5749A8359476J123248J338088J520272J945974K340099K894239L682105M346488
5741C7549989M594139M368912L838971K637872J61651k570208m479655n651980
5733D0449691n333610m037502k714985j747651j242138q50231o47983l99005m8415
5724B3428171J72387M90331O58953J030957J367481J750095K349175L012120L866972
$$ plain form
5715 38126642 42757667 47452088 51873488 55442393 57373228 56550775 53087555 47768478
5707 47768478 41469752 35835172 31819649 29005997 27049139 25559970 24254097 23413188
5699 23413188 23029534 22840326 22893745 23197885 23816051 24897263 26330315 28214257 30776455
5690 30776455 33819770 36945900 39693003 41852148 42685251 41420951 38692792 34773786
5682 34773786 30241673 26454969 23821033 22057769 20786866 19830654 19254460 18795952 18502636
5673 18502636 18442553 18670531 18959612 19376310 19881500 20823413 22207458 23974113 26334118
5664 26334118 29431700 32822263 35988486 38978899 40895938 41082514 39233473 35494956
5656 35494956 30682365 25672069 21625131 18782305 16614133 15067762 13854991 12930692
$$ packed form
5715C8126642M631025M694421M421400L568905J930835q22453l463220n319077
5707D7768478o298726n634580m015523k813652j956858j489169j305873q40909
5699B3413188l83654j89208N3419L04140O18166J081212J433052J883942K562198
5690C0776455L043315L126130K747103K159145Q33103j264300k728159l919006
5682C4773786m532113l786704k633936j763264j270903r56212n76194m58508k93316
5673A8502636o0083K27978K89081M16698N05190R41913J384045J766655K360005
5664B6334118L097582L390563L166223K990413J917039J86576j849041l738517
5656C5494956m812591n010296m046938k842826k168172j546371j212771r24299
$$ plain form
5648 12930692 12181908 11505714 10996832 10556366 10160804 9809428 9355174 9020193 8705514
5639 8705514 8395870 8132507 7957478 7784859 7572647 7416215 7313129 7207910 7154550 7057765
5629 7057765 7070677 7081858 7072114 7169160 7247547 7464268 7684997 7852669 7752647 7602197 7629352
5618 7629352 7500479 7269847 7024390 6844973 6625973 6352627 6344531 6329952 6201177 6200893 6106368
5607 6106368 6161825 6197091 6267999 6531723 6929074 7165768 7330081 7533452 7841810 8101795
5597 8101795 8249677 8357145 8282710 8057238 7767747 7485911 7079788 6771687 6457046 6303826
5587 6303826 6183961 6125843 6124796 6195884 6366807 6559257 6755758 7015091 7309972 7555117
5577 7555117 7649082 7822121 8064663 8152934 8225760 8222497 8051443 7909744 7625553 7151048
$$ packed form
5648A2930692p48784o76194n08882m40466l95562l51376m54254l34981l14679
5639H705514l09644k63363j75029j72619k12212j56432j03086j05219n3360r6785
5629G057765J2912J1181r744R7046P8387K16721K20729J67672j00022j50450K7155
5618G629352j28873k30632k45457j79417k19000k73346q096j4579j28775k84r4525
5607F106368N5457L5266P0908K63724L97351K36694J64313K03371L08358K59985
5597H101795J47882J07468p4435k25472k89491k81836m06123l08101l14641j53220
5587F303826j19865n8118j047P1088J70923J92450J96501K59333K94881K45145
5577G555117R3965J73039K42542Q8271P2826l263j71054j41699k84191m74505
$$ plain form
5567 7151048 6714837 6386623 6197059 5963158 5847932 5776635 5600175 5674285 5661406 5630400
5557 5630400 5667818 5840579 6021418 6258354 6591998 6869972 7146590 7309020 7465132 7524442
5547 7524442 7414917 7187688 6916483 6661884 6372188 6060389 5780189 5757633 5751283 5598615
5537 5598615 5589633 5568671 5522881 5668852 5805485 5930075 6042525 6224718 6390579 6439574
5527 6439574 6460333 6444611 6357996 6290713 6291986 6269428 6163741 5984946 5883167 5800313 5726100
5516 5726100 5510832 5454398 5458425 5481096 5542337 5541755 5721999 5789894 5687766 5510316 5516395
5505 5516395 5474881 5574958 5750187 5743798 5717141 5830591 5884946 5826544 5774119 5679397 5601715
5494 5601715 5552514 5409903 5326731 5077364 4847422 4846326 4789460 4692420 4615168 4673763 4699053
$$ packed form
5567G151048m36211l28214j89564k33901j15226p1297j76460P4110j2879l1006
5557E630400L7418J72761J80839K36936L33644K77974K76618J62430J56112N9310
5547G524442j09525k27229k71205k54599k89696l11799k80200k2556o350j52668
5537E598615q982k0962m5790J45971J36633J24590J12450J82193J65861M8995
5527F439574K0759j5722q6615o7283J273k2558j05687j78795j01779q2854p4213
5516E726100k15268n6434M027K2671O1241n82J80244O7895j02128j77450O079
5505E516395m1514J00077J75229o389k6657J13450N4355n8402n2425r4722p7682
5494E601715m9201j42611q3172k49367k29942j096n6866r7040p7252N8595K5290
$$ plain form
5483 4699053 4539838 4488708 4502459 4437141 4424613 4332935 4208277 4196818 4252039 4051659 3974141
5472 3974141 3981835 4014769 3994336 4038043 4058588 4028351 4028689 4170716 4139284 4013636 3951198 4001629
5460 4001629 4004441 4000263 4043845 4023762 3796792 3842234 3845719 3693717 3788932 3721480 3726012 3817646
5448 3817646 3913369 3969721 3942390 3980787 3990439 4027347 3932282 3901628 3974947 4056828 4111354 4127273
5436 4127273 4061345 3974886 3957987 4056687 4118409 4116243 4063393 4108232 4154106 4099295 4165693 4195073
5424 4195073 4159558 4085330 4131353 4168581 4182104 4213875 4173445 4271517 4293023 4258931 4354893
5413 4354893 4454411 4521032 4463353 4518395 4420804 4477943 4487193 4448349 4543558 4577075 4640244 4660191
5401 4660191 4610637 4699559 4833783 4855652 4738960 4655256 4699228 4864592 4911434 4911505 5074305
$$ packed form
5483D699053j59215n1130J3751o5318j2528r1678j24658j1459N5221k00380p7518
5472C974141P694L2934k0433M3707K0545l0237L38J42027l1432j25648o2438N0431
5460D001629K812m178M3582k0083k26970M5442L485j52002R5215o7452M532R1634
5448C817646R5723N6352k7331L8397R652L6908r5065l0654P3319Q1881N4526J5919
5436D127273o5928q6459j6899R8700O1722k166n2850M4839M5874n4811O6398K9380
5424D195073l5515p4228M6023L7228J3523L1771m0430R8072K1506l4092R5962
5413D354893R9518O6621n7679N5042r7591N7139R250l8844R5209L3517O3169J9947
5401D660191m9554Q8922J34224K1869j16692q3704M3972J65364M6842P1J62800
$$ plain form
5390 5074305 5179050 5161153 5234018 5485379 5698416 5821582 6063502 6326419 6649911 6912264
5380 6912264 7157332 7523383 7787550 7835393 7775818 7744697 7500982 7128620 6885131 6697270
5370 6697270 6508118 6302056 6274919 6414260 6541775 6506084 6609569 6793896 7048289 7223776
5360 7223776 7468083 7805709 8134819 8412705 8612725 8807974 8955507 9020304 8992625 8782641
5350 8782641 8488701 8190882 7818733 7451754 7195006 7059708 7032452 6876883 6612977 6582579
5340 6582579 6537102 6432265 6415958 6339877 6233844 6137846 6112323 6125936 6091953 6098873 6112124
5329 6112124 6159566 6110955 6002569 5820928 5768094 5546953 5487849 5350059 5225784 5100935
5319 5100935 4989658 5012819 4950494 4957242 4977436 4974152 4878757 4870142 4768064 4855060 4940479 4996389
$$ packed form
5390E074305J04745j7897P2865K51361K13037J23166K41920K62917L23492K62353
5380F912264K45068L66051K64167M7843n9575l1121k43715l72362k43489j87861
5370F697270j89152k06062k7137J39341J27515l5691J03485J84327K54393J75487
5360G223776K44307L37626L29110K77886K00020J95249J47533O4797k7679k09984
5350H782641k93940k97819l72149l66979k56748j35298k7256j55569k63906l0398
5340F582579m5477j04837j6307p6081j06033r5998k5523J3613l3983O920J3251
5329F112124M7442m8611j08386j81641n2834k21141n9104j37790j24275j24849
5319E100935j11277K3161o2325O748K0194l284r5395q615j02078Q6996Q5419N5910
$$ plain form
5307 4996389 4971961 5017170 5223203 5426137 5533751 5599354 5735022 5583752 5570707 5464290
5297 5464290 5252914 5148559 5147658 5105880 5158156 5155372 5231086 5255678 5300425 5348690 5469857
5286 5469857 5689682 5823748 6090663 6194396 6246925 6236159 6154087 6051337 5937680 5691239
5276 5691239 5648517 5717109 5729754 5714896 5828915 5971510 6084873 6209831 6255549 6337700 6260695
5265 6260695 6297368 6335383 6294999 6379749 6510218 6672058 6740446 6717673 6611035 6355109 6082441
5254 6082441 5810555 5618643 5591157 5490548 5570258 5612098 5592171 5685815 5753084 5791649 5859533
5243 5859533 6038319 6195828 6397106 6488787 6716404 7004209 7124058 7059846 6949452 6866229
5233 6866229 6762148 6688224 6567015 6371242 6306282 6268456 6227091 6318196 6389070 6367573 6364596
$$ packed form
5307D996389k4428M5209K06033K02934J07614O5603J35668j51270j3045j06417
5297E464290k11376j04355r01m1778N2276k784P5714K4592M4747M8265J21167
5286E469857K19825J34066K66915J03733N2529j0766q2072j02750j13657k46441
5276E691239m2722O8592J2645j4858J14019J42595J13363J24958M5718Q2151p7005
5265F260695L6673L8015m0384Q4750J30469J61840O8388k2773j06638k55926k72668
5254F082441k71886j91912k7486j00609P9710M1840j9927R3644O7269L8565O7884
5243E859533J78786J57509K01278R1681K27617K87805J19849o4212j10394q3223
5233F866229j04081p3924j21209j95773o4960l7826m1365R1105P0874k1497k977
$$ plain form
5222 6364596 6508901 6588877 6703351 6871772 6948814 7064046 7201031 7434053 7607258 7873712
5212 7873712 8059098 8099625 8164435 8131583 8247929 8170748 7949191 7862271 7905698 7833905 7787992
5201 7787992 7811625 7861266 8049832 8124094 8167652 8333873 8499443 8612368 8706353 8858227
5191 8858227 9064525 9341739 9504180 9658825 9768197 9884060 10005136 10121060 10142629 10193461
5181 10193461 10159465 10270047 10404810 10564343 10758308 10799046 10986308 11195060 11406842 11651718
5171 11651718 11875358 12138848 12496525 12830147 13139957 13511466 14031819 14516586 14845107
5162 14845107 15212738 15751015 16253173 16766177 17358217 18327888 19454731 20641355 22191561
5153 22191561 23770712 25257271 26622530 27455285 27752364 27576860 27306258 27389518 28117503
$$ packed form
5222F364596J44305P9976J14474J68421P7042J15232J36985K33022J73205K66454
5212G873712J85386M0527O4810l2852J16346p7181k21557q6920M3427p1793m5913
5201G787992K3633M9641J88566P4262M3558J66221J65570J12925R3985J51874
5191H858227K06298K77214J62441J54645J09372J15863J21076J15924K1569N0832
5181A0193461l3996J10582J34763J59533J93965M0738J87262K08752K11782K44876
5171A1651718K23640K63490L57677L33622L09810L71509N20353M84767L28521
5162A4845107L67631N38277N02158N13004N92040R69671J126843J186624J550206
5153B2191561J579151J486559J365259Q32755K97079j75504k70602Q3260P27985
$$ plain form
5144 28117503 29467622 31453066 33823551 36366304 38867884 41203138 42715837 43101191
5136 43101191 42861004 42290600 41986452 42427082 43548414 44701218 45792615 46647133 47560569
5127 47560569 48981765 50607070 52148585 53581140 54365374 54865587 55435723 55862240 55628367
5118 55628367 54726035 53627106 52521391 52146212 52790542 54425545 56358493 57586658 58039256
5109 58039256 58070710 57779065 57451513 57227786 57094372 56619434 56267966 56105317 56310464 57039350
5099 57039350 57929072 58680169 59262102 59334948 59000280 58439067 57276975 54756098 51305350
5090 51305350 47494969 43698793 41114549 39471043 38849397 38966672 39513734 40203046 41138369
5081 41138369 42296833 43089370 43616214 44089942 44465611 45169237 46179570 47256524 47800276
$$ packed form
5144B8117503J350119J985444K370485K542753K501580K335254J512699L85354
5136D3101191k40187n70404l04148M40630J121332J152804J091397Q54518R13436
5127D7560569J421196J625305J541515J432555P84234N00213N70136M26517k33873
5118E5628367r02332j098929j105715l75179O44330J635003J932948J228165M52598
5109E8039256L1454k91645l27552k23727j33414m74938l51468j62649K05147P28886
5099E7039350Q89722P51097N81933P2846l34668n61213j162092k520877l450748
5090E1305350l810381l796176k584244j643506o21646J17275N47062O89312R35323
5081D1138369J158464P92537N26844M73728L75669P03626J010333J076954N43752
$$ plain form
5072 47800276 47857280 47449586 46511478 45325907 44003222 42781606 41377420 39963382 38870323
5063 38870323 37843271 37048527 36253107 35699367 35573190 35860615 36627557 37796139 39381202
5054 39381202 41471218 44231929 47560992 51120406 55051407 59119573 62720535 65020545
5046 65020545 66364559 67075129 67024823 66754841 66184282 65179555 63658554 62263641 60753481
5037 60753481 59072628 57187408 55758413 55860366 57107576 59199977 62226579 65751184
5029 65751184 69002580 72200756 75269670 78442125 81849260 85445636 88519089 90972485
5021 90972485 94106721 98116672 101584797 103866496 105195366 103818351 101558293 98739324
5013 98739324 95383200 91227509 86264137 80083660 73605613 66631981 59831122 54338180
$$ packed form
5072D7800276N7004m07694r38108j185571j322685j221616j404186j414038j093059
5063C8870323j027052p94744p95420n53740j26177K87425P66942J168582J585063
5054C9381202K090016K760711L329063L559414L931001M068166L600962K300010
5046F5020545J344014P10570n0306k69982n70559j004727j521001j394913j510160
5037F0753481j680853j885220j428995J01953J247210K092401L026602L524605
5029F5751184L251396L198176L068914L172455L407135L596376L073453K453396
5021I0972485L134236M009951L468125K281699J328870j377015k260058k818969
5013I8739324l356124m155691m963372o180477o478047o973632o800859n492942
$$ plain form
5005 54338180 50272564 48204308 47308713 47631266 48495798 49319927 49952247 50000002 48703209
4996 48703209 47023038 45040131 43708881 42590612 41762717 41006648 39816153 38673336
4988 38673336 37612933 36417424 34968947 33635598 32560575 31196827 29545478 27671481
4980 27671481 25952801 24684678 24216029 24312733 24637973 25059068 25477983 25475888 24542595 23172496
4970 23172496 21263356 19421293 18156967 17149982 16245585 15409741 14735293 14277509 13861678
4961 13861678 13643529 13466210 13147415 12876525 12634588 12459328 12219777 12043141 11945390 11757877
4951 11757877 11685097 11581661 11601902 11595207 11558054 11581300 11584482 11678082 11678445 11669871 11637680 11493444
4939 11493444 11513551 11518007 11594080 11522793 11494580 11670972 11718111 11952281 12080985 12264554 12285861
$$ packed form
5005E4338180m065616k068256q95595L22553Q64532Q24129O32320M7755j296793
4996D8703209j680171j982907j331250j118269q27895p56069j190495j142817
4988C8673336j060403j195509j448477j333349j075023j363748j651349j873997
4980B7671481j718680j268123m68649R6704L25240M21095M18915k095r33293j370099
4970B3172496j909140j842063j264326j006985r04397q35844o74448m57784m15831
4961A3861678k18149j77319l18795k70890k41937j75260k39551j76636r7751j87513
4951A1757877p2780j03436K0241o695l7153K3246L182R3600L63q574l2191j44236
4939A1493444K0107M456P6073p1287k8213J76392M7139K34170J28704J83569K1307
$$ plain form
4928 12285861 12456770 12660528 12770374 12935133 13152141 13333602 13609686 13977452 14384082
4919 14384082 14859992 15265169 15890595 16685952 17629690 18764714 20147258 21647945 23695287
4910 23695287 26357169 29309666 32601106 36008873 38904094 41263585 42892062 42965325
4902 42965325 40963633 36857002 31849610 27312628 23901675 21610238 20148103 19029649
4894 19029649 18133077 17431717 16988310 16795200 16730978 16754739 16899193 17104878 17294778 17534149
4884 17534149 17914635 18425165 19119258 19986515 21042161 22157428 23230997 24647380 25658626
4875 25658626 26165477 26531315 26914278 27919468 29724569 32120666 35064733 38680006 42879163
4866 42879163 47236162 51119426 54183315 55150195 52589013 47006786 41052884 36995099
$$ packed form
4928A2285861J70909K03758J09846J64759K17008J81461K76084L67766M06630
4919A4384082M75910M05177O25426P95357R43738J135024J382544J500687K047342
4910B3695287K661882K952497L291440L407767K895221K359491J628477P3263
4902D2965325k001692m106631n007392m536982l410953k291437j462135j118454
4894A9029649q96572p01360m43407j93110o4222K3761J44454K05685J89900K39371
4884A7534149L80486N10530O94093Q67257J055646J115267J073569J416383J011246
4875B5658626N06851L65838L82963J005190J805101K396097K944067L615273M199157
4866D2879163M356999L883264L063889R66880k561182n582227n953902m057785
$$ plain form
4858 36995099 35146248 34597823 34540893 35026662 35797010 37207444 39744358 43095493 46638106
4849 46638106 49638899 50275801 47605516 42250486 36706635 32558659 29381685 26768684
4841 26768684 24525303 22994357 22094511 21498021 21203560 20763532 19996685 19038792 18183412
4832 18183412 17482808 16968672 16611368 16306675 16229895 16240087 16183157 16012849 15933872 16035171
4822 16035171 16092645 16339249 16791723 17134850 17592240 18294357 19118687 20024083 21018559 22432889
4812 22432889 24267008 26152289 28085297 29751385 30615295 30561971 30174816 30040149 30289792
4803 30289792 31061302 32459985 34691818 37195868 39823457 42717715 44769348 45524224
4795 45524224 45714387 45009111 44445585 44019061 43257973 42076189 40526960 39300366 38918791
$$ packed form
4858C6995099j848851n48425n6930M85769P70348J410434K536914L351135L542613
4849D6638106L000793O36902k670285n355030n543851m147976l176974k613001
4841B6768684k243381j530946q99846n96490k94461m40028p66847r57893q55380
4832A8183412p00604n14136l57304l04693p6780J0192n6930j70308p8977J01299
4822A6035171N7474K46604M52474L43127M57390P02117Q24330R05396R94476J414330
4812B2432889J834119J885281J933008J666088Q63910n3324l87155j34667K49643
4803C0289792P71510J398683K231833K504050K627589K894258K051633P54876
4795D5524224J90163p05276n63526m26524p61088j181784j549229j226594l81575
$$ plain form
4786 38918791 39769038 41507570 44006293 46864315 49690870 52728505 55816501 58388895
4778 58388895 60675941 62903324 64784167 64667306 62536365 58983333 54938055 52222940
4770 52222940 50504400 49227984 47944697 46477111 45318672 44369126 43715705 43777179 44289069
4761 44289069 44630591 44982149 45408124 45847409 45909797 45990924 45570971 44369184 42299651
4752 42299651 39941684 37118938 35061602 34526120 34885339 35811859 37058945 38421487 39460997
4743 39460997 39658625 39149800 37485429 35096003 32718995 30526585 29232999 28535608 28455735
4734 28455735 28669678 29212551 30143531 31524091 33391984 35834812 39119587 43269509 47240238
4725 47240238 51024588 54433307 55942258 54688340 51592199 46739545 41857131 38719281
$$ packed form
4786C8918791Q50247J738532K498723K858022K826555L037635L087996K572394
4778E8388895K287046K227383J880843j16861k130941l553032m045278k715115
4770E2222940j718540j276416j283287j467586j158439r49546o53421O1474N11890
4761D4289069L41522L51558M25975M39285O2388Q1127m19953j201787k069533
4752D2299651k357967k822746k057336n35482L59219R26520J247086J362542J039510
4743C9460997J97628n08825j664371k389426k377008k192410j293586o97391p9873
4734B8455735K13943N42873R30980J380560J867893K442828L284775M149922L970729
4725D7240238L784350L408719J508951j253918l096141m852654m882414l137850
$$ plain form
4717 38719281 37003388 36196832 36085610 36659659 37788038 39761846 42464060 46093386 50965951
4708 50965951 57050801 63771567 71192301 78970788 84766608 87649575 88197726 84865325
4700 84865325 78075869 69941231 61038121 52955151 47167873 43545218 41584724 40740270
4692 40740270 41040911 42261708 44447255 47532995 51775228 57017376 62124817 66297440
4684 66297440 69334305 70415657 68377247 63134671 55571075 46568501 38300563 32367318
4676 32367318 28176461 25024536 22552117 20597649 19032821 17710754 16547169 15755055
4668 15755055 15089536 14367502 13726016 13286479 12718334 12194595 11858586 11685541 11343406
4659 11343406 11074389 10767827 10653533 10537079 10336740 10223739 10047974 10048042 10125511 10090222
$$ packed form
4717C8719281j715893q06556j11222N74049J128379J973808K702214L629326M872565
4708E0965951O084850O720766P420734P778487N795820K882967N48151l332401
4700H4865325o789456q134638q903110q082970n787278l622655j960494q44454
4692D0740270L00641J220797K185547L085740M242233N242148N107441M172623
4684F6297440L036865J081352k038410n242576p563596r002574q267938n933245
4676C2367318m190857l151925k472419j954468j564828j322067j163585p92114
4668A5755055o65519p22034o41486m39537n68145n23739l36009j73045l42135
4659A1343406k69017l06562j14294j16454k00339j13001j75765O8P7469l5289
$$ plain form
4649 10090222 10028641 9913533 9802476 9708151 9623632 9648711 9629210 9614295 9587888 9626491 9762523
4638 9762523 9829554 9683594 9511425 9378626 9191130 9193219 9203751 9218484 9246479 9312379 9371071
4627 9371071 9535765 9595558 9832084 9957069 10164876 10434148 10550717 10821492 11073529 11224175
4617 11224175 11376237 11446396 11575423 11469358 11424466 11430737 11213186 11152993 11032762 10914571
4607 10914571 10922102 10945113 11145020 11472811 11552390 11768402 12090819 12457963 12900688 13286711
4597 13286711 13494687 13726719 13923285 14162909 14545537 14932674 15234856 15469505 15679158
4588 15679158 15764948 15828746 15965789 16219222 16634023 17099009 17644666 18274232 19051026 19815007
4578 19815007 20666544 21600948 22608831 23731223 24969786 26350831 28099928 30199312
$$ packed form
4649A0090222o1581j15108j11057r4325q4519K5079j9501j4915k6407L8603J36032
4638I762523O7031j45960j72169j32799j87496K089J0532J4733K7995O5900N8692
4627I371071J64694N9793K36526J24985K07807K69272J16569K70775K52037J50646
4617A1224175J52062P0159J29027j06065m4892O271k17551o0193j20231j18191
4607A0914571P531K3011J99907L27791P9579K16012L22417L67144M42725L86023
4597A3286711K07976K32032J96566K39624L82628L87137L02182K34649K09653
4588A5679158Q5790O3798J37043K53433M14801M64986N45657O29566P76794P63981
4578A9815007Q51537R34404J007883J122392J238563J381045J749097K099384
$$ plain form
4570 30199312 32596333 35608283 39460700 44259775 49710398 55296924 60827515 65299944
4562 65299944 67486810 66885579 63893407 59671137 56015322 54126001 54397189 56563282
4554 56563282 59886649 63454655 66935138 69577836 70199567 68225081 64266691 59461970
4546 59461970 55672927 54090018 54495909 56020437 57909367 59300848 59180579 57101957
4538 57101957 53479198 49155367 45310906 43133944 42700658 43706958 45588006 47754596
4530 47754596 49649341 50621126 49844757 46891036 42179662 36761300 31509880 27567809
4522 27567809 24808674 22721071 21152469 19775459 18642063 17630333 16782775 16111303
4514 16111303 15602663 15194450 14943807 14673413 14530958 14385242 14031735 13901290 13743949
$$ packed form
4570C0199312K397021L011950L852417M799075N450623N586526N530591M472429
4562F5299944K186866o01231k992172m222270l655815j889321K71188K166093
4554E6563282L323367L568006L480483K642698O21731j974486l958390m804721
4546E9461970l789043j582909M05891J524528J888930J391481j20269k078622
4538E7101957l622759m323831l844461k176962m33286J006300J881048K166590
4530D7754596J894745R71785p76369k953721m711374n418362n251420l942071
4522B7567809k759135k087603j568602j377010j133396j011730q47558o71472
4514A6111303n08640m08213k50643k70394j42455j45716l53507j30445j57341
$$ plain form
4505 13743949 13715066 13661343 13764583 13744634 13590458 13682153 13718143 13737966 13740832 13846264 13926637
4494 13926637 14011319 14102069 14317704 14553805 14780232 15161809 15481759 15889736 16403611 16915523
4484 16915523 17596440 18307771 19009172 19965192 21219757 22646090 24348678 26307523 28768372
4475 28768372 31812144 35642250 40175257 45185920 50154700 54246634 56690516 56734129
4467 56734129 54254041 50909040 48205801 47711790 49546645 52124881 55002911 57640351
4459 57640351 57939206 55089196 50382108 44579232 40425614 38529517 38468647 39818996 41894242
4450 41894242 44661435 47593415 50150473 51419286 51004615 49522658 47471470 45922420
4442 45922420 45350423 45854134 47011152 48023390 48305124 46768074 42993346 38037110 32574628
$$ packed form
4505A3743949k8883n3723J03240j9949j54176R1695L5990J9823K866J05432Q0373
4494A3926637Q4682R0750K15635K36101K26427L81577L19950M07977N13875N11912
4484A6915523O80917P11331P01401R56020J254565J426333J702588J958845K460849
4475B8768372L043772L830106M533007N010663M968780M091934K443882M3613
4467E6734129k480088l345001k703239m94011J834855K578236K878030K637440
4459E7640351K98855k850010m707088n802876m153618j896097o0870J350349K075246
4450D1894242K767193K931980K557058J268813m14671j481957k051188j549050
4442D5922420n71997N03711J157018J012238K81734j537050l774728m956236n462482
$$ plain form
4433 32574628 27861607 24505570 21950325 20109069 18576758 17172738 15976286 15007794
4425 15007794 14234917 13550283 12975309 12520327 12098222 11820874 11490614 11341920 11142610
4416 11142610 10916345 10635775 10398732 10295934 10239154 10183385 10272952 10181299 10045153 9821563
4406 9821563 9544856 9231309 8878581 8632043 8329910 8267059 8280017 8371429 8527152 8597832
4396 8597832 8418126 8317584 8002928 7678571 7369921 7237865 7082976 6887762 6804907 6685328
4386 6685328 6469321 6275731 6008257 5811850 5749832 5698610 5720741 5721951 5723897 5885385 6042058
4375 6042058 6006163 5936900 5749900 5526929 5259492 5109189 4959874 4811623 4823163 4839451
4365 4839451 4752426 4637909 4594811 4473321 4299694 4192640 4082988 4039160 4136786 4182505
$$ packed form
4433C2574628m713021l356037k555245j841256j532311j404020j196452r68492
4425A5007794p72877o84634n74974m54982m22105k77348l30260j48694j99310
4416A1142610k26265k80570k37043j02798n6780n5769Q9567r1653j36146k23590
4406I821563k76707l13547l52728k46538l02133o2851J2958R1412J55723P0680
4396H597832j79706j00542l14656l24357l08650j32056j54889j95214q2855j19579
4386F685328k16007j93590k67474j96407o2018n1222K2131J210J946J61488J56673
4375F042058l5895o9263j87000k22971k67437j50303j49315j48251J1540J6288
4365D839451q7025j14517m3098j21490j73627j07054j09652m3828R7626M5719
$$ plain form
4355 4182505 4084556 3954723 3913574 3861787 3775650 3755735 3659907 3522174 3439883 3527504 3531540
4344 3531540 3625276 3684347 3587996 3522044 3417399 3363654 3475461 3573876 3478300 3389296 3397520
4333 3397520 3376473 3266404 3187554 3155400 3216934 3175853 3204060 3230298 3153748 3291840 3414061
4322 3414061 3574766 3641280 3659705 3611996 3648591 3440872 3311059 3274015 3248685 3239964 3226038
4311 3226038 3275627 3428332 3659535 3873577 3923131 3969854 3966913 4071146 4146586 4273915 4349436
4300 4349436 4507118 4666800 4655390 4650531 4562466 4439208 4347133 4171532 3979094 3854967
4290 3854967 3811158 3766167 3797923 3794484 3803359 3888648 3889607 3974497 4085719 4279690 4375297 4551738
4278 4551738 4707046 4799928 4864854 5062524 5165264 5148718 5189449 5208165 5364808 5562279
$$ packed form
4355D182505r7949j29833m1149n1787q6137j9915r5828j37733q2291Q7621M036
4344C531540R3736N9071r6351o5952j04645n3745J11807R8415r5576q9004Q224
4333C397520k1047j10069p8850l2154O1534m1081K8207K6238p6550J38092J22221
4322C414061J60705O6514J8425m7709L6595k07719j29813l7044k5330q721j3926
4311C226038M9589J52705K31203K14042M9554M6723k941J04233P5440J27329P5521
4300D349436J57682J59682j1410m859q8065j23258r2075j75601j92438j24127
4290C854967m3809m4991L1756l439Q875Q5289R59Q4890J11222J93971R5607J76441
4278D551738J55308R2882O4926J97670J02740j6546M0731J8716J56643J97471
$$ plain form
4268 5562279 5721849 5694956 5604829 5719269 5772330 5739810 5852799 5948186 5905735 6011632 6088725
4257 6088725 6246514 6294367 6345742 6378000 6516684 6674167 6620550 6703509 6878514 6984496
4247 6984496 7170577 7382970 7530459 7657797 7925332 8300110 8794058 9387367 9990911 10456927
4237 10456927 10965861 11373217 11664769 11922324 12094849 12236629 12427864 12629447 12811376
4228 12811376 12972163 13233895 13368518 13617223 13822226 13873807 14040175 14138302 14329480 14541945
4218 14541945 14781666 14918364 15092495 15334109 15549169 15888901 16271605 16610084 17018990
4209 17018990 17477089 17890106 18188268 18483331 18879865 19420077 19854011 20295098 20689193
4200 20689193 21217506 21801539 22334331 22907623 23410067 24050115 24732818 25471780 26282534
$$ packed form
4268E562279J59570k6893r0127J14440N3061l2520J12989R5387m2451J05897P7093
4257F088725J57789M7853N1375L2258J38684J57483n3617Q2959J75005J05982
4247F984496J86081K12393J47489J27338K67535L74778M93948N93309O03544M66016
4237A0456927N08934M07356K91552K57555J72525J41780J91235K01583J81929
4228A2811376J60787K61732J34623K48705K05003N1581J66368R8127J91178K12465
4218A4541945K39721J36698J74131K41614K15060L39732L82704L38479M08906
4209A7018990M58099M13017K98162K95063L96534N40212M33934M41087L94095
4200B0689193N28313N84033N32792N73292N02444O40048O82703P38962Q10754
$$ plain form
4191 26282534 27176511 28172511 29162432 30217878 31323474 32447282 33682723 35098547 36499248
4182 36499248 37812554 39303946 40876250 42476392 43960393 45528812 47155347 48863019
4174 48863019 50597312 52520804 54563628 56581379 58692288 61217922 64231784 67736359
4166 67736359 71829707 76511997 81652179 87588450 94243561 101739646 110491931 120628048
4158 120628048 132472126 146733628 164217382 185833904 212468528 246349837 289992595
4151 289992595 344029561 404167374 465553158 513675151 535280355 519415369 465971019
4144 465971019 394608360 322518786 263399426 218310453 183921151 157825285 137957700
4137 137957700 122487128 110269789 100453022 92307006 85046265 78213005 71827941 65863833
$$ packed form
4191B6282534Q93977R96000R89921J055446J105596J123808J235441J415824J400701
4182C6499248J313306J491392J572304J600142J484001J568419J626535J707672
4174D8863019J734293J923492K042824K017751K110909K525634L013862L504575
4166F7736359M093348M682290N140182N936271O655111P496085Q752285J0136117
4158A20628048J1844078J4261502J7483754K1616522K6634624L3881309M3642758
4151B89992595N4036966O0137813O1385784M8121993K1605204j5864986n3444350
4144D65971019p1362659p2089574n9119360m5088973l4389302k6095866j9867585
4137A37957700j5470572j2217339r816767q146016p260741o833260o385064n964108
$$ plain form
4129 65863833 60543361 56063229 52314999 49050643 46033167 43390182 40817177 38403807
4121 38403807 36254785 34390002 32790260 31527614 30311762 29094616 27946286 26691158
4113 26691158 25560217 24696488 23730223 22805606 21978178 21017293 20134094 19477674 18796518
4104 18796518 18117099 17652639 17108288 16561159 16093022 15426316 14785189 14060356 13292151
4095 13292151 12684875 12242749 11724250 11188227 10873713 10530398 10174913 9830627 9637206
4086 9637206 9272835 8982523 8873661 8816294 8693192 8502151 8302318 8136519 8000088 7844273
4076 7844273 7631898 7319336 7211357 7078886 6958438 6879063 6822772 6753761 6498475 6384916
4066 6384916 6315920 6308689 6327793 6451930 6557806 6711302 6975567 7211740 7490939 7641941
$$ packed form
4129F5863833n320472m480132l748230l264356l017476k642985k573005k413370
4121C8403807k149022j864783j599742j262646j215852j217146j148330j255128
4113B6691158j130941q63729r66265r24617q27428r60885q83199o56420o81156
4104A8796518o79419m64460n44351n47129m68137o66706o41127p24833p68205
4095A3292151o07276m42126n18499n36023l14514l43315l55485l44286j93421
4086I637206l64371k90312j08862n7367j23102j91041j99833j65799j36431j55815
4076G844273k12375l12562j07979j32471j20448p9375n6291o9011k55286j13559
4066F384916o8996p231J9104J24137J05876J53496K64265K36173K79199J51002
$$ plain form
4056 7641941 7599946 7590093 7475772 7310698 7123980 6888642 6604489 6404606 6130317 5838351
4046 5838351 5688212 5480879 5309635 5328103 5185048 5165129 5060351 4934267 4904265 4956072
4036 4956072 4807094 4679667 4612523 4499506 4419550 4388654 4400550 4407475 4403839 4378269 4531343
4025 4531343 4654434 4763097 4810928 4782767 4801487 4711136 4695676 4687336 4663238 4622876 4570428
4014 4570428 4668090 4764811 4782141 4886172 4932808 5090562 5059077 5140525 5192050 5174522 5171909
4003 5171909 5217797 5288471 5327731 5477870 5471191 5592854 5924271 6206197 6456064 6935710
3993 6935710 7434652 7824079 8215770 8489452 8680285 8959217 9276310 9920225 10779522 11596674
3983 11596674 11928635 12413899 12780497 12175136 10849022 9970604 9645605 9538871 9551123
$$ packed form
4056G641941m1995r853j14321j65074j86718k35338k84153j99883k74289k91966
4046E838351j50139k07333j71244J8468j43055j9919j04778j26084l0002N1807
4036D956072j48978j27427o7144j13017p9956l0896J1896O925l636k5570J53074
4025D531343J23091J08663M7831k8161J8720r0351j5460q340k4098m0362n2448
4014D570428R7662R6721J7330J04031M6636J57754l1485Q1448N1525j7528k613
4003E171909M5888P0674L9260J50139o679J21663L31417K81926K49867M79646
3993F935710M98942L89427L91691K73682J90833K78932L17093O43915Q59297Q17152
3983A1596674L31961M85264L66598o05361j326114q78418l24999j06734J2252
$$ plain form
3974 9551123 9418162 9019752 8596042 8420810 8215760 7665984 6748033 6085610 5620080 5352350
3964 5352350 5028791 4669334 4435111 4199200 4026505 3852635 3604151 3319938 3113011 2940933
3954 2940933 2728739 2617038 2498049 2433329 2363236 2266726 2187335 2137143 2096251 1914252 1874669
3943 1874669 1916705 1846056 1853140 1793599 1745609 1696972 1593969 1648428 1558875 1555118 1512696 1487362
3931 1487362 1327491 1248331 1166486 1165454 1310144 1322892 1242163 1202757 1101901 1076164 1050226
3920 1050226 1049260 1041343 958015 927465 910605 889623 775954 756111 839082 754585 741349 735605
3908 735605 646370 608260 617525 532939 416522 515877 554556 546951 607204 661356 659911 702857
3896 702857 727139 780014 790406 739723 629988 642197 722847 681957 782481 857446 816406
$$ packed form
3974I551123j32961l98410m23710j75232k05050n49776r17951o62423m65530k67730
3964E352350l23559l59457k34223k35911j72695j73870k48484k84213k06927j72078
3954B940933k12194j11701j18989o4720p0093r6510p9391n0192m0892j81999l9583
3943A874669M2036p0649P084n9541m7990m8637j03003N4459q9553l757m2422k5334
3931A487362j59871p9160q1845j032J44690J2748q0729l9406j00856k5737k5938
3920A050226r66p917q3328l0550j6860k0982j13669j9843Q2971q4497j3236n744
3908G35605q9235l8110R265q4586j16417R9355L8679p605O0253N4152j445M2946
3896G02857K4282N2875J0392n0683j09735J2209Q0650m0890J00524P4965m1040
$$ plain form
3885 816406 794034 935331 953515 1037022 1075281 1092261 1191612 1236971 1282561 1246641 1331373
3874 1331373 1307525 1254009 1343926 1475529 1510095 1570076 1587987 1805830 2009141 2176048 2449513
3863 2449513 2804466 3086437 3388561 3823739 3947614 4019767 3979556 3882394 3584686 3121193
3853 3121193 2593113 2164046 1923491 1802369 1565506 1349589 1254115 1225597 1221950 1128094
3843 1128094 1082071 920563 964786 1097287 1139934 1166977 1209586 1275036 1259715 1197271 1128218
3832 1128218 1020465 939499 773998 780238 705278 606850 518385 415017 444726 427244 314351
3821 314351 371164 480289 359375 373163 354786 291590 285854 238617 205020 231887 200812
3810 200812 237115 298979 245244 138974 275028 286009 222110 269637 298610 237860 145067
$$ packed form
3885H16406k2372J41297J8184Q3507L8259J6980R9351M5359M5590l5920Q4732
3874A331373k3848n3516Q9917J31603L4566N9981J7911K17843K03311J66907K73465
3863B449513L54953K81971L02124M35178J23875P2153m0211r7162k97708m63493
3853C121193n28080m29067k40555j21122k36863k15917r5474k8518l647r3856
3843A128094m6023j61508M4223J32501M2647K7043M2609O5450j5321o2444o9053
3832A128218j07753q0966j65501O240p4960r8428q8465j03368K9709j7482j12893
3821C14351N6813J09125j20914J3788j8377o3196n736m7237l3597K6867l1075
3810B00812L6303O1864n3735j06270J36054J0981o3899M7527K8973o0750r2793
$$ plain form
3799 145067 237952 138783 146388 265496 278830 360431 396401 242401 230271 148834 172518
3788 172518 174775 174100 296128 261114 180417 267149 262384 266283 133168 130318 130743 206383 127904
3775 127904 173496 201822 188964 268268 345155 387770 319911 298207 331456 366358 326565 282984
3763 282984 292106 289800 316764 220025 163748 241369 180905 188749 225444 187332 218067 206211
3751 206211 168338 242708 276944 226705 172341 160004 138890 102104 100360 241113 108069
3740 108069 134701 133846 74817 101769 240393 186931 141760 -33591 88851 152679 77154
3729 77154 95416 131839 51438 110428 170411 235739 177617 71877 172492 223886 184366
3718 184366 130626 79822 116427 89816 38693 114616 152985 99327 124411 202587 198017 174545
$$ packed form
3799A45067R2885r9169P605J19108J3334Q1601L5970j54000j2130q1437K3684
3788A72518K257o75J22028l5014q0697Q6732m765L899j33115k850M25P5640p8479
3775A27904M5592K8326j2858P9304P6887M2615o7859k1704L3249L4902l9793m3581
3763B82984R122k306K6964r6739n6277P7621o0464P844L6695l8112L0735j1856
3751B06211l7873P4370L4236n0239n4364j2337k1114l6786j744J40753j33044
3740A08069K6632q55n9029K6952J38624n3462m5171j75351J22442O3828p5525
3729G7154J8262L6423q0401N8990N9983O5328n8122j05740J00615N1394l9520
3718A84366n3740n0804L6605k6611n1123P5923L8369n3658K5084P8176m570k3472
$$ plain form
3706 174545 202411 203981 186544 243378 257327 200199 198669 134102 106710 138219 206177 194069
3694 194069 36345 30873 39331 15459 55086 144822 157552 199739 173232 113024 72812 31844
3682 31844 -19537 24001 58765 55486 -31944 -50427 16252 -24237 71389 68237 -1032 -35612
3670 -35612 -37495 -96349 -99939 29332 18963 23847 77865 166496 20962 12374 -39307 38677
3658 38677 70202 27278 -31440 -27684 -47464 -52856 30461 48781 38387 -67723 -71487 -45995
3646 -45995 -45410 -27938 -15173 -15350 21821 -16768 -9798 -2389 -24643 -56572 -87238 -59266 -41771
3633 -41771 34986 -11966 -71924 -27206 35478 22378 -15509 4719 -12417 -90327 -104304 -91135
3621 -91135 -74181 -21109 48911 30125 65708 69662 115061 132790 -739 20731 15798 79610
$$ packed form
3706A74545K7866J570j7437N6834J3949n7128j530o4567k7392L1509O7958j2108
3694A94069j57724n472Q458k3872L9627Q9736J2730M2187k6507o0208m0212m0968
3682C1844n1381M3538L4764l279q7430j8483O6679m0489R5626l152o9269l4580
3670c5612j883n8854l590J29271j0369M884N4018Q8631j45534q588n1681P7984
3658C8677L1525m2924n8718L756j9780n392Q3317J8320j0394j06110l764K5492
3646d5995N85J7472J2765j77L7171l8589O970P409k2254l1929l0666K7972J7495
3633d1771P6757m6952n9958M4718O2684j3100l7887K0228j7136p7910j3977J3169
3621i1135J6954N3072P0020j8786L5583L954M5399J7729j33529K1470m933O3812
$$ plain form
3609 79610 68404 90713 150844 81404 192758 104812 -26217 60515 47932 31453 50401
3598 50401 22139 14477 -27738 -48001 3591 80537 32345 66091 154704 148232 28342 12051
3586 12051 16723 -42699 -78030 -1173 62791 4239 -89053 -80389 -10072 23292 94645 86958
3574 86958 64821 78974 29110 -47386 -106287 -82587 19744 57407 66536 7339 10495 21224
3562 21224 37776 21470 112134 1270 4033 10916 -34226 55040 -32998 -84836 -15825 10486
3550 10486 72067 80696 26511 57615 96722 44653 83796 165509 145157 124223 64589 -853
3538 -853 -140831 -90409 7649 -54490 -85848 -68167 -71978 -30130 51057 -59629 -2995 32926
3526 32926 -1844 34383 97409 -66911 15003 46502 8410 -30369 -97324 13290 -39318
$$ packed form
3609G9610j1206K2309O0131o9440J11354q7946j31029Q6732j2583j6479J8948
3598E0401k8262p662m2215k0263N1592P6946m8192L3746Q8613o472j19890j6291
3586A2051M672n9422l5331P6857O3964n8552r3292Q664P0317L3364P1353p687
3574H6958k2137J4153m9864p6496n8901K3700J02331L7663R129n9197L156J0729
3562B1224J6552j6306R0664j10864K763O883m5142Q9266q8038n1838O9011K6311
3550A0486O1581Q629n4185L1104L9107n2069L9143Q1713k0352k0934n9634o5442
3538h53j39978N0422R8058o2139l1358J7681l811M1848Q1187j10686N6634L5921
3526C2926l4770L6227O3026j64320Q1914L1499l8092l8779o6955J10614n2608
$$ plain form
3515 -39318 24646 88227 113790 28045 21337 61606 107361 143101 136457 4963 43946 83799
3503 83799 49719 158835 61769 115904 88643 -6082 66943 133466 207929 149051 -14504
3492 -14504 46673 230969 217266 215321 270997 345681 350077 266752 325946 295592 213842 260914
3480 260914 274600 345819 285607 110801 24317 -34235 -26749 80202 31351 98619 170985
3469 170985 149842 114202 132707 85831 118134 133350 61126 96061 135119 152945 209821 215581
3457 215581 111190 100227 164440 156825 153578 117065 40002 144244 169087 145019 222626 177295
3445 177295 188172 216531 177352 171231 105865 96380 141887 251777 271909 309540 246528 263645
3433 263645 322073 264486 263059 207957 173878 194191 258098 293964 308237 342309 352903 437615
$$ packed form
3515c9318O3964O3581K5563q5745o708M0269M5755L5740o644j31494L8983L9853
3503H3799l4080J09116r7066N4135k7261r4725P3025O6523P4463n8878j63555
3492a4504O1177J84296j3703j945N5676P4684M396q3325N9194l0354q1750M7072
3480B60914J3686P1219o0212j74806q6484n8552P486J06951m8851O7268P2366
3469A70985k1143l5640J8505m6876L2303J5216p2224L4935L9058J7826N6876N760
3457B15581j04391j0963O4213p615l247l6513p7063J04242K4843k4068P7607m5331
3445A77295J0877K8359l9179o121o5366r485M5507J09890K0132L7631o3012J7117
3433B63645N8428n7587j427n5102l4079K0313O3907L5866J4273L4072J0594Q4712
$$ plain form
3421 437615 438556 393471 431707 560337 668410 646938 586765 528838 409947 455527 433891
3410 433891 448132 309685 289049 430066 415955 403034 455176 363340 285151 433946 392982
3399 392982 330014 384915 498200 460456 504544 542475 591526 581766 654475 721813 740729 824460
3387 824460 968556 1107922 1263415 1286043 1249014 1142915 1062765 934451 804280 808439 829972
3376 829972 705495 647198 625376 582245 761665 751424 584350 571478 643686 636333 617192
3365 617192 598477 592539 618164 700672 727563 761849 782777 882710 905031 945798 1075838 1040856
3353 1040856 1089967 1131282 1102810 1016044 978337 1025275 950209 833788 797061 769208 732318
3342 732318 771958 800793 732321 792249 768346 788269 871214 862687 953801 921543 1016292 1042132
$$ packed form
3421D37615R41m5085L8236J28630J08073k1472o0173n7927j18891M5580k1636
3410D33891J4241j38447k0636J41017j4111j2921N2142r1836p8189J48795m0964
3399C92982o2968N4901J13285l7744M4088L7931M9051r760P2709O7338J8916Q3731
3387H24460J44096J39366J55493K2628l7029j06099q0150j28314j30171M159K1533
3376H29972j24477n8297k1822m3131J79420j0241j67074j2872P2208p353j9141
3365F17192j8715n938K5625Q2508K6891L4286K0928R9933K2321M0767J30040l4982
3353A040856M9111M1315k8472q6766l7707M6938p5066j16421l6727k7853l6890
3342G32318L9640K8835o8472N9928k3903J9923Q2945q527R1114l2258R4749K5840
$$ plain form
3330 1042132 986293 1041929 1029029 1064024 1099179 1110917 1056940 1074913 1125424 1254431 1375350
3319 1375350 1389217 1384918 1394122 1393224 1469179 1634032 1680701 1699904 1719169 1660356 1719990 1731396
3307 1731396 1752430 1803950 1828370 1784784 1729182 1876582 1917951 1835597 1838386 1861025 1935794
3296 1935794 1963879 2071504 2106866 2068559 2185802 2216818 2400166 2484613 2611492 2578222 2597929
3285 2597929 2593724 2684181 2889704 2991715 3073595 3103756 2960490 2813156 2752832 2813972 2780248
3274 2780248 2741560 2808639 2888166 2997070 3002264 3069119 3139262 3102283 3141380 3233400 3300109
3263 3300109 3488032 3666200 3708679 3752695 3863334 3935719 3843160 3901731 4022215 4052767 4133044
3252 4133044 4402122 4537538 4551952 4714911 4827201 4930286 4892702 4986125 5154742 5220425
$$ packed form
3330A042132n5839N5636j2900L4995L5155J1738n3977J7973N0511J29007J20919
3319A375350J3867m299R204q98P5955J64853M6669J9203J9265n8813N9634J1406
3307A731396K1034N1520K4420m3586n5602J47400M1369q2354K789K2639P4769
3296A935794K8085J07625L5362l8307J17243L1016J83348Q4447J26879l3270J9707
3285B597929m205R0457K05523J02011Q1880L0161j43266j47334o0324O1140l3724
3274B780248l8688O7079P9527J08904N194O6855P0143l6979L9097R2020O6709
3263C300109J87923J78168M2479M4016J10639P2385r2559N8571J20484L0552Q0277
3252D133044K69078J35416J4414J62959J12290J03085l7584R3423J68617O5683
$$ plain form
3242 5220425 5353409 5579218 5837996 6111684 6407046 6690720 7050696 7263114 7489236 7750018
3232 7750018 7771326 7794839 7619048 7261309 6868114 6453468 5959896 5472603 5020781 4737659
3222 4737659 4606909 4443416 4340755 4258937 4092202 4122828 4044540 3983142 4050946 4057265 4078918
3211 4078918 4103185 4258581 4343767 4379255 4534360 4581946 4681786 4661950 4636759 4552480 4363974
3200 4363974 4383165 4470332 4526486 4416129 4114544 3826372 3465758 3167433 2953462 2851350
3190 2851350 2740096 2681795 2579277 2586745 2634867 2607458 2765601 2898044 2957666 2966743 3189728
3179 3189728 3383377 3507658 3743484 4088745 4321487 4418761 4555758 4432385 4167836 3740694
3169 3740694 3407179 3102609 2942439 2808670 2606665 2427410 2278062 2199717 2031746 1859959
$$ packed form
3242E220425J32984K25809K58778K73688K95362K83674L59976K12418K26122K60782
3232G750018K1308K3513j75791l57739l93195m14646m93572m87293m51822k83122
3222D737659j30750j63493j02661q1818j66735L0626p8288o1398O7804O319K1653
3211D078918K4267J55396Q5186L5488J55105M7586R9840j9836k5191q4279j88506
3200D363974J9191Q7167N6154j10357l01585k88172l60614k98325k13971j02112
3190B851350j11254n8301j02518P468M8122k7409J58143J32443N9622R077K22985
3179C189728J93649J24281K35826L45261K32742R7274J36997j23373k64549m27142
3169C740694l33515l04570j60170j33769k02005j79255j49348p8345j67971j71787
$$ plain form
3159 1859959 1770893 1693342 1525301 1580272 1626553 1601230 1632922 1637725 1685344 1611156 1622276
3148 1622276 1639328 1650022 1723003 1924198 2122161 2135877 2339496 2337433 2078451 1839964 1623333
3137 1623333 1447373 1392036 1243823 1087093 1090869 1026695 906558 925635 895370 907306 1008577
3126 1008577 962409 826425 771012 721843 609058 616377 614368 614010 644198 709771 614322 446665
3114 446665 474760 487684 511530 418992 521609 548964 470642 518245 477554 458790 501318
3103 501318 440013 481901 367919 407612 442376 421487 395534 338292 327655 286943 296239 382868
3091 382868 352485 364448 458941 517490 325373 325962 317998 298133 286222 252604 324880 294613
3079 294613 356876 334107 319688 305944 250891 311103 393472 349911 277497 261020 236139 252146
$$ packed form
3159A859959q9066p7551j68041N4971M6281k5323L1692M803M7619p4188J1120
3148A622276J7052J0694P2981K01195J97963J3716K03619k063k58982k38487k16631
3137A623333j75960n5337j48213j56730L776o4174j20137J9077l0265J1936J01271
3126A008577m6168j35984n5413m9169j12785P319k009l58L0188O5573r5449j67657
3114D46665K8095J2924K3846r2538J02617K7355p8322M7603m0691j8764M2528
3103E01318o1305M1888j13982L9693L4764k0889k5953n7242j0637m0712R296Q6629
3091C82868l0383J1963R4493N8549j92117N89p964j9865j1911l3618P2276l0267
3079B94613O2263k2769j4419j3744n5053O0212Q2369m3561p2414j6477k4881J6007
$$ plain form
3067 252146 325385 262465 182154 214817 270991 212634 229012 204466 228950 179173 206851 235073
3055 235073 155986 140016 256975 177941 145175 217191 176650 195529 172864 138756 58439
3044 58439 34835 57347 127292 185347 71647 49145 25389 122834 139068 76930 144418 141875
3032 141875 85583 61292 103221 87607 112517 116304 127041 86327 77155 113632 38411 25941
3020 25941 -1172 11715 2119 67404 133283 157428 184000 240440 141743 52329 150036 199402
3008 199402 91620 172909 115279 142650 99273 72669 235182 249605 140207 157687 149654
2997 149654 228239 266726 220215 161904 214696 352573 251502 296515 328323 327211 319480 187210
2985 187210 138974 250285 206612 199528 237502 155562 149730 113600 108706 167279 234034 286087
$$ packed form
3067B52146P3239o2920q0311L2663N6174n8357J6378k4546K4484m9777K7678K8222
3055B35073p9087j5970J16959p9034l2766P2016m0541J8879k2665l4108q0317
3044E8439k3604K2512O9945N8055j13700k2502k3756R7445J6234o2138O7488k543
3032A41875n6292k4291M1929j5614K4910L787J0737m0714r172L6477p5221j2470
3020B5941k7113J2887r596O5285O5879K4145K6572N6440r8697q9414R7707M9366
3008A99402j07782Q1289n7630K7371m3377k6604J62513J4423j09398J7480q033
2997A49654P8585L8487m6511n8311N2792J37877j01071M5013L1808j112p731j32270
2985A87210m8236J11311m3673p084L7974q1940n832l6130m894N8573O6755N2053
$$ plain form
2973 286087 231112 325041 382258 292110 261741 227748 285033 413823 415561 367297 386027 474679
2961 474679 429942 483598 426568 451905 359737 463085 470198 443891 388927 281015 270061
2950 270061 327012 362825 365587 393926 314235 345385 326207 386586 329162 300486 271297 382128
2938 382128 536504 439309 332873 376315 506905 529966 495354 465078 565731 472236 528691
2927 528691 617798 625308 646063 617923 667359 656009 714499 674895 627369 658360 672971 673987
2915 673987 638974 657826 769310 746342 776928 776128 638902 740610 805239 770297 888680
2904 888680 836150 932592 948202 960874 1065624 1058768 969696 996709 985725 1026557 1116366 1122509
2892 1122509 1201582 1241911 1239180 1191087 1229559 1174553 1081562 954643 935944 878366 966852
$$ packed form
2973B86087n4975R3929N7217r0148l0369l3993N7285J28790J738m8264J8730Q8652
2961D74679m4737N3656n7030K5337r2168J03348P113k6307n4964j07912j0954
2950B70061N6951L5813K762K8339p9691L1150j9178O0379n7424k8676k9189J10831
2938C82128J54376r7195j06436M3442J30590K3061l4612l0276J00653r3495N6455
2927E28691Q9107P510K0755k8140M9436j1350N8490l9604m7526L0991J4611J016
2915F73987l5013J8852J11484k2968L0586q00j37226J01708O4629l4942J18383
2904H88680n2530R6442J5610J2672J04750o856q9072K7013j0984M0832Q9809O143
2892A122509P9073M0329k731m8093L8472n5006r2991j26919j8699n7578Q8486
$$ plain form
2881 966852 938686 988496 965017 952262 904684 809003 835268 866162 954344 951778 939413 954682
2869 954682 991769 1043397 1078036 1041641 987183 1046165 1111476 1101079 1008384 1025347 980296 934635
2857 934635 914960 762526 753465 790315 786490 752298 782239 684683 606691 622954 639399 673185
2845 673185 663966 594214 582482 537877 633971 600063 532318 499305 559494 555369 594020 628448
2833 628448 539271 414132 418796 433629 382000 330839 348500 371308 280317 244768 261243 230758
2821 230758 278227 311559 263219 250605 176164 267322 349457 323688 218690 234679 228791 165695
2809 165695 194284 183691 214946 60720 26605 17858 40277 177801 91061 141626 102400
2798 102400 63327 30360 45620 87865 106635 68491 51694 51671 -49598 -30695 -54796 -22926
$$ packed form
2881I66852k8166M9810k3479j2755m7578r5681K6265L0894Q8182k566j2365J5269
2869I54682L7087N1628L4639l6395n4458N8982O5311j0397r2695J6963m5051m5661
2857I34635j9675j52434r061L6850l825l4192K9941r7556p7992J6263J6445L3786
2845F73185r219o9752j1732m4605R6094l3908o7745l3013O0189m125L8651L4428
2833F28448q9177j25139M664J4833n1629n1161J7661K2808r0991l5549J6475l0485
2821B30758M7469L3332m8340j2614p4441R1158Q2135k5769j04998J5989n888o3096
2809A65695K8589j0593L1255j54226l4115q747K2419J37524q6740N0565l9226
2798A02400l9073l2967J5260M2245J8770l8144j6797k3j01269J8903k4101L1870
$$ plain form
2786 -22926 18781 81538 47735 3096 -19651 8218 -373 -10506 10693 36698 -14012 -11442
2774 -11442 1234 -68983 -142567 -122331 -10162 -106519 -129399 -160996 -218328 -141700 -117567 -150076
2762 -150076 -59629 -30087 -18987 14018 -40634 8554 -27314 -108187 -129744 -88997 -15428 -30111
2750 -30111 -59607 -136794 -154548 -115681 -70597 -44787 -17714 -105815 -111469 -45205 -78985 44113
2738 44113 22056 -138681 -15848 50970 -19740 -158818 -192600 -149186 -186117 -182684 -164641
2727 -164641 -150654 -262691 -156350 -152061 -164499 -149893 -235771 -200825 -283202 -244750 -223919
2716 -223919 -167049 -196733 -179727 -98282 -69298 -198966 -221818 -208835 -118852 -49480 -213921
2705 -213921 -191065 -201186 -151250 -56272 -113894 -109175 -166044 -219907 -274140 -221572 -194692 -237089
$$ packed form
2786b2926M1707O2757l3803m4639k2747K7869q591j0133K1199K6005n0710K570
2774a1442J2676p0217p3584K0236J12169r6357k2880l1597n7332P6628K4133l2509
2762a50076R0447K9542J1100L3005n4652M9188l5868q0873k1557M0747P3569j4683
2750c0111k9496p7187j7754L8867M5084K5810K7073q8101n654O6264l3780J23098
2738D4113k2057j60737J22833O6818p0710j39078l3782M3414l6931L433J8043
2727a64641J3987j12037J06341M289j2438J4606q5878L4946q2377L8452K0831
2716b23919N6870k9684J7006Q1445K8984j29668k2852J2983Q9983O9372j64441
2705b13921K2856j0121M9936R4978n7622M719n6869n3863n4233N2568K6880m2397
$$ plain form
2693 -237089 -239143 -209462 -243062 -221429 -151634 -124513 -105427 -175979 -221525 -192052 -171967 -169221
2681 -169221 -75821 -37369 -217483 -224940 -207099 -105481 -81949 -178621 -189091 -147789 -80892
2670 -80892 -128102 -153354 -257310 -243355 -231934 -240440 -265894 -259406 -247000 -157044 -177538 -167364
2658 -167364 -191693 -188009 -150088 -190891 -333430 -332338 -140049 -147164 -220537 -158018 -160096 -135071
2646 -135071 -146202 -125279 -190558 -95306 -158589 -192402 -123791 -170082 -142815 -102282 -146767 -205209
2634 -205209 -117349 -18986 -103872 -213969 -89319 -79777 -137562 -152987 -142126 -92212 -172894
2623 -172894 -189607 -198592 -82958 -87616 -180047 -161635 -189262 -181167 -156159 -122180 -208626 -150916
2611 -150916 -153561 -108224 -151924 -134557 -28017 -74550 -100699 -120963 -171131 -123491 -169841 -192350
$$ packed form
2693b37089k054K9681l3600K1633O9795K7121J9086p0552m5546K9473K0085K746
2681a69221R3400L8452j80114p457J7841J01618K3532r6672j0470M1302O6897
2670h0892m7210k5252j03956J3955J1421q506k5454O488J2406Q9956k0494J0174
2658a67364k4329L684L7921m0803j42539J092J92289p115p3373O2519k078K5025
2646a35071j1131K0923o5279R5252o3283l3813O8611m6291K7267M0533m4485n8442
2634b05209Q7860R8363q4886j10097J24650R542n7785j5425J0861M9914q0682
2623a72894j6713q985J15634m658r2431J8412k7627Q095K5008L3979q6446N7710
2611a50916k645M5337m3700J7367J06540m6533k6149k0264n0168M7640m6350k2509
$$ plain form
2599 -192350 -157498 -173056 -175146 -94977 -178039 -208875 -172297 -185380 -191374 -205974 -171442 -163292
2587 -163292 -142776 -28055 -141396 -58996 -158925 -184445 -100381 -117216 -52072 -74018 -89289
2576 -89289 -109771 -184721 -217648 -171065 -199442 -142278 -221029 -202862 -156584 -141463 -64186 -99200
2564 -99200 -10586 17020 -99147 -130410 -83572 -118336 -12479 -4402 -181339 -206160 -134247
2553 -134247 14762 -90631 -127429 -100325 -154239 -110690 -85642 -107424 -58410 -247247 -214174
2542 -214174 -242759 -102829 -104997 -178929 -183992 -281559 -167675 -137533 -143812 -102222 -39852 -145694
2530 -145694 -116569 -108688 -117796 -116814 -141157 -142387 -178465 -219694 -262704 -285751 -267019 -204531 -142254
2517 -142254 -199952 -232976 -199981 -214123 -151141 -177784 -166243 -98097 -151152 -282628 -164395
$$ packed form
2599a92350L4852j5558k090Q0169q3062l0836L6578j3083n994j4600L4532Q150
2587a63292K0516J14721j13341Q2400r9929k5520Q4064j6835O5144k1946j5271
2576h9289k0482p4950l2927M6583k8377N7164p8751J8167M6278J5121P7277l5014
2564i9200Q8614K7606j16167l1263M6838l4764J05857Q077j76937k4821P1913
2553a34247J49009j05393l6798K7104n3914M3549K5048k1782M9014j88837L3073
2542b14174k8585J39930k168p3932n063r7567J13884L0142o279M1590O2370j05842
2530a45694K9125P881r108R82k4343j230l6078m1229m3010k3047J8732O2488O2277
2517a42254n7698l3024L2995j4142O2982k6643J1541O8146n3055j31476J18233
$$ plain form
2506 -164395 -144529 -208572 -118923 -62110 -184879 -234229 -141896 -170751 -142129 -89425 -112704
2495 -112704 -171820 -128077 -156265 -209641 -244531 -234894 -199382 -174335 -154221 -222453 -181724 -137977
2483 -137977 -140644 -153065 -117707 -73225 -99112 -60461 -84181 -103653 -146211 -264193 -286176 -218602
2471 -218602 -181048 -132223 -80554 -77186 -4223 -71735 -99358 -128090 -146200 -100642 -130426 -114152
2459 -114152 -174349 -233298 -126736 -218616 -163250 -179646 -250100 -120111 -174815 -110091 -138009
2448 -138009 -178476 -208105 -121062 -97366 -141247 -100585 -114693 -102235 -90481 -239350 -203960
2437 -203960 -143721 -92504 -181638 -64072 -66086 -152446 -222012 -309053 -157566 -137775 -155898
2426 -155898 10751 21168 -167750 -213235 -214188 -140173 -177434 -108571 -124561 -174379 -196957 -116956
$$ packed form
2506a64395J9866o4043Q9649N6813j22769m9350R2333k8855K8622N2704k3279
2495a12704n9116M3743k8188n3376l4890R637L5512K5047K0114o8232M0729M3747
2483a37977k667j2421L5358M4482k5887L8651k3720j9472m2558j17982k1983O7574
2471b18602L7554M8825N1669L368P2963o7512k7623k8732j8110M5558k9784J6274
2459a14152o0197n8949J06562r1880N5366j6396p0454J29989n4704O4724k7918
2448a38009m0467k9629Q7043K3696m3881M0662j4108J2458J1754j48869L5390
2437b03960O0239N1217q9134J17566k014q6360o9566q7041J51487J9791j8123
2426a55898J66649J0417j88918m5485r53P4015l7261O8863j5990m9818k2578Q0001
$$ plain form
2414 -116956 -122782 -113442 -212370 -251967 -194380 -277283 -210835 -193863 -178114 -243222 -187145 -160682
2402 -160682 -120047 -126237 -93707 -78710 -151565 -104711 -48806 -101694 -124282 -81793 -71517 -116363
2390 -116363 -127297 -89198 11086 -28507 65865 27149 -33276 -14480 -106280 -93093 -71933
2379 -71933 -124293 -52282 -32701 -92766 -126806 -76434 -73908 -153706 -37431 -47430 -32257 -87192
2367 -87192 -18451 -22882 -39827 52572 -4519 11800 24285 65606 129483 16579 2322 -39519
2355 -39519 -21979 -14254 29777 -12823 -58592 -103091 -119779 -122982 -69371 -80209 -86359 -23782
2343 -23782 13837 -20455 23338 106209 58015 126568 90503 -22681 29362 67564 12344 -37816
2331 -37816 25394 32224 -55996 -172404 -160865 -136951 -19094 -11389 29680 48970 34307 26327
$$ packed form
2414a16956n826R340r8928l9597N7587q2903O6448J6972J5749o5108N6077K6463
2402a60682M0635o190L2530J4997p2855M6854N5905n2888k2588M2489J0276m4846
2390a16363j0934L8099J00284l9593R4372l8716o0425J8796r1800J3187K1160
2379g1933n2360P2011J9581o0065l4040N0372K526p9798J16275r999J5173n4935
2367h7192O8741m431j6945R2399n7091J6319J2485M1321O3877j12904j4257m1841
2355c9519J7540P725M4031m2600m5769m4499j6688l203N3611j0838o150O2577
2343b3782L7619l4292M3793Q2871m8194O8553l6065j13184N2043L8202n5220n0160
2331c7816O3210O830q8220j16408J1539K3914J17857P705M1069J9290j4663p980
$$ plain form
2319 26327 -16673 -6500 -117771 -82611 -139965 -54115 6790 -75789 -15237 -49485 -17316 4317
2307 4317 7688 -25029 -155628 -195342 -168198 -144464 -177800 -141345 -138520 -143171 -75116 29038
2295 29038 -65429 -120398 -67316 -120394 -40249 -37631 18164 41986 -27684 -21161 -67756 -84258
2283 -84258 -95252 -135629 -133568 -76373 -93006 -111419 -31240 12430 -33945 -21750 -1220 -96309
2271 -96309 -108990 -23002 -49012 -64979 -87993 -96432 -115588 -92245 -87978 -88035 -56957 43372 -20971
2258 -20971 23135 146456 82656 114706 113238 62154 53447 20736 10034 6797 24246 35050
2246 35050 57754 73276 67365 13712 14396 -43529 -79010 -14405 104344 -7619 -70168 -110087
2234 -110087 -20793 -89614 -154616 -47809 -48405 -98032 -64861 28417 41970 49923 47240 56980
$$ packed form
2319B6327m3000J0173j11271L5160n7354Q5850O0905q2579O0552l4248L2169K1633
2307D317L371l2717j30599l9714K7144K3734l3336L6455K825m651O8055J04154
2295B9038r4467n4969N3082n3078Q0145K618N5795K3822o9670O523m6595j6502
2283h4258j0994m0377K061N7195j6633j8413Q0179M3670m6375J2195K0530r5089
2271i6309j2681Q5988k6010j5967k3014q439j9156K3343M267n7L1078J00329o4343
2258b0971M4106J23321o3800L2050j468n1084q707l2711j0702l237J7449J0804
2246C5050K2704J5522n911n3653O84n7925l5481O4605J18749j11963o2549l9919
2234a10087Q9294o8821o5002J06807n96m9627L3171R3278J3553P953k683R740
$$ plain form
2222 56980 -3081 12939 28728 -13281 117704 108101 46593 182991 158051 129216 148239 189447
2210 189447 85136 164149 190550 159809 186988 224930 166930 147183 164044 222973 255469
2199 255469 314135 290537 226303 307695 307399 316793 291023 290918 344662 373335 373511 279128 284669
2186 284669 323963 355441 407736 515868 645439 530985 426602 586358 601436 567618 644084
2175 644084 641286 709908 603242 690710 757342 650679 627297 678105 789742 802365 747474
2164 747474 717289 647945 671957 666022 694872 754814 789218 828616 825255 849260 839718 963463
2152 963463 1048392 1032757 1030770 1013709 1101453 1047559 980727 1075520 1151427 1145262 1108713 1203601
2140 1203601 1234203 1296220 1356392 1485858 1510151 1538111 1695940 1817138 1816551 1859024 1894037
$$ packed form
2222E6980o0061J6020J5789m2009J30985r603o1508J36398k4940k8835J9023M1208
2210A89447j04311P9013K6401l0741K7179L7942n8000j9747J6861N8929L2496
2199B55469N8666k3598o4234Q1392k96R394k5770j05N3744K8673J76r4383N541
2186B84669L9294L1478N2295J08132J29571j14454j04383J59756J5078l3818P6466
2175F44084k798O8622j06666Q7468O6632j06663k3382N0808J11637J2623n4891
2164G47474l0185o9344K4012n935K8850N9942L4404L9398l361K4005r542J23745
2152I63463Q4929j5635j987j7061Q7744n3894o6832R4793P5907o165l6549R4888
2140A203601L0602O2017O0172J29466K4293K7960J57829J21198n87M2473L5013
$$ plain form
2129 1894037 1948172 2097894 2213215 2280866 2352552 2487500 2594613 2656032 2856159 2904828
2119 2904828 2946126 3077294 3173881 3408529 3587921 3750717 3973571 4253364 4671539 5090650
2109 5090650 5497361 5989883 6323360 6590379 7120672 7770000 8378790 9345653 10521269
2100 10521269 11985020 13861060 16426077 19735300 24322862 29513311 34298748 37858951
2092 37858951 36937425 31267489 23418270 17161195 13365811 10952318 9358331 8131967
2084 8131967 7042405 6142362 5512755 5069184 4744736 4568142 4387103 4102093 3782462
2075 3782462 3416275 3034505 2753893 2622928 2399648 2203006 2148743 2013688 1914669 1775676
2065 1775676 1657901 1678882 1569727 1570947 1491130 1478040 1235854 1130849 1076686 1001615 1009245
$$ packed form
2129A894037N4135J49722J15321O7651P1686J34948J07113O1419K00127M8669
2119B904828M1298J31168R6587K34648J79392J62796K22854K79793M18175M19111
2109E090650M06711M92522L33477K67019N30293O49328O08790R66863J175616
2100A0521269J463751J876040K565017L309223M587562N190449M785437L560203
2092C7858951r21526n669936p849219o257075l795384k413493j593987j226364
2084H131967j089562r00043o29607m43571l24448j76594j81039k85010l19631
2075C782462l66187l81770k80612j30965k23280j96642n4263j35055r9019j38993
2065A775676j17775K0981j09155J220p9817j3090k42186j05005n4163p5071P630
$$ plain form
2054 1009245 971728 767272 705292 779910 907852 887740 768336 690213 669709 587326 584040
2043 584040 663201 666861 553047 419030 458658 456572 390704 354860 332255 343055 305399 309394
2031 309394 271676 343967 415337 284706 247637 314304 336032 282146 232245 240298 204331 205430
2019 205430 204534 244865 231475 165039 220765 205318 228139 244013 205826 168919 106471 103521
2007 103521 117875 145779 139699 197448 281656 351819 296711 193493 140808 112778 161658 87949
1995 87949 141763 103901 55400 87308 99585 24441 72571 109188 93120 67057 310 14176
1983 14176 62262 -10377 81559 -12204 -79012 78257 122940 54203 39965 36458 85430 88534
1971 88534 144116 79267 94506 35392 33505 32533 73931 92487 108646 162947 61936 -52660
$$ packed form
2054A009245l7517k04456o1980P4618J27942k0112j19404p8123k0504q2383l286
2043E84040P9161L660j13814j34017L9628k086o5868l5844k2605J0800l7656L995
2031C09394l7718P2291P1370j30631l7069O6667K1728n3886m9901Q053l5967J099
2019B05430q96M0331j3390o6436N5726j5447K2821J5874l8187l6907o2448k950
2007A03521J4354K7904o080N7749Q4208P0163n5108j03218n2685k8030M8880p3709
1995H7949N3814l7862m8501L1908J2277p5144M8130L6617j6068k6063o6747J3866
1983A4176M8086p2639R1936r3763o6808J57269M4683o8737j4238l507M8972L104
1971H8534N5582o4849J5239n9114j887r72M1398J8556J6159N4301j01011j14596
$$ plain form
1959 -52660 -130490 -14421 19377 71556 25607 81799 80367 126027 149238 45905 92094 77339
1947 77339 -3879 -8406 1781 48762 65062 549 38960 32848 -9620 95533 91829 -27982
1935 -27982 -72793 -33531 8977 -4136 -34345 21072 -35503 -60785 -45045 6310 -24638 -87364
1923 -87364 -49850 -80700 -112244 -14374 -92753 -74410 -113158 -196511 -75735 -82882 -139198 -96766
1911 -96766 -33492 4623 -29109 18355 -38564 -150920 -69097 47880 -41328 -116846 -108187 -66072
1899 -66072 -86617 -101936 -109727 -55511 -162209 -163722 -93307 -89421 -135340 -69538 746 -86403
1887 -86403 -90511 -13731 -23043 -71506 -15463 -40825 -16755 -37249 -37257 -97484 -155778 -157976 -195865
1874 -195865 -101580 -124179 -73287 -59690 -19759 14504 -14763 -32946 -29833 76946 -101440
$$ packed form
1959e2660p7830J16069L3798N2179m5949N6192j432M5660K3211j03333M6189j4755
1947G7339q1218m527J0187M6981J6300o4513L8411o112m2468J05153l704j19811
1935b7982m4811L9262M2508j3113l0209N5417n6575k5282J5740N1355l0948o2726
1923h7364L7514l0850l1544R7870p8379J8343l8748q3353J20776p147n6316M2432
1911i6766O3274L8115l3732M7464n6919j12356Q1823J16977q9208p5518Q659M2115
1899f6072k0545j5319p791N4216j06698j513P0415L886m5919O5802P0284q7149
1887h6403m108P6780r312m8463N6043k5362K4070k0494qo0227n8294k198l7889
1874a95865R4285k2599N0892J3597L9931L4263k9267j8183L113J06779j78386
$$ plain form
1863 -101440 -130503 -102792 -6351 -57894 -122647 -88927 -96203 -19915 65128 -35078 -56327 -116125
1851 -116125 -82902 -139743 -47965 -14390 -50979 -43791 -67553 -103678 -81373 -22032 -63405 -94973
1839 -94973 -76578 -67293 -62483 -22461 -725 -4702 60476 14921 -50434 -74231 -57002 -39767
1827 -39767 96483 126842 57667 -70103 5973 84985 -6360 -68288 -68390 -48427 -131076 -119059
1815 -119059 -103068 -110706 -176965 -193916 -141194 -83299 -85543 -21060 4633 -21331 -140221 -178553
1803 -178553 -265420 -131937 -123147 -131560 -64477 -96902 -186816 -184267 -197695 -108878 -133023 -93355
1791 -93355 -44784 -34100 -119385 -136246 -104813 -96330 11696 33812 1044 -14751 7769 -38017
1779 -38017 -101404 -98879 -93666 -155101 -53595 -96236 -94392 -88945 -36787 -3070 -71814 -109574
$$ packed form
1863a01440k9063K7711R6441n1543o4753L3720p276P6288Q5043j00206k1249n9798
1851a16125L3223n6841R1778L3575l6589P188k3762l6125K2305N9341m1373l1568
1839i4973J8395R285M810M0022K1736l977O5178m5555o5355k3797J7229J7235
1827c9767J36250L0359o9175j27770P6076P9012r1345o1928j02J9963q2649J2017
1815a19059J5991p638o6259j6951N2722N7895k244O4483K5693k5964j18890l8332
1803a78553q6867J33483Q790q413O7083l2425q9914K549j3428Q8817k4145L9668
1791i3355M8571J0684q5285j6861L1433Q483J08026K2116l2768j5795K2520m5786
1779c8017o3387K525N213o1435J01506m2641J844N447N2158L3717o8744l7760
$$ plain form
1767 -109574 -114741 -71830 8687 9101 47100 -41616 -79463 -13290 -30572 4801 86384 26035
1755 26035 -174401 -178980 -170426 -123743 -198590 -154621 -37479 -108544 -105372 -101967 -86459 -42142
1743 -42142 -70603 -53842 -135193 -131348 -21684 -52489 -102846 -95517 -25870 59206 22347 18553
1731 18553 -43397 -104022 -119774 -71151 -38007 -72500 24664 -11 -76761 -69736 -90518 -85232
1719 -85232 -61119 -35222 18195 -24101 -42443 -125608 -112328 -72674 32475 62591 -8070 3382
1707 3382 -9456 71691 -40250 -7326 -27528 -100442 -80500 -113734 -132871 -175197 -95997 -53840
1695 -53840 -83220 -12726 -440 -51931 -131683 -197771 -136368 -65373 5247 -96453 -36243 -79046
1683 -79046 -126601 3854 -68484 -178175 -162054 -118701 -108133 -89896 -129998 -153014 -136100
$$ packed form
1767a09574n167M2911Q0517M14L7999q8716l7847O6173j7282L5373Q1583o0349
1755B6035k00436m579Q554M6683p4847M3969J17142p1065L172L405J5508M4317
1743d2142k8461J6761q1351L845J09664l0805n0357P329O9647Q5076l6859l794
1731A8553o1950o0625j5752M8623L3144l4493R7164k4675p6750P025k0782N286
1719h5232K4113K5897N3417m2296j8342q3165J3280L9654J05149L0116p0661J1452
1707C382j2838Q1147j11941L2924k0202p2914J9942l3234j9137m2326P9200M2157
1695e3840k9380P0494J2286n1491p9752o6088O1403P0995P0620j01700O0210m2803
1683g9046m7555J30455p2338j09691J6121M3353J0568J8237m0102k3016J6914
$$ plain form
1672 -136100 13084 15651 -150408 -93531 7872 -16834 -79717 -89685 -114191 -130275 -48040
1661 -48040 -20273 -9847 -18301 -62265 -146132 -56101 -91070 -12307 67663 -17509 -130765 -84488
1649 -84488 -30587 -189864 -161350 -111902 -221194 -265370 -94577 -37077 1557 -38686 -85643
1638 -85643 -188119 -137849 -118486 -79212 -20451 4574 -56657 -136030 -158096 -198520 -207944 -139786
1626 -139786 -192081 -239305 -174899 -190555 -164975 -153216 -124547 -86786 -68112 -91250 -61733 35205
1614 35205 70271 81922 -66659 -89494 -69270 -116591 -106104 -30735 -20233 32333 -40685 -70286
1602 -70286 37512 12775 -50855 26278 -22179 -122245 -73887 -10790 -6567 -107495 -64056
1591 -64056 -63641 -67169 -52956 -95712 -64368 -133169 -68113 -45458 -116202 -122686 -123266 -106705 -129787
$$ packed form
1672a36100J49184K567j66059N6877J01403k4706o2883r968k4506j6084Q2235
1661d8040K7767J0426q454m3964q3867R0031l4969P8763P9970q5172j13256M6277
1649h4488N3901j59277K8514M9448j09292m4176J70793N7500L8634m0243m6957
1638h5643j02476N0270J9363L9274N8761K5025o1231p9373k2066m0424r424O8158
1626a39786n2295m7224O4406j5656K5580J1759K8669L7761J8674k3138K9517R6938
1614C5205L5066J1651j48581k2835K0224m7321J0487P5369J0502N2566p3018k9601
1602g0286J07798k4737o3630P7133m8457j00066M8358O3097M223j00928M3439
1591f4056M15l528J4213m2756L1344o8801O5056K2655p0744o484n80J6561k3082
$$ plain form
1578 -129787 -171034 -197913 -215596 -148351 -40101 -33125 -64200 -57840 -77719 -64576 -108033 -65078
1566 -65078 25972 -66466 -32378 -37498 -45088 -47452 -88275 -124000 -130881 -106442 -53009 -27207 60586
1553 60586 -62123 -162663 -180532 -101972 -89346 -33066 -75710 -29390 -16410 -133864 -100979
1542 -100979 -65400 -110903 -91005 -124002 -61032 -96562 -41379 24974 3539 -142334 -144503 -6966
1530 -6966 22553 -24182 -77956 -47852 102974 71589 -74 -14892 -3817 770 330 9673 -87343
1517 -87343 -41973 -56448 -41113 -61515 -27338 96547 70468 -19964 -25297 -48939 8486 -60324
1505 -60324 -96199 -67143 -60848 -84553 -74556 -8299 -102395 -117999 -18493 -90758 -127841 -131781
1493 -131781 -113096 -72924 -64563 -88387 -139101 -128508 -43990 -125511 -111344 -30764 -74981 -133716
$$ packed form
1578a29787m1247k6879j7683O7245J08250O976l1075O360j9879J3143m3457M2955
1566f5078R1050r2438L4088n120p590k364m0823l5725o881K4439N3433K5802Q7793
1553F0586j22709j00540j7869P8560J2626N6280m2644M6320J2980j17454L2885
1542a00979L5579m5503J9898l2997O2970l5530N5183O6353k1435j45873k169J37537
1530f966K9519m6735n3774L0104J50826l1385p1663j4818J1075M587m40R343r7016
1517h7343M5370j4475J5335k0402L4177J23885k6079r0432n333k3642N7425o8810
1505f0324l5875K9056O295k3705R997O6257r4096j5604R9506p2265l7083l940
1493a31781J8685M0172Q361k3824n0714J0593Q4518q1521J4167Q0580m4217n8735
$$ plain form
1481 -133716 15338 58245 34099 155057 91963 -40573 -136578 -89600 -90879 50702 103496
1470 103496 -34272 -119316 -101957 -51622 -60313 7275 32510 -17967 -105997 -147766 -144448 -91587
1458 -91587 -100453 -106898 -75158 -63107 -134580 -192509 -123410 56487 69626 -53871 -180640 -139321
1446 -139321 -181344 -165576 -99383 -40204 44869 -100267 -162202 -107517 -99162 -152716 -162833 -50851
1434 -50851 -17978 33643 40593 -72271 -65112 -42186 30530 -34465 -57764 9838 -46867 -29618
1422 -29618 -65222 -71145 -135172 -45596 -40190 -10169 -25788 -26941 -9057 18586 -43204 -26568
1410 -26568 19065 -37427 7880 -53142 -112071 -44972 -119757 -65360 -34476 -69729 -65173 -46965
1398 -46965 36943 24685 -118638 -167436 3878 -98001 -125952 -120533 -126850 -74679 13019 -5663
$$ packed form
1481a33716J49054M2907k4146J20958o3094j32536r6005M6978j279J41581N2794
1470A03496j37768q5044J7359N0335q691O7588K5235n0477q8030m1769L318N2861
1458i1587q866o445L1740J2051p1473n7929O9099J79897J3139j23497j26769M1319
1446a39321m2023J5768O6193N9179Q5073j45136o1935N4685Q355n3554j0117J11982
1434e0851L2873N1621O950j12864P159K2926P2716o4995k3299O7602n6705J7249
1422b9618l5604n923o4027Q9576N406L0021j5619j153J7884K7643o1790J6636
1410b6568M5633n6492M5307o1022n8929O7099p4785N4397L0884l5253M556J8208
1398d6965Q3908j2258j43323m8798J71314j01879k7951N419o317N2171Q7698j8682
$$ plain form
1386 -5663 -91292 -152427 -134952 -109385 -62311 -1406 -25888 -5960 27170 -49604 23710 17892
1374 17892 -26690 -54420 -59797 33215 -50793 -12851 35001 -40977 -106043 -155651 19744 8998
1362 8998 27181 50719 -1777 -56228 56938 -18521 -29857 33365 69112 23757 -7650 -71411
1350 -71411 -16039 52346 -2508 -10628 -28563 -52555 -178361 -21056 -69228 -66536 -29795 -47135
1338 -47135 -94749 -114607 -64162 -41144 -53800 -74241 -106212 -39663 36149 -12653 -27091 85530
1326 85530 49863 2729 66914 114610 144991 95708 61576 -44335 -67203 -50392 -77992 -95493
1314 -95493 -55610 -7757 -34046 -51780 -52679 -15278 -60126 -37873 -25263 -50404 -63523 -197713
1302 -197713 -110217 -87748 -55562 -54063 -120641 -105248 -86690 -38282 17044 53012 -16531 3447
$$ packed form
1386e663q5629o1135J7475K5567M7074O0905k4482J9928L3130p6774P3314n818
1374A7892m4582k7730n377R3012q4008L7942M7852p5978o5066m9608J75395j0746
1362H998J8183K3538n2496n4451J13166p5459j1336O3222L5747m5355l1407o3761
1350g1411N5372O8385n4854q120j7935k3992j25806J57305m8172K692L6741j7340
1338d7135m7614j9858N0445K3018j2656k0441l1971O6549P5812m8802j4438J12621
1326H5530l5667m7134O4185M7696L0381m9283l4132j05911k2868J6811k7600j7501
1314i5493L9883M7853k6289j7734q99L7401m4848K2253J2610k5141j3119j34190
1302a97713Q7496K2469L2186J499o6578J5393J8558M8408N5326L5968o9543J9978
$$ plain form
1290 3447 9802 7967 41284 -13966 -12653 -81466 -39575 -15512 -144582 -114385 29448 -32993
1278 -32993 -82823 -91062 -22817 59473 22619 -68572 -172690 -113811 -8108 -73975 -67691 50022
1266 50022 16542 -55421 -34387 1515 4896 -10007 6301 -8944 -2522 141090 50934 -13691
1254 -13691 57363 -6345 -269 -54403 -1193 -35598 -68171 -28636 -25840 -173641 -187228 -82869
1242 -82869 -77858 -85792 -121519 7630 13035 68801 39592 39314 -58699 -63229 13052 104213 100798
1229 100798 121461 -1565 -29985 12937 -8092 -106776 -5590 -44259 -65041 -29759 -76470
1218 -76470 -26908 -51783 48631 44098 36991 21990 9446 -8432 -35740 28140 -83547 -47442
1206 -47442 -28626 -85660 35743 38329 -9079 -113638 -107964 -130291 -24240 82092 18615
$$ packed form
1290C447O355j835L3317n5250J313o8813M1891K4063j29070L0197J43833o2441
1278c2993m9830q239O8245Q2290l6854r1191j04118N8879J05703o5867O284J17713
1266E0022l3480p1963K1034L5902L381j4903J6308j5245O422J43612r0156o4625
1254a3691P1054o3708O076n4134N3210l4405l2573L9535K796j47801j3587J04359
1242h2869N011p934l5727J29149N405N5766k9209k78r8013m530P6281R1161l415
1229A00798K0663j23026k8420M2922k1029r8684J01186l8669k0782L5282m6711
1218g6470M9562k4875J00414m533p107j5001j2544j7878k7308O3880j11687L6105
1206d7442J8816n7034J21403K586m7408j04559N674k2327J06051J06332o3477
$$ plain form
1195 18615 5400 43359 115549 37892 -34027 63380 11416 74816 13569 -45175 -99685 -151807
1183 -151807 -112234 -62925 -32371 -45547 -17882 45348 57267 14662 91218 7702 -163011
1172 -163011 -78663 -8295 -80781 -188395 -94767 -45402 13285 39437 -9032 10226 50162
1161 50162 8866 -101295 38664 -3622 38079 130203 59673 30750 -37510 -25431 69625
1150 69625 30849 -83790 -49600 37675 -738 17315 48571 111679 -2493 -32357 -66464
1139 -66464 -27078 -54639 -42554 -69352 -22075 -1612 -76340 -24090 132580 171830 77099 34640
1127 34640 53220 106387 -4126 -24601 21268 -15010 -38148 -10543 13780 17307 35718 76135
1115 76135 15318 -5806 6802 -61775 -74687 -97537 -119083 -2818 -74398 -16312 35851 -65755
$$ packed form
1195A8615j3215L7959P2190p7657p1919R7407n1964O3400o1247n8744n4510n2122
1183a51807L9573M9309L0554j3176K7665O3230J1919m2605P6556q3516j70713
1172a63011Q4348P0368p2486j07614R3628M9365N8687K6152m8469J9258L9936
1161E0162m1296j10161J39959m2286M1701R2124p0530k8923o8260J2079R5056
1150F9625l8776j14639L4190Q7275l8413J8053L1256O3108j14172k9864l4107
1139f6464L9386k7561J2085k6798M7277K0463p4728N2250J56670L9250r4731m2459
1127C4640J8580N3167j10513k0475M5869l6278k3138K7605K4323L527J8411M0417
1115G6135o0817k1124J2608o8577j2912k2850k1546J16265p1580N8086N2163j01606
$$ plain form
1103 -65755 -85888 -61477 22968 88514 27247 29445 18465 -2578 11133 -56517 -19373 81525
1091 81525 -39914 33575 40324 18089 41471 44362 5917 14303 -82989 14260 43252 23023
1079 23023 -88350 6211 117377 116563 5306 -97910 8233 63437 5543 -144762 -38270
1068 -38270 -6674 37116 34282 2667 13170 -53763 -81760 -118088 -39061 -41363 -41925 60463
1056 60463 28399 -24440 61603 80720 5322 -48873 -17346 58640 49832 -7039 -21609 -30442
1044 -30442 -21938 -18615 -125428 -148852 -34855 -24143 -18664 -29036 -23504 -39825 -113445 -86663
1032 -86663 -172845 -106550 -24386 14952 -13907 -83968 -96513 -75118 -110373 -111703 -41061 -9490
1020 -9490 33076 71879 -16001 20840 -70260 -68999 13264 105209 105365 28857 26951 63783 94781
$$ packed form
1103f5755k0133K4411Q4445O5546o1267K198j0980k1043J3711o7650L7144J00898
1091H1525j21439P3489O749k2235K3382K891l8445Q386r7292R7249K8992k0229
1079B3023j11373R4561J11166q14j11257j03216J06143N5204n7894j50305J06492
1068c8270L1596M3790k834l1615J0503o6933k7997l6328P9027k302n62J02388
1056F0463l2064n2839Q6043J9117p5398n4195L1527P5986q808n6871j4570q833
1044c0442Q504L323j06813k3424J13997J0712N479j0372N532j6321p3620K6782
1032h6663q6182O6295Q2164L9338k8859p0061j2545K1395l5255j330P0642L1571
1020i490M2566L8803q7880L6841r1100J261Q2263R1945J56p6508j906L6832L0998
$$ plain form
1007 94781 87900 49490 -48183 -92334 -30321 19089 -20045 -18050 -13121 -18913 15593 -44384 -72023
994 -72023 -51179 -21670 -89409 -41069 27917 -16326 -49749 -44628 29725 75774 62070 83149
982 83149 -34813 -12978 -2785 -8615 -86891 -130097 70890 66216 125194 58691 -1107 -22151
970 -22151 -91250 83607 52496 24470 -53698 -115573 28752 105979 28456 88056 52181 -47172
958 -47172 -7614 -4940 19279 81467 85942 64747 59703 33877 64529 125359 55068 84036 108929
945 108929 64187 2507 -71313 15686 92114 39055 39179 117092 166029 56182 -49007 -48286
933 -48286 -35464 21093 56923 34167 6187 76459 185043 218261 123824 22728 105443 241160
921 241160 161324 200736 118489 -2708 -2429 -72909 -79219 17645 -11307 -2201 27376 -17253
$$ packed form
1007I4781o881l8410r7673m4151O2013M9410l9134J995M929n792L4506n9977k7639
994g2023K0844K9509o7739M8340O8986m4243l3423N121P4353M6049j3704K1079
982H3149j17962K1835J0193n830p8276m3206K00987m674N8978o6503n9798k1044
970b2151o9099J74857l1111k8026p8168o1875J44325P7227p7523N9600l5875r9353
958d7172L9558K674K4219O2188M475k1195n044k5826L0652O0830p0291K8968K4893
945A08929m4742o1680p3820Q6999P6428n3059J24P7913M8937j09847j05189P21
933d8286J2822N6557L5830k2756k7980P0272J08584L3218r4437j01096Q2715J35717
921B41160p9836L9412q2247j21197K79p0480o310R6864k8952R106K9577m4629
$$ plain form
909 -17253 -31590 10007 83360 104214 -12374 -142 -115903 -65264 -15271 -39352 -40767 37111
897 37111 89992 90865 1501 -47381 -17761 -32508 30300 137547 26804 37838 63509 -65838
885 -65838 -148340 17144 120148 145125 182663 148019 54345 19139 18829 97862 173627 98862
873 98862 -71765 -103081 -2822 -47095 53751 27973 -26063 31689 72489 13287 -21748
862 -21748 -12606 -13329 -32738 -150368 3427 98968 6031 52434 108965 86577 17478 102429
850 102429 206758 154984 110463 64814 6202 -49313 -49419 28616 76896 14184 -75652 -69009
$$ packed form
909a7253j4337M1597P3353K0854j16588J2232j15761N0639M9993k4081j415P7878
897C7111N2881Q73q9364m8882K9620j4747O2808J07247j10743J1034K5671j29347
885f5838q2502J65484J03004K4977L7538l4644r3674l5206l10P9033P5765p4765
873I8862j70627l1316J00259m4273J00846k5778n4036N7752M0800n9202l5035
862b1748R142p23j9409j17630J53795R5541r2937M6403N6531k2388o9099Q4951
850A02429J04329n1774m4521m5649n8612n5515j06P8035M8280o2712q9836O643
$$ [...]
##END NTUPLES=NMR SPECTRUM
##END=
