##TITLE=1H_TG-2340-II
 CDCl3
 8 sc, 
 13.4.2023
##JCAMPDX= 6.0         $$ Bruker NMR JCAMP-DX V2.0
##DATA TYPE= NMR SPECTRUM
##DATA CLASS= NTUPLES
##ORIGIN= UXNMR, Bruker Analytische Messtechnik GmbH
##OWNER= root
$$ XWIN-NMR		Version 3.5
$$ Thu Apr 13 14:46:56 2023 Russian Standard Time (UT+4h)  she@DPX200
##.OBSERVE FREQUENCY= 200.13135
##.OBSERVE NUCLEUS= ^1H
##.ACQUISITION MODE= SIMULTANEOUS
##.ACQUISITION SCHEME= undefined
##.AVERAGES= 8
##.DIGITISER RES= 18
##SPECTROMETER/DATA SYSTEM= spect
##.PULSE SEQUENCE= zg30
##.SOLVENT NAME= DMSO
##.SHIFT REFERENCE= (INTERNAL, DMSO, 0, 15.7414)
##AUDIT TRAIL= $$ (NUMBER, WHEN, WHO, WHERE, WHAT)
$$ ##TITLE= Audit trail, XWIN-NMR		Version 3.5
$$ ##JCAMPDX= 5.01
$$ ##ORIGIN= Bruker BioSpin GmbH
$$ ##OWNER= she
$$ F:/spectra/data/she/nmr/H-F/1/pdata/1/auditp.txt
$$ ##AUDIT TRAIL=  $$ (NUMBER, WHEN, WHO, WHERE, WHAT)
(   1,<2023-04-13 14:45:54.92 +0400>,<she>,<DPX200>,
      <created by zg, POWCHK disabled, PULCHK disabled
       configuration hash MD5:
       00 E9 B6 7A A2 85 ED C7 34 08 36 98 17 FE 4E 26
       data hash MD5: 16K
       3C 43 67 F0 3B DC 91 E2 04 9E 7E 72 92 E8 58 D2>)
(   2,<2023-04-13 14:45:57.79 +0400>,<she>,<DPX200>,
      <Start of raw data processing
       efp BC_mod = 2 LB = 0.24 FT_mod = 6 PKNL = 1 PHC0 = -19831.35 PHC1 = 9.800809 SI = 16K 
       data hash MD5: 16K
       90 0F D3 42 5B 79 62 DA F0 1C F2 2D 3D 75 24 7A>)
(   3,<2023-04-13 14:46:12.89 +0400>,<she>,<DPX200>,
      <pk PHC0 = -2.083088 PHC1 = 1.6 
       data hash MD5: 16K
       0F EF 9A A9 F0 E9 9A 77 44 47 1E 8A 77 63 7F 5A>)
(   4,<2023-04-13 14:46:15.60 +0400>,<she>,<DPX200>,
      <abs ABSG = 5 
       data hash MD5: 16K
       E5 67 B6 14 36 AA CA 9D A8 C1 A0 85 C5 27 8F F1>)
$$ ##END=
$$ 
$$ hash MD5
$$ E9 FB A1 1E 37 E6 1A 9F 3C 34 85 E3 0C E9 AF 6D
##$RELAX= 
##$RELAX= 
##$RELAX= 
##$RELAX= 
##$RELAX= 
##$RELAX= 
$$ Bruker specific parameters
$$ --------------------------
##$DU= <F:/spectra>
##$EXPNO= 1
##$NAME= <H-F>
##$PROCNO= 1
##$TYPE= <nmr>
##$USER= <she>
##$AMP= (0..31)
100 100 100 100 100 100 100 100 100 100 100 100 100 100 100 100 100 100 
100 100 100 100 100 100 100 100 100 100 100 100 100 100 
##$AQSEQ= 0
##$AQ_mod= 1
##$AUNM= <au_zg>
##$AUTOPOS= <>
##$BF1= 200.13
##$BF2= 200.13
##$BF3= 200.13
##$BF4= 200.13
##$BF5= 200.13
##$BF6= 200.13
##$BF7= 200.13
##$BF8= 200.13
##$BYTORDA= 1
##$CFDGTYP= 0
##$CFRGTYP= 5
##$CHEMSTR= <none>
##$CNST= (0..31)
1 1 145 1 1 1 1 1 1 1 1 1 1 1 1 1 1 1 1 1 1 1 1 1 1 1 1 1 1 1 1 1 
##$CPDPRG= <>
##$CPDPRG1= <>
##$CPDPRG2= <>
##$CPDPRG3= <>
##$CPDPRG4= <mlev>
##$CPDPRG5= <mlev>
##$CPDPRG6= <mlev>
##$CPDPRG7= <mlev>
##$CPDPRG8= <mlev>
##$CPDPRGB= <>
##$CPDPRGT= <>
##$D= (0..31)
0 1.2 0 0 0 0 0 0 0 0.06 0 0.03 0 0 0 0 0.0002 0 0 0 0 0 0 0 0 0 0 0 0 
0 0 0 
##$DATE= 1681382754
##$DBL= (0..7)
120 120 120 120 120 120 120 120 
##$DBP= (0..7)
150 150 150 150 150 150 150 150 
##$DBP07= 0
##$DBPNAM0= <>
##$DBPNAM1= <>
##$DBPNAM2= <>
##$DBPNAM3= <>
##$DBPNAM4= <>
$$ [...]
##$SUBNAM3= <"">
##$SUBNAM4= <"">
##$SUBNAM5= <"">
##$SUBNAM6= <"">
##$SUBNAM7= <"">
##$SUBNAM8= <"">
##$SUBNAM9= <"">
##$SW= 18.05172834244
##$SWIBOX= (0..15)
0 0 2 0 0 0 0 0 0 0 0 0 0 0 0 0 
##$SW_h= 3612.71676300578
##$TD= 16384
##$TD0= 1
##$TE= 0
##$TE2= 300
##$TE3= 300
##$TEG= 300
##$TL= (0..7)
0 120 120 120 120 120 120 120 
##$TP= (0..7)
150 150 150 150 150 150 150 150 
##$TP07= 0
##$TPNAME0= <>
##$TPNAME1= <>
##$TPNAME2= <>
##$TPNAME3= <>
##$TPNAME4= <>
##$TPNAME5= <>
##$TPNAME6= <>
##$TPNAME7= <>
##$TPOAL= (0..7)
0.5 0.5 0.5 0.5 0.5 0.5 0.5 0.5 
##$TPOFFS= (0..7)
0 0 0 0 0 0 0 0 
##$TUNHIN= 0
##$TUNHOUT= 0
##$TUNXOUT= 0
##$USERA1= <user>
##$USERA2= <user>
##$USERA3= <user>
##$USERA4= <user>
##$USERA5= <user>
##$V9= 5
##$VALIST= <valist>
##$VCLIST= <CCCCCCCCCCCCCCC>
##$VD= 0
##$VDLIST= <DDDDDDDDDDDDDDD>
##$VPLIST= <PPPPPPPPPPPPPPP>
##$VTLIST= <TTTTTTTTTTTTTTT>
##$WBST= 1024
##$WBSW= 4
##$XGAIN= (0..3)
0 0 0 0 
##$XL= 0
##$YL= 0
##$YMAX_a= 171928
##$YMIN_a= -260868
##$ZGOPTNS= <>
##$ZL1= 120
##$ZL2= 120
##$ZL3= 120
##$ZL4= 120
##$ABSF1= 15.73697
##$ABSF2= -2.314879
##$ABSG= 5
##$ABSL= 3
##$ALPHA= 0
##$AQORDER= 0
##$ASSFAC= 0
##$ASSFACI= 0
##$ASSFACX= 0
##$ASSWID= 0
##$AUNMP= <proc_1d>
##$AZFE= 0.1
##$AZFW= 0.1
##$BCFW= 0
##$BC_mod= 2
##$BYTORDP= 0
##$COROFFS= 0
##$CY= -3
##$DATMOD= 1
##$DC= 0
##$DFILT= <>
##$DTYPP= 0
##$F1P= 0
##$F2P= 0
##$FCOR= 1
##$FTSIZE= 16384
##$FT_mod= 6
##$GAMMA= 0
##$GB= 0
##$INTBC= 1
##$INTSCL= 3.70164e-10
##$ISEN= 128
##$LB= 0.24
##$LEV0= 0
##$LPBIN= 0
##$MAXI= 10000
##$MC2= 0
##$MEAN= 0
##$ME_mod= 0
##$MI= 1.114404
##$NCOEF= 0
##$NC_proc= -7
##$NLEV= 6
##$NOISF1= 3.799351
##$NOISF2= 2.8
##$NSP= 0
##$NTH_PI= 0
##$NZP= 0
##$OFFSET= 15.74138
##$PC= 1
##$PHC0= -19833.43
##$PHC1= 11.40081
##$PH_mod= 1
##$PKNL= yes
##$PPARMOD= 0
##$PSCAL= 0
##$PSIGN= 0
##$REVERSE= no
##$SF= 200.13000603512
##$SI= 16384
##$SIGF1= 3
##$SIGF2= 2
##$SINO= 5.538805
##$SIOLD= 16384
##$SREGLST= <1H.CDCl3>
##$SSB= 0
##$STSI= 16384
##$STSR= 0
##$SW_p= 3612.71676300578
##$SYMM= 0
##$S_DEV= 0
##$TDeff= 16384
##$TDoff= 0
##$TI= <>
##$TILT= no
##$TM1= 0
##$TM2= 0
##$TOPLEV= 0
##$USERP1= <user>
##$USERP2= <user>
##$USERP3= <user>
##$USERP4= <user>
##$USERP5= <user>
##$WDW= 1
##$XDIM= 16384
##$YMAX_p= 429511353
##$YMIN_p= -758053
$$ End of Bruker specific parameters
$$ ---------------------------------
##NTUPLES= NMR SPECTRUM
##VAR_NAME=  FREQUENCY,     SPECTRUM/REAL,   SPECTRUM/IMAG
##SYMBOL=    X,             R,               I
##VAR_TYPE=  INDEPENDENT,   DEPENDENT,       DEPENDENT
##VAR_FORM=  AFFN,          ASDF,            ASDF
##VAR_DIM=   16384,         16384,           16384
##UNITS=     HZ,            ARBITRARY UNITS, ARBITRARY UNITS
##FACTOR=    0.220516191357247, 1,           1
##FIRST=     3150.32242193784, 0,            0
##LAST=      -462.394341067943, 0,           0
##MIN=       -462.394341067943, -758053,     0
##MAX=       3150.32242193784, 429511353,    0
$$ Real data points
##PAGE= N=1
##DATA TABLE= (X++(R..R)), XYDATA
$$ [...]
9206 4138707 4353245 4405946 4229016 4249208 4357052 4303138 4152342 4012070 4086832 4206991
9196 4206991 4173746 4234575 4158032 4008924 3968460 4176876 4176786 3981517 3828439 3833825 3878347
9185 3878347 4039143 4139147 3965373 4021339 4079353 4069170 3949763 3945133 4133089 4440246
9175 4440246 4518761 4668695 4531485 4268375 4301740 4399282 4307811 4228382 4352065 4260109 4332335
9164 4332335 4367681 4484228 4502349 4578513 4654759 4824350 4784955 4630217 4631370 4849419 4875567
9153 4875567 4880775 5069918 5249807 5362626 5518458 5676194 5452407 5652104 5927680 5889600
9143 5889600 6140491 6284348 6303534 6316681 6538529 6721632 6643438 6775662 7069588 7198649
9133 7198649 7314019 7377089 7481635 7692922 7803316 8171609 8480427 8682254 9099122 9423704
9123 9423704 10009946 10652188 10941823 11436325 12181721 13127993 13937865 14617305 14986460 15407382
9113 15407382 15897920 16529071 17057231 17570736 17679196 17581757 17014451 16424059 16138386 16046075
9103 16046075 16055139 16382927 16850334 17111915 17324582 17594781 17921613 18304484 18925581 19589017
9093 19589017 20326866 21155277 22209723 23592266 25118569 27008305 29495018 32255698
9085 32255698 35449414 39056564 42842619 46526532 50811735 56259665 62485044 67702780
9077 67702780 70368030 71079917 72321811 75547480 80126983 84278191 85060715 81272701
9069 81272701 74594163 66952259 60136622 54809842 51272124 49345899 48260361 47115408
9061 47115408 45359231 43132532 40945123 39189974 38214548 37726342 37505805 37714067 38619426
9052 38619426 39875027 41624111 44131306 47329720 51321497 55984109 60758239 65327261
9044 65327261 69667710 73398849 76691890 80749883 86590663 93465472 98881407 101384963
9036 101384963 103043806 103996103 103106643 99808769 92773014 83259317 74669833 67419542
9028 67419542 61685277 57212964 53499188 50318569 47770362 45816797 44364416 42934543
9020 42934543 41584079 40174650 38437512 36929997 35645758 35189996 35171640 34986683 34397785
9011 34397785 33179181 31728972 30237824 28782265 27757689 27341420 27137417 27209151 27307238
9002 27307238 27328531 27551789 27496680 27305852 27336737 27724290 28740321 29588381 29929515 30064089
8992 30064089 30099711 30383125 30521020 30071262 29244206 28254508 27263059 26533379 26299978 26393721
8982 26393721 26586555 27166247 27825252 28069896 28025836 27949494 27662726 26669290 25360023 23560725
8972 23560725 21132536 18999640 17363187 16023264 14743644 13869981 13162826 12814467 12426858
8963 12426858 11840439 11311664 11051857 10680986 10126643 9867767 9621987 9376270 9131519
8954 9131519 8796512 8843778 8802603 8763092 8515202 8279761 8087790 8006309 7891390 7874498
8944 7874498 8008747 8058849 7799543 7485958 7398817 7485575 7369739 7369755 7210918 7329257 7353215
8933 7353215 7239842 7264067 7334995 7532697 7593584 7775952 7728481 7604862 7576740 7543607 7531978
8922 7531978 7826661 7767108 7943687 8033320 8174765 8167440 8274742 8439422 8480376 8594830
8912 8594830 8900439 9271401 9531852 9636939 9733184 9890694 10050854 10189869 10256495 10544547
8902 10544547 10705658 10595110 10849791 10969066 10972004 11267358 11480839 11647409 11775388 11806698
8892 11806698 12153192 12419474 12725739 12857818 13115811 13643707 14081599 14320871 14683535
8883 14683535 15250474 15563845 16071291 16563465 17153024 18077316 18776601 19656979 20656108
8874 20656108 21560891 22215356 22843978 23567486 24349403 25283850 26161237 27091055 28297326
8865 28297326 29942363 32126842 34349998 36435244 38338084 40477994 43335118 47027173
8857 47027173 51006640 54751239 57925359 60931882 63444770 64096222 62282445 58690072
8849 58690072 55145735 52757037 51580310 51586228 52494346 53471489 54028548 53829719 53561892
8840 53561892 53091816 52763868 52299982 52506850 53272981 54398509 55583198 57559354 59905100
8831 59905100 61999851 63659423 65379202 67834778 71463229 76542860 82815357 90024791
8823 90024791 97955029 106173321 113208230 118286429 119773750 116838033 110971826 104362146
8815 104362146 98760927 95477508 93845906 92615043 89530801 85091387 80948075 77143343
8807 77143343 73878927 70898401 68100615 66175088 64989145 64484627 64451002 64364295 64137632
8798 64137632 63777063 63980689 64353054 65006997 66475107 68915812 72345725 76099684 79039082
8789 79039082 81112271 82690145 84222376 86131118 88040991 89632642 90156411 88764914
8781 88764914 85247593 79698147 72560419 65610340 59886475 55610510 52540126 50789144
8773 50789144 49496959 48558393 47436386 45764860 43950242 42295102 40842028 39641747
8765 39641747 38776945 38559451 38379456 38272661 38340815 37766499 37128706 36312156 35296366
8756 35296366 34430541 34190594 34189303 33983640 33541576 32839966 31664670 30149484 28572858
8747 28572858 26950256 25341012 24201218 23198484 22576502 21911981 21568471 21390532 21107347
8738 21107347 20698707 20279149 20347796 20217153 20139735 20320497 20347041 20385619 20345848 20478464
8728 20478464 20914698 21082287 21282355 21382659 21599393 21557363 21653764 21737629 21707672 21990021
8718 21990021 22348324 23055519 23684084 24471703 25497589 26940766 28838278 31287977 34065829
8709 34065829 37848402 42349732 47937355 54106875 61026628 68910774 78885554 90186513
8701 90186513 98883441 98355182 90016322 80548128 71742702 65089475 60027127 56030192
8693 56030192 51973721 48238309 45035345 42241791 39770477 37807858 35816696 33910177
8685 33910177 32622724 31959784 31528822 31207663 30947103 30920020 31369306 32556453 34133826
8676 34133826 35876494 37060885 37978762 39111321 40956864 43490158 47226624 51924105
8668 51924105 56301668 59596049 61035237 60093871 56509870 51915837 47895145 44608124
8660 44608124 42520948 41710515 41493389 41327389 40359812 38422565 36155847 33938714 31520068
8651 31520068 29243581 27335727 25866181 24759911 23936318 23386878 22780346 22402460 22403869
8642 22403869 22472504 22723010 23642458 24516815 24956759 25388928 25994769 26754370 28002252
8633 28002252 28816750 28581361 27897397 27381852 27159474 26975399 26499193 25479944 24785810
8624 24785810 24196252 23505083 22919938 21849626 20633942 19236139 17827708 16534860 15174214
8615 15174214 14046037 13188156 12364152 11904666 11596030 10874811 10356536 10057338 9579876
8606 9579876 9154570 8956460 8586758 8323506 8274699 8186266 7904161 7933860 8073332 8267941
8596 8267941 8581899 8527243 8620584 8785297 8681531 8571318 8248054 8004199 7759184 7645471
8586 7645471 7238760 6873872 6361334 5833815 5380175 4938429 4625322 4331469 3978284 3754696
8576 3754696 3714093 3566277 3385762 3385804 3358157 3091576 2909335 2692273 2857003 2938737 2831900
8565 2831900 2890028 2882176 2841611 2856957 2882217 2932779 2818186 2586813 2562223 2581277 2699463
8554 2699463 2644202 2398902 2129279 1922613 2064904 2015218 1901290 1888638 1743410 1684708
8544 1684708 1638179 1470186 1433175 1346380 1447131 1300621 1145061 1125160 936955 855550
8534 855550 815060 798332 564182 577511 648460 608117 552390 617351 604792 424214 325065
8523 325065 442397 594660 630725 438037 316132 397969 303830 273823 264855 598948 614941
8512 614941 456230 355264 457005 528460 396463 251665 119840 170611 160278 306919
8502 306919 150680 243791 313768 198979 174082 83994 182279 -2099 -66209 62425 314325
8491 314325 297548 303452 363780 192797 122076 215137 302110 254244 286433 177172 339326
8480 339326 300432 268836 92770 124082 112304 43235 242805 63400 45787 40098 25075
8469 25075 150355 161806 129664 78910 137937 184613 277295 125293 -24539 20149 141333
8458 141333 96503 181622 327229 292886 547337 433594 486973 673167 703284 678235 169838
8447 169838 53202 151886 206150 351169 332927 413984 333409 253592 241717 477469 271020
8436 271020 71883 84780 72573 33873 -130 -46863 173344 37208 68246 -71721 -59843
8425 -59843 211487 273383 202996 99345 144469 65591 121924 115458 -68621 -51945 -44278 -89910
8413 -89910 -34653 67497 94155 124627 -7242 -91897 -82589 -240279 -236309 -133805 28089
8402 28089 -87543 20386 -103104 -6320 -202637 -307364 -199341 -366149 -335471 -325136
8392 -325136 -324372 -103105 -25124 -30453 -81287 -160914 -52405 -151370 -397340 -255588 39994
8381 39994 -8229 72589 -153092 -313614 -143258 -164379 -279059 -228102 -257524 -517870 -420650
8370 -420650 -328920 -375793 -182141 -218389 -243455 1712 -183573 -318754 -370378 -315491 -241579
8359 -241579 -177840 -340451 -285851 -273552 -233513 -231063 -187700 -202472 -220451 -136121 -118101 -255917
8347 -255917 -361545 -360811 -458060 -401369 -316772 -238951 -240333 -311806 -226024 -128867 -199542 -61737
8335 -61737 16793 59099 -62420 -278191 -220738 -66686 -257837 -255470 -131364 -75468 -97835
8324 -97835 -208566 -176456 -137172 -133892 -320039 -514566 -390245 -305444 -456248 -488859 -439615
8313 -439615 -472300 -338428 -358987 -419399 -273122 -196857 -11620 80123 -2256 -178543 -312673
8302 -312673 -300133 -187280 -243081 -226999 -344957 -374018 -338690 -280908 38361 119402 49306
8291 49306 -212682 -282535 -323916 -272447 -248228 -187963 -286732 -216777 -154961 -377854 -618806
8280 -618806 -378676 -374391 -388498 -127128 78993 16437 45315 -156708 -244174 -227252 -321603
8269 -321603 -351242 -412160 -336899 -262417 -127285 -50449 -28485 -61208 -90245 -276514 -330984
8258 -330984 -233156 -91711 -127040 -236090 -219105 -419093 -471152 -413695 -224451 -131864 -78501
8247 -78501 -95067 -164664 -146735 -427433 -332174 -217810 -346333 -444722 -167364 -113206 -168760
8236 -168760 -281670 -168601 -379442 -360594 -403222 -287996 -169282 -85938 -234589 -255347
8226 -255347 -52656 190545 73630 -35666 28839 -27121 -39960 -15872 -377018 -402273 -423240
8215 -423240 -337911 -316216 -249857 -19808 -146793 -26581 -50075 -354395 -497609 -364394
8205 -364394 -428864 -115774 -397888 -528303 -443459 -323191 -308490 -330400 -465927 -304578
8195 -304578 -553689 -568592 -457293 1307792 934663 91451 84817 -252126 -142523 -122525
8185 -122525 17359 -143871 -220560 -200293 -28715 -306037 -281078 -245719 -99225 -398778
8175 -398778 -308738 -232794 -293539 -316528 -271713 -412345 -320834 -493925 -614398 -440391 -101884
8164 -101884 -96026 -260455 -224217 -176927 -149598 -151918 -102484 -202504 -116298 -88473 -241324
8153 -241324 -127620 -101768 -37332 55517 -229653 -370894 -277265 -153324 -256421 -400043
8143 -400043 -390428 -472270 -495926 -512969 -357952 -481836 -344966 -249647 -198463 -118647 -354075
8132 -354075 -405209 -336900 -153463 -177408 -298743 -213405 -219399 -354040 -461788 -266192 -69171
8121 -69171 -99450 -189696 -130544 -107755 -56820 -267745 -443498 -277834 -188719 -205259 -299473
8110 -299473 -189057 -165880 -128404 -297727 -219420 -312281 -313435 -222582 -90606 59635 81289
8099 81289 -87713 -42983 -190942 -150212 -394215 -446540 -278079 -207043 -76855 -318098 -270046
8088 -270046 -360917 -256427 -321677 -347941 -76376 -167276 -292615 -533168 -313219 -258054 -156413
8077 -156413 -28574 -31894 -135120 -249503 -52989 -90255 -306564 -409347 -142350 -177832
8067 -177832 -176818 -107731 -234306 -280211 -41979 -170834 -339808 -424849 -299574 -91152 -80520
8056 -80520 -292596 -303771 -339677 -323458 -384579 -230231 -381355 -346015 -161671 -377319 -367588
8045 -367588 -452459 -173109 -372404 -326723 -242608 -171993 -53265 -25071 -3551 -39733 -276906
8034 -276906 -412576 -286984 -256872 -352977 -306925 -381260 -325464 -251210 -360493 -233482 -138158
8023 -138158 -220429 -284406 -218231 -489112 -556139 -758053 -441769 -127737 -70414 -258594 -301919
8012 -301919 -329570 -336726 -266297 -270110 -355039 -188261 -27021 -31436 -132969 -186473 -53596
8001 -53596 80561 17084 17808 -112519 -178674 -255901 -257954 -171310 -236051 -136232 -104142 -247000
7989 -247000 -236900 -187766 -122843 -51168 -228768 -165799 -21918 -55843 -184779 -76930 -176809
7978 -176809 -230933 -326465 -489994 -456251 -206563 -380139 -265831 -16951 16252 -139919
7968 -139919 -136895 -389109 -291722 -157228 -75180 16670 -116601 -164604 -273330 -167759 -227271
7957 -227271 -229504 -140326 -230644 -173196 -14162 -109151 -51381 -98429 -129273 -188670 -254786 -180851
7945 -180851 -206521 -245418 -315666 -154096 -27164 -243671 -226271 13468 -93968 -153544 -308553
7934 -308553 -188980 -175793 -63076 -202963 -314586 -64256 -60354 -142736 -111891 61026 5277
7923 5277 -70186 -109660 -231093 -105569 -206307 -342957 -206097 -324662 -378487 -173112 -219077
7912 -219077 -87049 -130130 -123559 -191020 -219940 7926 -39576 -30174 -10142 84612 -48617
7901 -48617 -219234 -273708 -243935 -288937 -115119 -313349 -104499 -104584 -174541 -169544 -278389 -228595
7889 -228595 -165781 -79288 -163875 -250100 -455745 -364494 -71242 -94210 -68418 -46506 51957
7878 51957 -90157 -178977 -188583 -147705 -86209 -156642 -174618 -62122 -50424 -106675 64933
7867 64933 213928 -49107 -208418 -301463 -403044 -314706 -269446 -365290 -237759 -172983 -165783
7856 -165783 -228340 -171662 -212538 -219043 -204587 -86226 -257106 -307940 -120927 -264006 -197341
7845 -197341 -157114 -127637 -131316 -123772 -75266 -108086 -121033 -39480 -178874 -237640 -222910 -215882
7833 -215882 -258743 -123278 134204 77873 -196703 -125528 -144724 -268779 -349276 -413235 -285812
7822 -285812 -164618 -259057 -160921 -1843 -86004 -41177 -174987 -124882 -45335 -263369 -183351
7811 -183351 -68694 23348 -94897 -93959 -250392 -170796 -135038 -214853 -146246 -32940 -110331
7800 -110331 -67079 84980 624679 331741 73258 48781 -284655 -151320 -194076 -103999
7790 -103999 -50366 -201309 -207599 -6638 -105122 -106888 26103 -75890 -63286 -221742 -144448
7779 -144448 87117 44720 -46975 -153417 -126563 -191461 -325864 -147478 51524 -14321 -170976
7768 -170976 -122854 -168729 60997 282918 271678 98589 -29893 -55750 -29248 7237 -25714
7757 -25714 -68088 -35138 189115 91784 41866 -256213 -293478 -151902 -12292 -119332 -215582
7746 -215582 -195605 -166789 -232621 -228551 -69295 66612 213696 174861 2298 215223 292805
7735 292805 182890 339539 458547 577616 725685 690346 615140 308684 149875 111845
7725 111845 207013 305166 233865 259506 266877 158736 165807 18658 -52665 -20233 -108200 -99924
7713 -99924 -241946 -257069 -168161 -181752 -68642 75798 130661 10118 -13440 -114795 77715
7702 77715 40113 -61904 -80320 106562 -62354 -87201 114971 -79416 -112937 -9742 111565
7691 111565 133075 116543 86665 96538 -26728 17127 -155548 -103767 -76155 30101 -182172
7680 -182172 -160380 -78185 -159679 -242947 -275675 -344497 -78796 157827 -10575 -153161 -187373
7669 -187373 -81238 -4105 39542 101528 -57185 -62424 11347 51140 10784 -203736 -125377
7658 -125377 10287 -227556 -171744 -42205 -2705 133160 75578 -74561 -252896 -321482
7648 -321482 -321764 -103937 -33968 -53326 -77812 -126814 -261635 -252765 -122474 -134760 -16833
7637 -16833 35459 69278 -20003 -2112 148750 -67958 -152436 -245932 -209870 -191061 -73690
7626 -73690 25621 -36607 22655 153695 192832 193290 57909 11721 2504 204741 -120148 -49727
7614 -49727 53230 -154925 -117888 -140261 -97224 -64260 -89428 -103904 -141141 -203586 -12498
7603 -12498 -210964 -80583 9357 -127110 -135107 52210 117905 244797 276107 202213 -86309
7592 -86309 -92409 23218 116867 108028 181965 184649 6640 33816 95365 22325 78144 157671
7580 157671 -52049 61326 70177 134482 223067 131178 -70810 111914 77924 55758 258456
7569 258456 54202 13451 224644 154287 14118 54388 -37063 -173414 -170332 87734 108798
7558 108798 81051 -32767 -223839 -111086 53864 -213056 -183892 -13430 -17702 95590
7548 95590 220913 31189 84652 49325 -20514 168123 87823 38015 8552 -94655 -43574
7537 -43574 112310 -150910 -3973 236966 -497 67616 20813 11088 121384 98935 128118
7526 128118 165549 240849 170623 191002 149779 262721 272585 408036 365836 206867 319340
7515 319340 468893 352540 334681 347677 444007 442319 487104 670729 728760 712646 678300
7504 678300 471817 316808 219444 145973 182580 201217 130967 55454 -15570 153966 401608
7493 401608 231019 133296 198357 173963 261226 255330 77128 28680 88869 208779 428028
7482 428028 626446 418296 325606 434952 253664 215221 9158 65844 106587 219347
7472 219347 275342 259969 167321 179347 133676 92451 110041 276565 370702 119862 125497
7461 125497 30943 103052 -60934 -66185 46400 -89397 -95781 173485 221500 153839 -75241
7450 -75241 34994 28672 29392 197098 204779 150286 197236 138236 155209 87172 27749 53173
7438 53173 323584 280275 282120 506387 388438 196415 344174 141351 188003 268773 234855
7427 234855 205583 219015 224987 263303 163430 7599 34611 163226 498218 399978 331278
7416 331278 335385 344719 435672 313246 464043 354260 236643 255559 286676 314939 281839
7405 281839 233432 173666 329445 251928 372869 23187 -45754 104778 51066 228787 473077
7394 473077 415751 348764 346899 164304 387183 415140 197185 286452 279048 364691 185829
7383 185829 109891 87999 111837 233323 315583 295167 260617 258191 213651 266922 387390
7372 387390 489323 539753 84943 200395 322166 254513 248757 114511 182997 350210 434576
7361 434576 255278 215911 322716 352384 324069 432565 514455 488591 523874 436510 293040
7350 293040 415822 355480 239749 421004 286478 41446 257153 210758 74810 183018
7340 183018 263888 466699 456781 146520 189163 264255 46060 284123 306625 275296 225787
7329 225787 447495 325551 161487 223802 331796 405811 438497 390417 192548 290217 171705
7318 171705 276566 461383 410221 306251 218003 255503 391767 308720 311885 235885 224839
7307 224839 333237 363322 388264 307747 245280 272683 444472 616195 511481 557137 605359
7296 605359 476388 316614 382963 426676 345683 526884 503129 363660 394418 589684 589301
7285 589301 382972 596364 466024 518144 606022 691155 527190 346437 381648 373697 322423
7274 322423 393959 443324 534872 741867 526356 583169 805497 719027 785989 734023 649539
7263 649539 681891 727022 746023 787645 717836 754460 727060 839811 850278 787800 850193
7252 850193 888358 870004 763177 856933 921693 854732 629677 671722 884665 718088 868874
7241 868874 879827 725125 1070867 1048160 947666 933358 913984 882516 924165 907531 966185
7230 966185 751378 847570 984326 937193 967649 1306121 1321626 1384570 1434507 1132204 1217022
7219 1217022 1214091 1324075 1213536 1308130 1280864 1242378 1373267 1293837 1176271 1303293 1318800
7208 1318800 1343597 1453289 1421008 1375046 1389738 1472632 1543037 1453871 1479801 1478147 1434145
7197 1434145 1682491 1758394 1780283 1777264 1784593 2015858 2027094 1905855 1941876 2030494 2227154
7186 2227154 2395178 2290229 2293119 2483843 2567287 2674383 2689895 2698625 2590248 2598772 2644691
7175 2644691 2785310 2799062 2737003 2772888 2977092 2954771 3097802 3311752 3417312 3369083
7165 3369083 3481351 3491353 3520396 3563440 3418419 3603344 3777311 3833932 4009140 4054572
7155 4054572 4288816 4611324 4605801 4668672 4761683 5124321 5566454 5624131 5748205 5684909 5763808
7144 5763808 6069912 6279335 6294174 6812947 7300264 7769619 8210541 8610609 8718824 8944757
7134 8944757 9186467 9761260 10401148 10770960 11451515 11888014 12803040 13413449 14256959 15301806
7124 15301806 16378569 17746992 19362862 21391592 24022950 27635138 32034637 37209309
7116 37209309 44011458 52488788 63544140 76885293 91311622 103479966 109577294 107716425
7108 107716425 98666051 84850735 70389531 57652479 47558884 40035523 34608376
7101 34608376 30670344 27666329 25382646 23398207 21769945 20375783 19505256 18638841
7093 18638841 18073321 17876360 17922895 18213426 18791547 19929370 21424955 22837347 24112205
7084 24112205 25094701 24958775 23977806 21933353 19524285 17186264 15049937 13192170 11776509
7075 11776509 10963440 10065829 9541372 9120992 8546259 7988403 7628318 7343355 7135126
7066 7135126 6901469 7039925 6817184 6662284 6399763 6150331 6225837 6024039 6118306 5833738
7056 5833738 5677067 5500456 5563192 5808887 5810865 5775731 5909898 6126194 6522114 6824735
7046 6824735 7033831 7482093 7834810 8039374 8151769 8379075 8469719 8419744 8335329 7988959
7036 7988959 7502801 7202100 7064543 6930192 6834139 6871074 6786695 6618717 6927514 7206340
7026 7206340 7617328 8401488 9345326 10423623 11614050 13350486 15638967 18295490 20787971
7017 20787971 22526573 22467893 21215454 18879811 16111025 13467940 11197438 9394169
7009 9394169 7979047 7059057 6489156 5887175 5433695 4929529 4386596 4053147 3792690
7000 3792690 3781744 3549177 3213794 3119408 3127528 2846823 2727461 2556311 2412823 2408148 2251017
6989 2251017 2136334 1937636 1771672 1848621 1789016 1630050 1618360 1512847 1473803 1632933
6979 1632933 1710632 1405080 1416758 1307584 1350190 1261709 1185932 1192574 1216048 1132710 1171210
6968 1171210 1219191 1168091 1125994 1012763 976767 926111 1009841 961693 800559 675347 905664
6957 905664 917267 752020 817389 780835 680672 774787 943564 910938 923553 776237 552571
6946 552571 708746 669373 799318 714075 692058 615293 585322 664029 441020 519460 527579
6935 527579 549287 682623 609041 631557 710177 699278 739600 752404 669437 563520 278134
6924 278134 352777 321324 399604 490431 470157 224810 332845 401681 370416 399965 577785
6913 577785 618966 514972 593043 548160 589706 411646 633201 592031 618360 855374 818399
6902 818399 805809 842889 908827 876521 804965 757191 701223 521005 618846 650548 722297
6891 722297 683120 470639 380626 599175 782511 684195 799457 699869 840918 827199 768564
6880 768564 878656 982071 1064041 994854 1087264 1198013 1235941 942632 736942 646101 616772
6869 616772 541073 634201 637428 739778 538136 370263 661761 780678 818361 750303 660743
6858 660743 588669 657630 755984 840970 638034 651247 771734 712207 590987 881423 915241
6847 915241 855693 867963 926216 884156 1012180 1031258 979764 1231688 1359227 1246161 1223882
6836 1223882 1201485 1240707 1109391 816433 828767 911979 819572 679154 603621 608013 489204
6825 489204 228025 311624 312028 280099 287009 442290 450222 272360 284226 260925 372313 421714
6813 421714 406405 278611 407606 379404 429028 326501 359581 482114 354595 396401 451637
6802 451637 298541 237850 257569 323066 219340 145244 89211 50510 300576 263764 284157
6791 284157 232894 266696 281430 344477 457002 462960 199564 139624 374915 380436 432715
6780 432715 337190 298296 467889 381660 484350 499500 408023 379934 464791 359785 454965
6769 454965 356664 310843 243616 191381 163213 171387 170608 210239 205522 405206 95446 106696
6757 106696 -38023 80345 197434 154597 210714 148905 215732 389062 390547 34634 -93425
6746 -93425 84434 213543 66780 254235 -7560 -45002 -4848 95285 151336 153017 335647
6735 335647 413391 336066 368500 244481 327797 393772 420183 368754 365031 311709 409707 441216
6723 441216 432391 227333 284846 304847 262075 208731 65641 171493 484311 493118 352136
6712 352136 472364 467152 820363 873866 789221 790731 768365 734266 509991 237327 112775
6701 112775 373401 297913 247925 328286 402596 298966 176177 138078 253203 267174 265438
6690 265438 197720 313648 376372 512507 598416 305804 331128 374046 454248 254298 184791
6679 184791 295655 470140 390672 325493 116222 68128 106544 125790 148161 210244 369837
6668 369837 407778 178760 149672 140989 101585 193671 171135 272061 114333 26928 58157
6657 58157 101398 226361 289499 313763 416874 408717 159378 105634 51206 208602 236208
6646 236208 105744 48280 -12651 9518 240240 299817 348296 283896 242336 254552 407808
6635 407808 492122 209915 87657 265138 389429 532108 534132 254460 205965 205871 284634
6624 284634 51071 161065 168271 90620 30811 242824 322760 343872 440279 530334 596971
6613 596971 586260 590653 384444 258126 261791 318802 409001 376505 296089 364377 214159
6602 214159 255057 248117 444535 525874 343648 381410 200356 222595 254052 145871 290539
6591 290539 349363 205880 8871 -10081 58631 233427 57453 114280 417599 471334 534081
6580 534081 614367 534319 304719 189376 151393 213911 232754 161323 260944 514074 532155
6569 532155 565722 306347 106820 234943 412246 323824 362512 389231 359723 513035 586777
6558 586777 507985 322309 356409 222528 302472 405544 408589 355360 272366 425852 373432
6547 373432 365054 429874 392298 435465 525170 438089 464882 427869 532879 577824 445796
6536 445796 491193 623985 654285 849025 919122 980870 1101958 708265 659126 637514 518584
6525 518584 437289 588980 654049 687104 508281 370382 403661 338963 319642 415921 329081
6514 329081 457547 723790 462306 504314 548439 542811 513825 418807 363339 348645 451179
6503 451179 362864 376807 373388 644647 627417 366975 217417 438367 372878 394794 385076
6492 385076 329177 431994 336386 409836 280526 337885 321395 418980 426860 281570 210186
6481 210186 360806 362596 315361 65705 -85749 71525 109574 198634 363366 458989 472088
6470 472088 271578 269607 293793 728291 693389 460236 461053 558528 574540 543508 385272
6459 385272 307769 500568 502052 494818 605009 612683 565374 474139 536417 586688 534631 456653
6447 456653 359286 422865 268352 336302 289516 306639 206052 303332 340005 436002 383295
6436 383295 318604 344182 464284 317617 293138 249828 253181 228781 385653 465659 382882
6425 382882 436005 251574 326944 474709 383540 290329 341523 457953 305610 161243 234428
6414 234428 290212 427043 361487 523157 544493 483802 507161 349654 453359 450103 400718
6403 400718 546070 518549 505720 386284 488783 612865 511155 518443 763608 701890 572536
6392 572536 749955 669675 499818 308143 321652 642258 535323 410799 453569 445973 399105
6381 399105 418276 476100 610123 460170 298240 349170 355158 539406 487953 402365 370774
6370 370774 401388 543343 441469 553123 494885 589759 575689 396623 428536 624699 446192
6359 446192 489903 345690 392158 537250 425257 556759 583991 439792 325704 321288 406597
6348 406597 405381 512691 595983 767800 771934 554939 591748 589887 740423 600039 642472
6337 642472 768244 800045 554038 535596 293722 413127 541981 410758 475713 584410
6327 584410 575402 436957 471863 539966 555473 507996 464600 515227 583176 568117 541181 694155
6315 694155 881520 845010 594952 579368 739900 634540 612856 554554 677072 880379
6305 880379 791429 748427 735908 766454 749632 710854 688483 755829 876201 693777 789951
6294 789951 760498 689801 762229 762954 819362 668491 683405 603852 661866 596407 737156 581614
6282 581614 639447 755560 784098 725297 813289 965242 862792 523008 639480 964330
6272 964330 947220 1055158 1127223 895680 638574 1002995 1245554 1131622 963086 890716
6262 890716 849939 837237 777439 794228 719082 696868 717257 833415 869314 909075 984724
6251 984724 991882 990669 1009462 835817 868999 1000571 961496 857842 980272 1094750 1051114
6240 1051114 1164442 1209455 1053269 907852 915912 959727 1079742 1060406 993978 910216 1065803
6229 1065803 1221499 869087 933051 1146462 1207953 1069387 929646 985067 1113420 901724
6219 901724 1097144 1044929 1079062 1199527 1162017 1325458 1231206 1132983 1130342 1005266 1122824
6208 1122824 1162039 1282818 1285168 1224159 1323691 1320944 1511175 1295332 1319464 1389671 1311615
6197 1311615 1322775 1449500 1515050 1406014 1554785 1772665 1809905 1684736 1466743 1560829
6187 1560829 1615890 1666176 1663281 1663914 1427044 1429036 1630301 1640210 1862514 1815241 1772392 1860967
6175 1860967 1743557 1962798 1753686 1642247 1774432 2032215 1926562 1751927 2032726 1865808
6165 1865808 1975560 1939982 1943753 2007811 2062224 2210640 2139057 2318951 2355889 2079060 1997911
6154 1997911 1964752 2006584 2040203 2202118 2251604 2287502 2243358 2190851 2133236 2271242 2358935
6143 2358935 2397568 2506477 2553955 2591965 2573922 2590884 2677404 2598627 2547023 2605908 2646129
6132 2646129 2838172 2757483 2621159 2714300 2832247 2729606 2926297 3099599 3136723 2952785
6122 2952785 3045442 3197472 3245487 3385860 3319551 3189798 3177331 3436331 3440455 3484257 3473568
6111 3473568 3632613 3750224 3784745 3927125 4165532 4392087 4449709 4624680 4833138 4850706
6101 4850706 5087519 5205752 5421392 5578626 5739087 6183856 6351159 6561021 6827814 7175885
6091 7175885 7424591 7923282 8445962 9374342 10269879 11251499 12383624 13718064 15519376
6082 15519376 17773847 20717935 24235118 27801450 30820255 31579993 30160387 27493493
6074 27493493 25002781 22974686 22054146 21779363 22191858 23915103 26389945 29452610 32142064
6065 32142064 33025226 31312887 27917367 24041378 20799425 18029800 16000453 14487337
6057 14487337 13299097 12569235 12113355 11545149 11099652 10730701 10564176 10398133 10364075
6048 10364075 10273911 10273541 10293506 10331495 10496617 10471415 10854255 11109103 11447900 11751987 12331849
6037 12331849 12994209 14035587 15434363 16877085 18618478 20644669 23045362 26544949
6029 26544949 31055517 36041982 40784114 43104588 42332960 39115152 35510905 32484857
6021 32484857 30381343 29320060 29744876 31123480 33662554 37575390 41502034 43817869
6013 43817869 43032112 39310821 34095731 29182818 25162799 21823459 19428867 17451142
6005 17451142 15959174 14806497 14084573 13127020 12514084 11767027 11405449 11063978 10593395
5996 10593395 10118568 9806834 9717541 9582234 9480843 9270226 9075412 8753777 8684179 8704272
5986 8704272 8740783 8570581 8381399 8282121 8107419 8088487 8398977 8172868 8120350 8081049
5976 8081049 8052057 7872979 8108712 8113734 8004130 7930749 7860863 8000156 8031655 7934920 7727480
5965 7727480 7798100 8135146 8136117 8093904 8075665 7920688 8006701 8092583 8344205 8476190 8482105
5954 8482105 8389314 8493511 8672663 8735032 8969189 9389284 9374454 9404626 9651559 9725603
5944 9725603 9884482 9820697 9697711 9654454 9757977 9827860 9781352 9640757 9380921 9277825
5934 9277825 9325906 9422793 9599537 9526416 9233373 9476856 9533162 9432360 9562302 9447386
5924 9447386 9632028 9803716 9958942 9963790 9699982 9828258 10304188 10739060 10963646 11360326
5914 11360326 11922908 12571709 12990769 13567618 13774430 13878448 13979140 14045685 14067355 14007700
5904 14007700 13930708 13931798 14058934 13842778 13671286 13731408 13814856 13820286 14125979 14351029 14552410
5893 14552410 15032826 15560019 15944419 16619517 17256514 17642439 17821639 17695966 17493480
5884 17493480 17389189 16875819 16125127 15644221 15384244 15147638 14928668 15071014 14974805 15082561
5874 15082561 15454849 15668071 15930417 16057485 16161974 16495292 16786630 17058529 17427956
5865 17427956 17491436 17982852 18295080 18759009 19560287 20408516 21348772 22564354 23919780
5856 23919780 25392070 26845381 28261200 30087913 31981170 33966447 36059834 37900462
5848 37900462 39319038 39842174 39326328 37995117 36244437 35038690 34304981 33901536 33696148
5839 33696148 33559939 33391518 33224385 33407187 33252488 32953121 32069744 31341254 31203165
5830 31203165 31173776 31097792 31339524 31742330 31993839 31887934 31275251 30943931 30605737 30157094
5820 30157094 29684376 29071471 28647915 28809050 29511927 30328824 31149098 30955626 29543049
5811 29543049 27399539 24925242 22681726 20871106 19490678 18160254 17220811 16511700
5803 16511700 16079758 15671129 15163329 14647286 14348192 13973144 13853513 13581177 13289673
5794 13289673 13140044 13102464 12964907 12817794 12752761 12708012 12529707 12320493 12257740 12056291
5784 12056291 11851882 11782271 11906391 11678292 11655841 11803918 12150640 12409871 12517106 12481446
5774 12481446 12737139 12902399 13266767 13623650 13519390 13987303 14237655 14829696 15426672
5765 15426672 16197987 17085647 18434823 19670452 21559508 23920913 27051075 31016395
5757 31016395 35870965 40111997 41723251 40190698 36096862 31581675 27462609 24378844
5749 24378844 22104885 20148978 19092168 18342785 17711459 17268801 16834544 16638090 16394066
5740 16394066 16625851 17355761 18289657 19411563 20624677 22141310 24417357 27421457 31045968
5731 31045968 35601548 40661687 44288663 44483403 41361979 36578706 31694052 27673289
5723 27673289 24532621 22357460 20570616 19505670 18619909 18162525 17748303 17413447 17428700
5714 17428700 17512809 17911399 18258619 18911318 19807286 21126074 23138363 25784102 28818294
5705 28818294 31863392 34033070 33888905 31501876 28378864 24862614 21988641 20089407
5697 20089407 18594170 17509749 16567148 16092462 15569921 14957136 14603540 14694022 14458403
5688 14458403 14685684 15285444 15911901 16563311 17753834 18941008 20385037 22883917 26142761
5679 26142761 29896583 33140068 34559152 33516930 30064331 26182218 22581936 19655809
5671 19655809 17684669 16069601 14653007 13766863 13100648 12413118 11853208 11421517 11148202
5662 11148202 10697845 10380685 10252036 10065914 10018844 9766019 9702455 9551795 9461736 9366294
5652 9366294 9191307 9089223 9067925 9131474 8987447 8924078 8761470 8683503 8549846 8459744
5642 8459744 8232727 8139827 8129972 8103137 8213434 7923397 7777757 7954426 8120312 8125482 7927038
5631 7927038 7870243 7772359 7764494 7700660 7673655 7487956 7452907 7477265 7616094 7425761 7330571
5620 7330571 7286835 7462458 7323448 6993746 6748435 6570496 6590392 6718579 6649332 6616390
5610 6616390 6434070 6335521 6232509 6270901 6357184 6255946 6150179 6123366 6010328 6105369
5600 6105369 6362370 6282091 6119384 6238066 6227582 6061350 6298681 6362978 6223335 6355646
5590 6355646 6357855 6204363 6408524 6612774 6645552 6418407 6360121 6311390 6487386 6349248
5580 6349248 6269821 6412318 6416437 6364435 6050477 5689020 5658676 5799422 5809022 5820613 5911085
5569 5911085 5993823 6159192 6335991 6577440 6801777 7002410 6976702 6805350 6662564 6399990
5559 6399990 6242182 6114151 6042495 6005327 5959494 5864642 5816554 5903361 5561651 5579737 5600656
5548 5600656 5583166 5498560 5460584 5578747 5510766 5844744 5802988 5869713 5806505 5853956 5913178
5537 5913178 5989109 5901004 5800563 6056255 6038887 6016545 6046765 6102286 6024595 5988421 6115223
5526 6115223 6388010 6652812 6788802 6735234 6751600 6782489 6755926 6780797 6798565 6937314 7329623
5515 7329623 7704287 7908256 8198486 8631251 9002304 9481970 9934366 10239322 10306755 10172905
5505 10172905 10108796 10034814 9909894 9757994 9731991 9628590 9513977 9379500 9371555 9381382 9641656
5494 9641656 9871029 10168206 10174693 9931746 9891257 9784354 9665876 9572614 9270358 8984847
5484 8984847 8609428 8502584 8479697 8469316 8289520 8312142 8230634 8099809 8213627 8061907
5474 8061907 8300778 8163505 8175125 8180417 8081032 7953922 7914120 7951342 7872561 7791845 7881041
5463 7881041 7836969 7939575 7642740 7567522 7614944 7644421 7829551 7881066 7887080 8082360 8256170
5452 8256170 8411054 8472209 8384260 8248062 7930174 7675238 7693072 7665138 7750875 7749326 7736095
5441 7736095 7800262 7878166 7877166 7789117 7954148 7899344 7768972 7747697 7899813 7765032 7753334
5430 7753334 7908536 7892173 7704516 7680808 7717150 7867254 8149966 8262061 8496768 8830298
5420 8830298 9066065 9457715 10026359 10696885 11212809 11633979 11710919 11233947 10840899 10484858
5410 10484858 10308565 10300508 10319987 10674663 10803765 11180013 11827067 12530244 13329409 13830675
5400 13830675 14002687 14169933 14378025 14642217 14621694 14698680 14974744 15319229 15726865 15836242
5390 15836242 15647234 15293063 14952010 14472219 14285479 14004459 13998093 14179728 14349973 14590601
5380 14590601 14858122 14709776 14304397 14019257 13634488 13518759 13507915 13547658 13677153 13757365
5370 13757365 13724430 13511764 13328793 13158741 12989353 12647151 12404916 12235007 11892157 11756918
5360 11756918 11716024 11676248 11664950 11678361 11830051 12129476 12511449 12994066 13607316 14372553
5350 14372553 15346231 16010515 16394195 16752726 16795944 16884897 16659032 16485234 15985981 15623255
5340 15623255 15090748 14631068 14359422 14121974 13835300 13620948 13826209 13886958 13877430 14078708
5330 14078708 14400379 14613045 15181628 15926675 16279968 17049416 17673622 17637774 17520031 17409313
5320 17409313 17059101 16549435 16091799 15681884 15433199 15167363 14775214 14612444 14133571
5311 14133571 13678322 13300359 12693141 12435364 12254130 12136596 11901634 11836783 11971301 11911447
5301 11911447 11933532 12186821 12166755 11961939 11485573 11366072 11155762 11113411 11313724 11286339
5291 11286339 11279038 11313286 11379621 11672764 11818752 12009827 12124296 12012387 12050471 11828653
5281 11828653 11617337 11602453 11881823 12149667 12005399 12018057 11878566 11906358 11895906 11954218
5271 11954218 11875563 11967642 12068595 11939304 11980821 11875499 11750009 11520957 11214179 11226592
5261 11226592 11288958 11089359 11083566 11204333 11138519 11208279 11198964 11145019 11202926 11231494 11193103
5250 11193103 11143322 11103909 11219000 11386979 11404848 11458096 11499356 11832256 11901814 11914579 11674251
5239 11674251 11496955 11308787 10972831 10772494 10798359 10861832 10896210 10766245 10662994 10583805
5229 10583805 10668284 10564795 10522968 10538445 10648551 10794039 10779921 10604857 10710563 10785281
5219 10785281 10983899 10972854 11100606 11458264 11517734 11621021 11603909 11716563 11671260 11701948
5209 11701948 11636808 11841658 11734817 11662952 11872721 11984993 12132363 12183663 12477991 12656239
5199 12656239 12768464 13097808 13210957 13264598 13332669 13600203 13854739 14025139 14100716 14186270
5189 14186270 14269155 14558870 14792290 14867883 15109411 15426157 15479318 15945959 16122943 16405725
5179 16405725 16899310 16916146 17263742 17576028 17989121 18469225 18789413 19567630 20289823 20987278
5169 20987278 21645078 22344971 23131897 24361438 25966173 27387788 28284141 28410333 28163213
5160 28163213 28101987 28252476 28680824 29451740 30664450 32308285 34581539 37464889 40555718
5151 40555718 42960774 43528928 43223683 43284960 44019777 45733465 48054510 50912491 53664188
5142 53664188 56777038 61468026 67173568 73722964 79996372 84503607 85776601 83196344
5134 83196344 78957027 74756355 70323423 65930825 61698096 58751038 56976552 56726548
5126 56726548 57823559 59187996 59943475 59837553 59736874 60465086 61656451 62929421 64666392
5117 64666392 65958587 66878406 67668728 67740608 67024776 65601855 62703280 59354015 57034362
5108 57034362 56034956 55737255 55666978 55171598 53028872 50662857 47897212 45404020 43373448
5099 43373448 41831592 40932229 40778588 41176891 42589574 44374160 46197419 47618124 48357013
5090 48357013 48313474 47947990 47754050 47870667 47236291 45694234 44143627 43279932 43145821
5081 43145821 43642697 44266369 44422165 44004120 42878464 41600818 40938840 40873479 41205123
5072 41205123 42404962 44154915 46909843 50968226 56234519 62236919 68183058 72256985
5064 72256985 73815853 74257400 74730178 73870491 70700688 66469485 63194211 61357988 61296297
5055 61296297 62950918 65286061 66877966 66832878 65132796 63764283 63312043 64470524 67360885
5046 67360885 71756287 77267758 82768565 86700653 91040648 97933431 107339125 118107831
5038 118107831 127080289 132161344 134573243 132406755 128714312 127615151 128335803 129340312
5030 129340312 130093646 129645730 125755662 118867786 109472067 99567840 91686353 85939155
5022 85939155 80882671 75131593 69665500 65274808 62082016 60441749 60599710 62124838
5014 62124838 65070944 68327927 70337974 70716817 67088205 61970008 57540811 53963150
5006 53963150 52060154 51245878 51063357 50381400 48528543 46136102 44368670 43518198 43061619
4997 43061619 42788352 40938685 38413276 35900776 33701479 32119882 31464651 31527707 32002463
4988 32002463 33242959 34655904 34782850 33138318 30536336 28095148 26013712 24306154
4980 24306154 22997857 21861707 20827764 20107628 19518918 19067576 18561202 17958973 17587910
4971 17587910 17201046 16990826 16853243 16366374 16149604 16155548 15877689 15590705 15309859 15193478
4961 15193478 15216793 15066927 14898453 14778776 14614642 14519027 14428853 14280111 14521151 14474893
4951 14474893 13981694 13775559 13948150 14051005 14020536 13898912 13814085 13864275 13911933 13907311
4941 13907311 13939228 14179662 14173601 14304433 14457700 14696619 14693279 14745738 15058982 15329277
4931 15329277 15324578 15417374 15808106 16264542 16763525 17302531 17909710 19005150 20393488 21863666
4921 21863666 23708432 26511202 29812578 33292317 36721380 39638694 42632504 46505880
4913 46505880 50423309 52201323 50881465 47567970 42359811 36763255 32181439 28529125
4905 28529125 26005322 24145091 22871506 21975945 21424803 20794840 20447383 20245952 20224388
4896 20224388 20332471 20728321 21041226 21481534 22326120 23366175 24501850 26257250 28283471
4887 28283471 29989452 30680765 30592298 30281184 30431752 31899802 34073005 37026149 39976215
4878 39976215 42101634 43591867 45358725 48566505 53921485 61508431 68807790 71985475
4870 71985475 68592038 61671905 54721575 48903476 44628570 42017594 41006010 41020233
4862 41020233 42348963 45311396 49981676 56045643 63009803 68157838 67913231 62082853
4854 62082853 54791463 48583694 43997246 40960419 38831699 37078737 35091720 32950142
4846 32950142 31091811 29695399 28895284 28430559 28154879 27295244 25923338 24780875 23681075
4837 23681075 22792817 22255659 21785215 21329878 21380631 21314284 21253145 21376499 21398251 21661137
4827 21661137 22050849 22615975 23185783 24204429 25689353 27436858 29491106 32130870 35499469
4818 35499469 39440714 43597521 47432475 50797948 55095864 59309163 62963938 63603528
4810 63603528 61253301 59569017 58932071 58871393 57905724 55871185 53172073 50646605 48982612
4801 48982612 48412617 49716001 52553552 56199870 60099507 63283786 66558652 69892250
4793 69892250 73811518 79479425 85625824 88652073 85427533 79594480 74651446 70930978
4785 70930978 67961458 64948804 62918967 61951820 61665448 61036322 60238429 59778106 59134389
4776 59134389 57812681 57246141 57732575 59149175 60176702 60968530 62228196 63153083 61678018
4767 61678018 57767411 54339193 51949867 51139210 51677695 54147717 58350059 64769079
4759 64769079 73010540 80866421 84913521 83953690 78249820 68956421 59513791 51542513
4751 51542513 45408093 41160117 38500254 36851033 36256320 36024949 36120908 36522334 37897775
4742 37897775 40123625 43700467 47946182 51421825 52161993 49235689 44926317 40831450
4734 40831450 37445436 34639116 32978865 31863245 31469741 31629961 32375385 33738333 35601236
4725 35601236 37951883 41446123 46081082 51706653 58576887 65300542 70752709 73850102
4717 73850102 74664049 72199138 65577372 58140858 51441244 46048765 42140425 39466314
4709 39466314 37748659 36875457 37071977 37675758 39262291 41537598 44655136 48982656 54895222
4700 54895222 62643487 71828442 81225865 88485682 92575412 93683869 91310960 86950027
4692 86950027 80372356 70365067 59938141 51036091 43945480 38642407 34546804 31608115
4684 31608115 28881066 26824128 24802788 23218602 21940695 21061816 20065184 19178684 18558827
4675 18558827 17701564 17203069 16796344 16383993 15913820 15507147 15025072 14607470 14140791
4666 14140791 13946330 13708627 13569498 13258967 13151435 13060422 13051046 13036033 12872497 13070491
4656 13070491 13208272 12990814 12830540 12839740 12819495 12680923 12682966 12615230 12336167 12017211
4646 12017211 11895315 11584679 11362332 11230958 11409735 11420939 11349925 11384032 11505908 11661517
4636 11661517 11877467 12114157 12108187 12119474 12303547 12211509 12064832 12073455 12176771 12103020 12133949
4625 12133949 12077602 11654908 11210103 11020707 11131976 10916441 10596727 10511413 10528631 10598466
4615 10598466 10441420 10660036 10837853 10928434 11121142 11380987 11630605 11738144 12009047 12306644
4605 12306644 12664380 12785357 12891094 13064824 13139756 13247489 13259754 13256003 13291252 13418672
4595 13418672 13766219 14142947 14809012 15332049 15875880 16430999 17703586 18896894 20090185
4586 20090185 21615748 23659476 25766350 28027543 30531286 33241118 36844560 41535934
4578 41535934 46383813 50529011 51587269 49630409 46087532 42470761 39825707 38650108
4570 38650108 38925319 40377955 43329270 47602099 52406372 56382902 57107060 54695551
4562 54695551 50964812 47432703 44815430 43359053 43573610 45054772 47078853 48470237
4554 48470237 48399462 45978413 42463952 39113840 36550240 35135723 34821105 35114644 36422719
4545 36422719 38619546 41400622 42942390 42310477 39597964 36049311 32465979 29191323
4537 29191323 26988182 25419487 24021103 22504340 21299056 20548804 20133334 19790063 19280673
4528 19280673 18892197 18640429 18289098 17724050 17288045 16873177 16671407 16404080 16294800
4519 16294800 16616974 16583291 16652307 17322648 17680485 17928955 18233850 18360881 18381059 18630812
4509 18630812 18516788 18283236 18202178 18035926 17821828 17826235 17975821 18020083 18292877 18683197
4499 18683197 19300744 20080743 20801141 21418048 22308196 23404244 24792306 26612386 28936223
4490 28936223 31611540 34278186 37656808 42241196 48373882 55943477 64536837 71790283
4482 71790283 75297185 74412005 70109472 65355101 62167789 61394141 63559165 68736677
4474 68736677 75446272 80703739 79650356 72787729 64963660 58305493 53173823 50494403
4466 50494403 49744008 50758548 53634485 58370305 63845708 67844004 68722069 67391056
4458 67391056 65183678 63459966 61940029 61308350 62526684 64670013 66090157 66192406
4450 66192406 63146484 56101224 48284059 41617407 36351375 32006644 29133501 27145925
4442 27145925 25990258 24615364 23561583 22586308 21460743 20181809 18796785 17818001
4434 17818001 17063019 16388340 15603514 14944908 14557144 14436091 14336483 14112702 13995028 13830455
4424 13830455 13645617 13543942 13297710 12959203 13199564 13229904 13106213 12929727 12773465 12807981
4414 12807981 12703469 12596147 12193573 11839710 11635508 11640902 11805791 11967338 11958805 11923216
4404 11923216 11947123 11922906 11693984 11490410 11319826 10924119 10821190 10675743 10742340 10654419
4394 10654419 10670470 10541211 10414892 10192841 9724562 9739123 9547329 9376886 9162521 8845421
4384 8845421 8369691 7926499 7653999 7487579 7040291 6675676 6635043 6275902 6011588 5769315
4374 5769315 5610446 5606940 5509568 5577385 5530464 5630472 5623061 5601673 5451999 5203082 5059060
4363 5059060 5234257 4981770 4766421 4647612 4395242 4479573 4460392 4265779 4191284 4394841
4353 4394841 4553200 4517028 4447885 4320773 4436804 4652479 4754852 5101405 5641565 5575508
4343 5575508 5576377 5533410 5497463 5477598 5423146 5564075 5548590 5577189 5509920 5546717 5678838
4332 5678838 5663252 5558449 5578915 5513392 5548032 5630470 5357858 5432731 5698364 5966067 6121031
4321 6121031 6084645 5910139 6010415 5858081 5924960 5994071 5957676 5846629 5585827 5493862
4311 5493862 5425034 5341527 5329704 5452794 5532060 5444504 5394446 5394492 5554839 5647660 5573050 5552672
4299 5552672 5614668 5648204 5592968 5686071 5577729 5694776 5501297 5535120 5378738 5646193
4289 5646193 5838921 5837118 5782836 5872593 6192328 6128543 5984810 6247028 6371135 6427364 6587609
4278 6587609 6595514 6678881 6821284 6867584 6804747 6869847 6967871 7018238 7077397 6997422 6818742
4267 6818742 6988815 7116180 7303367 7356657 7562361 7768788 7844140 8322510 8550190 8557220
4257 8557220 8759498 8723814 8987974 9355777 9312610 9596536 9855795 9924907 9827641 10253686
4247 10253686 10402122 10299870 10382758 10351325 10473079 10582930 10455877 10481884 10487447 10589811
4237 10589811 10573396 10634046 10993924 11177731 11318942 11573544 11748462 12217229 12785335 13220809
4227 13220809 13886732 14756990 15233618 15895392 16558341 16742364 16990070 17339597 17659767
4218 17659767 17982690 18376574 18739462 19102538 19522402 19863832 20283585 20397149 20397298 20689226
4208 20689226 20758421 21114679 21646164 22164002 22880178 23355550 23637409 24109892 24403123 24744546
4198 24744546 25339211 26105276 26907867 27709793 28514078 29715707 31190795 32379257 33867650
4189 33867650 35794303 38147821 40787910 43485347 45297056 46700481 48392848 49490675
4181 49490675 49740053 49547370 48696655 47993294 47957951 48040335 48468480 49450420 50809802 52617931
4171 52617931 54840355 57457713 60466678 63613112 67153541 70855862 75466180 81500374
4163 81500374 89596793 100047680 112995074 128777115 148166020 171870185 202522042
4156 202522042 242584103 293798622 351808298 404055862 429511353 420468672 381472238
4149 381472238 330502856 282805580 243028750 212727675 191708025 179462373 172631123
4142 172631123 168493033 163380552 154745457 141842735 127314502 113162797 100806417
4135 100806417 90384349 82058135 75175943 69447937 64548246 60552860 56985180 53847291
4127 53847291 51105509 48879066 47115724 45679461 44386325 43304416 42275645 40933968
4119 40933968 39492981 38168191 36281532 34585018 32885380 31260802 29942725 28653468
4111 28653468 27805663 27187536 26703265 26334787 26012928 25705074 25567447 25071556 24768431
4102 24768431 24342524 23473163 23007191 22424273 22050677 21525286 21168201 20757281 20422124
4093 20422124 20251914 20025428 19871508 19496700 19321582 19191915 19115205 19356552 19653331 19843881
4083 19843881 20160607 20567738 20926159 21425235 22246502 23356409 25097109 27594054 30742298
4074 30742298 34752345 39752509 45334550 49131325 48886572 44669494 38962584 33096458
4066 33096458 28253155 24278528 21295726 19288352 17812139 16481209 15557627 14588105
4058 14588105 13604054 12800789 12130916 11275299 10848231 10407815 9928232 9627302 9319640
4049 9319640 8912579 8574506 8264541 7923915 7727968 7489848 7401424 7409370 7406533 7228383
4039 7228383 7110633 6801609 6635139 6648621 6535650 6463478 6339150 6189950 6134836 6058609
4029 6058609 6298826 6186475 6130512 6107604 6314483 6294637 6142439 6203411 6068556 6099602
4019 6099602 6016697 6110310 6010301 5885387 5748846 5668193 5889895 5955060 5903426 5790446
4009 5790446 5975929 6006524 6073130 6285402 6493211 6566024 6845710 6892463 7011727 7068441
3999 7068441 7390157 7924299 8630191 9097445 9949144 11167859 12650323 14289266 16201160
3990 16201160 18738081 20921801 21551423 20123049 17788932 15306622 13015210 11346429
3982 11346429 10021428 9222357 8577308 7975716 7666003 7412148 7117431 6902855 6608693
3973 6608693 6443788 6342660 6383063 6411573 6210417 6120297 5995469 5861739 5665548 5935934
3963 5935934 5689703 5727994 5780839 5715570 5636727 5447117 5522431 5619418 5507756 5451166 5134245
3952 5134245 5201323 5151485 5107675 5264407 5291290 5315444 5178531 5162321 5202478 5399535 5202184
3941 5202184 5097695 5209784 5294629 5331088 5388318 5336100 5374032 5543645 5667553 5738760 5825205
3930 5825205 5770128 5804427 5791717 5886153 6076699 6270013 6283209 6322328 6398555 6235376 6436537
3919 6436537 6545573 6586279 6743905 6792111 6935619 7023703 7131813 7070507 7279318 7560276
3909 7560276 7816894 7977039 7945651 8144136 8711551 8917620 9079561 9193259 9346880 9780523
3899 9780523 10087712 10170688 10611572 10659542 10616451 10811828 11072649 11374215 11533720 11823786
3889 11823786 11910911 11886815 12043703 12135920 12376213 12401711 12679731 12850963 12844395 13212543
3879 13212543 13283310 13404593 13677935 13843501 13862035 14117222 14423595 14448235 14652954 15265837
3869 15265837 15987029 16827692 17580734 18823937 20630886 22851772 25684236 29392193 34136240
3860 34136240 39341926 43888295 44598022 40530298 35065674 30012000 25571387 22117577
3852 22117577 20069536 18562788 17737067 16843168 16014483 14953182 13863575 12949217 12030637
3843 12030637 11133013 10560385 10002246 9453123 8976471 8642079 8405123 8280619 7947431
3834 7947431 7892347 8011618 7977656 7928956 8399709 8599463 8746828 8616370 8275226 7656397
3824 7656397 7083147 6810849 6601229 6255580 6004757 6074765 6039220 6246632 6520375 6512041
3814 6512041 6547860 6406096 6306776 6300550 6433354 6652640 6834114 7194754 6979116 6626523
3804 6626523 6138356 5646537 5452886 5296080 5136169 5130976 5194544 5322872 5597411 5688615
3794 5688615 5579216 5294745 4822870 4819539 5135138 5375967 5484056 5533245 5354817 5093880
3784 5093880 4689888 4718894 4475918 4253193 4189646 4143027 4009441 4028846 4005871 3903637
3774 3903637 3938913 3781358 3501282 3389404 3166740 3206952 3081887 2885890 2831052 2909386
3764 2909386 2738031 2651926 2600412 2705212 2648953 2776607 2935724 3098029 3195107 3075969
3754 3075969 2818749 2614497 2521892 2260440 2079702 2105969 2049982 2037945 1932841 1847115
3744 1847115 1919259 1819626 1713951 1602365 1527705 1552624 1539297 1321605 1473296 1476030 1584102
3733 1584102 1351035 1079591 1147004 1195451 1200794 1245556 1428862 1400848 1484204 1225482 1176330
3722 1176330 1085755 976606 952326 958615 1245133 1228082 1006815 849879 830542 921948 1000439
3711 1000439 977529 848477 619146 595294 991477 922339 825216 852229 995793 997839 851848
3700 851848 897866 941954 899622 1075684 1152886 965309 952794 680371 643309 916184 899720
3689 899720 1014409 848033 843751 863247 813026 1041294 978054 804102 1011720 1230287 1098737
3678 1098737 1383959 1212366 1059529 1303359 1388456 1451429 1684582 1461529 1365103 1576300
3668 1576300 1614501 1617971 1921782 1979722 2472607 2498319 2296331 2205165 2063859 1730889 1455632
3657 1455632 1485401 1521392 1448218 1526350 1497577 1490825 1467875 1610618 1711980 1887080 1817928
3646 1817928 2123520 2249110 2199024 2278418 2194381 2003575 1925296 1875395 1557554 1448147
3636 1448147 1378534 1578645 1693153 1656059 1883708 1767729 1729073 1799384 2026337 2081018
3626 2081018 1853449 1932952 1861881 1638683 1538415 1278254 1045078 1085957 1260113 1315217
3616 1315217 1178510 1375142 1299607 1385860 1285397 1441938 1562031 1677237 1800309 1523067
3606 1523067 1536143 1543681 1192291 900818 919077 1004120 988872 1128379 971902 946202 803477
3595 803477 574697 560175 934326 965168 721980 588607 697654 834955 670803 658676
3585 658676 543444 508341 634947 685387 947987 628136 491404 628779 704354 1034901
3575 1034901 989106 812097 869867 685733 681627 743997 783312 934440 903250 887108 817190
3564 817190 598680 524911 524778 444640 563740 608125 315858 185002 261477 506246 626548
3553 626548 522965 428947 484661 516188 443560 554606 624393 683481 529584 231229 466522
3542 466522 613123 638718 617169 579311 472769 472204 743439 572152 499157 402769 306456
3531 306456 305677 471836 555241 365505 470529 538051 417702 566202 666056 534346 508848
3520 508848 601057 314853 458606 761586 587233 421821 417834 531347 481420 409542 437568
3509 437568 513697 515966 646374 555595 662072 688374 650307 691220 451936 271864 482406
3498 482406 794516 789163 670244 588282 722802 631856 898301 928261 871810 989099 670979
3487 670979 476185 551432 541983 404517 332886 512027 742591 698607 604361 642914 559755
3476 559755 668800 705839 636534 652321 397169 385179 556132 430051 397194 421831 565061
3465 565061 674772 633599 425194 555169 613140 480316 475521 463281 785230 663039 459733
3454 459733 582200 545233 532122 594357 543675 561216 698120 568290 523955 498188 494314
3443 494314 674065 612511 373691 442402 691802 685741 640509 634418 540446 646084 643499
3432 643499 569962 626791 720512 1124720 1104623 1181080 1243436 1246839 1179150 927092 905604
3421 905604 756284 789053 735449 882217 979093 971200 780863 738017 827587 720021 786224
3410 786224 571230 674014 1051696 1067520 1082114 819653 902351 1118528 1059545 1003125 1049135
3399 1049135 1362667 1323203 1412897 1595680 1624041 1603019 1626400 1465089 1332466 1262452 1325513
3388 1325513 1208473 1270244 1164630 1012991 1102714 964241 1131062 1234153 1275794 1218266
3378 1218266 1169063 1175156 1057765 1079798 1266410 1112754 955635 926553 1090220 1328857
3368 1328857 1157500 1185282 1242824 1245332 1505956 1637856 1519502 1335649 1404662 1493267 1476084
3357 1476084 1289370 1124396 1111500 1054620 1085705 1158076 1161847 1215345 1370323 1227149 1295026
3346 1295026 1385131 1230568 1317626 1419296 1442352 1415804 1439963 1521613 1440865 1378582 1363146
3335 1363146 1329729 1389716 1398238 1665527 1649113 1413936 1272058 1309380 1553157 1780800 1869002
3324 1869002 1726633 1803194 1959882 1910647 1885407 1957302 1905727 1910525 1892087 1980211 2115340
3313 2115340 2333983 2355157 2348543 2355767 2246463 2425889 2799115 2812104 2620965 2546903 2391922
3302 2391922 2358317 2530957 2535450 2606652 2804156 3093528 3217962 3107334 3121818 3062166 3215494
3291 3215494 3422579 3657989 3624395 3475173 3529635 3409917 3410052 3526997 3633682 3565354 3584895
3280 3584895 3676494 3728142 3687443 3710787 3825873 3812170 3757763 3998290 4147606 4161250 4408518
3269 4408518 4557937 4573311 4588675 4591991 4565716 4567154 4823149 4993927 5164897 5304816 5173423
3258 5173423 5398698 5452458 5309893 5078732 5051259 5265692 5522486 5704769 5852427 6226486
3248 6226486 6401275 6751337 7143908 7283229 7698285 8108680 8305096 8503374 8803198 9305115
3238 9305115 9744760 9958425 9985690 9745500 9281164 8539006 8077050 7615118 7328906 6910964
3228 6910964 6543313 6228635 6008456 5926451 5792109 5836570 6004962 5974194 6009366 6483123
3218 6483123 6460863 6443510 6351423 6266381 6075570 6002801 6133076 6154877 6311135 6579714 6982620
3207 6982620 7081770 7291425 7602844 7721430 7346771 6683604 6019664 5500863 5325281 5162944
3197 5162944 5028482 4797277 4707920 4680628 4729940 4974047 5206235 5480528 5899430 6456599
3187 6456599 6848128 6647714 6232640 6037663 5910523 5745840 5471397 5228251 5096513 4823418
3177 4823418 4528633 4404377 4590337 4579850 4543386 4497083 4289027 4099506 3962537 3958147
3167 3958147 3669210 3473500 3358652 3403835 3325164 3431986 3486819 3699604 3826810 3657908
3157 3657908 3742517 3652105 3911091 3933143 3553557 3290700 3099105 2794819 2727503 2632824
3147 2632824 2417344 2391125 2332673 2137175 2107400 1906951 1859743 1758439 1556089 1741256
3137 1741256 1712074 1690665 1816442 1902759 1870938 1702287 1350696 1443400 1469712 1505438 1353303
3126 1353303 1161182 1459074 1566485 1491927 1380949 1337567 1275315 1086538 1090734 1272090
3116 1272090 1147071 1184945 1034757 876483 975205 1070204 1231251 1223042 1058341 862082
3106 862082 822804 955781 1154135 1235114 1045370 1090126 1162086 1008468 1125074 1083286 934390
3095 934390 921769 886971 889751 858007 770963 786379 965748 922681 739835 905774 725617
3084 725617 690460 716568 592407 686500 628580 757009 906944 1022497 855443 744441
3074 744441 885415 583797 457506 678305 654018 716543 933201 695378 585839 656744
3064 656744 795042 667598 603364 549770 479251 573304 596722 611002 656295 722709 738641
3053 738641 824118 754631 798657 684669 766207 701678 820282 926410 743456 767847 620366
3042 620366 559476 645370 533875 638503 696023 661803 581619 665213 821954 609514 709259
3031 709259 724327 592595 488575 445173 417268 357979 592974 627989 831019 791855 595803
3020 595803 405829 496551 388538 528176 571028 330997 401805 360936 505384 440680 280058
3009 280058 238912 547130 482856 637118 768417 674664 644320 467394 488770 504464 472615
2998 472615 564865 603524 554391 787368 808045 521904 541747 557463 735856 973996 857199
2987 857199 696687 570162 373910 320100 560486 459329 491815 584871 783260 978368
2977 978368 770214 676501 693147 698464 685210 956168 935637 883901 988822 996181 838901
2966 838901 835195 995352 1066264 976826 1014641 1172117 1092890 888446 903881 847848 984149
2955 984149 1037834 955652 937258 872863 968090 795157 683181 857062 883658 1004870 1011780
2944 1011780 1160389 1110156 902359 1317973 1251247 1201193 1314977 1465241 1493661 1613917
2934 1613917 1536832 1628160 1715535 1734783 1908113 2026236 1907108 1713405 1794475 1918848
2924 1918848 2009495 1839992 1939717 1944649 1965404 1972779 2090148 2023290 1966993 1908277 2026296
2913 2026296 2022979 2142776 2103664 1944425 2079023 2149441 2229425 2098479 2148989 2270514 2543566
2902 2543566 2927044 2939979 3266009 3315406 2878061 2800752 3084417 3272201 3089495 2855465
2892 2855465 2852888 2584090 2416732 2499752 2367042 2418688 2405184 2300543 2336003 2245851 2300362
2881 2300362 2484565 2296312 2194715 2218449 2412148 2432370 2620641 2680390 2743562 2638964
2871 2638964 2534225 2609688 2745357 2555766 2576410 2603929 2401888 2446573 2252443 2290014
2861 2290014 2170560 2139461 2010609 1767961 1737641 1740263 1927856 2189147 2015140 1780243
2851 1780243 1915424 1874052 1701212 1628913 1362014 1362930 1486824 1373260 1452513 1218917 1302985
2840 1302985 1353742 1450556 1465579 1306726 1078753 937098 1015598 1048566 1101720 1013840 818912
2829 818912 750943 792258 662502 720116 872919 935735 702867 750322 991919 705998 411172
2818 411172 479803 793831 815875 967418 909501 684697 669974 553134 583687 775735 840437
2807 840437 752469 693344 634975 580440 385755 457659 350239 299118 248471 405187 565363
2796 565363 495551 658236 567505 399175 465838 481647 416321 331299 477027 582016 439064
2785 439064 290547 183981 268005 244175 283803 183158 81433 230713 381513 308565
2775 308565 269741 297053 184511 330063 445632 193967 146303 155404 239864 219180 41073
2764 41073 102269 -119330 169388 356856 292305 204554 209045 227793 34671 -6711 104475
2753 104475 134900 92429 1643 45959 174681 -27488 -33327 115282 59323 165568 187625
2742 187625 246574 158234 -128566 35274 37008 -163664 -147580 -228498 -304178 -138832 -43658
2731 -43658 -101076 62430 258613 156639 194548 198356 -19639 10150 9428 -95357 -10279
2720 -10279 -6299 -166134 -261924 1684 44649 82579 39946 141058 218131 112173 -25863
2709 -25863 -134416 -142996 -169057 19262 -224454 -275793 -218152 -91121 -78852 -83051 125830
2698 125830 11743 -283552 -198502 -78158 -37124 -58557 -180368 -257586 -20004 169369
2688 169369 113848 10129 -125166 -161787 -71072 26333 62178 -32156 -140397 17035 20883
2677 20883 -1834 -65063 -130691 -272311 -91809 126949 154079 47733 -18172 -205356 -180342
2666 -180342 -20194 -100976 -167105 -90262 -100170 10267 -84044 -76014 19326 -75581 -175541 55726
2654 55726 -35295 25337 112335 67354 88685 24968 -5553 -98970 35017 -261424 -262485 -184466
2642 -184466 -221159 -120199 -61404 -194836 -212770 -269971 -241891 -251962 -36697 -86856 -48520
2631 -48520 -81632 -68078 -151260 -414412 -291626 -253266 -268386 -190254 -143634 -143810 -90641 -77605
2619 -77605 -47922 43202 64570 -255079 -161501 -123144 -48191 -34390 -147973 -27483 34049
2608 34049 -57156 38382 9688 -57093 -114679 -159328 36795 77771 49753 -79208 -5373
2597 -5373 159415 198679 112656 9826 -70710 -190115 -63671 64968 220797 -46812 -259145
2586 -259145 -167672 -117621 41163 -209635 -145259 -56013 -85959 11573 -30607 -163842 -86404
2575 -86404 6156 -88519 -243192 -174840 -162384 -183870 -250829 -325140 -119993 -192986 -176056
2564 -176056 -134738 11771 -57487 -90286 -200042 -227471 -158129 -72652 -133116 -119378 -86461
2553 -86461 -61743 -48455 -91298 -5787 31831 -85549 9912 145765 24150 -75152 -210002
2542 -210002 -120487 -48979 22678 -17891 -20506 -272775 -161817 -35399 8406 -38368 -121334
2531 -121334 53793 71480 55698 -9453 -69549 -32487 -59609 134087 135703 -34160 -188157
2520 -188157 -122429 -84764 -136483 -98288 -135828 -101126 -83461 -188049 -295412 -255982 -273084
2509 -273084 -295538 -337803 -360567 -121499 -183996 -195013 -231800 -295613 -136114 -191794 -234283
2498 -234283 -191840 -202012 -51575 -204668 -247053 -83641 -150139 -90522 -65821 -134344 -169795
2487 -169795 -266771 -23555 126342 -108072 57187 112926 -140750 -231852 -115532 -271357
2477 -271357 -36179 92681 -72923 -184298 -100266 -58606 -156429 -163732 -58500 -1597 32306
2466 32306 145679 -13974 -102040 -75114 -169031 -160910 -135644 -125193 -176106 -60293 -315422
2455 -315422 -241795 -151158 -315300 -229690 -5009 -243138 -367588 -207735 -178711 -172330 -197260
2444 -197260 -119047 -186002 -227801 -83217 -137912 -53238 -138168 -42116 -38656 -393176 -159215
2433 -159215 -207360 -201365 -228101 -180898 -156957 -336956 -238082 -128109 -93060 -53711 -149799
2422 -149799 93354 -81405 -1423 116001 -99803 -228034 -91399 239097 32992 -30290
2412 -30290 84881 -4943 -202029 -315142 -264897 -164295 -6944 -36606 77358 48402 -26340
2401 -26340 -116689 -71539 113967 -20020 -60352 65889 -131165 -126419 -92763 -228863 -155133
2390 -155133 -67580 -75827 135585 133532 9867 63682 62853 -40636 -137011 23301 98629 58325
2378 58325 -87132 98402 125874 105916 100222 87753 67277 90630 110816 30747 22356 178321
2366 178321 358494 494221 539874 337466 314911 241141 285815 241248 -18802 63346 93972
2355 93972 66938 125155 124766 174494 273446 194822 106289 -25164 -1471 36897 -12166 -24486
2343 -24486 52215 113231 89523 29929 -32867 -11110 2049 -200074 -74914 121112 67814
2332 67814 -233233 -202587 50939 196590 182371 19135 98845 224449 205118 -81838 148046
2321 148046 160952 74600 120913 140852 73976 -15716 -58423 131809 74648 -27217 54103
2310 54103 -10972 -45317 -202313 -90229 -159219 -184306 -17084 -33775 -191223 21863 126008
2299 126008 -106913 92933 33396 -143112 -127203 -153203 96327 160935 46791 -42780 45940
2288 45940 136154 149290 95519 155227 148383 86127 94587 19957 35910 -56993 -110346 -2732
2276 -2732 32797 3940 -71761 -44461 103239 78745 316508 129557 87208 174032 299855
2265 299855 406856 121904 14404 70672 55226 176984 379949 171964 29304 149527
2255 149527 179234 132187 137651 121276 194866 191897 152914 150085 271276 184765 69029 -24760
2243 -24760 -46742 132243 -1423 -33146 -47457 -44764 141566 243706 378370 373851 210766
2232 210766 156846 256726 201504 115882 230728 170384 163555 226910 245968 359527 304669
2221 304669 357483 286509 221878 211897 94473 61081 89714 184829 133844 260731 296085
2210 296085 397626 526950 363152 283194 369610 414876 433359 700084 673251 619246 404506
2199 404506 267250 298309 231003 277256 515292 481912 327613 413657 364643 575614 651050
2188 651050 658114 569118 413008 614978 629102 523219 514347 796424 598081 579830 731070
2177 731070 599531 553706 603676 680462 831232 1038349 1017236 1074063 965117 987083 1042622
2166 1042622 1103657 1053055 1105213 1104490 1254647 1366483 1317789 1329430 1401134 1428887 1321103
2155 1321103 1375340 1291850 1415519 1518352 1399534 1284414 1426894 1606597 1652689 1770022
2145 1770022 1832313 1815768 1773867 1960223 1991489 1976670 2112434 2116407 2149985 2208871 2368700
2134 2368700 2545733 2479170 2556364 2614822 2820731 2985386 3091893 3352974 3546433 3768266
2124 3768266 3946144 4160139 4239014 4477358 4960445 5397462 5804329 6047611 6416733 6913117
2114 6913117 7646029 8267112 8733496 8964221 9606672 10326191 11247140 12843369 14838593
2105 14838593 17094225 20193524 23639270 28659117 35523428 44946290 55779632 65283553
2097 65283553 66452316 57113725 46561497 37130823 29300757 23791981 19820026 16975103
2089 16975103 15074712 13318624 12339514 11388550 10240116 9652358 9070567 8284003 7659543
2080 7659543 6993446 6484023 5930303 5548751 5142462 4912212 4758869 4536949 4084624 3958083
2070 3958083 3818808 3596595 3619384 3370790 3076217 2925024 2622415 2604651 2635819 2416318
2060 2416318 2376675 2324809 2189046 1977522 1822697 1713867 1674494 1848291 1735687 1510591
2050 1510591 1644067 1763469 1477329 1392901 1379423 1335330 1360486 1443789 1525835 1342294 1403711
2039 1403711 1374511 1352209 1166715 958877 693697 761530 823515 924353 858582 700012
2029 700012 764365 935842 769362 539691 637752 590645 592657 624776 630220 450016 562126
2018 562126 687218 410888 631391 556682 501653 449853 315542 290836 319939 315438 381016
2007 381016 435230 384767 178949 126579 283793 229885 319644 239510 147031 171836 278225
1996 278225 233025 429316 315336 28379 168578 224880 219969 395550 367664 179879 221987
1985 221987 144695 80051 277411 198788 231119 186663 -10071 -66055 172358 97621 -53798
1974 -53798 108402 80518 29647 -161212 -105427 21268 200782 233913 122174 140681 356927
1963 356927 258073 163496 104736 13822 90755 132765 287103 110258 -123203 -198245 -272069
1952 -272069 -94194 36199 152603 -28985 -125097 7782 129754 169197 96744 -134293
1942 -134293 -189231 -35551 39345 239077 169614 102408 183098 90003 54933 61621 122449
1931 122449 48352 238230 -48129 -91311 1860 -190419 -139245 -274353 -139895 136463
1921 136463 183572 1208 -117999 -46727 -139925 -256039 -163516 -94053 -179863 -294264 -61311
1910 -61311 -18215 -151473 -189929 -16951 -109887 64910 -11261 -142498 -14660 29853 93766
1899 93766 65985 -89404 -57846 141109 175051 -66978 -194206 -236491 36692 -16698 -9431
1888 -9431 66633 -92644 -89795 -134564 -32427 -70472 -178611 -307277 -234342 -198997 -162329
1877 -162329 51358 223426 106791 113832 25932 -142249 -168639 -109831 -70078 -83532 81208
1866 81208 -141795 -303258 -120537 -107565 43635 103566 -111705 -176994 -19945 -86401 -185431
1855 -185431 -158093 -87690 -217951 -306537 -56449 8746 -32685 -15671 164985 84981 80009
1844 80009 31105 60043 64114 -86359 -22420 -118812 -100887 170161 267283 226384 139104 76037
1832 76037 -27387 26679 86310 108390 179903 354399 488515 371781 175474 102783 56916
1821 56916 -145977 -178839 -70550 72454 73019 59938 -43521 -50140 47668 138647 -107134
1810 -107134 -167535 -163533 -70454 6123 73361 -53747 931 87383 190929 134049 141417 209085
1798 209085 104544 42354 -160157 -244311 -181844 123947 -63544 40817 -200236 -118802
1788 -118802 37535 -103409 -10588 88837 304162 195295 52766 78639 175644 4153
1778 4153 -210716 -95769 49200 161868 99291 11335 -100547 -178482 -105629 471 -37119
1767 -37119 -188686 -115773 -86907 226017 157881 54053 103489 63400 64669 41843 -53630
1756 -53630 -153847 -57169 92410 23334 -9438 -52850 -166554 -113831 -195243 -98051 64256
1745 64256 15954 -40432 -169663 -350531 -228287 -71380 13115 -212246 -271722 -126327 122054
1734 122054 11052 60919 15952 -118692 -46404 81787 233897 207931 167796 -50386 -127215
1723 -127215 -197263 -44843 -59683 -14885 -277072 -111538 -20817 103486 287482 260346 87645
1712 87645 -19916 -117646 -152702 -61419 204220 190353 93307 165057 97309 -35756 -33382
1701 -33382 -5149 -283797 -150978 -178643 -116042 -122369 -54918 -79140 -231380 -817 68394
1690 68394 144091 180885 147167 43646 6476 137014 174889 147553 103265 -137096 -16578
1679 -16578 -73088 -118207 -17204 25876 156494 -2535 143404 -48552 -131772 -217670 -70730
1668 -70730 25809 -240132 -19144 -80051 -137245 -62248 -385222 -321756 -344078 -87328 -140579
1657 -140579 -199326 -19565 70306 47129 19412 -42028 -25329 36052 86010 193276 105333
1646 105333 -116135 -280846 -248250 -170417 -204897 -75344 -88267 135833 264461 62603
1636 62603 -17460 -70744 -8874 19670 41419 93464 -42741 -157000 -181086 156639 416581
1625 416581 394563 242018 201367 -35912 53650 103533 -4243 -43718 -177855 -120963 -37329
1614 -37329 40950 -123664 -14752 15251 -1065 -156059 -83103 23854 2835 -147481 -84281
1603 -84281 47854 221829 148341 157949 -67416 67843 52472 32482 -25708 -47825 69013
1592 69013 -10966 142502 66693 49959 -42071 -27913 38614 56756 97873 19373 87311 -12414
1580 -12414 68074 73737 20458 158726 60823 -42093 43907 59228 -127968 -51570 122546
1569 122546 126863 193865 52639 -114674 -183554 -42448 -85032 -125069 -108656 -147305 -137172
1558 -137172 46164 136904 117956 338548 264257 80457 114078 190094 66022 177868 242388
1547 242388 -28065 -45438 -33487 71110 54928 -33143 32485 189653 22538 -103956 -85564
1536 -85564 -244690 -135356 41984 29020 -53667 -27904 -133911 -119049 -283511 -58592 112774
1525 112774 -22848 -215891 -32921 102919 252881 203970 54179 39684 -39049 -167366
1515 -167366 -5448 -143362 -118263 -167101 -113618 -91163 -185994 -137803 -277226 -118787 -42814
1504 -42814 -144666 -318701 -244299 -269581 -188987 -109677 67488 -70297 -211596 -98803 128691
1493 128691 8484 -12170 153804 155025 28872 -49489 -2888 -8548 68237 44947 -180594
1482 -180594 -81387 4473 -42801 45580 -49721 -102461 -41063 64889 -35699 -39992 8668
1471 8668 -63745 -73706 -211215 -55439 47406 113295 149626 1615 29504 -62103 -22087
1460 -22087 73739 96089 -97947 -112012 -157783 -162235 66220 98856 -35271 -22395 122124
1449 122124 110007 -96309 -125655 38322 95678 204306 -109869 -355115 -252975 -213737
1439 -213737 -135406 -40270 -87497 -172972 -91023 35050 -45032 -1053 210201 103951 -120808
1428 -120808 -146687 -130765 -211641 -158473 -73787 -153434 -214008 -225313 -140173 -98544 -98743 -62332
1416 -62332 -111497 -99703 104346 -59792 1998 -101380 -77997 -5966 57896 151065 -210344
1405 -210344 -97810 133510 171905 -1325 103197 102043 -101243 -51795 45398 -59138 -182681
1394 -182681 -183399 -84919 -42349 -59641 -94860 -167396 -1491 208314 87243 80353 -156406
1383 -156406 -194313 -230423 -207282 -92194 -159903 -188695 -214268 -183055 -133879 -129714 -44962 -7100
1371 -7100 -143069 -106891 16356 14115 30129 141728 256921 66808 -31472 -158879 14644
1360 14644 207262 205576 58836 -154297 -57470 60174 336114 255731 -16492 -207804 -238557
1349 -238557 -171608 27203 54628 38236 43190 164582 -113791 80798 280501 175586 27983
1338 27983 -50718 -4939 63836 123015 -107742 -70265 -56384 78991 120863 259030 143553
1327 143553 -7010 8081 152138 145801 147430 254964 330228 128967 -168764 -112953 -155533
1316 -155533 -97909 -103848 -57941 -39559 -48161 -225598 -241395 -26072 -72906 -156673 -5482
1305 -5482 65924 -104928 -71439 -24707 -313552 -186987 124563 184810 24759 -65151 188823
1294 188823 62112 -108246 -39996 -146145 8238 -47875 -16996 -125094 -55614 -85079 -120220
1283 -120220 -162458 -222081 -140424 30759 13748 106485 5650 -120132 -126824 -195068 -176547
1272 -176547 38304 152018 113698 -28459 8303 195323 108015 163909 139475 -23477 -94069
1261 -94069 -99106 -186031 -171109 -241096 -32322 -94138 -61207 -79236 -34413 -116577 -96124 -69729
1249 -69729 -7453 -145431 -132541 32545 254288 130159 110495 48884 40880 -9568 -59462
1238 -59462 47476 90295 111216 5269 -49782 212643 255792 61002 -87960 -189833 -17461
1227 -17461 -12139 73136 -8869 -30690 193565 418380 217313 262435 190335 172919 97850
1216 97850 -116800 -1967 25114 -23937 101187 196447 77655 31693 -68931 -137316 -133960
1205 -133960 -108066 -119805 -189036 -154830 -14050 21920 28133 15572 109319 66970 -176640
1194 -176640 -124041 19835 -29071 -119400 -63627 -15838 105671 120919 55994 -12738 -63879
1183 -63879 -83493 -111097 -103069 -191992 -224829 -187418 66835 97431 173440 114485 61183 -56508
1171 -56508 87203 15488 -117889 -53251 -106279 -79841 -176797 -180390 -75013 67781 63629
1160 63629 7441 24081 -54714 -56181 1775 -43553 -93549 58812 99584 -130256 -84982 -103438
1148 -103438 -137917 -80898 50075 -33832 65361 33555 66697 97529 43979 1293 43367
1137 43367 144717 3730 101146 326114 52301 -122468 53611 -39841 -72404 -10583 -31561
1126 -31561 -98094 -176388 -177656 -318012 -183943 -27667 -52710 -94867 47618 1910 68653
1115 68653 139123 112281 -61380 -75917 -37269 67867 86294 43748 -128664 -107898 -237086
1104 -237086 -148165 219627 28912 -10635 -72837 98968 294516 43980 -13350 42070 -9765
1093 -9765 -203933 -57547 115510 28949 -4439 -86620 93865 3691 -185045 -222170 -305913
1082 -305913 -320571 -229963 -140170 -44685 -13233 60422 137658 -125200 -202262 128483 101232
1071 101232 -39125 -135829 26954 -13536 2111 -77134 -208227 -8426 167819 120097 61449
1060 61449 -40104 94795 55348 -93579 -80303 149892 134166 81866 -162887 -268580 -137699
1049 -137699 -9819 -192474 -152105 -98660 -268885 -116663 47062 -42643 -38906 38081 241939
1038 241939 118890 -117188 11059 18788 142112 202969 310533 68479 108639 74710 -84525
1027 -84525 28021 291567 133701 170350 93953 68374 133227 131481 -97336 -226273 -295074
1016 -295074 -167297 97221 81273 206785 37513 -175254 -180028 -137054 -17279 -43288 -65093
1005 -65093 -127599 -297498 -104603 3495 -53413 141804 203663 -29983 -102338 8392 272563
994 272563 -38577 -104942 98740 20750 -56240 45384 -54602 -117206 -117057 -69247 35340
983 35340 -34385 -10846 17372 39184 -15835 -58296 -103266 -84342 -55692 -64994 -6582 -100862
971 -100862 -45747 -34057 34495 225838 257936 216356 24279 -143270 -35947 115099 78909
960 78909 173414 53813 -80205 -182956 -198254 -258469 -331091 -183375 -69888 -95954 -66586
949 -66586 127813 118072 81548 145291 -49324 -228192 -3610 -159841 -64367 22506 12462
938 12462 147126 166057 206390 -27127 -45879 2761 -52247 42289 99348 109965 14496 -3046
926 -3046 253658 296460 48455 -109770 61080 94190 167325 192606 235183 135692 46004
915 46004 -5821 -172007 -235289 -278260 -210990 -4610 -103820 -340665 -178385 -131083 -46472
904 -46472 -82461 -104820 -53113 7029 158748 87003 59499 172069 266248 166119 162555 110404
892 110404 183196 237645 136588 -3351 283809 336162 119869 -25230 -231866 -66697
882 -66697 -49413 -262013 124378 181306 25816 190270 196677 -62631 52967 76286 -39334
871 -39334 -6144 162250 152022 79201 -71958 -160172 -2516 -33140 -59539 -137043 10149
860 10149 82936 61606 -62764 110914 196644 8368 90701 88984 34971 118341 58714 -32618
848 -32618 88265 203429 196350 40587 -138853 57461 -17251 -197241 -65392 149752 -54777
837 -54777 -2038 93341 23037 98380 24500 -9866 33684 60355 58273 130116 263758 116501
825 116501 -16199 62760 6707 -1553 179260 166715 -4933 -115823 -325416 -325788 20986
814 20986 165840 169383 50856 -20999 -36475 -225727 -237858 -94479 32800 230017 9007
803 9007 -94405 -59731 17675 -127916 -91165 -136431 -64895 39204 -31911 -121050 -10752
792 -10752 -26637 -60391 -22975 114607 32362 -74837 -93296 -203866 -107669 -30628 -155202
781 -155202 -254214 -133253 23950 123575 98370 -74542 -57652 -37630 -73951 -2921 -306531
770 -306531 -207143 -55320 -39070 -20822 91966 99413 55976 19342 330311 270823 158048
759 158048 307521 255487 163180 112792 191021 93091 -91139 44299 61035 -96093 -99469
748 -99469 15620 -160936 -91488 -68204 1953 -149400 -266276 -162848 -56754 -47800 -50957
737 -50957 96905 82751 -14791 -9074 -138634 -119799 -81628 -60061 83180 105486 117839 229255
725 229255 230705 -72731 -144448 62399 150815 16698 -107373 -82217 -144663 -288074 -203116
714 -203116 -15796 -50539 29853 -155901 -145947 -24919 140632 77622 -37157 147502 217060
703 217060 208613 -59421 -170501 -126617 16231 17971 82937 281603 170069 9004 173190
692 173190 -27246 -128781 -69992 -8144 87005 62256 12312 197679 98249 29243 -107664
681 -107664 65520 218131 225990 -10975 -89578 -3597 39288 206830 58840 -23594 -183783
670 -183783 -55143 -205344 -31188 140599 34197 -87519 -183913 -17764 -15236 -45210 -85153
659 -85153 -42119 15746 68575 263583 321277 221623 35300 31537 43417 186369 141330 31233
647 31233 22716 -74250 115882 235285 89165 164073 135253 71290 154064 2804 -60751
636 -60751 -78913 104372 185605 162904 201155 174963 47771 39877 115788 178966 -102715 -241629
624 -241629 30069 6098 -180805 -35398 -101185 -150198 -119580 -189543 -117256 -111231 -110204 -127390
612 -127390 -36314 -29026 -188088 133219 181217 -42677 124963 200917 8427 -133899 -136178
601 -136178 11470 -217825 -201258 -29122 -132849 -112572 -80310 -30964 16639 31812 23151
590 23151 -152585 30516 -77652 -170537 -79401 -88024 -88357 -78670 -73155 -90227 -136858 -15461
578 -15461 175857 305798 143436 -8574 76984 112392 188016 279748 139065 -10450 39236
567 39236 116357 219781 193179 126971 -158974 -136033 -18691 95485 -58529 55681 99387
556 99387 125746 57136 50366 18062 -71039 91300 5274 -58652 138484 119329 169833 82498
544 82498 32362 45441 -27670 -136613 2349 82532 -6641 -131439 -63320 151356 73794
533 73794 67916 -14310 -148552 67021 -22076 -222442 -117126 152717 52564 -186587 -320487
522 -320487 -293265 -164190 118159 60262 -69476 56269 60048 -78898 38009 72649 3583
511 3583 26198 -60096 -176980 -233652 -160214 -52452 25636 127897 139069 -8946 76624
500 76624 112107 -49200 127892 56220 26662 115531 181318 151264 -54828 -189671 -180354
489 -180354 86149 53341 131177 141620 26625 81491 119206 34592 -12184 -109745 182354
478 182354 286763 103528 -63385 -131980 -177157 -14009 6668 5321 -70810 -101286 -121678
467 -121678 -87776 -24046 37077 -15056 101942 -32906 69511 113981 -11362 -166833 46562
456 46562 68083 -30273 60754 115854 270473 119302 140538 5057 -103337 -60235 -144548
445 -144548 -24255 65372 145066 182772 242354 149857 123935 12289 -89967 -64603 4234
434 4234 82946 -86781 77480 242313 142242 -62455 -197538 -170611 51190 -45076 -79942
423 -79942 5497 -102547 -213715 29046 -41358 -151801 -93589 -142717 -316395 -31373 109282
412 109282 -52306 -119085 49151 88331 37693 165220 161528 18607 21470 81006 247778
401 247778 347861 200131 81742 -52055 41675 3576 -82699 -233925 -96131 103586
391 103586 122633 -138414 -195839 -120848 -48296 -64053 -136088 -77263 -46943 -43147 -213332 -191369
379 -191369 18878 -115872 53441 32998 23261 222423 223762 37058 -72425 -68459 -36233
368 -36233 158150 -9686 41959 74949 1215 -77391 -85910 39993 180732 162116 232914
357 232914 157802 11951 -175172 214380 185387 48744 57427 108947 49552 -44892 29626
346 29626 115373 126865 153380 232813 186178 243950 282108 224629 -88061 -198229 -16943
335 -16943 -33768 -103677 1861 -241383 -122608 143478 156086 4739 -134328 123256 -29279
324 -29279 -194385 -82393 -138560 -133528 -55362 52532 -54099 -84270 -140585 -10885 114455
313 114455 130535 -59487 -197939 -54757 87329 129679 326691 188260 105534 161830 111386
302 111386 14065 97107 160464 238172 116099 6885 205577 217532 97103 -51226 28250
291 28250 20147 28641 -71820 -40378 -37547 -104574 79083 78504 -33672 -232913 -208794 60961
279 60961 -2089 -60942 100033 275139 100499 94421 34408 177568 270965 268750 188565 461000
267 461000 327409 128764 75802 -83411 -87521 -8076 2252 4477 -30811 -154500 -108602
256 -108602 -70905 -325295 -249877 15755 -82392 53911 -80659 11602 189184 82827 26061
245 26061 33858 129702 -286457 -381524 -119144 -157974 5687 113646 20864 -11097 181577
234 181577 -41096 10521 100574 47683 -93061 -81664 -143132 -40644 -195092 -40734 -672
223 -672 54806 86119 7877 61102 102893 118243 26979 183873 341113 390612 301671 227325
211 227325 129481 174366 120011 166432 269601 128339 147540 99933 -58890 -101016 -106244
200 -106244 -116597 -191089 -1901 126458 57489 -64607 79823 152735 140307 -10583 -98966
189 -98966 101187 -33177 -56940 56437 243039 214215 32036 -49759 158874 388908 279401
178 279401 207817 154042 121885 182296 101394 71526 170722 23634 -59475 124087 25529
167 25529 -82530 -36177 67518 146028 146631 -22542 -82067 109651 -98909 -158218 -31609
156 -31609 -152021 -195053 39631 -48337 -45185 -8186 73469 23042 -77732 -109844 16526
145 16526 -63313 108058 211342 26652 -21580 -173502 -153762 4119 120274 -60478 -95438
134 -95438 35776 87856 78910 67220 98739 144836 10906 -109579 -51576 -61041 121597 68502
122 68502 -48293 -123173 -3003 4044 117009 142675 17624 249426 313734 124562 -56795
111 -56795 153066 89245 14229 47635 -46388 60870 120222 129766 80709 -32725 47116 4328
99 4328 69126 55811 -121526 -126470 -113199 -46756 57791 129631 240882 174333 160155 64009
87 64009 -48118 2331 -41809 119188 64986 75144 27782 -5003 66466 -19387 -15885 41011
75 41011 152814 118526 -18451 -205078 -144927 -41926 9241 92167 52591 104476 131610
64 131610 35722 114535 49023 78244 190345 210893 175532 88753 12126 98317 144772 21362
52 21362 38968 40198 -10675 -20802 157779 35013 79353 75135 44720 131900 84320 36682
40 36682 -11455 -8515 137488 231793 205878 123374 138865 143105 42290 78706 81449 95353
28 95353 82015 -87884 -172776 -208434 -57790 -24231 25450 -20565 -34839 19635 36276 68809
16 68809 125170 85434 64947 1639 74134 252996 133706 47295 -82870 23645 75272
5 75272 158704 -21365 74772 -17768 -67440
0 -67440
$$ Imaginary data points
##PAGE= N=2
##DATA TABLE= (X++(I..I)), XYDATA
16383 -1100822 -1099186 -1035979 -1010820 -1014402 -1054781 -1102020 -949482 -946503 -926189 -949524 -918848 -898042
16371 -898042 -852435 -1006716 -915257 -985397 -836772 -905227 -716983 -669300 -704750 -609017 -550162
16360 -550162 -589434 -543223 -522988 -445559 -460546 -434907 -374343 -379336 -292620 -221146 -277803 -333990
16348 -333990 -222925 -257772 -284861 -231408 -204545 -100104 -61842 -65938 -48228 -133460 -52141
16337 -52141 165809 257330 117093 86584 104171 165935 237205 185203 38655 140118 226610
16326 226610 210204 326687 450049 383596 370193 347322 275974 303697 322554 365881 486717
16315 486717 563902 443898 573287 668796 756566 797013 689765 659712 815140 896594 915322
16304 915322 825042 816243 842785 916895 915102 738770 667642 740245 873128 1103143 1191567
16293 1191567 1077686 1110690 1181907 1179618 1243278 983589 1012423 1363945 1215600 1280464 1213719
16282 1213719 1130366 1215815 1317595 1381142 1445555 1538226 1410223 1316943 1131899 1264208
16272 1264208 1265171 1336773 1370262 1306657 1130639 1147279 1354639 1521537 1665135 1528768 1481695
16261 1481695 1598506 1713791 1745164 1876249 1874549 1703255 1440708 1507695 1573929 1701903
16251 1701903 1633111 1651193 1843648 1975775 1763627 1749555 1668911 1556926 1718246 1710836
16241 1710836 1683476 1841655 2013601 1784445 1788473 2007789 2053679 1951976 1899509 1847006
16231 1847006 1911519 1982929 1985177 2037227 2010159 2107225 2025291 2056245 2116882 1966011 1961704
16220 1961704 2206374 2219570 2241300 2203729 2200065 2107320 2267062 2187693 2062342 2203239 2084521
16209 2084521 2060329 2069765 1966317 1984111 2143895 2088008 2232146 2428036 2384676 2356521 2195610
16198 2195610 2336886 2422863 2386614 2465847 2472136 2487545 2326315 2262519 2529698 2485914 2497901
16187 2497901 2649315 2565561 2518759 2517927 2395959 2417445 2534492 2597550 2451961 2532737 2483987
16176 2483987 2404223 2517190 2536687 2468632 2529104 2551605 2413674 2371070 2503960 2476560 2252442
16165 2252442 2383215 2545495 2539992 2685352 2638075 2591139 2490550 2429645 2532453 2580770
16155 2580770 2658318 2576926 2708827 2775197 2779600 2585371 2459688 2387174 2742930 2590054
16145 2590054 2670587 2777514 2862110 2764267 2746641 2696449 2687037 2851029 2815987 2809828 2947970
16134 2947970 2784180 2740959 2642674 2576441 2677896 2879862 2726046 2541418 2473391 2603797
16124 2603797 2785197 2662546 2759255 2806428 2624467 2779804 2839234 2924036 3010426 2834807
16114 2834807 2828054 2894314 2933425 2894185 2974873 3095103 3122362 2913876 2797368 2925665 3022064
16103 3022064 3050970 2921142 2869282 3047706 3032065 2916391 2869726 2853276 2926206 3027376
16093 3027376 3026827 2852959 2895271 3029576 2867317 2894073 2898159 2811904 2765838 3031301 2896893
16082 2896893 2973741 2950122 3024102 2983607 2910667 2824499 2685309 2809549 2855776 2848242 2939252
16071 2939252 2892068 2810441 2873718 3067747 3092529 2904782 2801155 2758036 2750185 2927747 2758117
16060 2758117 2716951 2829873 2912751 2728188 2918021 2929798 2880016 2827897 2884110 2891185 2870737
16049 2870737 2975512 2849969 2918039 2862536 2871918 2862105 2810859 2753858 2996095 3005206 2994695
16038 2994695 3007177 2980642 3029490 2978049 3242058 3176619 3010036 2901338 2788254 2810712
16028 2810712 3051065 3131502 3065100 2928076 2804744 2855354 2772505 2891206 2851494 2970894
16018 2970894 2812267 2870495 2912321 2922440 2911986 3133034 3139611 2776279 2938974 3018368 2904194
16007 2904194 2944384 3006864 3062920 3045095 3091378 3118103 3006034 2823010 2920200 3102377 3202519
15996 3202519 3038809 2970068 2928989 2903714 2853235 2692642 2891484 3098302 2957050 2917735
15986 2917735 2973384 2990742 2936704 2871720 2746607 2801282 2933103 2893282 3061341 2978131 2869118
15975 2869118 2937383 2938219 2799315 2876582 3053953 3154320 3202034 3058988 3071505 2985147 2961985
15964 2961985 2865459 2803756 2917926 3145850 3055287 2918967 3011444 3009775 2966819 2867338 2976463
15953 2976463 2939377 2996548 2941175 2950953 3030527 2930826 2729813 2805434 2868805 2853141 2691534
15942 2691534 2825733 2986796 2948017 3007913 3052224 2966680 2726630 2849270 2921423 2963549
15932 2963549 3047519 2967655 2836490 2951079 2942669 2853204 2790548 2863046 2963382 2981170 2974530
15921 2974530 2831173 2887675 2779923 2749523 2931819 2933285 2861256 2878985 2913148 3153011 3154924
15910 3154924 3031712 3026958 2947365 2903239 3013488 2994721 3142098 3183103 3091096 3027225 3113658
15899 3113658 3092904 2875748 2989754 2921290 2838166 2971937 3128554 3199115 3230782 3053690
15889 3053690 2929444 2899615 2894596 3021024 3090833 3005926 2795301 2922357 3038086 3057698
15879 3057698 2946222 2963699 3156687 2958317 2893347 2954824 3000382 2978716 2930103 3004417 3085371
15868 3085371 3083715 3127930 3154074 3144491 2937360 2862799 2931283 2963149 2926041 2927195 3069402
15857 3069402 3105043 2993518 2997618 3049736 2960234 2787984 2847318 2998150 3118269 2853749
15847 2853749 2929027 3198953 3027705 2921043 2855443 3091950 2784605 2639166 2740051 2916402
15837 2916402 3033070 3064795 3234370 2954615 3023491 3084841 3024523 2922674 2966622 3060111
15827 3060111 3045918 2956041 2820692 3045746 3365281 3047172 2983301 3034612 3017466 3045986
15817 3045986 2956431 3068218 3122957 2961077 2855910 2851572 2850108 2995698 3005598 2999981 3007495
15806 3007495 2992457 2966018 3012053 2934684 2735699 2676101 2983631 2941769 3043440 3108629 3179743
15795 3179743 3159264 3139833 3186827 2927330 2909811 2917229 2997341 2849479 2784189 2805461 2962647
15784 2962647 3005884 3094364 3032065 2953169 2803458 2759700 3041268 3168051 3202354 2989861
15774 2989861 2924642 2924637 2948833 2916005 2915555 3013929 2922315 2956610 3096658 3085642 3211630 3052542
15762 3052542 3034846 2900757 2728979 2797001 2909990 2899371 2945190 3111592 3028603 2957320
15752 2957320 3104951 3044632 2973368 3066164 3015265 2867204 2968456 3050673 3050150 3119177 2941127
15741 2941127 3034583 3104737 3200961 3222875 3188265 3086817 2995662 2928648 3041528 3206490 3136406
15730 3136406 3183839 2986089 3204855 3198505 2935336 3028487 3042663 3130479 3106635 2953207 2985749
15719 2985749 3063513 2972458 2961345 3122164 2982554 2916952 2897540 2910761 3090501 2975252
15709 2975252 2929005 2948497 2956828 2768951 2850893 2873818 2868440 3129597 3210855 3173158 3143548
15698 3143548 3062531 2889662 2818839 2911834 2690899 2640050 2776766 2999385 3011583 2851737
15688 2851737 2963778 2981068 2970932 3123309 3147614 3135715 3017910 3080160 3043005 2899455
15678 2899455 3038904 3116082 3093296 2964232 3120449 3088294 3117833 3010546 3104376 3240127
15668 3240127 3110029 3065404 3085633 3095569 3124306 3104483 3307266 3135457 3213008 3432313 3242123
15657 3242123 3305797 3029617 3052803 3014611 2993961 3187075 3223253 3159411 2942171 2972561 2976782
15646 2976782 2902293 2982808 3032349 3116188 3099006 3030278 3076246 3150373 3026857 2805480 2875538
15635 2875538 2910102 3135538 3115217 2950882 2943206 3100844 3195513 3048823 3154952 3014845
15625 3014845 2992625 3066981 3035178 3088757 3048687 3032470 2928012 2954028 2976415 3054453 3058986
15614 3058986 2979108 3062714 3180879 3063874 3095235 3202280 3167085 3147468 3163325 3002201
15604 3002201 3155001 3285118 3214315 3298575 3138814 3161434 3008932 3019982 3020382 3046112 3139018
15593 3139018 3112475 3226169 3113769 3077143 3310437 3247268 3245221 3091257 3010572 3159114
15583 3159114 3195200 3110638 3117731 3206011 3276853 3159137 3288881 3104915 3009181 2942491 3028533
15572 3028533 3082779 3096219 3090629 3103227 3072195 3097211 3238386 3221085 3222339 3061809 3330476
15561 3330476 3324677 3136931 3182753 3177299 3109625 3121924 3234233 3145547 2861939 2856758 2845015
15550 2845015 3003320 3294266 3012166 2949287 3131789 3122708 3340769 3188160 3109499 3172261
15540 3172261 3083563 3111758 3030498 3087588 3090185 2967640 3047576 3124165 2955689 2945770 2890036
15529 2890036 2958248 3157474 3368522 3376087 3294699 3317408 3151516 3130867 2990579 2867821
15519 2867821 2846790 2883776 2918362 2980466 3051120 2937869 3023227 3234054 3206019 3097524 2924734
15508 2924734 3019645 2935551 2847216 3177292 3117428 2915083 3074838 3063331 3371170 3227607
15498 3227607 3106139 3167184 3330687 3196913 3327256 3166596 3087714 3087425 3133606 3208867 3172176
15487 3172176 3180387 2892405 2895598 3139634 3281881 3143824 3067414 3045888 3274397 3167780
15477 3167780 3160541 3045159 3055248 3193472 3222252 3279905 3298995 3145080 3098562 3232067 3144268
15466 3144268 3304179 3244187 3102387 3134827 3348642 3239652 2929187 3051742 3135217 2964997
15456 2964997 2814707 3183708 3230855 3165087 2917400 3031718 3071262 3082890 3192401 3092768
15446 3092768 3103804 3041035 3116279 3219222 2938285 3093911 3175318 3062424 3041299 3111451
15436 3111451 3150804 3021074 3314736 3233619 3182081 3053087 3190218 3165685 3343535 3152491
15426 3152491 3216810 3190895 3015895 3068184 3221546 3123051 3124947 3150928 3084843 3161967 3100488
15415 3100488 3209076 3166266 3137585 2945492 3086477 2918484 3108168 3107216 3106802 3321863 3330206
15404 3330206 3379336 3214246 3107824 3297430 3313589 3242976 3073248 3243142 3216937 3294464
15394 3294464 3119439 3162287 2951514 2791796 3118027 3343207 3122248 3054557 3150639 2982317
15384 2982317 2959403 3190579 3323690 3198694 3216009 3151699 3084751 3035190 2926851 3045611
15374 3045611 3202418 3356945 3294730 3210818 3262753 3144072 3248531 3216493 3289069 3174090
15364 3174090 3170363 3301289 3203598 3103624 3195677 3265278 3197326 3118006 3021034 2973427 2966535
15353 2966535 3080547 3138834 2899044 3127956 3212224 3058963 3128878 3099388 3143915 3141776 3091612
15342 3091612 3080269 3070472 3202112 3355093 3357480 3488199 3395840 3270259 3301680 3545599 3389977
15331 3389977 3046555 3041852 3125585 3183477 3051604 3041016 3262464 3329373 3161707 3308429
15321 3308429 3073966 3101355 3344847 3247767 3327721 3296906 3249207 3327795 3338384 3242780 3257486
15310 3257486 3220480 3157244 3245312 3306680 3380314 3282926 3279311 3104047 3078818 3096236 3070352
15299 3070352 3141376 3124691 2969638 3079634 3297619 3296497 3010627 3003568 3045759 3092479 3287705
15288 3287705 3102226 3019652 3013446 3149694 3312954 3175466 3138596 3074394 3281823 3310930
15278 3310930 3246457 3171049 2963308 3189947 3404784 3312950 3276860 3160851 3397649 3128491
15268 3128491 3023651 3115723 3139681 3083381 3052894 2971396 2904731 3112126 3162198 3155897 3316495
15257 3316495 3337196 3309573 3268702 3233995 3482861 3424516 3314113 3064848 3122517 3206079 3190319
15246 3190319 3037309 3063726 3114995 3265179 3345492 3081800 2888831 2954057 3086715 3178073
15236 3178073 3283280 3189357 3305450 3311016 3159625 3225516 3237791 3391763 3314119 3130250
15226 3130250 3053707 3217874 3153381 3065014 3162843 3184835 3038182 3115149 3048245 3078752 3165542
15215 3165542 3211854 3084150 2910933 3015206 3295005 3297348 3429867 3525990 3418678 3299323
15205 3299323 3192845 3170518 3228532 3237647 3243198 3353311 3285476 3245603 3426565 3352743 3194700
15194 3194700 3235189 3044526 3132710 3012135 3082904 3331296 3178114 3026404 3219422 3196412
15184 3196412 3196172 3080525 3179784 3290007 3130835 3215095 3277083 3248050 3284737 3371781 3289017
15173 3289017 3223501 3202276 3158193 3148047 3121351 3187469 3447414 3572899 3515790 3250197 3338302
15162 3338302 3323300 3169467 3304794 3259280 3313174 3247508 3125593 3295975 3334900 3379011
15152 3379011 3253127 3249619 3208914 3256568 3149627 3255001 3349561 3371779 3293585 3215691 3295833
15141 3295833 3381693 3195724 3216117 3268494 3334126 3273312 3311059 3292872 3057272 3114840 3082597
$$ [...]
##END NTUPLES=NMR SPECTRUM
##END=
