##TITLE=1H_TG-2340-II-a
 CDCl3
 8 sc, 
 13.4.2023
##JCAMPDX= 6.0         $$ Bruker NMR JCAMP-DX V2.0
##DATA TYPE= NMR SPECTRUM
##DATA CLASS= NTUPLES
##ORIGIN= UXNMR, Bruker Analytische Messtechnik GmbH
##OWNER= root
$$ XWIN-NMR		Version 3.5
$$ Thu Apr 13 14:40:54 2023 Russian Standard Time (UT+4h)  she@DPX200
##.OBSERVE FREQUENCY= 200.13135
##.OBSERVE NUCLEUS= ^1H
##.ACQUISITION MODE= SIMULTANEOUS
##.ACQUISITION SCHEME= undefined
##.AVERAGES= 8
##.DIGITISER RES= 18
##SPECTROMETER/DATA SYSTEM= spect
##.PULSE SEQUENCE= zg30
##.SOLVENT NAME= DMSO
##.SHIFT REFERENCE= (INTERNAL, DMSO, 0, 15.737)
##AUDIT TRAIL= $$ (NUMBER, WHEN, WHO, WHERE, WHAT)
$$ ##TITLE= Audit trail, XWIN-NMR		Version 3.5
$$ ##JCAMPDX= 5.01
$$ ##ORIGIN= Bruker BioSpin GmbH
$$ ##OWNER= she
$$ F:/spectra/data/she/nmr/H-F/1/pdata/1/auditp.txt
$$ ##AUDIT TRAIL=  $$ (NUMBER, WHEN, WHO, WHERE, WHAT)
(   1,<2023-04-13 14:39:28.79 +0400>,<she>,<DPX200>,
      <created by zg, POWCHK disabled, PULCHK disabled
       configuration hash MD5:
       00 E9 B6 7A A2 85 ED C7 34 08 36 98 17 FE 4E 26
       data hash MD5: 16K
       DE 46 AA EC AF 95 E9 75 57 A3 7F 8C 5D 50 3F 2F>)
(   2,<2023-04-13 14:39:31.21 +0400>,<she>,<DPX200>,
      <Start of raw data processing
       efp BC_mod = 2 LB = 0.24 FT_mod = 6 PKNL = 1 PHC0 = -19840.72 PHC1 = 21.20081 SI = 16K 
       data hash MD5: 16K
       09 52 B4 CE 68 FC 75 8E 90 9F 6D 07 1B 31 9E 69>)
(   3,<2023-04-13 14:39:56.20 +0400>,<she>,<DPX200>,
      <pk PHC0 = 9.369859 PHC1 = -11.4 
       data hash MD5: 16K
       74 6C 40 B6 F8 7F 0A 86 D7 57 55 DF 75 8D FE 29>)
(   4,<2023-04-13 14:40:02.21 +0400>,<she>,<DPX200>,
      <abs ABSG = 5 
       data hash MD5: 16K
       29 87 EB BD 6C 3E F4 74 85 D0 0A AA 0C 59 50 85>)
$$ ##END=
$$ 
$$ hash MD5
$$ 2B DF 01 19 F8 9E 26 DB 66 C2 F9 AA 7F 6E FB 9F
##$RELAX= 
##$RELAX= 
##$RELAX= 
##$RELAX= 
##$RELAX= 
##$RELAX= 
$$ Bruker specific parameters
$$ --------------------------
##$DU= <F:/spectra>
##$EXPNO= 1
##$NAME= <H-F>
##$PROCNO= 1
##$TYPE= <nmr>
##$USER= <she>
##$AMP= (0..31)
100 100 100 100 100 100 100 100 100 100 100 100 100 100 100 100 100 100 
100 100 100 100 100 100 100 100 100 100 100 100 100 100 
##$AQSEQ= 0
##$AQ_mod= 1
##$AUNM= <au_zg>
##$AUTOPOS= <>
##$BF1= 200.13
##$BF2= 200.13
##$BF3= 200.13
##$BF4= 200.13
##$BF5= 200.13
##$BF6= 200.13
##$BF7= 200.13
##$BF8= 200.13
##$BYTORDA= 1
##$CFDGTYP= 0
##$CFRGTYP= 5
##$CHEMSTR= <none>
##$CNST= (0..31)
1 1 145 1 1 1 1 1 1 1 1 1 1 1 1 1 1 1 1 1 1 1 1 1 1 1 1 1 1 1 1 1 
##$CPDPRG= <>
##$CPDPRG1= <>
##$CPDPRG2= <>
##$CPDPRG3= <>
##$CPDPRG4= <mlev>
##$CPDPRG5= <mlev>
##$CPDPRG6= <mlev>
##$CPDPRG7= <mlev>
##$CPDPRG8= <mlev>
##$CPDPRGB= <>
##$CPDPRGT= <>
##$D= (0..31)
0 1.2 0 0 0 0 0 0 0 0.06 0 0.03 0 0 0 0 0.0002 0 0 0 0 0 0 0 0 0 0 0 0 
0 0 0 
##$DATE= 1681382368
##$DBL= (0..7)
120 120 120 120 120 120 120 120 
##$DBP= (0..7)
150 150 150 150 150 150 150 150 
##$DBP07= 0
##$DBPNAM0= <>
##$DBPNAM1= <>
##$DBPNAM2= <>
##$DBPNAM3= <>
##$DBPNAM4= <>
$$ [...]
##$SUBNAM3= <"">
##$SUBNAM4= <"">
##$SUBNAM5= <"">
##$SUBNAM6= <"">
##$SUBNAM7= <"">
##$SUBNAM8= <"">
##$SUBNAM9= <"">
##$SW= 18.05172834244
##$SWIBOX= (0..15)
0 0 2 0 0 0 0 0 0 0 0 0 0 0 0 0 
##$SW_h= 3612.71676300578
##$TD= 16384
##$TD0= 1
##$TE= 0
##$TE2= 300
##$TE3= 300
##$TEG= 300
##$TL= (0..7)
0 120 120 120 120 120 120 120 
##$TP= (0..7)
150 150 150 150 150 150 150 150 
##$TP07= 0
##$TPNAME0= <>
##$TPNAME1= <>
##$TPNAME2= <>
##$TPNAME3= <>
##$TPNAME4= <>
##$TPNAME5= <>
##$TPNAME6= <>
##$TPNAME7= <>
##$TPOAL= (0..7)
0.5 0.5 0.5 0.5 0.5 0.5 0.5 0.5 
##$TPOFFS= (0..7)
0 0 0 0 0 0 0 0 
##$TUNHIN= 0
##$TUNHOUT= 0
##$TUNXOUT= 0
##$USERA1= <user>
##$USERA2= <user>
##$USERA3= <user>
##$USERA4= <user>
##$USERA5= <user>
##$V9= 5
##$VALIST= <valist>
##$VCLIST= <CCCCCCCCCCCCCCC>
##$VD= 0
##$VDLIST= <DDDDDDDDDDDDDDD>
##$VPLIST= <PPPPPPPPPPPPPPP>
##$VTLIST= <TTTTTTTTTTTTTTT>
##$WBST= 1024
##$WBSW= 4
##$XGAIN= (0..3)
0 0 0 0 
##$XL= 0
##$YL= 0
##$YMAX_a= 214994
##$YMIN_a= -335390
##$ZGOPTNS= <>
##$ZL1= 120
##$ZL2= 120
##$ZL3= 120
##$ZL4= 120
##$ABSF1= 15.73697
##$ABSF2= -2.314879
##$ABSG= 5
##$ABSL= 3
##$ALPHA= 0
##$AQORDER= 0
##$ASSFAC= 0
##$ASSFACI= 0
##$ASSFACX= 0
##$ASSWID= 0
##$AUNMP= <proc_1d>
##$AZFE= 0.1
##$AZFW= 0.1
##$BCFW= 0
##$BC_mod= 2
##$BYTORDP= 0
##$COROFFS= 0
##$CY= -3
##$DATMOD= 1
##$DC= 0
##$DFILT= <>
##$DTYPP= 0
##$F1P= 0
##$F2P= 0
##$FCOR= 1
##$FTSIZE= 16384
##$FT_mod= 6
##$GAMMA= 0
##$GB= 0
##$INTBC= 1
##$INTSCL= 3.70164e-10
##$ISEN= 128
##$LB= 0.24
##$LEV0= 0
##$LPBIN= 0
##$MAXI= 10000
##$MC2= 0
##$MEAN= 0
##$ME_mod= 0
##$MI= 1.114404
##$NCOEF= 0
##$NC_proc= -6
##$NLEV= 6
##$NOISF1= 3.799351
##$NOISF2= 2.8
##$NSP= 0
##$NTH_PI= 0
##$NZP= 0
##$OFFSET= 15.73697
##$PC= 1
##$PHC0= -19831.35
##$PHC1= 9.80081
##$PH_mod= 1
##$PKNL= yes
##$PPARMOD= 0
##$PSCAL= 0
##$PSIGN= 0
##$REVERSE= no
##$SF= 200.130006917749
##$SI= 16384
##$SIGF1= 3
##$SIGF2= 2
##$SINO= 5.538805
##$SIOLD= 16384
##$SREGLST= <1H.CDCl3>
##$SSB= 0
##$STSI= 16384
##$STSR= 0
##$SW_p= 3612.71676300578
##$SYMM= 0
##$S_DEV= 0
##$TDeff= 16384
##$TDoff= 0
##$TI= <>
##$TILT= no
##$TM1= 0
##$TM2= 0
##$TOPLEV= 0
##$USERP1= <user>
##$USERP2= <user>
##$USERP3= <user>
##$USERP4= <user>
##$USERP5= <user>
##$WDW= 1
##$XDIM= 16384
##$YMAX_p= 283747795
##$YMIN_p= -625676
$$ End of Bruker specific parameters
$$ ---------------------------------
##NTUPLES= NMR SPECTRUM
##VAR_NAME=  FREQUENCY,     SPECTRUM/REAL,   SPECTRUM/IMAG
##SYMBOL=    X,             R,               I
##VAR_TYPE=  INDEPENDENT,   DEPENDENT,       DEPENDENT
##VAR_FORM=  AFFN,          ASDF,            ASDF
##VAR_DIM=   16384,         16384,           16384
##UNITS=     HZ,            ARBITRARY UNITS, ARBITRARY UNITS
##FACTOR=    0.220516191357247, 1,           1
##FIRST=     3149.43990452061, 0,            0
##LAST=      -463.276858485168, 0,           0
##MIN=       -463.276858485168, -625676,     0
##MAX=       3149.43990452061, 283747795,    0
$$ Real data points
##PAGE= N=1
##DATA TABLE= (X++(R..R)), XYDATA
$$ [...]
9352 1604782 1579947 1563879 1597412 1709954 1769965 1847250 1935755 2060334 2150785 2115682 2198161
9341 2198161 2297612 2380531 2614808 2696617 2844260 2989146 3070213 3270530 3426033 3578192
9331 3578192 3774957 3870210 3849525 3954919 3950773 3841197 3637246 3732625 3729074 3684326 3482549
9320 3482549 3467095 3525674 3481510 3460776 3386301 3421984 3457820 3504841 3608521 3657216 3783755
9309 3783755 3857366 3978799 4157622 4425510 4674452 4857186 5073785 5327344 5735725 5945699
9299 5945699 6089250 6275984 6407818 6603270 6858787 6983207 7015872 7113366 7091369 7083636
9289 7083636 7196638 7394935 7676226 8058668 8545373 8920448 9514897 10110947 10535624 10759573
9279 10759573 10975104 11182733 11434142 11772518 12063006 11982315 11663514 11018491 10325912 9839557
9269 9839557 9448685 9251163 9117558 9155502 9092219 9103484 9069781 9043923 9095651 9157217 9045059
9258 9045059 8980223 9042272 9100100 9104607 8838218 8816394 8889171 9047702 9343952 9656819 10013811
9247 10013811 10333127 10660305 11099971 11402980 11839612 12383412 12730259 12774253 12814880 12659266
9237 12659266 12192803 11626898 10754557 9745219 8769035 7797120 6964609 6430869 6067462
9228 6067462 5815817 5580383 5269537 5177086 5110289 4863679 4563089 4389543 4302593 4169925
9218 4169925 4020538 3990592 3986562 3882011 3668698 3617224 3559176 3490253 3401669 3297720 3326404
9207 3326404 3339370 3285090 3244539 3333571 3373189 3337754 3286310 3299060 3337387 3235187 3186606
9196 3186606 3257439 3129912 3109316 3140406 3204228 3211722 3162083 3085505 3120856 3084346 3061146
9185 3061146 3094835 3077171 3139707 3279901 3297689 3187625 3178332 3244376 3286663 3369206 3275048
9174 3275048 3268597 3248206 3287147 3232963 3165233 3294148 3256955 3246491 3301881 3298225 3383979 3283961
9162 3283961 3340398 3386934 3423223 3524264 3545050 3727913 3958813 4066904 4047732 4151354
9152 4151354 4101544 4059546 4114382 4250074 4275268 4373486 4380234 4426747 4608251 4822698 4876735
9141 4876735 4948989 5048166 5045794 5175155 5319401 5320080 5483355 5675975 5836821 5979449 6091584
9130 6091584 6381175 6564126 6620956 6824537 7011414 7344404 7664659 7980891 8226993 8560791
9120 8560791 9007990 9587998 10162301 10684355 11339315 12008280 12745573 13607982 14463675 15036702
9110 15036702 15541593 16017342 16454040 17003908 17451216 17621237 17589662 17360266 16968259 16565353
9100 16565353 16420388 16435117 16611981 16867382 17246620 17618394 17948957 18344969 18896425 19608137
9090 19608137 20509091 21674196 22953655 24428805 26294807 28519471 31157029 33861567
9082 33861567 36724221 40040675 43620886 47553098 51204824 53379759 54672759 56282974
9074 56282974 58357904 61297910 64068000 64651971 63341378 60209541 55930004 51476744
9066 51476744 47420562 44005578 41498133 39674416 38187395 36462392 34788075 33322857
9058 33322857 32256475 31544737 31249594 31202128 31314445 31924492 32874980 34385154 36057693
9049 36057693 38260692 40967639 43872397 46884223 49873256 52853342 55323241 57506593
9041 57506593 60049619 63364411 67453009 70366935 71627521 72588703 72843599 71880081 69817820
9032 69817820 65476964 59562271 53890236 48634423 44336540 41224796 38894627 37209062
9024 37209062 35660851 34368415 33154156 31837924 30461195 29331916 28512383 27937595
9016 27937595 27620049 27210204 26617946 26009552 25603735 25472418 25395202 25426588 25112089 24549216
9006 24549216 23673554 22774216 22021434 21375888 21130781 21224503 21291995 21407396 21364635 21199965
8996 21199965 21210215 21237683 21494765 21892964 22179391 22367394 22328244 22513118 22586119 22430087
8986 22430087 22093590 21635581 21315725 20968855 20545437 20217647 20137301 20198171 20491626 20852206
8976 20852206 21244119 21370034 21254559 21114716 20750253 19979685 18925553 17492254 16005328
8967 16005328 14542493 13282905 12393540 11612844 11019887 10462061 10143498 9919343 9561990
8958 9561990 9250695 8946453 8573326 8223114 8072800 7850905 7560428 7421770 7370195 7181474
8948 7181474 7061785 6915408 6850109 6799989 6819940 6667803 6561491 6529007 6415729 6262689
8938 6262689 6208481 6190776 6178172 6153005 6220197 6264250 6210790 6153680 6138755 6247476 6217781
8927 6217781 6154745 6134086 6263163 6252737 6329962 6488889 6586403 6703635 6856814 6859964 6921648
8916 6921648 6939455 6956964 7085573 7161179 7315331 7318308 7453251 7606570 7765190 7880467
8906 7880467 7986110 8122029 8446784 8639512 8760238 9031648 9206058 9426893 9685377 9790388
8896 9790388 9988059 10163765 10376494 10544864 10660663 10910349 11212187 11520526 11634821 11910467
8886 11910467 12238324 12577697 12838168 13189212 13566213 13800114 14123420 14522342 15022791
8877 15022791 15573264 16103109 16661137 17206790 17815595 18579536 19381344 20112073 21064554
8868 21064554 21994603 22944029 24169229 25565542 27157547 29035664 30895452 32509582
8860 32509582 34353668 36567087 38959744 41769218 44304536 46392991 48422407 49942593
8852 49942593 50384667 49317378 47249810 45114793 43075762 41645142 41067710 41029294 41533132
8843 41533132 41973910 42202520 42216180 42275912 42566041 42905195 43623940 44348744 45196051 46466719
8833 46466719 48002080 50045508 52378397 54459628 56566990 58877221 61367728 64357271
8825 64357271 67956933 72158307 77075684 82108838 86618413 90474147 92206278 91606376
8817 91606376 88906261 85140578 81266504 77595380 74775865 72418962 69492206 66463714
8809 66463714 63772431 61403928 59585196 58129286 57076343 56390643 55703491 55043183 54498762
8800 54498762 54099207 54109650 54278142 54816766 55490338 56095005 56822925 57566711 58621198
8791 58621198 60108907 61536378 62821023 64259019 66123540 68321296 70416136 72511208
8783 72511208 74090114 73592554 71731588 68298599 63616268 58919249 54540706 50837325
8775 50837325 47781168 45235595 43331422 41670420 40221339 39140556 38337495 37718142
8767 37718142 37139046 36611718 35773921 34844711 34074223 33418986 32927114 32416804 31950282
8758 31950282 31575280 30991423 30271743 29524021 28772184 28019248 27438177 26945565 26753122
8749 26753122 26651139 26521603 26404960 26237628 25746203 24952852 23841385 22846286 22135921
8740 22135921 21390583 20837625 20399146 19997653 19721461 19517867 19362827 19296018 19229067 19046441
8730 19046441 18872286 18747348 18634895 18708655 18796737 18876346 18947854 19072792 19128968 19300684
8720 19300684 19430328 19644640 19953016 20404268 20931083 21607313 22611260 23695058 25007805
8711 25007805 26699361 28672238 31216143 34269987 37823305 41706090 45584507 50429239
8703 50429239 56500898 62739129 67789672 68102639 63716463 57985715 51893963 46787063
8695 46787063 43180047 40540591 38010652 35714971 33697313 31888499 30251223 29087569
8687 29087569 28294837 27703295 27375214 26984721 26622482 26424257 26501631 26701475 27059273 27597550
8677 27597550 28320979 29165906 29628216 30092471 31001170 32206098 33922460 36216297 38786779
8668 38786779 40944766 42294520 42773872 41955615 40109682 38027142 36267088 34682859
8660 34682859 33606026 33080762 32731245 32465370 31916890 31014980 30131651 29431092 28629068
8651 28629068 27653356 26359244 24919543 23676138 22602875 21585543 20709516 20309646 20158896
8642 20158896 20182764 20406724 20747790 20965996 21137821 21455909 21762286 22158641 22816030 23117491
8632 23117491 23097644 22919002 22704065 22478409 22449088 22357358 22201842 21980677 21661091 21242057
8622 21242057 20878040 20486719 19794487 19181621 18397262 17521746 16396610 15264411 14154435
8613 14154435 13177587 12367578 11652195 11080387 10620720 10114021 9769874 9420589 8982604
8604 8982604 8703077 8633921 8577498 8569373 8508993 8303286 8228515 8303328 8450444 8580929 8773000
8593 8773000 8821193 8811834 8860438 8736511 8479679 8127100 7905992 7785814 7497855 6964113
8583 6964113 6530605 6179279 5879402 5584466 5204412 4980009 4626882 4355936 4243137 3942984
8573 3942984 3773898 3732106 3671001 3547243 3566839 3410553 3292052 3326134 3356415 3222641
8563 3222641 3154673 2986494 3120619 3111557 3054002 2885347 2836877 2714445 2444006 2421228 2426426
8552 2426426 2349171 2184708 2104568 1972090 1970197 1905306 1851897 1746870 1624096 1519617 1524626
8541 1524626 1414114 1340970 1301309 1295926 1263049 1310622 1250188 1260577 1142255 1231439 1202044
8530 1202044 1192527 1172644 1079613 1099754 973537 964503 949747 946495 940164 933683 949887 1018058
8518 1018058 971609 919798 826026 787962 738174 767031 737690 703000 655488 682452 728522
8507 728522 710625 701597 711155 753278 721402 711155 672455 692059 603634 695331 662459 602253
8495 602253 639505 645934 549867 654516 625587 554164 675479 630043 672079 684740 714185
8484 714185 735069 748041 638742 614951 656483 647886 621319 519474 522851 544315 580209 505463
8472 505463 490058 501101 561852 585328 630832 534628 565902 559137 499738 537387 464425 457353
8460 457353 555260 576220 549648 507255 637845 668884 651599 585890 659822 711518 721925
8449 721925 725870 727071 681631 597701 667465 603482 461537 466812 539129 464219 468004 378658
8437 378658 481821 471304 507268 429216 336649 405662 450409 523963 479085 421183 314099
8426 314099 344921 462036 320203 376821 367019 399183 361245 399748 511388 503615 380587
8415 380587 365640 500448 510409 406786 332128 260992 348945 431210 328350 408016 358018
8404 358018 330384 398891 355637 326412 257449 333802 280130 190166 169415 186477 220046 213611
8392 213611 167676 142154 265366 189510 78074 127649 216827 222204 77988 124276 166510
8381 166510 100283 132325 184820 131160 133932 208793 127854 101152 155249 160519 160881 131864
8369 131864 79786 180242 95294 85133 148749 139279 164688 159597 150457 144253 162353 131440
8357 131440 110327 116252 117039 -35203 47332 37649 23875 113993 117078 117404 -24581 -26735 95375
8344 95375 74563 91319 102057 128909 75055 90451 173648 126138 296583 192752 100632
8333 100632 118884 149504 182361 186485 79996 4205 318 47408 129921 47089 48257 90628
8321 90628 45708 -30257 14823 170240 149832 134361 62363 71854 108019 188005 179113 108218
8309 108218 152353 154158 160941 217023 148466 105084 68156 49988 119346 205595 143697 131341
8297 131341 186856 134558 195811 226020 181932 119043 171910 102191 88148 59338 -16264 -50793
8285 -50793 3122 74225 155496 148040 3643 2113 -21908 39848 88003 74259 41015 22763
8273 22763 63048 96287 -17769 -39565 1685 99604 153747 148599 123622 -3828 124995
8262 124995 92280 34276 98899 115043 88896 100468 103692 109085 152973 14587 73066 136050
8250 136050 25151 30875 30691 668 -75894 -16327 96809 95181 86727 33584 28192 62907
8238 62907 57383 55071 29199 98553 74006 30 48883 39110 26651 54992 150924 123294
8226 123294 126864 112016 190538 233146 197433 135760 128095 138542 13055 26130 122279 115549
8214 115549 22899 71267 143904 85393 125793 136576 7773 -32485 65561 23667 -1122
8203 -1122 89270 -28466 -23738 -54115 7070 10105 67508 -27546 22375 123882 284728 -293472
8191 -293472 -625676 -287756 -213842 -123526 -44628 -51713 -68708 -44781 -97737 -137623 -205137
8180 -205137 -125240 -118781 -134770 -101169 -79412 -111785 -154066 -167285 -99424 -154917 1414 70430
8168 70430 53319 -7094 -70309 -147972 -92069 -123280 -103621 -20808 -97528 12213 -42934 -27251
8156 -27251 -65927 -69422 44238 -20420 -776 -60845 -30428 -38564 -69776 -139700 -184397 -171213
8144 -171213 -130787 -65118 -23657 -26365 -75036 -34212 -34498 -2576 -61922 -86044 -61668 -68984
8132 -68984 -50132 -91238 -97777 -166378 -227056 -174999 -86503 -65484 -72797 -28543 -68994 -139772
8120 -139772 -108791 -98371 -218618 -201298 -154455 -130060 -219384 -149107 -91974 -86158 -13457 -7160
8108 -7160 10648 -29015 -36425 -171816 -170048 -132523 -118480 -74524 -120061 -134046 -156263 -64823
8096 -64823 -79120 -180121 -132189 -86634 -69180 -141561 -92214 56628 27019 -106817 -183419
8085 -183419 -187536 -94363 -36616 -55068 -52889 -44249 -77923 -21649 -64949 -80503 29422 -8266
8073 -8266 -33133 -137821 -159788 -216414 -72744 29702 -35626 -47054 -97158 -123517 -132617 -127092
8061 -127092 -180043 -148061 -222660 -145574 -40675 -23626 -35049 -78390 -101984 -104023 -28597 1169
8049 1169 -76177 -50203 -95753 -106805 -117579 -178243 -195260 -173858 -133889 -59753 -3429 3606
8037 3606 -41601 -72417 -87430 -47233 -92729 -63174 50534 -38825 -7264 -109797 -103542 -96596
8025 -96596 -116095 -102209 -106841 -67629 -14679 -121025 -144586 -73095 -54115 -89412 -98025 -69279
8013 -69279 -45591 -130291 -42260 -26290 -48980 -53498 -132394 -141616 -189774 -163188 -142559 -156908
8001 -156908 -38847 -23311 -44920 -33212 -33035 -55422 -83578 5528 26413 -75555 -56080 -86466
7989 -86466 -106805 -79173 -129020 -83499 -124560 -91296 -108563 -135418 -42209 -75190 -136537 -110714
7977 -110714 -107289 -128570 -128781 -98571 -96322 -58795 -114842 -80644 -40826 -52975 12232 62952
7965 62952 -7207 36244 48464 -68557 -137976 -49508 -52852 -66432 -51546 -117184 -53369 -68522
7953 -68522 -68602 -41518 -40448 2232 -64286 -119573 -173845 -125430 -130022 -24973 -77258 -35312 -24263
7940 -24263 -11588 -31205 -55472 381 -61012 -142341 -134861 -48875 -34042 -51131 -49179 18119
7928 18119 3482 57870 52105 51509 57109 51509 18899 -83902 -166651 -95254 5220 -28449
7916 -28449 -154245 -154383 -180158 -143306 -159847 -213227 -176743 -91579 -119623 -103712 -28942 11528
7904 11528 -22528 -44626 -46519 -44347 -104793 -124414 -62542 -135063 -54551 -62243 -117671 -120116 -113903
7891 -113903 -49817 -52103 18608 69246 15865 -67517 8562 -90535 -21680 -129483 -121306 -13556
7879 -13556 -94508 -81463 -83486 -89071 -144769 -94644 -118121 -268995 -253467 -132541 46568 4008
7867 4008 -119778 -167565 -207961 -175487 -210526 -114032 -64712 -161419 -94961 -26912 -110270 -175956
7855 -175956 -128489 -8616 57304 5930 -64000 -64321 -70293 -152227 -97864 -75180 -120955 -81105
7843 -81105 -129126 -62737 -62565 -192511 -186438 -115557 -102575 -94590 -145949 -57992 -42686 -96315
7831 -96315 -140625 -83606 -59438 -48374 -108718 -71697 8267 -36108 -111780 -25017 -116324 -62916
7819 -62916 55129 81228 -26898 -4253 -468 -23424 -63210 -71796 -21508 -118419 -95033 -42041
7807 -42041 -55702 -50973 -103409 -148815 -96887 -36363 -145223 9983 38132 -78158 12636
7796 12636 -38156 -79054 -44426 40663 -71796 -76607 -52604 -126232 -133392 -74939 -91313 11835
7784 11835 30975 69428 38468 39022 -34530 15052 136812 33662 -90785 -92978 -92053 -113859
7772 -113859 -53616 50400 101802 61299 48266 66687 -59863 5920 -89978 -79130 -66373
7761 -66373 -74953 -42137 -91675 -52390 -73019 -43326 -98311 -33190 -12376 -21543 25406 51989
7749 51989 39929 70786 45964 86131 106845 41135 16764 -16669 -48885 -41406 97703 119172
7737 119172 212439 184979 158899 148126 218167 170200 200330 329428 508970 521303 394076
7726 394076 342079 330992 219702 95042 135921 89175 141574 27443 19638 -38533 -31339
7715 -31339 -47465 -64107 72316 138194 64816 -4998 1648 11316 28940 12407 -3188 31016
7703 31016 78473 116288 -71395 -80434 19393 -17871 -5322 -40119 -106170 -85883 -64240 -121521
7691 -121521 -157535 -95610 -88310 -34316 -113843 -125461 -41490 -32017 -4019 -10909 -64579 -95737
7679 -95737 -119854 -68029 11314 -5721 39614 18034 -26713 -29345 -2666 -17484 -33110 -18106
7667 -18106 18969 70001 62342 27877 14117 28534 14170 -11767 -76678 -29772 -27580 -71356
7655 -71356 -77181 -73837 -48790 11928 83553 34591 14017 -46183 -77904 -2763 109003 13520
7643 13520 -23971 -105532 -59049 36886 21969 -22588 -39527 -8746 -26323 -9066 -104954 -108564
7631 -108564 -93546 -69306 11847 8313 -79450 -192956 -127079 -22591 -85547 -49543 -12782
7620 -12782 -60841 -102429 -72836 -75495 -17723 29763 -28184 -54550 -55653 -58442 -39871 -6074
7608 -6074 32652 -40843 40197 122501 11596 -23030 -49976 -74063 -141362 -103872 4392 26365
7596 26365 -37637 476 -9265 14167 -6340 -118498 -49495 -54330 -106728 -90336 -80157 -42842
7584 -42842 -13636 -22168 -37039 -49443 45770 30826 25596 -26839 -45282 -70698 -52749 -66550
7572 -66550 -91882 31149 -47176 48175 56754 -58189 -3566 56057 13102 24812 -9539 -149324
7560 -149324 -85562 -33860 3501 -43733 -113055 -55133 -35365 -56026 -32215 29879 -109051
7549 -109051 -13428 6399 25971 9655 -99747 -146430 -93793 -6663 -61974 -109402 -25511
7538 -25511 -2224 -14534 96813 63833 47666 66739 122035 172686 49814 49167 32439 -37339
7526 -37339 88429 99271 -20657 -52893 -9079 110739 125196 93136 -29101 -87555 -26176
7515 -26176 105513 161754 175449 206431 283722 345239 346834 330685 373056 415220 442734 459401
7503 459401 364304 293538 305258 362399 343629 255639 151982 112205 88109 200541 234428
7492 234428 121942 31835 110765 150274 244000 128558 17348 81527 133551 141927 44807
7481 44807 -79693 -56615 8543 36179 89102 66888 86414 65425 -17 10825 76119 123579
7469 123579 53120 171048 114968 155442 236888 230457 216139 252655 209318 254158 169563 17781
7457 17781 78995 70934 13314 29432 47641 71995 206271 282926 250031 172332 94650 88665
7445 88665 -2220 46787 137478 126261 69218 -39396 129157 153629 170099 155317 198192
7434 198192 126628 78935 156484 166367 269149 236238 63306 67922 190719 164510 86808
7423 86808 46291 82524 119291 122426 170480 129511 111981 142512 122917 120101 163040 138244
7411 138244 178959 118353 136160 159151 170421 206459 107932 58323 82173 131976 138040 152717
7399 152717 161849 195303 177729 162598 162905 202356 301704 290831 284749 176899 176826 214703 156023
7386 156023 118893 32958 115397 155325 131573 132811 128203 107561 56171 98186 139651 185807
7374 185807 94585 189552 255027 211183 150766 253323 178230 121399 143331 175000 149423
7363 149423 204063 241510 179251 107584 125676 169068 127342 238111 366049 343810 351523
7352 351523 356809 350841 232288 177531 317368 314009 294248 288967 370885 339904 283467 308258
7340 308258 357029 344924 258615 194574 239575 306733 360637 390205 401443 389678 372200 382182
7328 382182 368234 300293 390908 327181 357139 388098 362639 400712 410510 412195 322917 312871
7316 312871 412406 425354 366746 259362 288981 285581 282191 215044 223698 270306 274517 279522
7304 279522 323223 287137 345788 276204 324845 359792 363116 413475 364110 328115 315975 315927
7292 315927 333735 332432 379909 475619 449623 406777 408753 523405 450283 405653 472452 457236
7280 457236 443172 511738 426613 403048 365890 458990 533756 533021 526829 489072 482826 535276
7268 535276 533489 453136 455651 402043 495133 507450 435127 563323 607109 549548 529671 504138
7256 504138 472340 549859 606750 614861 722627 764394 698764 567896 495046 574737 675511
7245 675511 597439 634478 750895 765607 675907 616528 639547 710085 686906 696669 724827 686773
7233 686773 659381 732159 674596 634770 699930 672316 656086 643508 649783 570724 584378 671246
7221 671246 787567 789251 761963 767189 825394 805560 806585 741271 814876 921113 952121 1025176
7209 1025176 1017032 1009506 1095978 1146170 1116021 1131133 1171456 1265664 1482298 1470648 1376808 1350258
7197 1350258 1413342 1433857 1504832 1409727 1393115 1463714 1499601 1528148 1681739 1649855 1523211
7186 1523211 1521919 1510334 1679406 1746904 1781352 1768856 1707716 1738840 1926960 2006238 1995374
7175 1995374 2028149 2073889 2137665 2228392 2205297 2285972 2337750 2343789 2385826 2562801 2631800
7164 2631800 2722392 2749297 2769140 2825377 2871887 2823382 2844577 2953802 3086316 3133986 3128465
7153 3128465 3343838 3527115 3639055 3754193 4000879 4092982 4264639 4502621 4739283 4817461
7143 4817461 4999924 5306877 5579705 5925537 6214571 6427312 6615397 6870739 7045843 7290562
7133 7290562 7457960 7687692 8051802 8364234 8774945 9163555 9713778 10324243 11082017 11852162
7123 11852162 12749995 13744686 15041118 16386448 17962700 19749282 21855415 24473754
7115 24473754 27628242 31629060 36621810 42714631 50041016 58065823 66034137 71709818
7107 71709818 73412953 70876791 64299132 55671929 46517024 38405185 31683987 26633547
7099 26633547 22828678 20026739 17958400 16321200 14934783 13765941 12752049 11965331
7091 11965331 11250779 10686556 10207616 9936275 9674968 9353361 9119258 8984833 8834903
7082 8834903 8643086 8560528 8486749 8397144 8460265 8614113 8875389 9236697 9775705 10309278
7072 10309278 10989956 11688779 12430394 12996176 13433968 13519200 13249110 12540966 11538999
7063 11538999 10512569 9341568 8377887 7568715 6902605 6476641 6125446 5759315 5465474
7054 5465474 5212817 5034763 4941250 4841099 4679309 4628467 4487007 4425676 4474619 4441994
7044 4441994 4349925 4448682 4557354 4631957 4695067 4916903 5140153 5452026 5798341 6095362
7034 6095362 6321523 6426227 6418762 6497527 6462125 6282210 6151618 5969027 5788111 5452155
7024 5452155 5163540 4990525 4774318 4580649 4466355 4529055 4510842 4479515 4552811 4801105
7014 4801105 4865744 4968458 5236256 5524634 5825473 6296068 6857243 7633841 8471856 9402211
7004 9402211 10421971 11779838 13174106 14498692 15318441 15473757 15065444 14044754 12496282
6995 12496282 10851406 9205698 7661947 6453321 5536156 4943730 4515311 4077577 3696514
6986 3696514 3412922 3224216 3055573 2915229 2818503 2520288 2357539 2185923 2173689 2147411
6976 2147411 1998551 1898427 1789507 1671985 1654685 1610082 1453114 1397426 1342974 1270635
6966 1270635 1346935 1260358 1118600 1021487 1125972 1156230 1149168 1133318 1100918 1048583 924956
6955 924956 855505 922729 943119 802600 760899 800506 761549 780744 723774 773403 711988
6944 711988 666932 708947 616482 612874 626929 513016 440136 556757 626743 615844 625698 558260
6932 558260 565191 539342 498106 511739 506897 402278 367947 409929 436288 531069 398945 324244
6920 324244 289908 270093 323467 286011 319706 326232 353807 355744 346650 358859 309416 267717
6908 267717 328916 318865 317321 353437 402255 283915 172254 255129 345069 364861 249445
6897 249445 299718 330459 271796 202955 186927 297750 223871 239381 313558 306325 309706 239212
6885 239212 255610 187272 278248 246630 192402 229746 254864 218084 332217 360025 354737 320399
6873 320399 274343 219731 248705 321700 186426 188210 135021 149460 162669 200414 164331 212532
6861 212532 196229 230401 271975 240979 342609 261660 130798 98270 253236 306972 263067
6850 263067 218319 128370 231429 217137 238186 310068 257422 226721 188400 215243 361042
6839 361042 205115 195185 218086 201218 196689 175870 211025 170279 133813 149474 186418 206346
6827 206346 316373 287107 259494 193724 194322 207466 257084 192951 151691 164121 129553 111604
6815 111604 95242 -8947 108748 123434 65492 153980 165513 72375 88006 139797 195401
6804 195401 260515 239158 252485 129556 162297 253182 160791 193727 217127 208407 160133 269706
6792 269706 255975 128967 104592 221418 243725 227826 196726 220014 252359 174410 164068
6781 164068 80502 184243 93737 239845 308552 246002 185066 154584 231225 220778 251184
6770 251184 296733 280393 245450 290823 216560 151953 184446 217626 146044 114685 31196 86204
6758 86204 176477 109472 113085 73485 143172 158634 59239 84336 109191 16581 93936 89996
6746 89996 104272 156558 207010 263073 121447 -42866 24713 181783 225652 173978 161392
6735 161392 84767 103914 121711 31111 51286 202429 210089 194421 258994 162597 167183 196471
6723 196471 212097 201765 134929 162132 249110 242413 254406 243485 252715 283323 363256 347526
6711 347526 261287 284166 479881 491177 356337 417621 478088 441185 472848 410835 373911
6700 373911 378281 181841 134494 176588 143716 203513 169567 151323 136121 91980 255866
6689 255866 251827 151543 151275 143907 137743 79540 68164 35104 21344 25837 18811 127129 99150
6676 99150 51538 112994 281400 321736 254736 263658 300002 230636 177031 188507 239557 199243
6664 199243 156493 177980 172956 235555 223638 225183 279133 236932 163628 151174 120988 95367
6652 95367 132474 127127 47905 100715 28107 77500 88318 107567 157407 42449 114789 151979
6640 151979 67748 74959 26691 103743 127660 117185 219042 253470 104382 75040 214595
6629 214595 93214 142130 98806 164674 299228 249599 84838 12304 99824 109507 62283
6618 62283 84204 33975 17346 300 -3933 32882 34716 132572 130495 15086 102702 130079
6606 130079 127610 220149 156302 122185 181465 140646 -8245 -39997 -39127 20085 92433 168603
6594 168603 201340 148839 238196 214857 203914 147032 45808 147133 170331 302536 285333
6583 285333 259721 253265 133835 70289 168981 204170 200399 216698 177129 116903 15808 52593
6571 52593 134677 182374 235514 140670 75423 90430 9041 65023 97702 112372 79556 -6459
6559 -6459 14229 156414 108142 83897 177280 215153 192515 158084 203578 243027 272757 278746
6547 278746 388811 287317 257459 295245 196826 188348 183185 171046 204650 231461 263591 295225
6535 295225 330650 430664 395616 456105 428012 470651 576256 526134 601872 519304 403274
6524 403274 242865 204124 215726 159994 137782 124819 158571 169511 136937 212119 226128
6513 226128 193390 201128 192239 185066 167163 195215 281650 223297 170956 186863 193976 197466 208819
6500 208819 201209 166855 204652 157546 91338 76287 125516 233723 140568 191742 213240 145973
6488 145973 109875 151576 205242 198999 286693 312147 239004 272535 309916 284240 179345 173250
6476 173250 159586 169472 227311 202365 226937 118126 125267 172123 129795 64474 60483 58322
6464 58322 130277 130664 249202 228440 139631 132745 205836 161644 118328 219913 235779 197554
6452 197554 172305 165565 159268 129465 119822 133637 245193 169096 164492 130796 152986 137201
6440 137201 146217 152675 123924 221790 120171 79072 108095 128399 208446 147192 148208 160592
6428 160592 201655 219628 165125 147173 238615 328996 329069 334635 259641 202708 175086 69409
6416 69409 162456 150053 181738 259176 264304 210876 220643 253779 188795 202705 161694 226897
6404 226897 71107 158234 203782 200879 267383 326064 318961 223045 154269 128055 96717 160246
6392 160246 212372 239882 246611 236146 216215 258588 220627 276180 275938 265555 219659 175944
6380 175944 90293 90959 85372 243998 292451 221905 265202 252584 220525 179300 218968 225831
6368 225831 259701 229124 289621 278084 188996 141803 319524 290851 229363 199022 172474
6357 172474 249383 338727 391304 344963 370079 353924 376466 355657 380144 465684 435255 267205
6345 267205 378831 399352 430129 387457 379148 398669 380248 426484 465509 439506 332197
6334 332197 328474 299167 287761 262271 323550 305202 260113 248697 266211 248920 304719 289879
6322 289879 269424 256846 210277 198516 196122 246821 321680 344577 379207 327552 360915 381469
6310 381469 349664 351294 259950 297921 292090 270970 287114 239261 281532 321912 278984 238591
6298 238591 235886 272908 303138 265372 290525 236172 236229 250008 234711 238409 330370 356985 299529
6285 299529 252966 133202 262024 289424 193898 289623 297194 312366 395613 419865 376874
6274 376874 381079 318958 309881 342603 429992 373599 446411 441559 339159 357108 370141 427924
6262 427924 530451 558387 550894 465948 387572 457108 433116 424881 474925 469937 503047 485525
6250 485525 423444 352401 477363 510047 565209 623819 534848 591553 578915 535386 500199
6239 500199 457147 470438 551192 481465 476977 514586 533424 456029 427112 510269 554296 524643
6227 524643 611671 651750 598662 606301 657742 621138 507775 672921 819339 729753 798005
6216 798005 818527 763760 698624 819488 756298 722300 850463 790551 779306 848791 871558
6205 871558 825358 746503 687613 671681 704443 722822 811100 728657 761356 860386 843821 847488
6193 847488 821050 817710 876756 851279 962340 1017666 916291 974611 1015259 972311 988621
6182 988621 1001805 1018198 999360 968217 1021771 1024324 1049680 1079764 1054433 1012933 1096379 1049864
6170 1049864 1003132 994763 1088890 1169565 1182147 1164579 1230229 1189897 1090928 1152766 1253803
6159 1253803 1200391 1259257 1232249 1326391 1437300 1400858 1409562 1383120 1322376 1362472 1482396
6148 1482396 1465254 1495437 1480630 1477609 1487533 1472428 1563423 1579890 1658748 1735542 1689408 1781241
6136 1781241 1741109 1770716 1823044 1874114 1805188 1821609 1901796 1976194 1980202 2004086 2086781 2087426
6124 2087426 2129859 2254839 2393495 2299819 2311684 2357697 2305090 2361260 2416800 2483173 2360470
6113 2360470 2513871 2663006 2720915 2807980 2823669 2799385 2928477 3103418 3110827 3315190 3484749
6102 3484749 3550472 3544651 3562773 3745926 3996435 4071975 4191602 4251401 4416333 4641349 4812164
6091 4812164 5000818 5287341 5549025 5811334 6109815 6514322 7072934 7606010 8210875 8884525
6081 8884525 9706084 10768882 12046107 13501447 15211179 17361345 19621611 21416999
6073 21416999 22116491 21531386 20233629 18899911 17544115 16712422 16387295 16735071 17575945
6064 17575945 18766700 20299660 21725047 22220771 21315363 19559667 17330167 15118951
6056 15118951 13225566 11812998 10696036 9985642 9337286 8872545 8528134 8260919 8026755
6047 8026755 7816537 7727465 7726518 7756711 7780483 7802408 7929278 8176470 8369886 8686917 8915923
6036 8915923 9276094 9614542 10006136 10519699 11119482 11855431 12929955 14181398 15594526
6027 15594526 17395768 19601061 22205962 24996325 27772135 29483989 29423910 27978581
6019 27978581 25997462 24100448 22665032 21780593 21670136 22405831 23774813 25601809 27681437
6010 27681437 29021591 28620783 26478343 23578319 20584326 17695302 15275234 13338298
6002 13338298 12052339 10979128 10038727 9345949 8751238 8284949 7847624 7447808 7141590
5993 7141590 6956853 6748467 6554087 6296965 6108630 6062976 6056348 5916536 5809140 5761358
5983 5761358 5690345 5648385 5592815 5436189 5454845 5505640 5413532 5346687 5337081 5373451 5408007
5972 5408007 5404653 5434275 5433959 5544325 5560869 5505258 5486859 5562024 5667872 5612176 5641908 5580482
5960 5580482 5552926 5646978 5703372 5669842 5725812 5744313 5780960 5861577 5838782 5737384 5869876
5949 5869876 5941847 6016266 6073321 6070783 6116526 6112661 6223116 6369468 6510073 6534545 6628807
5938 6628807 6864057 6933300 6851466 7034638 7214285 7356332 7436075 7515694 7762484 7981772
5928 7981772 8026998 8135908 8282589 8445676 8640235 8798563 8922543 8925676 8927450 9013393 9119752
5917 9119752 9137775 9259244 9332004 9296165 9311919 9323048 9406043 9345652 9350746 9405124 9571439
5906 9571439 9714238 9780269 9785669 9809553 10052043 10120014 10273667 10486762 10666107 10822278
5896 10822278 11059107 11412076 11796004 12171018 12590944 13074495 13613368 14099137 14573785
5887 14573785 15054759 15457144 15784084 16057795 16242947 16401841 16477849 16466053 16564225 16732379
5877 16732379 16865603 16942857 17184259 17328462 17548897 17815675 18208761 18504416 18681948 18910416
5867 18910416 18914392 18858281 18659522 18375526 17996613 17673743 17306694 16885046 16504893 16220630
5857 16220630 15939438 15919072 16011464 16079701 16368375 16515730 16654568 16973044 17190688 17529025
5847 17529025 17800810 18170038 18544377 18954980 19487270 20098058 20793233 21626279 22403292
5838 22403292 23357647 24374192 25326682 26430340 27574372 28652393 29603829 30702862 31739763
5829 31739763 32512690 32946119 32971176 32721491 32051646 31044752 30090436 29339821 28647726
5820 28647726 27817040 27306305 26815159 26281124 25838450 25480675 25192376 24960621 24829221
5811 24829221 24823560 24858031 24865926 25103342 25322123 25419804 25454466 25465038 25471638 25518605 25416922
5800 25416922 25380493 25280493 25102431 25087338 24828933 24142220 23346792 22444285 21414105 20278375
5790 20278375 19205080 18313606 17532738 16943563 16376306 15844682 15346329 14926931 14668344
5781 14668344 14431889 14079927 13843351 13633539 13483305 13312596 13276806 13257810 13235015 13177006
5771 13177006 13319169 13404677 13457049 13540766 13748089 14029863 14191843 14434034 14888169 15223220
5761 15223220 15646908 16112767 16692334 17388597 18280093 19377133 20655414 22303610 24075460
5752 24075460 26169130 28490335 30703779 31845184 31315977 29620402 27467927 25147118
5744 25147118 22874403 21182584 20041291 19310141 18828374 18498600 18355106 18283662 18356491
5735 18356491 18558065 18826871 19278395 19860976 20613152 21605598 22788869 24314384 25908076
5726 25908076 27827708 30019982 32199707 33746962 33899828 32393884 29918831 27033490
5718 27033490 24193693 21691872 19650335 18093414 17065754 16396116 15926669 15502757 15301808
5709 15301808 15116704 15119304 15262923 15485198 16028287 16729432 17574417 18654267 20039357
5700 20039357 21406779 22992039 24015095 23934325 22823694 21164693 19351723 17447615
5692 17447615 15954836 14608107 13625421 13103785 12704124 12463785 12210784 12054963 12010334
5683 12010334 12171749 12364994 12602382 13022758 13647124 14309609 15173842 16282462 17628781
5674 17628781 19138211 20960259 22650975 23422495 22747210 21247185 19264909 16990913
5666 16990913 14968526 13257055 11835015 10844884 10196601 9644832 9133155 8674312 8373833
5657 8373833 8143276 7908937 7695545 7515756 7351173 7274236 7125523 6977767 6894745 6801268
5647 6801268 6747843 6650270 6590480 6642195 6429915 6285135 6175851 6159862 6120420 6103211 6017539
5636 6017539 5996700 5985928 5999883 5931091 6038999 6040664 5957824 5980725 5954162 6000321 6062640
5625 6062640 6010151 5869850 5905604 5922326 5848803 5775362 5724014 5794770 5812513 5837956 5755693
5614 5755693 5827466 5803141 5814808 5755370 5672257 5765100 5721299 5889708 5882016 5674485 5733872
5603 5733872 5828260 5842007 5808889 5801187 5785291 5721989 5674604 5620751 5632566 5679473 5688523 5720974
5591 5720974 5791787 5868776 5884861 5845712 5864718 6036173 6108486 5968175 6024642 6127671 6150801
5580 6150801 6016077 6031287 6168840 6261358 6226253 6156049 6148312 6007423 5900002 5813594 5777575
5569 5777575 5841594 5765201 5742963 5676709 5747545 5760380 6001604 6144493 6122869 6165165 6244908
5558 6244908 6275564 6213886 6058750 5792041 5670334 5550316 5429890 5321461 5108566 5097222
5548 5097222 5034935 5054196 5028577 4990035 5042588 5109751 5104989 5109890 5060946 5061950 5113443 5199922
5536 5199922 5194797 5155695 5229212 5260189 5230094 5177986 5150960 5180708 5150345 5133568 5115716 5143639
5524 5143639 5207233 5214143 5329315 5387803 5374305 5350488 5369842 5396022 5475472 5531756 5557865
5513 5557865 5621651 5799793 5953147 6060144 6226593 6345523 6534147 6771070 6923984 7045288
5503 7045288 6956787 6912231 6686902 6461546 6360180 6254948 6109349 5989849 6062142 6145431
5493 6145431 6319280 6410472 6496004 6581591 6643431 6516679 6387533 6270977 5968202 5815801
5483 5815801 5617506 5402883 5241421 5083959 5008112 5008395 4963946 4950817 4782675 4714425 4713463
5472 4713463 4725706 4635037 4524730 4553624 4613893 4533163 4534247 4513270 4482084 4487580 4552840 4600599
5460 4600599 4656702 4652078 4619389 4553567 4424839 4371109 4454341 4433576 4456467 4465179 4545212 4543659
5448 4543659 4500273 4531787 4479127 4370697 4443492 4514288 4426841 4374280 4334113 4390230 4448587
5437 4448587 4532552 4575240 4587876 4543625 4514358 4548000 4530425 4473277 4438160 4448672 4487338
5426 4487338 4441542 4410416 4338485 4278055 4287498 4384194 4322292 4248469 4374819 4382886 4446954 4482633
5414 4482633 4456913 4523975 4632259 4783795 4810566 4851634 4851374 4900668 4981910 5152856 5290179
5403 5290179 5349539 5563584 5828470 5985781 6067178 6046441 5936728 5875792 5862314 5797971 5850032
5392 5850032 5998470 6136145 6251885 6446519 6759947 7111123 7490542 7829620 7987350 8209090
5382 8209090 8323107 8474652 8514803 8407187 8467276 8503025 8421133 8446130 8320109 8143821
5372 8143821 8066900 7929386 7816352 7897334 7935636 7937068 8088745 8312727 8400179 8509795 8478949
5361 8478949 8360473 8351235 8235994 8093016 7903807 7818414 7674788 7693523 7660508 7564710 7645732
5350 7645732 7604312 7509458 7554947 7536719 7494527 7455008 7493274 7430371 7265007 7115550 7212717
5339 7212717 7228441 7233180 7171643 7148708 7363629 7486550 7450074 7353485 7268763 7145291 7036818
5328 7036818 6893518 6829138 6772448 6747184 6858415 7031069 7139992 7189446 7255227 7479530
5318 7479530 7537381 7587438 7627975 7677399 7698833 7757699 7731773 7601871 7650224 7670546 7623768
5307 7623768 7751157 7730292 7816962 7794739 7816287 7778642 7659007 7521490 7473071 7444505 7273069
5296 7273069 7294671 7154614 7091167 6930403 6893208 6887271 6829911 6776422 6796191 6802567 6702003
5285 6702003 6693924 6671907 6682911 6668315 6722421 6754983 6587751 6489528 6408948 6343346 6502889
5274 6502889 6606144 6630199 6683273 6693115 6834123 6793641 6683742 6641237 6615219 6652469 6732967
5263 6732967 6749974 6828945 6837712 6774710 6913340 6920296 6838178 6762968 6725149 6710653 6729233 6747086
5251 6747086 6687919 6727012 6714016 6746834 6715332 6785689 6802108 6646071 6643878 6771527 6672083
5240 6672083 6672840 6712389 6683979 6794980 6837954 6914149 6960818 6957761 6887297 6825985 6830459 6694639
5228 6694639 6641722 6619884 6529495 6472673 6521634 6486550 6495981 6469021 6525652 6577051 6556553 6541032
5216 6541032 6624409 6666366 6641489 6728705 6604927 6613562 6681157 6604800 6652388 6664229 6533246
5205 6533246 6563198 6626834 6719960 6754469 6742717 6785112 6874317 7017967 7082661 7118101 7241441
5194 7241441 7414468 7518101 7626982 7708188 7743324 7686167 7600081 7776784 7874762 7825687 7872599
5183 7872599 7949154 8012561 8088452 8135937 8220521 8385365 8574751 8785526 8943042 9144754
5173 9144754 9375427 9588823 9783373 10066065 10416946 10723913 11106606 11498377 12010199 12384616
5163 12384616 13030036 13705513 14476176 15422404 16108379 16353984 16469135 16543069 16649176 16804111
5153 16804111 17202050 17898218 18809544 19918730 21204147 22768564 24234521 24833249 24897568
5144 24897568 24880360 24893453 25030731 25399330 26177289 26712960 27244379 28017154 28945648 30013709
5134 30013709 31046965 32071105 32970888 33647513 34503273 35603654 36701911 37241332 37450679
5125 37450679 37984113 38850209 40029370 41628493 43346583 44538560 44664198 44025085 43084787
5116 43084787 41795326 40165060 38572842 36967044 35316322 34048615 33161009 32574775
5108 32574775 32197115 31825641 31658331 31771481 32132079 32712220 33670725 34206529 34033612
5099 34033612 33476242 32742748 31762433 30736477 29770751 28990129 28468942 28006571 27920772
5090 27920772 28046337 28275765 28293545 28186426 27784349 26973400 26063395 25324370 24483089 23356927
5080 23356927 22157938 21174786 20293740 19706065 19228511 19070188 19021998 19028677 19223719 19633662
5070 19633662 20133029 20772416 21717668 22789103 24188324 25777252 27629937 29716739 31883242
5061 31883242 33639435 34356825 34309090 34147942 33608429 32367725 30750784 29448356 28442967
5052 28442967 27759387 27530779 27888501 27853055 27552127 27520396 27585515 27982004 28856863 30225184
5042 30225184 32167150 34325495 36085927 37967581 40070594 42342794 44807679 46504990
5034 46504990 47574328 49208621 50439784 50198007 49734685 49693530 49243262 48706809 48609897
5025 48609897 47547192 45806964 43797261 40899138 37876192 35331668 32810410 30159865
5017 30159865 27924718 26328977 25261834 24509649 24211305 24413751 25012748 25465114 25813020
5008 25813020 25594858 24907298 23836302 22531968 21359254 20412525 19728734 19437459 19234343
4999 19234343 18703697 18196777 17705957 17303895 16962264 16648816 15896977 15242630 14587404
4990 14587404 13917853 13345661 13068841 12873357 12863250 13184568 13449843 13289039 12705229 11958869
4980 11958869 11109664 10261574 9597497 9162924 8784904 8437207 8100070 7876556 7777635 7604763
4970 7604763 7538147 7424631 7224796 7189717 7085049 7044211 6962679 6897629 6837941 6748682 6710120
4959 6710120 6620351 6513832 6512220 6443433 6439078 6458256 6383134 6450755 6500602 6535630 6548246 6551363
4947 6551363 6619225 6539781 6524668 6483623 6454402 6544777 6453547 6421863 6498817 6513967 6682932
4936 6682932 6750297 6826784 6999886 7118656 7102408 7148581 7151429 7301604 7458626 7617398 7855578
4925 7855578 8114977 8342873 8731876 9229903 9781543 10381463 11264836 12242237 13278435
4916 13278435 14670494 16062703 17108032 18137614 19386625 20241865 20212330 19480250 18030119
4907 18030119 16161516 14352558 12808356 11663260 10750657 10125777 9724361 9414711 9192471
4898 9192471 9025064 8920669 8869884 8802892 8838333 8970793 9075452 9286491 9775006 10166845
4888 10166845 10664330 11250261 11919301 12585635 12897138 13001880 13176073 13407137 13715385
4879 13715385 14270217 15192163 16400573 17615252 18537186 19761061 21300917 23230582 25283897
4870 25283897 26615857 25790878 23951871 22232501 20346084 18606915 17441880 16927209
4862 16927209 16924607 17338538 18097268 19218354 20697225 22463612 24184076 24701623 23358294
4853 23358294 21516916 19611639 17865577 16497630 15358542 14318238 13313457 12605766
4845 12605766 11971451 11500070 11240684 10968566 10684946 10295996 9985496 9635925 9220423
4836 9220423 8932797 8930972 8843193 8731690 8669305 8657622 8759774 8760708 8806046 9048751 9304952
4825 9304952 9473625 9798374 10192345 10645989 11284404 11823817 12683735 13645967 14842818
4816 14842818 16046367 17015511 17747179 18417271 19216511 20160962 21293651 22542057 23081204
4807 23081204 22864249 22672964 22616502 22630846 22460603 21899148 21300666 20652669 20112333 19917239
4797 19917239 20084251 20757021 21839482 23191929 24429806 25866210 27118186 28055552 29417386
4788 29417386 31196933 32437290 31868486 30507093 29201574 27858306 26545777 25268595
4780 25268595 24386641 23911135 23553533 22884110 22416224 22345752 22299592 21964081 21792605 21886154
4770 21886154 22256501 22367242 22239528 22399228 22539676 21868813 20530158 19109531 17693858
4761 17693858 16528172 15492822 14801788 14437098 14425491 14496327 14637281 15154321 15843677
4752 15843677 16679376 17688976 18870743 20230796 21535079 22296345 22522883 22077615 21470368
4743 21470368 20943626 20462559 20416144 21011145 21974317 23281922 24899570 27037925 29042620
4734 29042620 29750563 28672202 27008075 25057761 23081801 21540664 20469035 20088974
4726 20088974 20049986 20268289 20806201 21783397 23021327 24697849 26874251 29578282 32726451
4717 32726451 36555599 40417610 42985142 44639336 45495397 44044657 40457648 36389536
4709 36389536 32349764 28630500 25541587 23477435 22058086 21213950 20905564 20892783 21396443
4700 21396443 22019745 23173424 24839622 27019603 29494532 32289201 34792457 35438019
4692 35438019 34340791 32791984 30822330 28806335 26614270 24799311 23202749 21197570
4684 21197570 19110394 17287626 15702145 14265891 13192518 12440827 11949839 11402909 11011281
4675 11011281 10616289 10175398 9894138 9761120 9533971 9320488 9121348 9003789 8946342 8951567
4665 8951567 8855061 8694114 8511138 8337258 8349202 8204460 8134520 8109005 7923029 7872054
4655 7872054 7900009 7783503 7870833 7900918 7985884 7987363 8030498 8064609 8061100 8017723 7889395
4644 7889395 7808888 7700191 7710069 7705877 7871850 7905222 8075407 8189429 8313243 8499636 8698444
4633 8698444 8793722 8982916 9228827 9229233 9348231 9471074 9496894 9505338 9545287 9531110 9488727
4622 9488727 9337959 9287781 9107820 8978699 8970698 8938102 8876735 8910828 9024563 9124508 9249317
4611 9249317 9448397 9590747 9753173 9952539 10014062 10087371 10103916 10161894 10280790 10426843
4601 10426843 10500103 10551531 10566157 10569479 10530006 10560945 10581908 10682312 10826459 11053704 11447683
4590 11447683 11818385 12168296 12613475 13142838 13699639 14381788 15170401 16002499 17030852
4581 17030852 18153741 19252199 20715600 22300820 24359432 26858151 29609933 32557978
4573 32557978 35152581 36523641 36157980 34814685 33404138 32028099 31136172 31307599 32302283
4564 32302283 34010077 36206513 38653852 40697176 41294610 40156416 38170242 36071800
4556 36071800 34126386 32862713 32334200 32718206 33675158 34575388 34583704 33460632 31798173
4547 31798173 29972757 28352053 27252342 26856241 27024764 27712220 28778662 30080262 30889653
4538 30889653 30666607 29164228 26972272 24451674 21956975 19781118 17981775 16575079
4530 16575079 15569848 14752085 14166963 13614945 13153163 12920576 12674223 12451047 12106513
4521 12106513 11808362 11588567 11318723 11205179 11124066 11092029 11235704 11381411 11479661 11568064
4511 11568064 11576363 11574663 11530066 11570239 11686013 11868913 11970361 12187636 12244946 12355627 12325883
4500 12325883 12215506 12189232 12107456 12100488 12261494 12562597 12872599 13270382 13820246 14367857
4490 14367857 14856868 15369814 16095768 17197958 18395418 19912729 21603466 23441290 25631059
4481 25631059 28136290 30094347 31081082 30883944 29774926 28432363 27491051 27030253 27414725
4472 27414725 28513469 30147660 31742398 31464403 29672460 27715244 25563670 23730419
4464 23730419 22516256 21980157 22388904 23179003 24503337 26049379 27251843 27676301 27238334
4455 27238334 26725428 26091884 25413328 24993351 25160954 25568623 25916299 25877675 24920188 22848651
4445 22848651 20598780 18365560 16379980 14886208 13926117 13258199 12703225 12287192 11918899
4436 11918899 11411447 10971860 10483014 10017220 9628216 9237418 9061400 8764556 8651887
4427 8651887 8626798 8451135 8432446 8386888 8278215 8070954 7922653 7902180 7833913 7842512 7760611
4416 7760611 7623893 7693565 7593597 7389926 7292216 7233667 7243312 7323789 7468102 7421523 7415619
4405 7415619 7503807 7470699 7358605 7359831 7314283 7204431 7261655 7348797 7583210 7799212 7879082
4394 7879082 7846647 7875637 7931760 7848914 7825983 7815986 7878945 7810763 7763579 7737822 7700358 7759386
4382 7759386 7754167 7645621 7524070 7378826 7171978 7127593 7008764 6973367 6937806 6824249
4372 6824249 6754007 6698109 6683841 6581298 6503948 6317009 6229368 6059826 5978614 5744379 5504061
4361 5504061 5281688 5176261 5022589 4828400 4650343 4576982 4395905 4377020 4306840 4251920
4351 4251920 4270306 4217972 4242717 4260525 4320268 4279647 4298253 4300807 4262270 4266911 4211744 4227262
4339 4227262 4290479 4336055 4349801 4313917 4324173 4325252 4387007 4501490 4669612 4752171 4775812
4328 4775812 4894550 5032477 5132277 5166002 5337698 5456626 5601552 5689178 5657972 5789817
4318 5789817 5799140 5763154 5724929 5665649 5665576 5675792 5758438 5723242 5776134 5851523 5851934 5906160 5915390
4305 5915390 5895335 5829866 5834751 5813417 5800238 5812003 5765441 5828260 5694453 5633759 5598118
4294 5598118 5492910 5378140 5253829 5196548 5067705 5077308 5003088 4944990 4889150 4921834 4963654
4283 4963654 5002042 5028790 5078824 5061136 5290210 5371571 5484366 5543890 5645961 5713490 5830747
4272 5830747 5954420 5982860 6073551 6139845 6300074 6414886 6422691 6479043 6583648 6598565 6547635
4261 6547635 6575712 6627472 6638983 6702891 6800129 6953952 7082126 7078705 7185153 7399981 7605119
4250 7605119 7832282 8164870 8328697 8484412 8811150 8941366 8993890 9132922 9266085 9408092
4240 9408092 9607695 9811630 10166026 10322501 10554333 10827426 11171500 11517501 11915114 12133072
4230 12133072 12309363 12626854 12761426 12895870 12966625 13153680 13285190 13308824 13515376 13865210
4220 13865210 14203244 14690205 15156688 15575159 15906742 16290369 16676406 16877149 17149571
4211 17149571 17535821 17903557 18330292 18686520 19090890 19454066 19728103 20056052 20302276
4202 20302276 20609696 20873676 21289134 21744833 22276763 22925738 23560771 24145245 24866939
4193 24866939 25520026 26397892 27237152 28193911 29304589 30404068 31606360 32843505 34314525
4184 34314525 35915132 37743910 39713234 41672114 43812950 46094328 48368810 50104656
4176 50104656 51148875 52107339 52881131 53285746 53524186 54111300 55146618 56637166 58667860
4167 58667860 61238242 64289536 68204677 72867315 78282623 84726872 92617664 102354421
4159 102354421 114161864 128510806 146446362 168602479 195141091 225608667 256717365
4152 256717365 277834607 283747795 272839229 249638004 222569024 193912660 168248490
4145 168248490 148108096 133559582 123836738 117842245 114310687 112061384 108956967 103852694
4137 103852694 96599875 88215816 79857446 72094739 65401941 60008323 55703638 52065077
4129 52065077 48876086 46168827 43696919 41467670 39353735 37363608 35520900 33947750
4121 33947750 32477344 31143739 29890055 28743206 27865579 27117233 26411346 25689139 25096576
4112 25096576 24487338 24064168 23707928 23382565 23203518 22946033 22576924 22294555 21972991
4103 21972991 21464916 21062888 20571222 19984375 19457283 19106639 18859841 18633674 18595853 18722216
4093 18722216 18703723 18531741 18238181 18119285 17867741 17659347 17515234 17447583 17324192 17258646
4083 17258646 17241212 17164291 17234923 17251052 17214261 17355827 17581444 17873150 18286211 18864780
4073 18864780 19657261 20593990 21721470 23085713 24892146 27052805 29573222 32423188
4065 32423188 35759849 39349180 43358624 46714013 47417729 45207975 41405488 36610124
4057 36610124 31533265 26720479 22844454 19867218 17774180 16194032 14785156 13650694
4049 13650694 12722415 12038142 11437414 10835987 10438005 10042796 9722979 9368925 9100120
4040 9100120 8811405 8493666 8116146 8051831 7938163 7708505 7590835 7437600 7245893 7014791
4030 7014791 7000443 6842882 6803266 6788783 6665794 6675024 6592399 6514902 6492590 6398144 6244273
4019 6244273 6188185 6148487 6052191 6024604 6034877 6098426 5977496 5994508 5918922 5937009 5856715
4008 5856715 5895268 5914594 5851189 5884004 5947983 5939743 5948784 5972110 5817064 5795826 5764563 5821429
3996 5821429 5812097 5840769 5923695 5960022 5984959 6077117 6130388 6184344 6241884 6389857 6499789
3985 6499789 6652252 6857542 7094307 7318820 7623154 8087061 8546832 9116852 9833957 10690041
3975 10690041 11493636 12516693 13698779 15000306 16354434 17280572 17258426 16757163 15991255
3966 15991255 14721426 13150813 11727793 10561035 9690549 9096472 8587173 8288521 8125284
3957 8125284 7935294 7637884 7340222 7101030 6911210 6674147 6457939 6351903 6183983 6104404
3947 6104404 6098363 5998715 5920442 5831644 5734002 5693234 5611007 5559965 5559552 5511443 5610782 5521302
3935 5521302 5377304 5383559 5384890 5455479 5420981 5479787 5488793 5428657 5444086 5406561 5443095 5474080
3923 5474080 5373154 5493854 5499694 5297372 5203372 5024625 4813635 4736337 4596266 4497959
3913 4497959 4390293 4430930 4492025 4541293 4441608 4432765 4527842 4487362 4563599 4557949 4638801 4735279
3901 4735279 4740461 4795485 4798986 4769139 4674327 4703199 4691026 4651499 4625243 4658603 4738402 4773752
3889 4773752 4896868 4948155 5131019 5203301 5354550 5403123 5617441 5697578 5621127 5755800
3879 5755800 5924112 6167154 6198152 6370196 6481849 6609345 6934465 7073841 7305731 7560455
3869 7560455 7957606 8345190 8660284 9189882 9791544 10304230 10852472 11460157 12118381 12882626
3859 12882626 13580530 14537165 15801616 17446812 19369032 21772782 24746604 27976120
3851 27976120 31562370 35891894 40526751 42285976 40473754 37624147 33609302 28682230
3843 28682230 24072029 20407045 17793239 16020695 14939912 14142551 13469223 12882245 12241155
3834 12241155 11545188 10696746 9864216 9224447 8612007 8167967 7847708 7608715 7312623
3825 7312623 7039942 6867604 6809751 6852266 6838724 6838458 7047339 7225499 7446376 7608643 7352414
3814 7352414 7167774 6836333 6397948 6033817 5646144 5442392 5303903 5256808 5232675 5130430
3804 5130430 5193590 5400786 5488800 5672136 5853309 6217450 6591799 6860581 7080965 7113194
3794 7113194 6913232 6586327 6201765 5769798 5325025 5074525 4714879 4541247 4490164 4490583
3784 4490583 4589533 4738967 4854523 5006102 5331238 5617371 5768950 6051387 6203508 6100486
3774 6100486 5985123 5672444 5427748 4991313 4516917 4128507 3936572 3665738 3487053 3391634
3764 3391634 3219747 3201781 3254652 3205253 3159651 3289806 3239625 3190754 3147646 3011331 2888213
3753 2888213 2876349 2806613 2674759 2589558 2522521 2541166 2486819 2433093 2429899 2461772 2535251
3742 2535251 2604804 2595199 2666404 2664423 2787041 2780743 2707866 2580954 2390719 2311532 2252218
3731 2252218 2060395 1898627 1789495 1738923 1764737 1718087 1678463 1628401 1599510 1603685 1627804
3720 1627804 1570102 1598695 1587661 1555531 1635731 1545868 1500410 1502125 1449931 1453027 1408719 1272174
3708 1272174 1178219 1252862 1406162 1358370 1179922 1115547 1190605 1258165 1255468 1089127 1052646
3697 1052646 1118394 1199936 1179103 1093598 1118627 1145688 1225535 1116482 1043086 1069067 1062318
3686 1062318 989861 871354 801239 870051 983229 953385 811359 913308 1066028 1111421
3676 1111421 1023196 953802 954850 1005328 1041586 1081970 985589 909119 946413 955047 945086 947519
3664 947519 996068 987031 959032 886881 878299 906425 981531 954473 997232 1044989 1145881 1197631
3652 1197631 1183098 1235976 1275156 1404311 1527587 1681974 1762478 1821621 1898340 1921155 1876829
3641 1876829 1871646 1677424 1625444 1459911 1466097 1457717 1328399 1261729 1368696 1460245 1458359
3630 1458359 1446737 1445525 1646308 1757410 1790434 1841224 1896492 1811351 1801303 1703589 1591691
3619 1591691 1543076 1481837 1381540 1456452 1475100 1402213 1456116 1480911 1566736 1717118 1776553
3608 1776553 1767269 1715274 1754718 1690050 1634969 1458116 1450032 1342226 1165348 1262783 1229698
3597 1229698 1241658 1327088 1265124 1253883 1256035 1297870 1350744 1520533 1471742 1421482 1411324
3586 1411324 1369392 1350478 1313823 1200556 1081775 930175 836902 866355 858952 745121 700656
3575 700656 652937 676189 669087 624133 604387 577870 548838 571457 645992 682448 775772 630569
3563 630569 630754 636277 571633 507558 576023 582186 638316 668508 695303 648960 619456 581795
3551 581795 528275 458619 520707 498957 479058 423562 422075 459971 452457 436474 375983 468230
3539 468230 517754 422955 339324 375687 383483 404677 486758 380904 373422 478713 435118 371161
3527 371161 357318 439367 457798 440435 425457 365701 384906 451119 452029 337645 242987 303223
3515 303223 402397 430583 450101 446147 430781 347904 414680 475477 526235 475585 505315 501240
3503 501240 326665 336029 422038 393704 403537 409345 360568 366322 447710 442440 444184 359512 352749
3490 352749 349769 343245 388411 288639 449726 396552 347265 380391 477924 451383 436185 419089
3478 419089 366112 236551 246659 283306 355708 468638 487738 403670 342367 356670 447042
3467 447042 449667 401602 393266 350641 427287 445576 402673 376908 508620 493116 485744 503580
3455 503580 545299 548697 432934 386381 410157 558177 583108 521544 488126 515536 494730
3444 494730 497923 474857 521792 537143 489295 463061 524186 558592 530878 402357 340478 453348
3432 453348 457760 518225 569841 541054 611647 602123 616422 628776 573756 550974 469508 524936
3420 524936 541691 508858 414581 441807 518393 478736 476846 439130 423734 413061 509275 533710
3408 533710 562338 567582 638591 522228 502819 615722 637775 618462 616896 710212 756153 764695
3396 764695 805605 861588 849921 880141 819075 783484 732582 704730 740624 771941 715850 702418
3384 702418 699303 695183 592629 488577 524955 517874 539871 670859 634027 611448 695307 712863
3372 712863 667638 685372 704754 652363 722578 657361 589200 685993 728606 773726 738742 639576
3360 639576 706178 816597 739105 646751 684210 677812 665277 771673 758704 805313 776010
3349 776010 708771 602150 670407 825821 807974 773020 754281 792100 835689 809055 837826
3338 837826 781333 732257 740646 704788 777125 789475 791068 767314 696555 806621 868644 932000
3326 932000 903472 1021350 1029307 1059796 1023604 989229 1102552 1230100 1198856 1217586 1232293
3315 1232293 1196150 1210201 1108803 1152010 1259692 1279812 1178760 1320329 1308163 1246578 1226085
3304 1226085 1209603 1336297 1499041 1482570 1419312 1492478 1574445 1616758 1559331 1608383 1724924
3293 1724924 1676153 1737829 1802412 1819870 1897245 1816463 1773823 1860425 1858495 1859802 1801255 1762271
3281 1762271 1860326 1960907 1904795 2043974 2083273 2015992 1962584 2028172 2156877 2216869 2231790
3270 2231790 2327462 2401741 2472408 2388440 2387498 2506844 2566846 2645620 2755903 2795065 2746436
3259 2746436 2781338 2819390 2883402 2948114 2993096 3067386 3149929 3252304 3430972 3570725 3658351
3248 3658351 3817537 3998049 4061958 4130679 4288201 4422149 4560336 4699671 4724464 4626377
3238 4626377 4498242 4361944 4201310 4006274 3747631 3538004 3324310 3196066 3110555 3073007
3228 3073007 2950664 2826530 2746972 2727573 2817864 2814184 2851023 2935604 3038912 3054614 3098304
3217 3098304 3078409 3133012 3120838 3114904 3116344 3034102 3041793 3032801 3123804 3132279 3045639 3133409
3205 3133409 3115008 2949795 2752160 2632671 2545206 2384803 2247637 2186238 2079748 2153197
3195 2153197 2154713 2176895 2271788 2328769 2464086 2539419 2557648 2564113 2782026 2930737 3020116
3184 3020116 3023393 2951856 2787833 2649555 2514562 2523052 2396724 2341836 2242420 2257460 2092150
3173 2092150 1991022 1948869 1850382 1701191 1545466 1527611 1515709 1484280 1333101 1294463 1343787
3162 1343787 1386853 1469590 1448923 1437182 1520891 1618751 1754839 1765029 1808615 1850714 1836624
3151 1836624 1736445 1634088 1683879 1538115 1404185 1275600 1151752 1155913 1060455 972532
3141 972532 965519 902123 929522 1024727 906903 930047 821739 806215 882040 908783 936472
3130 936472 864744 860352 756792 715884 661683 720936 854587 842995 830372 844050 875430
3119 875430 740122 683640 627913 692342 628147 531500 662377 679605 677188 615589 662640
3108 662640 624098 490064 461768 516330 502263 469694 512951 591635 670205 570366 594999
3097 594999 594819 505426 466227 527104 607076 630490 474200 454181 452718 448503 435079 465896
3085 465896 452952 543428 572351 542241 514242 412628 450768 480795 451184 405042 330488
3074 330488 389879 468710 483011 474936 375208 373454 400295 368843 422866 362527 343385 276471
3062 276471 273203 396543 447033 503794 407034 351232 309643 356202 469926 411291 311941
3051 311941 364008 419818 319214 364055 443619 421805 356691 294560 457787 402001 398144
3040 398144 307232 326566 365384 310731 180740 251071 386099 491688 319053 322373 261347
3029 261347 258977 408101 315153 333858 384481 412530 412979 414206 322507 354329 352027 319426
3017 319426 318552 390374 421287 346446 332347 396965 401697 292036 274326 375128 431993 427288
3005 427288 391428 353651 290688 384111 485057 503816 456705 487693 411793 322348 310454
2994 310454 404807 392468 426709 416811 312308 348870 436419 456796 477458 478476 417392 363790
2982 363790 292954 378145 458062 501955 489035 530243 545840 572740 553304 478715 474945 457915
2970 457915 493756 478305 509350 523378 531598 559578 605655 550208 603028 603886 539423 493873
2958 493873 571246 630915 626051 599028 574868 502438 470371 561050 643908 627574 645471 682668
2946 682668 711782 704540 729357 766545 766486 764103 763851 826994 841408 892494 899026 948349 882808
2933 882808 961424 1063762 1143374 1067214 1046720 1103721 1059339 1016621 1114668 1004234 1105566
2922 1105566 1041984 1010448 1090518 1078951 1054919 1096770 1041895 1121175 1118126 1160283 1208304 1190983
2910 1190983 1271839 1214448 1215150 1280430 1325364 1310675 1431239 1526182 1667480 1602066 1638042
2899 1638042 1593733 1634923 1629575 1617094 1585336 1451672 1436055 1545413 1486408 1346287 1365847
2888 1365847 1305099 1321893 1366790 1390724 1450494 1379628 1358088 1355389 1322822 1296977 1415642
2877 1415642 1390751 1405707 1384830 1470512 1526960 1525007 1465678 1464492 1425115 1277721 1275895 1277023
2865 1277023 1322608 1409908 1221725 1072117 1000721 1011720 1027384 998935 999381 941688 967096
2854 967096 973114 1045540 964513 923717 922163 902372 981103 953569 927072 891884 747659 694640
2842 694640 749770 784645 719362 728973 693634 580816 619260 647729 625571 681100 679958 676313
2830 676313 601114 471321 439729 591704 534521 413506 452582 454347 344006 465045 414732
2819 414732 446470 423392 422368 422093 286919 269641 385098 472800 409539 364049 401785 387588
2807 387588 312667 259856 270532 267526 349281 371721 357209 352435 287286 312334 400001 321932
2795 321932 290883 351761 296421 347786 334065 245801 228591 215718 144187 205939 160338 251442
2783 251442 169680 108563 186459 153256 85859 88607 82483 -29984 30022 158633 89060 137789
2771 137789 162788 160776 316817 184615 105111 126860 88825 131677 148369 136713 91221
2760 91221 139664 28766 104512 172151 116822 -6914 -39803 96388 142277 14560 57102
2749 57102 157436 137744 20059 32425 54855 40725 58696 220776 243347 136238 152344
2738 152344 170109 157961 76149 95914 81726 108915 98421 93387 12272 -14329 -56447 -85790
2726 -85790 -102836 -884 17355 80051 40286 66797 69928 37217 -7301 60550 104696 -18143
2714 -18143 -26622 -22416 40962 84570 114833 84833 96957 -6308 -107441 45260 119062 69169
2702 69169 -51149 -21642 -47936 62273 51478 52461 2243 -155290 -71883 -117994 -7060
2691 -7060 55105 -21610 90102 78390 -40480 -11435 18966 68807 45628 38858 -66242 -104335
2679 -104335 -91504 -191591 -137360 -64438 -68431 -33318 25324 81327 21380 -52524 -68311 -8390
2667 -8390 22757 2633 142539 67239 -81329 -119575 -21702 62733 -52785 -5597 -73231
2656 -73231 18901 107034 74006 77254 121144 86769 56387 36926 72468 125626 131087 77661
2644 77661 -17583 39460 1674 -6028 28394 -13025 44855 25408 -39293 -111491 -70195 35194
2632 35194 7852 -3288 -53861 9154 96812 76307 18633 -21666 12873 29542 -23996 -20698
2620 -20698 5969 -64903 31383 119065 50563 -55547 -109377 -109357 -24835 -12001 70712 75052
2608 75052 -21812 5167 -3866 -4108 -56609 -74553 -130664 -84354 -64746 -84576 -10366 39962
2596 39962 42443 39201 -75029 -42028 -68775 -62734 37235 -22425 -60127 -37551 42372 137422
2584 137422 68509 31598 -105993 -12581 18320 -37459 -2742 -91231 40092 96512 75306
2573 75306 -31224 -137541 -148987 -51608 -38047 -178 32629 -103392 -149545 -147773 -97713
2562 -97713 -14827 100707 18840 -154899 -121746 -8933 -14772 -158284 -106784 -125256 -53339
2551 -53339 -15362 -51160 -61033 -47194 22982 114611 92799 -15903 11185 -8010 18783 9318
2539 9318 -10528 40987 24636 -57317 -80771 -23548 -121657 -155019 -75003 -42531 -5585 -29067
2527 -29067 -131121 -133382 -22163 -27939 -110786 -112371 -6594 -42533 -29504 -27425 -56605 -47766
2515 -47766 20411 78044 46450 -19630 103936 107142 -31789 -57793 -112758 -55346 26800 29958
2503 29958 -7214 -1660 16175 -25627 -120999 -97786 10313 21588 64449 59572 -28041 -51238
2491 -51238 -16548 63882 49360 -37365 56190 26760 -27862 -81619 -68441 -133357 -136494 -54211
2479 -54211 -99918 -58655 -22604 -73787 -82937 -100744 -76053 -66160 -42379 48227 65305 -35474
2467 -35474 -47102 62355 -69160 -8505 -42894 6181 18190 44814 29581 -28995 30236
2456 30236 77871 84186 18714 -28494 35194 66323 -41622 -126364 -135721 -56184 -4179 41862
2444 41862 120461 -16172 -204498 -154053 17354 -36269 -116421 -41261 -86431 -60344 -20082
2433 -20082 -91830 -23301 -11735 -78741 -124155 -112438 -104652 -63770 -26797 -167557 -181881 -21561
2421 -21561 62103 -11992 4275 -65140 -167049 -38743 78776 -28346 -50061 -48773 -74805
2410 -74805 -46858 -51687 -69980 -110840 -68494 -45827 -59861 74116 101212 -11988 -75086 10598
2398 10598 -22736 -125775 -15911 18385 20382 -58086 -91752 27230 80808 134638 147575
2387 147575 -33698 -86248 -137966 -66204 -64127 48099 43788 -43187 -109080 -17176 -2022 -54785
2375 -54785 30962 -49171 19756 20288 127301 217345 210412 86263 83345 46683 -75667 -121176
2363 -121176 -32377 38371 25086 -7610 -15682 -22472 -56267 -17683 49636 14035 40841 -9824
2351 -9824 -44396 9201 33370 -4569 -26830 -49946 -38420 -52790 -57605 14035 79785 19801
2339 19801 -45086 -133304 -5312 30797 -27618 -29278 6463 77 -93864 -77896 -89063 -162445
2327 -162445 -85318 51021 -9882 5847 27662 13957 55307 140180 108609 45005 96196
2316 96196 27132 -32305 -3544 -28517 69861 56941 -3740 -27329 60044 143196 123130 -37196
2304 -37196 -65297 44706 110472 77797 60827 59621 -10019 -56806 -109363 -6243 61524 108995
2292 108995 122106 112437 72219 -14208 70621 113544 80307 85050 144265 71394 41814 64679
2280 64679 74477 16345 131376 125069 40577 87261 52286 92143 9812 14163 1825 -2503
2268 -2503 82199 108683 -12459 19813 20495 39589 99978 195308 113279 60505 151595 146562
2256 146562 130769 110042 60403 41989 91805 164395 128961 72936 117774 92925 96943 87805
2244 87805 107926 89156 86002 151677 139401 130265 108399 131651 191584 165735 187162 244919
2232 244919 314345 194556 154178 123883 167597 189714 167048 185416 248457 123665 48989
2221 48989 165895 255252 213135 232295 224586 176678 146230 151189 253795 237820 207076 235387
2209 235387 261869 214592 253554 202012 179816 260872 263222 285963 267268 244866 270627 266474
2197 266474 178894 293965 216694 220824 253431 310881 364148 296867 335165 401853 407755 421872
2185 421872 447907 426196 426370 409962 418670 467932 496005 550715 532583 538226 598792 619774
2173 619774 608058 581859 558991 601435 653198 689539 704976 651154 626917 744546 888637
2162 888637 900203 944053 926209 931438 933888 976177 952730 900948 969113 970154 929955 994974
2150 994974 1020111 999339 963562 1139782 1136698 1118627 1293675 1472877 1509069 1505538 1591471
2139 1591471 1781099 1899305 1926492 1945898 2065069 2237431 2388039 2457921 2615625 2609186
2129 2609186 2683773 2846192 2890762 2925119 3073902 3204355 3337477 3610225 3873028 4186480
2119 4186480 4558345 4961546 5442012 5835014 6162382 6624740 7188069 7720911 8439269 9402724
2109 9402724 10469698 11940430 13860591 16105849 18931082 22977347 27790117 32488456
2101 32488456 36289417 34615918 29968709 25219466 20161616 15921715 12777154 10619845
2093 10619845 9063800 8042794 7189851 6482411 5954075 5621663 5233987 5000962 4731460
2084 4731460 4379695 4019818 3760096 3409953 3282753 3011025 2722934 2539644 2451894 2308040
2074 2308040 2191814 2102411 1898950 1728265 1697004 1771839 1739472 1605491 1470912 1431438
2064 1431438 1423766 1193773 1237465 1281138 1232716 1196395 1196460 1086182 1016132 990259 982174 1086982
2052 1086982 1097585 1037699 1025385 869795 941774 925585 789997 638811 697842 714862 673731
2041 673731 570685 637101 605335 560427 517668 512214 462614 426230 458011 481902 415081 404609
2029 404609 368483 376042 397682 309843 265355 392143 508089 356989 343990 367484 292065
2018 292065 214507 225797 280287 330782 337796 236988 126409 222776 283897 259725 203644
2007 203644 238930 116779 210937 179587 174565 134494 130435 72989 85513 158165 115303 178509
1995 178509 163050 129302 7042 -34696 43193 101432 132048 48573 77606 155427 95284
1984 95284 103866 70899 97188 64241 106025 114351 20386 60141 128971 102657 107827 128405
1972 128405 105118 77427 -33361 34582 91394 175458 101095 82323 64433 76086 102633
1961 102633 64016 102695 168946 194932 180311 186693 106712 13412 103805 24466 -24909 5543
1949 5543 88402 146444 123291 42068 -121601 -123553 -100349 -185308 -91445 -41664 46082 31628
1937 31628 50032 21855 -46925 12093 -3277 14772 69518 25501 7679 -17080 -46379 -89187
1925 -89187 6537 64348 -22968 -54662 9932 43187 5036 102711 29869 -77899 -57682 -128
1913 -128 -10216 -7044 46833 79906 51099 50036 -8421 -55648 -121245 -22571 -29077 -33107 -86670
1900 -86670 -41681 -62550 -35339 -6600 -13460 39253 22388 9647 22931 71062 31692 14634
1888 14634 -71889 -62642 -12961 57846 98372 68603 -27129 46619 -13238 -121286 -125306 -32798
1876 -32798 -34715 20949 56188 135442 118176 79347 -6787 -1950 -28816 -63388 16558 -94572
1864 -94572 -27844 12127 20677 -32867 1223 -5425 -38906 32660 3481 1336 23702 -39087
1852 -39087 91022 116401 68483 24234 -103307 -31760 72894 91513 52367 -30955 94083
1841 94083 104057 96079 121214 96715 55737 27821 53053 80218 133142 244882 277159 141480
1829 141480 96311 161216 38958 -31363 63476 63930 -33254 -8650 -5984 -22932 -7694 39228
1817 39228 30085 12294 -7220 34245 -66678 46877 70588 -29019 23992 23505 -24553 82241
1805 82241 -29960 -68667 26405 -45254 -121922 -105698 -166475 -97435 2368 -50703 -40393 17057
1793 17057 47032 -31060 -104976 -15315 53235 -19857 18456 5232 63692 68201 24374 80058
1781 80058 16477 75425 105747 121317 117409 -61255 -79974 -73406 -43078 39301 13206 -93114
1769 -93114 -67236 -68254 8595 44146 -6715 20897 -25983 -17321 35338 -94559 -85177 -89
1757 -89 -105619 -75287 -114385 -64030 137239 101896 -26529 -84558 -26556 -55034 -9319 -29010
1745 -29010 -39195 -28169 14836 83342 84785 77270 74209 7195 76577 17798 -53732 -6225
1733 -6225 89206 -3163 -8445 16692 38758 -31465 57269 25227 -9064 49394 -41711 15120
1721 15120 60861 25468 66182 16836 -27031 -75097 -66863 -28684 -6284 -48286 -34784 10576
1709 10576 82156 55425 -31371 -55801 -106172 -107103 -57593 -128628 -181220 -162034 -146316 -116130
1697 -116130 -42303 2118 -72608 -131117 -96617 -9483 -11800 -10742 11791 81695 -19266 14362
1685 14362 -19897 -2398 140414 37133 -62989 -58082 -26528 -54096 -73538 -41336 35685
1674 35685 -42020 -11832 -35910 61986 10054 -21714 93802 -19130 -85818 -141280 -90037
1663 -90037 -34922 105173 87806 -23084 -37831 12458 -54316 -67678 -40071 18706 -2151
1652 -2151 1712 -24345 35283 27087 8057 -150933 -55657 -15995 28634 3541 -12965 -30441
1640 -30441 -145358 -66883 -23920 -113943 -32338 89674 3368 -103882 -29662 30876 -59278
1629 -59278 -69630 -95290 -6323 -25454 1597 43157 -23011 -30940 -61026 -27739 16345 87892
1617 87892 3005 46532 27508 -79571 15223 12496 31864 104681 -10496 1011 -129058
1606 -129058 -98089 -11321 -101098 -80119 -42978 80207 20402 -52039 -27714 -9654 -52219
1595 -52219 -34851 15724 27952 8220 -17697 -54074 -81976 -97968 -72222 7541 -62058 -58385
1583 -58385 14940 39061 -48420 -66547 64891 91663 93704 -6718 -49372 -38445 -141344
1572 -141344 -103420 64732 16311 38665 105814 27934 -22287 -39545 90469 46406 -42647
1561 -42647 -31571 29803 146336 -6734 15257 -28131 -42002 -88964 -152209 -66723 -8236
1550 -8236 12220 -17080 -82023 -81796 -94615 -65302 -25269 -10641 -44126 -106643 -188751 -93100
1538 -93100 -121863 -115109 -76626 -51372 -33618 -74608 -49830 -84835 -11106 -13773 -25606 -36114
1526 -36114 -71785 -124035 -153178 -72346 -64216 -61308 66958 83480 29160 66434 -25882 -54730
1514 -54730 -43683 -35474 -61760 -101018 -43366 -36347 3074 -3626 39651 -10983 -72011 -110258
1502 -110258 -95065 24302 82447 55258 4079 74643 93451 75818 -24031 76022 98195
1491 98195 114564 82396 63120 -8036 -91514 -149923 -119890 -28253 25132 -58685 30399 13927
1479 13927 -82083 26085 -15762 62439 123792 389 -53638 -6880 -2465 -14480 -73058 -24712
1467 -24712 -1978 -42795 -34413 -34769 -38692 -39166 -93290 -26739 7335 69147 41807 -21579 -47917
1454 -47917 -45741 -40626 35094 -88059 -77434 -67001 -31699 76726 40695 -30006 -178636 -85332
1442 -85332 -46245 -74402 -33598 -89796 -160090 -77383 -71925 -129981 -90301 -114670 -46122 -40161
1430 -40161 -94454 -73538 1109 -85582 -84083 45668 88853 14349 99950 88530 7990 -24792
1418 -24792 18848 2455 -58565 64093 41275 24377 54605 126652 59331 -41582 -36452 -115124
1406 -115124 -94962 -64409 -45488 -21499 -186989 -45102 60344 -5707 -30475 -36555 -45454
1395 -45454 -19241 -62873 -121417 -156315 -166336 -162021 -149034 -48755 -93613 -151282 -146040 -91909
1383 -91909 -147726 -100170 -64152 -43721 -185974 -94277 -88473 -150959 -101790 -19312 15393 -27987
1371 -27987 69946 94312 46151 -60615 -56230 -71918 -85341 -25048 -6244 82722 -82056 -244813
1359 -244813 -181571 -80814 -73753 68029 9030 -98273 -120642 -150308 -88473 -1472 -49908
1348 -49908 -9361 111867 133198 17019 -36156 55704 36279 32631 -31360 -27443 -824 9440
1336 9440 -82351 -34277 -6948 -34043 -51984 -84423 -52381 -14023 -69882 43120 -110283 -158476
1324 -158476 -51889 -80773 -81950 -154536 -205905 -131028 -6571 -20235 -1704 34544 67599
1313 67599 30066 -27078 65079 67356 115231 50734 -46579 -31677 34641 118613 138934 57326
1301 57326 51170 -20847 48231 -14427 -74862 -103005 -60665 -33684 45644 45025 122173 47663
1289 47663 -14899 23146 86608 61379 69517 82160 131129 32983 57632 30482 43871 118716
1277 118716 57107 95002 -23270 -1239 12586 -25457 1856 82964 39622 62972 61531 -11784
1265 -11784 -15511 47332 -34111 -59210 -43450 -20798 -25555 117408 44755 -56061 -97351 -135001
1253 -135001 -76564 -47158 -10722 52691 -9390 64097 -22492 -15996 38700 91794 100945 49603
1241 49603 -46781 4937 78167 130310 116684 37393 79672 56168 52793 -45756 20448 -23002
1229 -23002 -55054 -96854 5372 48522 -8096 8756 -25235 5170 31166 18290 -760 35953
1217 35953 73168 10299 -20441 -33738 -47567 -4990 -32354 -53086 -121714 -144261 -137601 44937
1205 44937 29547 -1038 -17590 -17142 49713 53917 -30751 -79467 -87914 -57590 10180 118322
1193 118322 112916 96882 92736 75625 29585 10046 80786 96234 41769 44470 48127 24356
1181 24356 30204 -60517 -4721 42346 -12083 62739 30511 37772 -13824 -56482 -84751 -48825
1169 -48825 -144935 -139380 -107742 -165093 -44915 31078 -4696 24874 69396 -15938 -66764 -38927
1157 -38927 -46542 -49971 5440 1416 1242 -97171 -63081 -14504 -5274 33003 72542 14406 116704
1144 116704 122112 52763 40713 40436 25812 -10705 -25095 38383 126863 98403 15549 22964
1132 22964 -65462 -4889 28191 9775 22571 -73059 -73176 -101057 -44882 20131 -51443 -26311
1120 -26311 -4781 10474 67192 54394 66931 9675 23499 -35595 -24005 97595 11749 10954
1108 10954 -29542 -48974 -88372 -60440 -49485 2881 9694 -57771 -44357 32031 -1739 -55498
1096 -55498 5372 2680 11013 -3338 11616 103224 -9113 -3630 41414 35108 -31976 -77091
1084 -77091 2673 49619 142369 102012 99303 -8280 -59211 75302 73508 -44021 -13191 -36854
1072 -36854 -6262 -8242 -17885 58854 -20899 -719 -5637 56725 60920 22252 -2807 42189 -6554
1059 -6554 -2250 -56815 23952 89560 -33304 -91892 -33897 -23691 -66487 -24199 40829 -3831
1047 -3831 -43532 -100247 -82937 22956 8253 -46365 -31099 -1773 16783 1811 -99236 -61352
1035 -61352 -38319 -30977 84894 93373 35100 75118 33619 -26270 5642 79064 83823 41791
1023 41791 -12036 31408 32740 33658 -12018 -46461 -43917 90727 -49827 -5313 13942 -7596
1011 -7596 55456 113796 118407 90136 42382 18418 -54412 -2490 -13185 89309 168523 87266
999 87266 57141 98395 73239 -3869 -1551 22765 12134 -31571 -46130 -142453 -98506 -28261
987 -28261 -25451 -13979 57162 37686 9046 -33410 -69851 -28729 -21034 -62115 -74619 -115786
975 -115786 -102575 -78006 -40151 -53931 -48366 8412 23954 -29397 -156045 -166940 -110095 -75498
963 -75498 -5580 -31606 -16029 14372 72145 110517 5965 -2987 13522 85967 111111 144537
951 144537 61320 -126198 -59467 33182 19596 9362 -22723 -42409 -56003 -78528 -40702 -8150
939 -8150 -5958 -32845 -7397 51224 32842 55552 76996 -16829 -72784 -67063 -56210 32057 57117
926 57117 -18525 -46136 21636 68401 -54781 -25926 15165 -100 -33660 -43478 -92640 -52452
914 -52452 24271 53056 10244 87395 144343 82577 151502 129412 67822 -42205 -93363 -37161
902 -37161 -32833 36896 -32255 20169 45416 58069 150965 171983 58217 20807 18552 29955
890 29955 35971 -54479 59596 71016 17785 47007 24798 -11871 3750 -80495 -71790 23511
878 23511 44324 -26223 -96291 -64162 -6611 13144 -7000 -47949 -27681 -51803 -25129 37827
866 37827 11102 -96643 -98893 -91101 -83231 -6560 -50607 2257 -11412 -6330 49625 57138 -57519
853 -57519 -46349 -52096 4290 -30253 -46449 26665 17456 51728 -1364 3543 -5730 -50227 -168368
840 -168368 -91223 -9351 89311 39140 67992 182775 74618 28495 41313 21062 -52757
829 -52757 -91572 -76214 -7603 84552 139449 92248 78429 18162 96732 113711 25633 115598
817 115598 21447 -52123 -19223 8126 75616 8402 -72554 -15455 69859 27746 -18143 64758
805 64758 -35516 -29127 -98372 -57576 -19485 -9619 18762 75261 84214 81416 52902 10409 41060
792 41060 -50458 -27734 -23551 67922 26886 35279 -41548 -57555 -103646 -85888 -67008 -205399
780 -205399 -195792 -79181 1805 -758 -60088 -111076 -93839 -116318 -133735 -90800 -117911 -101496
768 -101496 -155100 -24607 -15317 13057 34143 13897 68259 -2724 37298 29002 -12212 -15319
756 -15319 -1830 -69824 -62429 -128236 -130576 -102975 -86142 -135775 -111825 -157548 -62063 -25444
744 -25444 -8902 17148 17617 -30586 -38424 56182 121520 136828 99853 52771 67912 6698 5129
731 5129 37030 93350 36129 15949 41623 81437 120196 82299 21242 67103 98408 44882
719 44882 5287 -51617 -15078 -13267 -97821 -74850 -5947 71516 109933 50726 -64563 -29672
707 -29672 114258 -23622 1569 -20509 -52953 50961 45439 35858 117922 39374 7452 -25571
695 -25571 -7826 81112 74863 7296 -60951 -52759 -38754 -16022 -49178 -15233 69190 79205
683 79205 54920 -40474 -6190 26619 64291 59133 5866 126213 89848 1852 -35824 -37194
671 -37194 -19711 13428 46992 70337 61757 42525 99717 69628 69684 17583 39198 -26869 -71938
658 -71938 -7264 -10285 -23320 -1815 -16350 -57426 -128586 -135129 -140925 -81100 -140168 -116948 -48509
645 -48509 7570 11782 40451 59627 105220 19281 -17128 29453 -60706 -52036 11875 -65409
633 -65409 -65274 56253 28138 -78654 -18548 36928 62306 -36250 -42482 -53123 -87278 -36057
621 -36057 98781 -3317 -3162 87414 -50443 -77066 -23851 -13163 -45396 11781 -90820 -10776
609 -10776 85130 -39569 -65577 29184 71253 33232 33737 66704 43224 37074 -48006 -77891
597 -77891 -51288 32473 25178 36178 -27496 89471 114909 110311 34121 -1846 41750 19095
585 19095 -7637 89020 -34730 -88434 -119295 -48745 -39875 74271 96065 9257 18085 84387
573 84387 156406 74831 -27468 46628 61181 -8742 8462 -1784 -18436 -93917 -78200 -46036
561 -46036 -9222 11654 85672 85821 63133 -67184 -93142 56050 -29161 -58957 -13297 399
549 399 -67282 -98122 25134 48660 87781 6146 -54372 -69341 8847 -18187 -149109 -70789
537 -70789 -46246 -12806 17465 8362 71069 74244 -12570 -13702 31839 -74014 -79140 -51569 -73473
524 -73473 -56706 8265 89963 72875 1845 30357 -50242 -10233 32216 41352 64596 96028
512 96028 111542 76226 21189 15581 -19685 -92417 -73698 -3868 -82603 -75992 -29561 -116727
500 -116727 -39810 24881 -68270 -129339 -48638 -10551 -88002 -89597 -150816 -40542 440 -25862
488 -25862 22768 72735 69441 66795 132568 164456 33647 -80187 -11565 13813 54629 164019
476 164019 137131 60523 102663 12055 -65898 -74674 -94317 -95611 -68081 -30834 61353 28649
464 28649 -60222 32067 -4822 3626 -21633 14595 14681 60939 -3721 -44692 63933 -10089 -55493
451 -55493 -101750 15121 -64879 -69209 -33784 7394 -61903 -128392 -53655 25141 -42317 40455
439 40455 56145 -22825 39919 55353 45493 28076 -34922 31140 50440 52213 205831 175068
427 175068 88634 52957 1635 35465 54338 -51420 -116542 12392 98781 25794 -86673
416 -86673 -29965 29922 48205 112260 95508 127235 128117 90893 64805 2289 -38564 13659
404 13659 -24483 -52400 25532 1706 49252 -10712 -101160 -73327 -46940 52684 35112 87940
392 87940 81781 -52406 -64979 -77860 -121026 -48563 1108 -30012 -74009 -89813 -48865 -23004
380 -23004 -7591 58108 30559 98413 66149 77200 37164 -48903 -25609 100089 53730 31672
368 31672 68137 55763 41684 38664 53219 -11408 -56707 7100 22479 54203 45083 -91982
356 -91982 -69557 11450 48642 30333 56708 53478 44985 102854 24224 19406 -16930 -2578 74114
343 74114 -110423 -119919 -47038 -61127 -460 37562 41618 57363 -640 -7459 37 -2852 -19754
330 -19754 -77649 -41390 -11884 17302 -5316 34585 46152 -38222 -9102 -801 79655 33395
318 33395 35080 8858 5872 5882 -19655 21249 17364 35447 86872 -63894 -53843 -87466 -89761
305 -89761 -3728 -45624 -29960 -30793 -64317 -93544 -36765 -10814 68699 125939 35434 -6643
293 -6643 -101386 12776 87900 68960 116654 84084 27823 -37030 -34226 58459 2257 -37195
281 -37195 -19941 -23464 -60568 16438 17951 9124 27676 54427 97086 147815 122918 102229 95755
268 95755 -35622 17527 1161 -52867 28822 -64923 4210 104437 -2171 28413 -8775
257 -8775 25529 18093 72682 87072 57989 -5182 35883 -1442 20731 18914 12186 -91497 -18563
244 -18563 19102 -106583 -94009 -12141 8173 41477 24609 -19004 -154243 -103770 -110671 -77315
232 -77315 71208 -12846 -7012 -33094 49945 4053 -15621 -18001 -90772 -126954 -109118 954
220 954 8526 35746 -60699 -36783 56751 -15176 -46376 -36733 56172 42139 101566 121331 78685
207 78685 21127 -30205 -53194 34600 18298 56191 67201 7309 -1873 -61884 -51931 -6395
195 -6395 172266 119258 95528 21529 42511 44529 -25423 38805 20229 34089 23156 95713
183 95713 78715 7940 -75274 -19864 -13486 20731 -17016 -4207 18164 16960 35722 25742 31089
170 31089 17598 -96101 -78986 -9914 -43563 -58794 -95895 -14441 -26120 -5670 34862 14154
158 14154 -46708 -30793 -34160 -65988 -124432 -36264 61369 109646 93046 119675 55781 -26470
146 -26470 -35225 -45241 10636 25674 64351 73612 12225 -20667 71320 108054 100442 51382 105751
133 105751 129282 6058 25398 55058 104363 89930 68503 -3046 67480 98308 36344 -90725
121 -90725 -110075 -29072 -52269 -42765 83928 49780 2521 16671 33778 55225 -16182 -61159
109 -61159 -95005 -46551 -23843 22036 -45195 12779 7712 2255 -8360 20061 -14499 27881
97 27881 -17052 -6226 64352 128979 159034 117780 -14749 -25719 -14307 14119 79933 31480
85 31480 -6102 45318 166442 45141 33534 -35649 -64648 17457 40792 28154 15544 1841
73 1841 -67861 -36325 -37407 -73429 -41907 49624 22032 63595 46517 17372 45130 129999 99862
60 99862 -2938 -16057 90233 81653 -52084 -49238 -53297 -34464 -18583 295 -56358 -58024
48 -58024 23874 41666 84317 40066 29451 1619 -17465 6708 -5401 29427 -16877 -22909
36 -22909 -11770 -78743 -143367 -96978 -28266 214 22430 39081 23798 38787 42176 43667 12730
23 12730 -17998 19461 65917 49649 -1334 -74234 -96204 -25614 160 59893 87560 17661
11 17661 37253 16888 21209 40992 83838 66149 101080 58870 26369 -10867 19094
0 19094
$$ Imaginary data points
##PAGE= N=2
##DATA TABLE= (X++(I..I)), XYDATA
16383 -757029 -702099 -688971 -621377 -607334 -632784 -608500 -569269 -579121 -589023 -559211 -425377 -432832
16371 -432832 -441403 -465845 -464480 -456218 -484294 -485367 -427452 -380138 -416122 -366998 -245306 -242192
16359 -242192 -215520 -289467 -322903 -327093 -273747 -232749 -131393 -16378 -43482 -81065 -58665
16348 -58665 -47807 -86424 -147619 -110823 -35992 26989 -10188 -14701 22794 64845 62743 78082
16336 78082 146938 126789 106812 178224 221686 204136 176725 173839 146354 264323 253524 280921
16324 280921 324068 254856 306216 348853 347916 402253 422660 399529 414284 355808 388551 444368
16312 444368 506058 526088 584934 462780 579631 537334 535416 513665 572085 684243 628454
16301 628454 650674 606899 678758 641316 669127 669326 654128 720984 724456 741206 824304 790653
16289 790653 777882 757179 816524 843014 871481 890558 853649 847126 897986 942750 920696 906798
16277 906798 938770 941736 1034700 1004662 973774 969461 904919 976561 1094773 1144362 1138074 1125411
16265 1125411 1083069 1070753 1062268 1044878 1122648 1161202 1146971 1169897 1118466 1166300 1130961
16254 1130961 1087908 1157820 1121106 1152959 1190112 1242150 1278200 1245635 1257839 1281178 1333836
16243 1333836 1322929 1368939 1392479 1273095 1210328 1261365 1345018 1353313 1401191 1419918 1464597
16232 1464597 1408214 1336758 1314370 1338696 1355027 1371346 1413518 1357228 1438766 1571111 1591835
16221 1591835 1441689 1477521 1413466 1470425 1550552 1518386 1554915 1607477 1551171 1642763 1711720
16210 1711720 1690552 1692252 1614378 1645646 1573805 1549635 1565785 1608587 1679663 1715539 1755946
16199 1755946 1695298 1699055 1621956 1568876 1577879 1598384 1595373 1697278 1802980 1712438 1744248
16188 1744248 1687583 1694276 1689465 1735993 1785806 1650960 1684301 1696378 1692145 1752101 1730757 1650893
16176 1650893 1686903 1664902 1783239 1771875 1709913 1802650 1779075 1796832 1810778 1744074 1849877
16165 1849877 1843227 1811431 1864809 1907927 1824282 1816398 1841344 1896901 1863266 1794066 1909805
16154 1909805 1948811 1935915 1912651 1907328 1948369 1938522 1872806 1814349 1793166 1906764 1981260
16143 1981260 1870614 1910569 1925937 1897897 1883750 1821822 1921667 2029223 2083823 1976017 1955412
16132 1955412 1995473 1947547 1908701 1906780 1897324 1969288 1953822 1952629 1955257 1921846 1834002 1927224
16120 1927224 1887492 1843724 1916990 1993854 2034436 2019199 1984088 1918579 1891472 1895752 1877808
16109 1877808 1990941 1942699 1944242 2030799 1968239 1915434 1956956 1986366 1954707 2015642 1995420
16098 1995420 2062487 2081953 2121263 2102121 2065721 2090487 1982279 1978521 1989657 1949524 1875247
16087 1875247 2014176 1965273 2034482 2074738 2017990 2063296 2107372 2121175 2171393 2131553 2097606
16076 2097606 2122354 2118236 2070050 2023196 2095863 2144205 2103649 2051351 2010312 1966525 2041023
16065 2041023 2082864 2017378 2043234 2011351 1941252 1920822 2058758 2019320 1983185 1981054 1940665
16054 1940665 2023123 2086835 2122744 2158613 2077020 1991011 1959833 2014943 2056508 1953067 1958398
16043 1958398 2014349 2057049 2094631 2171136 2039578 2008330 1967858 1995444 2077424 2066204 1940736
16032 1940736 2061266 2102584 2000954 1977463 2063508 2054166 2071891 2077382 2042551 2014616 2020614
16021 2020614 1955677 2064022 2047839 1986032 2008253 2026622 2092704 2035234 1943110 2039529 2098284
16010 2098284 2120201 2151596 2112906 2124578 2230405 2168934 2170498 2180667 2128483 2120220 2192600
15999 2192600 2104330 2104194 2113573 2126810 2094895 2064453 2125279 2135668 2115652 2079097 2034946 2012974
15987 2012974 2129318 2052921 2062421 1985003 2046270 2034175 2000312 2054752 2117171 2072412 2102680
15976 2102680 2136658 2071832 2114775 2068144 1979909 2127076 2165342 2131518 2109282 2127276 2099981
15965 2099981 2117097 2064766 1922296 1950306 2004520 2058133 2114275 2159122 2157792 2139439 2105134
15954 2105134 2074589 2029363 2083623 2165735 2049293 1986623 2072788 2057381 2119030 2077998 2137167
15943 2137167 2127455 2165059 2082781 2079416 2039029 1997185 2062580 2133319 2189246 2070374 2065742 2062684
15931 2062684 2068112 2131492 2155235 1995375 2030348 2111103 2182511 2124085 2032519 2110459 1975135
15920 1975135 1998828 2087649 2090606 2077675 2143846 2230428 2133337 2094543 1999681 2014738 1943613
15909 1943613 2020139 2042820 2077365 2117883 2145332 2132247 2075300 2078131 2109544 2023375 2040331
15898 2040331 2138831 2053960 1978536 2031787 2069669 2108483 2057371 2122208 2055434 1980566 2008362
15887 2008362 2048508 2151225 2159081 2075879 2103832 2180162 2155016 2208207 2098293 2067770 2100173
15876 2100173 2080307 2156619 2130424 2129126 2154864 2176142 2214322 2282490 2180111 2074550 2012332
15865 2012332 2130454 2107792 2051379 2050844 2015889 2015486 2032556 2022157 1978999 2003544 1990266 2146458
15853 2146458 2158970 2143369 2093735 2061865 2036569 2056244 2032427 2075517 2125392 2106682 2112615
15842 2112615 2130567 2124815 2154907 2131272 2090522 2167391 2113255 2102265 2050533 2092648 2037996
15831 2037996 1999237 2069270 2038619 2033930 2012836 2090275 2050700 2145498 2103954 2023073 2040535
15820 2040535 2097051 2069203 1983421 2059410 2102242 2013437 2051109 2073458 2064916 1987150 2055883
15809 2055883 2034745 2089244 2166907 2144355 2103244 2024000 2055288 2095029 2130545 2120173 2117776
15798 2117776 2081745 2090605 2155321 2252474 2248111 2201300 2238757 2181455 2092398 1996940 1981775 2071971
15786 2071971 2135365 2022500 2032029 1997723 2164245 2139351 2140204 2179588 2200195 2156012 2066498
15775 2066498 2173766 2192213 2137214 2074517 2121093 2173891 2189742 2114756 2119495 2028050 2075262
15764 2075262 2052881 2014052 2096496 2162850 2170625 2122716 2143349 2059812 2034520 2092135 2093742 2128597
15752 2128597 2001612 2023729 2089641 2152791 2143417 2178621 2180164 2189769 2192665 2179988 2146158 2089215
15740 2089215 2169579 2219549 2191792 2197516 2143202 2069573 2064510 2091411 2099234 2047844 2117153 2153838
15728 2153838 2056397 2079471 2097674 2090686 2164595 2169320 2160193 2171764 2162006 2121676 2184032 2181662
15716 2181662 2116282 2097704 2139372 2201229 2154219 2066236 2025581 1985451 2095356 2166809 2064404
15705 2064404 2107014 2210815 2193852 2109720 2117007 2147371 2187552 2260379 2241958 2200766 2258316
15694 2258316 2195284 2180234 2121426 2093112 2085184 2183175 2174941 2222702 2154827 2073640 2015009 2064589
15682 2064589 2117841 2102457 2106164 2126144 2221613 2132982 2112281 2123784 2127387 2195899 2207594 2172671
15670 2172671 2111031 2181241 2179188 2134535 2040434 2034837 2103160 2136370 2147111 2177061 2237564 2268862
15658 2268862 2244972 2155168 2137343 2095451 2092087 2069031 2157821 2179912 2110384 2088358 2108957
15647 2108957 2078753 2108133 2152045 2155651 2231098 2221403 2217906 2277103 2224868 2122567 2119322 2248051
15635 2248051 2181560 2138344 2290719 2237348 2181135 2236365 2103785 2061604 2103829 2156018 2159065
15624 2159065 2135454 2185094 2220045 2018141 2095423 2044717 2061804 2053281 2133691 2183753 2108118
15613 2108118 2176862 2112814 2108492 2182227 2155392 2092372 2029297 2125570 2224482 2247084 2220672
15602 2220672 2199697 2260793 2239690 2250191 2257166 2310690 2259943 2175765 2193898 2100608 2122626
15591 2122626 2106579 2139608 2133872 2108866 2138482 2090060 2085203 2110358 2185320 2150622 2133313 2178386
15579 2178386 2176895 2096755 2127874 2171411 2268277 2234619 2207916 2161186 2222624 2291492 2210641
15568 2210641 2191675 2100304 2083500 2149246 2185585 2254557 2288037 2288390 2263887 2242463 2234484 2169579
15556 2169579 2162134 2151440 2182985 2155465 2092652 2080700 2059450 2134922 2177586 2215435 2230572
15545 2230572 2209601 2146685 2133837 2143026 2158607 2111591 2114231 2178579 2132987 2146796 2171229 2133828
15533 2133828 2104153 2046893 2066088 2116880 2150541 2124358 2180654 2222707 2188047 2112429 2131493
15522 2131493 2152681 2112997 2043446 2039418 2103576 2183390 2181339 2197267 2198402 2263102 2193381 2161728
15510 2161728 2184473 2078120 2035982 2046468 2129312 2227090 2151630 2095759 2097177 2204121 2200853
15499 2200853 2145276 2085887 2154725 2282658 2206286 2202694 2298589 2273323 2241049 2130836 2151264
15488 2151264 2224555 2180491 2183905 2141641 2242418 2236852 2272756 2262451 2214552 2163411 2175039
15477 2175039 2219549 2238161 2235291 2226589 2193106 2278969 2169055 2120353 2086399 2159619 2242163
15466 2242163 2247612 2198660 2176577 2275366 2300758 2363330 2295954 2204763 2268560 2140186 2088048
15455 2088048 2105774 2168732 2194609 2189919 2147177 2285674 2231578 2188103 2251064 2306035 2212644
15444 2212644 2186334 2273190 2170882 2208812 2265410 2165634 2120778 2177456 2213240 2284630 2218182
15433 2218182 2119483 2173129 2269769 2224477 2168123 2204507 2231762 2169322 2257325 2251855 2220909
15422 2220909 2181483 2194422 2250269 2244927 2179790 2225172 2327665 2338060 2306124 2387485 2270741
15411 2270741 2190305 2195833 2215157 2282247 2322928 2314348 2162686 2125373 2154790 2130571 2195430
15400 2195430 2266059 2252685 2183616 2148864 2214127 2265735 2313213 2229478 2265976 2393592 2278725
15389 2278725 2349386 2305820 2323729 2217013 2245158 2181257 2228765 2220073 2100854 2149405 2211468
15378 2211468 2249118 2309098 2343574 2286753 2234330 2204321 2199343 2255010 2218690 2222444 2209870 2103501
15366 2103501 2147382 2314822 2344021 2201949 2193730 2138500 2135097 2174226 2245628 2225181 2289853
15355 2289853 2314733 2306640 2211166 2200117 2218089 2178045 2136174 2211137 2217942 2329664 2310559
15344 2310559 2230602 2250022 2203299 2174818 2253188 2166391 2150729 2181840 2191105 2169611 2297323
15333 2297323 2363481 2289739 2279883 2254416 2240697 2330849 2239067 2219029 2215262 2188969 2232609 2241122
15321 2241122 2283710 2154814 2200357 2148184 2181149 2193215 2144517 2186021 2193298 2145808 2152665
15310 2152665 2279103 2283984 2260449 2171434 2177772 2225510 2168019 2232787 2229377 2153649 2215632 2228573
15298 2228573 2350479 2399739 2237905 2192165 2213710 2203075 2186023 2042134 2060034 2091961 2087202
15287 2087202 2151186 2091083 2174449 2222241 2182580 2143255 2256886 2228717 2233398 2284886 2408028
15276 2408028 2312031 2279015 2338470 2230995 2193198 2153896 2260842 2316729 2249887 2243680 2262505
15265 2262505 2305648 2457371 2286765 2164200 2234453 2231142 2287819 2335664 2306201 2234023 2276706
15254 2276706 2332846 2263622 2324676 2235932 2206878 2267546 2278537 2216172 2215772 2209947 2197905 2181470
15242 2181470 2229797 2265568 2230910 2255455 2218892 2164521 2144900 2260854 2336401 2352823 2234997
15231 2234997 2218561 2138338 2255819 2276197 2323972 2211771 2191676 2200937 2292040 2339707 2291896
15220 2291896 2206002 2255399 2277854 2280440 2287317 2278995 2269313 2215038 2251158 2341329 2378301 2308000
15208 2308000 2290697 2311803 2277030 2312820 2367236 2310534 2288510 2183015 2251755 2183570 2202065
15197 2202065 2166733 2200933 2176001 2260626 2360723 2348715 2329698 2213320 2253202 2320647 2312268
15186 2312268 2324447 2314980 2359184 2288394 2243185 2207126 2170119 2255710 2420133 2374271 2364220
15175 2364220 2332051 2327263 2313177 2313495 2263643 2165623 2219412 2302256 2286755 2266913 2204035 2246911
15163 2246911 2380023 2276121 2250325 2294384 2259684 2233805 2189620 2260938 2299075 2264203 2283449
15152 2283449 2304385 2317133 2317815 2396953 2408917 2471004 2432049 2354679 2285948 2407701 2449923
15141 2449923 2363335 2368736 2477535 2375628 2276560 2244128 2269254 2291380 2379252 2352725 2299925
15130 2299925 2292021 2264213 2351135 2320606 2299938 2245302 2216556 2259657 2237864 2280072 2327717
15119 2327717 2287160 2230234 2184260 2200728 2189092 2122356 2250514 2312715 2367338 2375190 2307479
15108 2307479 2356515 2263655 2231252 2214843 2246280 2203264 2288807 2342654 2273423 2276903 2274733 2208477
15096 2208477 2188102 2300814 2310983 2249667 2194584 2279142 2334852 2349818 2294813 2187378 2219873
15085 2219873 2229803 2175816 2137277 2281268 2171856 2109492 2150754 2316892 2328683 2194362 2323223
15074 2323223 2229796 2195312 2333828 2323198 2410229 2384809 2336389 2355534 2240850 2250488 2336147
15063 2336147 2331061 2267159 2242390 2252340 2163583 2254192 2321608 2367646 2457367 2462249 2415331 2355998
15051 2355998 2357394 2350291 2268315 2252731 2371711 2300646 2190469 2196139 2206664 2186586 2261827
15040 2261827 2330306 2287066 2243440 2266483 2343547 2368140 2287038 2272969 2214503 2217317 2246099
15029 2246099 2257958 2354754 2368834 2375779 2297961 2264036 2374466 2314815 2238239 2253376 2356060
15018 2356060 2366361 2379885 2342828 2336940 2262267 2140066 2200572 2278944 2353881 2365673 2306150
15007 2306150 2320951 2375099 2304495 2269066 2286165 2319819 2344521 2365586 2431740 2394722 2340459
14996 2340459 2463563 2378523 2273840 2311542 2268725 2305696 2260852 2312281 2345545 2372380 2307370
14985 2307370 2329884 2368774 2391352 2399956 2357323 2406081 2357751 2328337 2290533 2347979 2395425
14974 2395425 2359053 2364893 2382110 2415298 2316960 2287653 2395641 2474481 2447788 2359517 2431038
14963 2431038 2340879 2215478 2316525 2355058 2331897 2285479 2311423 2278754 2246926 2302168 2307756
14952 2307756 2213630 2276992 2280460 2354480 2326330 2341083 2264969 2191990 2296216 2361039 2442186
14941 2442186 2401728 2295971 2205298 2347338 2375251 2302327 2255778 2283370 2258087 2252894 2292175
14930 2292175 2201928 2203274 2200632 2254345 2272146 2272902 2403650 2416624 2330871 2224627 2262106 2228009
14918 2228009 2316606 2394493 2453510 2348311 2292125 2290497 2326006 2379167 2413276 2342340 2317902
$$ [...]
##END NTUPLES=NMR SPECTRUM
##END=
