##TITLE=1H_TG-2340-I
 CDCl3
 8 sc, 
 11.4.2023
##JCAMPDX= 6.0         $$ Bruker NMR JCAMP-DX V2.0
##DATA TYPE= NMR SPECTRUM
##DATA CLASS= NTUPLES
##ORIGIN= UXNMR, Bruker Analytische Messtechnik GmbH
##OWNER= root
$$ XWIN-NMR		Version 3.5
$$ Tue Apr 11 14:11:52 2023 Russian Standard Time (UT+4h)  she@DPX200
##.OBSERVE FREQUENCY= 200.13135
##.OBSERVE NUCLEUS= ^1H
##.ACQUISITION MODE= SIMULTANEOUS
##.ACQUISITION SCHEME= undefined
##.AVERAGES= 8
##.DIGITISER RES= 18
##SPECTROMETER/DATA SYSTEM= spect
##.PULSE SEQUENCE= zg30
##.SOLVENT NAME= MeOD
##.SHIFT REFERENCE= (INTERNAL, MeOD, 0, 15.748)
##AUDIT TRAIL= $$ (NUMBER, WHEN, WHO, WHERE, WHAT)
$$ ##TITLE= Audit trail, XWIN-NMR		Version 3.5
$$ ##JCAMPDX= 5.01
$$ ##ORIGIN= Bruker BioSpin GmbH
$$ ##OWNER= she
$$ F:/spectra/data/she/nmr/H-F/1/pdata/1/auditp.txt
$$ ##AUDIT TRAIL=  $$ (NUMBER, WHEN, WHO, WHERE, WHAT)
(   1,<2023-04-11 14:10:38.64 +0400>,<she>,<DPX200>,
      <created by zg, POWCHK disabled, PULCHK disabled
       configuration hash MD5:
       00 E9 B6 7A A2 85 ED C7 34 08 36 98 17 FE 4E 26
       data hash MD5: 16K
       5D 61 9A 17 84 7B 23 A9 23 4F 2B C1 8A AD B3 DA>)
(   2,<2023-04-11 14:10:41.48 +0400>,<she>,<DPX200>,
      <Start of raw data processing
       efp BC_mod = 2 LB = 0.24 FT_mod = 6 PKNL = 1 PHC0 = -19474.75 PHC1 = 15.0008 SI = 16K 
       data hash MD5: 16K
       BF DD 2C FB 8E 5A 11 F6 6B E3 7E 8C 83 18 97 83>)
(   3,<2023-04-11 14:11:03.92 +0400>,<she>,<DPX200>,
      <pk PHC0 = 3.16635 PHC1 = -4.600001 
       data hash MD5: 16K
       FA 33 F7 BE D9 5E 86 6B B0 2D FB FE 4A C7 AF D9>)
(   4,<2023-04-11 14:11:07.17 +0400>,<she>,<DPX200>,
      <abs ABSG = 5 
       data hash MD5: 16K
       55 C1 13 9E 96 B8 C4 39 09 92 AC B4 DD 78 53 B7>)
$$ ##END=
$$ 
$$ hash MD5
$$ 28 4E 08 BC 2E 84 53 10 E8 3C B2 CF 46 AE B5 4E
##$RELAX= 
##$RELAX= 
##$RELAX= 
##$RELAX= 
##$RELAX= 
##$RELAX= 
$$ Bruker specific parameters
$$ --------------------------
##$DU= <F:/spectra>
##$EXPNO= 1
##$NAME= <H-F>
##$PROCNO= 1
##$TYPE= <nmr>
##$USER= <she>
##$AMP= (0..31)
100 100 100 100 100 100 100 100 100 100 100 100 100 100 100 100 100 100 
100 100 100 100 100 100 100 100 100 100 100 100 100 100 
##$AQSEQ= 0
##$AQ_mod= 1
##$AUNM= <au_zg>
##$AUTOPOS= <>
##$BF1= 200.13
##$BF2= 200.13
##$BF3= 200.13
##$BF4= 200.13
##$BF5= 200.13
##$BF6= 200.13
##$BF7= 200.13
##$BF8= 200.13
##$BYTORDA= 1
##$CFDGTYP= 0
##$CFRGTYP= 5
##$CHEMSTR= <none>
##$CNST= (0..31)
1 1 145 1 1 1 1 1 1 1 1 1 1 1 1 1 1 1 1 1 1 1 1 1 1 1 1 1 1 1 1 1 
##$CPDPRG= <>
##$CPDPRG1= <>
##$CPDPRG2= <>
##$CPDPRG3= <>
##$CPDPRG4= <mlev>
##$CPDPRG5= <mlev>
##$CPDPRG6= <mlev>
##$CPDPRG7= <mlev>
##$CPDPRG8= <mlev>
##$CPDPRGB= <>
##$CPDPRGT= <>
##$D= (0..31)
0 1.2 0 0 0 0 0 0 0 0.06 0 0.03 0 0 0 0 0.0002 0 0 0 0 0 0 0 0 0 0 0 0 
0 0 0 
##$DATE= 1681207838
##$DBL= (0..7)
120 120 120 120 120 120 120 120 
##$DBP= (0..7)
150 150 150 150 150 150 150 150 
##$DBP07= 0
##$DBPNAM0= <>
##$DBPNAM1= <>
##$DBPNAM2= <>
##$DBPNAM3= <>
##$DBPNAM4= <>
$$ [...]
##$SUBNAM3= <"">
##$SUBNAM4= <"">
##$SUBNAM5= <"">
##$SUBNAM6= <"">
##$SUBNAM7= <"">
##$SUBNAM8= <"">
##$SUBNAM9= <"">
##$SW= 18.05172834244
##$SWIBOX= (0..15)
0 0 2 0 0 0 0 0 0 0 0 0 0 0 0 0 
##$SW_h= 3612.71676300578
##$TD= 16384
##$TD0= 1
##$TE= 0
##$TE2= 300
##$TE3= 300
##$TEG= 300
##$TL= (0..7)
0 120 120 120 120 120 120 120 
##$TP= (0..7)
150 150 150 150 150 150 150 150 
##$TP07= 0
##$TPNAME0= <>
##$TPNAME1= <>
##$TPNAME2= <>
##$TPNAME3= <>
##$TPNAME4= <>
##$TPNAME5= <>
##$TPNAME6= <>
##$TPNAME7= <>
##$TPOAL= (0..7)
0.5 0.5 0.5 0.5 0.5 0.5 0.5 0.5 
##$TPOFFS= (0..7)
0 0 0 0 0 0 0 0 
##$TUNHIN= 0
##$TUNHOUT= 0
##$TUNXOUT= 0
##$USERA1= <user>
##$USERA2= <user>
##$USERA3= <user>
##$USERA4= <user>
##$USERA5= <user>
##$V9= 5
##$VALIST= <valist>
##$VCLIST= <CCCCCCCCCCCCCCC>
##$VD= 0
##$VDLIST= <DDDDDDDDDDDDDDD>
##$VPLIST= <PPPPPPPPPPPPPPP>
##$VTLIST= <TTTTTTTTTTTTTTT>
##$WBST= 1024
##$WBSW= 4
##$XGAIN= (0..3)
0 0 0 0 
##$XL= 0
##$YL= 0
##$YMAX_a= 227986
##$YMIN_a= -377267
##$ZGOPTNS= <>
##$ZL1= 120
##$ZL2= 120
##$ZL3= 120
##$ZL4= 120
##$ABSF1= 15.74358
##$ABSF2= -2.30827
##$ABSG= 5
##$ABSL= 3
##$ALPHA= 0
##$AQORDER= 0
##$ASSFAC= 0
##$ASSFACI= 0
##$ASSFACX= 0
##$ASSWID= 0
##$AUNMP= <proc_1d>
##$AZFE= 0.1
##$AZFW= 0.1
##$BCFW= 0
##$BC_mod= 2
##$BYTORDP= 0
##$COROFFS= 0
##$CY= -3
##$DATMOD= 1
##$DC= 0
##$DFILT= <>
##$DTYPP= 0
##$F1P= 0
##$F2P= 0
##$FCOR= 1
##$FTSIZE= 16384
##$FT_mod= 6
##$GAMMA= 0
##$GB= 0
##$INTBC= 1
##$INTSCL= 3.70164e-10
##$ISEN= 128
##$LB= 0.24
##$LEV0= 0
##$LPBIN= 0
##$MAXI= 10000
##$MC2= 0
##$MEAN= 0
##$ME_mod= 0
##$MI= 1.114404
##$NCOEF= 0
##$NC_proc= -7
##$NLEV= 6
##$NOISF1= 3.799351
##$NOISF2= 2.8
##$NSP= 0
##$NTH_PI= 0
##$NZP= 0
##$OFFSET= 15.74799
##$PC= 1
##$PHC0= -19471.58
##$PHC1= 10.4008
##$PH_mod= 1
##$PKNL= yes
##$PPARMOD= 0
##$PSCAL= 0
##$PSIGN= 0
##$REVERSE= no
##$SF= 200.130004711996
##$SI= 16384
##$SIGF1= 3
##$SIGF2= 2
##$SINO= 5.538805
##$SIOLD= 16384
##$SREGLST= <1H.CDCl3>
##$SSB= 0
##$STSI= 16384
##$STSR= 0
##$SW_p= 3612.71676300578
##$SYMM= 0
##$S_DEV= 0
##$TDeff= 16384
##$TDoff= 0
##$TI= <>
##$TILT= no
##$TM1= 0
##$TM2= 0
##$TOPLEV= 0
##$USERP1= <user>
##$USERP2= <user>
##$USERP3= <user>
##$USERP4= <user>
##$USERP5= <user>
##$WDW= 1
##$XDIM= 16384
##$YMAX_p= 523888874
##$YMIN_p= -755624
$$ End of Bruker specific parameters
$$ ---------------------------------
##NTUPLES= NMR SPECTRUM
##VAR_NAME=  FREQUENCY,     SPECTRUM/REAL,   SPECTRUM/IMAG
##SYMBOL=    X,             R,               I
##VAR_TYPE=  INDEPENDENT,   DEPENDENT,       DEPENDENT
##VAR_FORM=  AFFN,          ASDF,            ASDF
##VAR_DIM=   16384,         16384,           16384
##UNITS=     HZ,            ARBITRARY UNITS, ARBITRARY UNITS
##FACTOR=    0.220516191357247, 1,           1
##FIRST=     3151.64524376776, 0,            0
##LAST=      -461.071519238022, 0,           0
##MIN=       -461.071519238022, -755624,     0
##MAX=       3151.64524376776, 523888874,    0
$$ Real data points
##PAGE= N=1
##DATA TABLE= (X++(R..R)), XYDATA
$$ [...]
9091 15448717 15872634 16187570 16578082 17159505 17832314 18354595 19049135 19491297 20184686
9082 20184686 21025856 21912878 22954121 24050519 25111937 26316728 27694032 29212649
9074 29212649 31296894 33543426 35991914 38807242 42095198 45525201 49153218 53102793
9066 53102793 57515926 62468299 67424720 71105133 73139804 74047998 75278418 77989928
9058 77989928 81506040 84661067 85095415 82054175 76591810 70596037 65289115 61602397
9050 61602397 59337356 57725006 56429737 55180396 53679895 52134360 50811871 50006470
9042 50006470 50058859 50729629 51952582 53298969 55116517 57654614 60654549 64506963 68961348
9033 68961348 74104869 79867811 85695834 91249101 96299209 101286752 106193406 111792497
9025 111792497 117947736 124404637 130168439 133868716 135229950 135242565 133458386 129521686
9017 129521686 124212561 117298139 110103277 103236604 96425494 89839378 83879155 78864132
9009 78864132 75377329 73070807 71196994 69777547 68358914 66875621 65437157 63804052
9001 63804052 62442251 61708664 61791740 62312223 62414527 62148444 61337585 60043709 59339175
8992 59339175 59593171 60585131 62139090 63681270 64957735 66074390 67077455 67959032 69239703
8983 69239703 70995218 73031374 74656671 75284811 75010223 74416489 73499152 71740813 68744611
8974 68744611 64993899 61483945 58831429 56883226 55462291 54178343 53260912 52781069
8966 52781069 52689675 52951754 53075733 52425401 51217167 49995742 48524563 46483565 43772408
8957 43772408 40534835 37010736 33920546 31702674 29837758 28180857 26837606 25612035
8949 25612035 24673370 23768133 23057625 22224929 21418566 20762252 20321501 19754353 19238738
8940 19238738 18924012 18384564 18109842 17742780 17306391 17123209 17002601 16584490 16101267
8931 16101267 15992422 15696424 15415893 15130756 14954021 14801017 14810742 14660019 14390044 14295437
8921 14295437 14272401 14054601 13801911 13688336 13800411 14010218 13850980 13757482 13538968 13495694
8911 13495694 13469874 13515683 13391521 13504892 13592281 13464105 13365876 13431162 13491546 13582836 13797138
8900 13797138 13751841 13610257 13669598 13842663 14096864 14146082 14095641 14358206 14415791 14617568
8890 14617568 14802519 14852331 15110127 15348179 15451811 15590149 15664614 15937720 16136862 16328322
8880 16328322 16557192 16774943 16981835 17424075 17603173 17839317 18383517 18839473 19073267
8871 19073267 19398100 19965776 20388365 20941323 21686121 22250934 22915924 23593673 24380465
8862 24380465 25264302 26390280 27355729 28394319 29883419 31518845 33349920 35672859
8854 35672859 38191424 40472359 43019838 45503447 48073614 51274907 55025701 58625086
8846 58625086 61654504 63960992 65986299 67420366 67054241 64943654 62257704 60322225
8838 60322225 59641739 60010644 60868309 61814867 62921022 63473223 63528811 63974269 64911632
8829 64911632 66045749 66850097 67362917 67971064 68408376 69079019 70353312 72529786 75379657
8820 75379657 78424110 81774820 85634928 90110320 95451208 101585887 108008742 115012504
8812 115012504 121460613 126476011 129622562 129953046 127266290 122696741 117875320 114681999
8804 114681999 112685448 110867169 108817770 105555185 102413352 100509424 99991016 99804813
8796 99804813 99584731 98470420 96544749 93868981 90997669 88329873 86147149 84790936
8788 84790936 84176927 83976773 83909691 84037188 84529448 85677890 87536855 89660708 91602351
8779 91602351 93077548 95430198 98750708 102775673 106613937 108918874 108947877 105735216
8771 105735216 100411858 94524826 88967653 84421245 81141930 78341188 75813156 73718914
8763 73718914 71590987 69761484 68394166 67330793 66234983 64698188 62921874 60260647
8755 60260647 57269742 54372295 51448751 49159292 47301261 45934746 44891757 44186833
8747 44186833 43675103 43133279 42583968 42208267 41780013 41681650 42029379 42357005 42599697 42776538
8737 42776538 42523458 41776251 40776644 39200283 37777934 36463115 35388824 34258173 33621514
8728 33621514 33150087 32619592 32164527 31953090 31681445 31356764 31171550 31329401 31572242
8719 31572242 32010712 32590394 33281088 34051164 35089292 36319669 37980879 39648971 41576530
8710 41576530 44164260 47593412 51523345 56700189 62858764 71233037 81652222 93038708
8702 93038708 96793767 93221558 90039471 84752261 78988111 74555314 71844428 70517682
8694 70517682 70982544 72194940 73350586 72826420 70407876 68128841 66926957 66702597 66806069
8685 66806069 65767158 63546186 60812162 58352744 56567792 55377275 54495915 53607046
8677 53607046 52570665 51420191 50256977 49411016 48944943 49267586 50009458 51132851 52389321
8668 52389321 53469545 54208359 54793603 55988965 58119742 61308610 64788129 68476176
8660 68476176 71657017 73257323 73351013 72058314 69771131 67262320 65311595 63812820
8652 63812820 62505783 60933987 58769742 56636607 54282918 51914734 49842680 48086050
8644 48086050 46740249 45251325 43327624 41094702 38960916 37059046 35509710 34472989
8636 34472989 33739463 33301617 33289122 33551044 33915591 34078532 33974281 33877290 34165315 34686185
8626 34686185 35154526 35312806 34574885 33344139 32399369 31799405 31518383 30822573 29788562
8617 29788562 28411187 26820373 25535796 24666387 23807504 23035463 22113894 20902302 19986155
8608 19986155 18886816 17930077 17222440 16481488 15788337 14952228 14171651 13450992 12883699
8599 12883699 12448882 12068682 11607011 11155988 10839379 10422628 10107610 9904135 9533697
8590 9533697 9255972 9114401 8836163 8665389 8489148 8153977 7731387 7952627 7979121 7710477
8580 7710477 7515822 7209959 6975013 6990054 6980516 6801392 6454882 6329303 6297418 6120889
8570 6120889 5938040 5721772 5590854 5515848 5395507 5261790 5118108 5035712 5015727 4734259
8560 4734259 4674582 4647621 4646718 4513099 4379880 4368254 4276733 4204698 4046572 4064856 4029642
8549 4029642 3812177 3714559 3641073 3535910 3603204 3594982 3300755 3206097 3183029 3244635 3188100
8538 3188100 2989351 3011926 3051222 2993152 2964432 2774485 2690151 2776192 2748189 2499066 2453728
8527 2453728 2603174 2595246 2503821 2538681 2456324 2301579 2345417 2140696 2171267 2203666 2227993
8516 2227993 2010134 2002067 1897673 1870876 1926928 1851231 1769429 1822627 1816156 1866159 1860582 1801558
8504 1801558 1699335 1531518 1579428 1578131 1518024 1463256 1687051 1574106 1407856 1612900
8494 1612900 1716151 1556024 1504489 1389055 1527386 1490949 1436625 1387592 1410721 1512155
8484 1512155 1607182 1554229 1513889 1465735 1469971 1383051 1242096 1383263 1332059 1336126 1295215
8473 1295215 1336500 1255571 1289723 1297660 1224532 1067416 1171526 1193226 1081274 1182012 1192988
8462 1192988 1393234 1447985 1236155 1171547 1125055 1158560 1186026 1012874 1066028 1094247 1104250
8451 1104250 1173290 1056069 1183323 1193665 1152631 1114589 1112293 1307431 1342069 1477974 1488233
8440 1488233 1371245 1256103 1134185 1206576 1172265 1031555 966331 975806 1043576 883068 856306
8429 856306 799886 844306 877277 684724 772487 755829 851484 775946 684066 848289 736014
8418 736014 775639 825797 856020 775890 894309 1000220 916125 921065 874613 759869 850492
8407 850492 976744 906362 658510 688951 679570 596568 659775 764572 818589 681818 792305
8396 792305 760716 733891 591279 577334 619400 375467 535357 617204 644442 612238 617114
8385 617114 658348 504573 496961 312610 299403 313031 403409 492329 510505 452430 443892 468933
8373 468933 346094 406379 324702 347465 333790 426672 368676 429994 377991 259426 233636
8362 233636 208624 257139 260104 242459 179705 295469 464557 412190 180370 175103 168231 173616
8350 173616 314493 279332 149211 233302 270649 281100 199916 305768 253168 122920 96326
8339 96326 83122 103191 170889 211198 216340 206522 287369 364909 310186 347105 276405 285954
8327 285954 160366 115271 222702 223294 253409 349408 406257 257827 243844 332348 293427
8316 293427 386688 247778 192922 260395 257453 340663 343575 238617 195715 141785 216218 270827
8304 270827 211059 292895 312655 411231 366067 386471 609094 692212 554903 399191 304773
8293 304773 410388 373526 264906 233792 357126 418667 590752 529943 286608 275264 227051
8282 227051 253837 181399 151121 237235 271257 267209 183835 182786 151315 239579 297665 456274
8270 456274 422559 245711 210889 226807 83718 146733 234569 345944 267216 160461 271318
8259 271318 441741 361837 256382 189484 46758 12855 -39668 250192 268659 349868 214279
8248 214279 -50673 112559 42168 1002 197738 289219 250726 194900 179131 240597 306216
8237 306216 278958 259426 199828 307730 200975 121730 181155 84488 179467 411924 364853
8226 364853 421949 305827 415087 393730 277675 181409 183610 152698 242017 260798 165300
8215 165300 68653 -34062 -13715 -10374 -50174 -36668 11496 202248 88900 165596 96169
8204 96169 12045 -25581 -7128 3655 25792 32837 90187 44951 -90244 -52713 -135541 -219489
8192 -219489 -755624 -367397 -235951 -212861 66080 70610 -14347 -35449 -148378 -165262 -311902
8181 -311902 -202384 -73413 -104983 -147401 -239119 -103842 43463 -137738 -114717 -119994 -219902
8170 -219902 -146672 -58405 -2672 39047 100074 -12807 73760 160200 22575 55671 54707 -132786
8158 -132786 -70504 -10173 40630 -87750 -119074 -109327 -83068 -113096 -27744 -62349 -104740 8784
8146 8784 -53088 23973 -2426 -105490 -278176 -335407 -227610 -140148 -162034 -247230 -187477
8135 -187477 -57880 -129275 -165983 -291988 -289985 -131724 -165192 -143171 -81754 8271 -12645
8124 -12645 -23200 -99045 -102837 -31511 -143742 -153481 -24510 25307 249858 102519 -53134
8113 -53134 -24592 108191 -23659 -89202 -44212 -64340 -52974 -109490 -173414 -27578 -7713
8102 -7713 -84501 5931 -158205 -312 78622 -29836 -128994 -56423 -99689 -144739 -110187
8091 -110187 -147241 -119762 -46507 82282 72140 -21278 -100409 7660 70826 61157 -53745
8080 -53745 -149062 35467 -7864 6442 -88724 -58651 -129977 -163904 -254794 -158254 -160438 -290769
8068 -290769 -65675 -187090 -150327 47604 18458 -52950 -21389 -43128 -76752 -36079 -201700
8057 -201700 -355752 -318227 -260158 -140989 -69187 -78254 -54094 -99524 -28188 -110196 -66486
8046 -66486 -63679 -146750 -49159 -76638 -168334 -132638 -90413 -60861 -26744 -42309 2192 28762
8034 28762 -40427 -100724 -213165 -166636 44211 -38577 -144009 -164553 -170752 -226990 -193213
8023 -193213 -163673 -132182 -63654 -138409 -108198 -164591 -192358 -74334 -181286 -173256 -12997
8012 -12997 104626 -80441 -4372 -213934 -339590 -109508 -72121 -35630 9504 -45863 -19335
8001 -19335 -36403 -96595 -129263 -120944 -34246 -150109 -117582 -70041 -101285 -149393 -183928 -79050
7989 -79050 -287935 -284307 -133120 -88378 -93942 -124116 -111951 -36925 -139254 -38576 88144
7978 88144 130411 16893 -171987 -150555 -24705 -83705 -256286 -102857 -122800 -175084 -114344
7967 -114344 -44698 -37980 -91367 -192151 -131919 10132 33922 -122260 -98732 -190462 -249282
7956 -249282 -156773 -230116 -311839 -225668 -222543 -129346 7676 -84867 -24019 20995 108 -69888
7944 -69888 -96377 -1507 -96322 -124580 -293168 -117510 -14002 -192675 -214163 -112959 -156988
7933 -156988 -38264 -54015 -110119 -82905 -70158 -15212 -93658 -135646 -29071 -70967 -113451
7922 -113451 -12518 -74943 -25213 -135529 -66986 -234774 -312965 -158511 -60805 -218919 -277369
7911 -277369 -32238 -101553 -67497 37369 -92899 -109105 -58153 -50344 -27732 -238533 -168491
7900 -168491 -153149 -197660 -159823 -254449 -67163 -182746 -236201 -222751 -77138 -25624 -22057
7889 -22057 -5557 -5647 -38843 -145993 -81525 -103684 -174627 -161666 -163924 -19228 43639 23414
7877 23414 37665 -149569 -50199 -112566 -206969 -230491 -88551 -31692 2733 -37390 -259472
7866 -259472 -99050 -70044 -22661 8466 -152853 -39966 50072 -72254 -183987 -269530 -162920
7855 -162920 -105138 -35895 -131875 -115375 -56573 74258 143839 48123 -108590 -235627 -149741
7844 -149741 -34704 -188783 -327713 -228187 -282979 -387018 -234187 -55440 -229799 -258349
7834 -258349 -148764 -70603 -120348 -106660 -179973 -106300 -142078 -227693 -163801 -182165 -158332
7823 -158332 -16137 134302 51716 -10104 77292 58398 31239 -63630 -115067 -19088 20316
7812 20316 -18504 4891 113354 94873 21684 -13257 8679 87404 24222 -61165 31381 304057
7800 304057 -89337 -386250 -309493 -178472 -110746 -242909 -306839 -262097 -146116 -243514 -159346
7789 -159346 24796 -98035 -66155 62506 -11270 39388 71151 30059 -26088 -87080 42219
7778 42219 90486 44371 -10128 16845 -26557 -79229 -21501 -96637 -92370 -173368 -184690 -99369
7766 -99369 -125258 -59772 -170574 -174501 -6857 -127976 -218434 -241620 19420 60884 -59496
7755 -59496 -111630 -17070 4486 -40076 7609 85425 160316 87635 -22360 -139885 -174647
7744 -174647 -99254 110977 108391 73518 73123 -70411 45239 101291 38649 80703 50970 -36749
7732 -36749 -67251 -138870 -92874 77302 58014 -126962 -208373 -139469 -99961 42349 140638
7721 140638 -15989 36065 23744 77097 66086 -109607 -36854 -5459 -61132 -108376 -176563
7710 -176563 25076 -68199 -18309 26264 38068 -32237 -137792 -189520 -208155 -99647 -121351
7699 -121351 -123636 55142 -9083 93700 52759 18045 128149 43161 -40970 -167288 -60828
7688 -60828 -88793 42690 91915 106745 67575 197081 134230 115397 12936 -13971 -18118
7677 -18118 36616 -78114 -226985 12403 190721 113205 5922 48342 48837 31922 59401
7666 59401 32178 -29255 -19846 166493 49758 126269 45669 -46826 -63870 -122924 -4219
7655 -4219 -11899 134942 205720 4967 -6080 64795 -18095 -15070 114690 178869 95147 -28341
7643 -28341 -57995 -47917 -90678 -58609 -38967 48626 117769 54496 27355 154571 164913 177924
7631 177924 49975 99127 -46676 -75032 -70515 75650 7923 42592 -11320 -29543 -42443
7620 -42443 -81883 -18668 -97524 -26576 -6010 121562 88904 35374 127732 44972 45263 -131233
7608 -131233 -123515 60531 -93568 125645 172088 239179 160001 51282 82451 66261 13067
7597 13067 186547 228815 211960 96238 3722 23101 83158 123544 176219 151782 1159
7586 1159 83631 172227 66172 169616 104977 277348 155416 24031 24694 40966 -22849
7575 -22849 -23879 -70283 -60928 -21139 -59801 65328 67445 50869 188882 179697 -57325 54181
7563 54181 117038 64278 -98343 76820 125297 236083 305311 181094 165391 151711 91826
7552 91826 165338 116052 134208 87929 222703 192447 140836 275462 243604 193591 112709
7541 112709 244713 328912 378060 346112 403516 477424 449615 447583 352920 316263 268093 383497
7529 383497 388427 507491 470360 323470 367723 421187 493820 583472 425951 376259 506277
7518 506277 572416 570163 579840 629191 710984 820642 846433 665467 599475 637847 666538 766302
7506 766302 780318 951480 931909 1001831 1141111 1133679 1118816 1226291 1276621 1181645 1080590
7495 1080590 879472 922463 929840 911945 840620 797605 758423 862590 752805 899430 977792
7484 977792 904526 873394 845201 915628 910452 851076 750689 912072 909133 813594 966860
7473 966860 858416 773151 859410 891695 899100 659522 644603 770782 955004 1100293 1101280
7462 1101280 1152977 1109309 1099844 1123226 947498 1070749 1259869 1374699 1097495 1078809 865565
7451 865565 994038 991876 908298 836905 811228 954186 815926 872555 983129 873135 865961
7440 865961 864990 802336 731484 863842 872871 814933 894383 822353 881085 814858 859294 758750
7428 758750 834484 937050 840250 840360 878340 846550 994344 1092992 1157157 1006536 986840
7417 986840 900985 869617 963663 975040 972314 978667 1148693 1041031 1110307 995978 942404
7406 942404 950607 919837 828380 836594 838641 899031 839653 887108 884187 819605 948451 1051687
7394 1051687 977101 1068288 1018746 1051689 1089029 917266 1006702 1138793 1045362 946529 884914
7383 884914 838652 940579 933984 860415 778990 898969 829878 1024865 903142 680928 687969
7372 687969 759952 656509 643707 630662 551616 632661 769980 827037 841886 731738 547168
7361 547168 545106 681811 640533 744909 844097 812400 811597 661415 552875 575609 643708
7350 643708 617143 507469 674910 563664 479136 683523 587637 591900 650732 681330 742908
7339 742908 696324 744843 653023 738640 737383 622256 720399 505882 554121 657171 739465
7328 739465 790086 818987 788845 563996 614040 569197 711888 756836 555511 493573 504262
7317 504262 560896 615886 648190 579876 591102 574844 645540 607372 525834 650352 795430
7306 795430 825518 917099 915119 876458 885257 922467 799467 686984 717489 789665 824313 898424
7294 898424 1027801 929729 862626 861809 723679 774801 859864 888410 951560 963184 842562
7283 842562 699689 705831 767615 803719 760069 872083 763551 858297 806271 705029 725911
7272 725911 888892 935290 904498 956102 1070184 1157584 1011006 985116 1081198 1026144 1049400
7261 1049400 1154291 1101886 1231045 1121158 1319936 1225202 1064167 1187085 1228876 1132238
7251 1132238 1116540 1226205 1253109 1191021 1144535 1106533 1224452 1332493 1288147 1124659 1165734
7240 1165734 1268773 1407253 1479651 1354047 1400477 1419626 1370900 1277618 1350486 1488058 1563100
7229 1563100 1374614 1404045 1432697 1405408 1555828 1675154 1703292 1720807 1752095 1657312 1682087
7218 1682087 1737314 1915516 2061826 1917583 1822171 1895217 1898850 2041739 2002049 1935847 2060506
7207 2060506 2225196 2238977 2255573 2354472 2375013 2245978 2310590 2470274 2533625 2609753 2613558
7196 2613558 2645017 2559471 2648977 2828671 2773853 2625161 2702138 2778891 2784603 2868337 2925492
7185 2925492 3026058 3136198 3157492 3251306 3207533 3123401 3165809 3167736 3064517 2976078 3120195
7174 3120195 3319099 3419835 3429626 3390000 3522328 3530394 3541453 3685682 3902185 3951226 4043117
7163 4043117 4067443 4040669 4117261 4233134 4322693 4201829 4392467 4525672 4430746 4439820 4395434
7152 4395434 4536471 4839662 4860817 4996333 5107990 5359412 5331140 5513659 5866315 6044277
7142 6044277 6174223 6342039 6781397 6941363 7161112 7339442 7554053 7732493 8218549 8566880
7132 8566880 8914506 9345389 9931830 10325759 10845003 11450943 11935649 12506411 13153245 13738648
7122 13738648 14564951 15514851 16491411 17745590 19111811 20667569 22532355 24667100 27114962
7113 27114962 29975851 33235988 37167375 41540688 46366085 51575576 57820872 65434182
7105 65434182 74807255 85924581 97258397 106947224 111869435 110033672 101853052 89837833
7097 89837833 76969498 65787316 57045709 49870402 43943333 39044225 35077065 31573137
7089 31573137 29022552 27095435 25529659 24347130 23453255 22755476 22411910 22251486 22199628
7080 22199628 22127539 22304432 22646881 23073780 23597316 24333969 25261611 26460022 27585704
7071 27585704 28978461 30822232 32957856 35440344 38550402 42038777 45663845 49131546
7063 49131546 51676699 52845531 52428579 50572245 47831272 44547810 40920948 37286989
7055 37286989 33740370 30663113 27784564 25408630 23314903 21506457 19947402 18262119
7047 18262119 16747350 15607322 14832614 14034772 13039293 12472983 11922088 11399161 10903332
7038 10903332 10426241 10253834 9981140 9582319 9415747 9275091 9089929 8960726 8959361 8816545
7028 8816545 8690342 8535838 8474762 8419346 8384022 8280670 8277956 8246127 8211483 8236964 8299446
7017 8299446 8364173 8346765 8532649 8716941 8924024 8934455 9239764 9753318 10145279 10528185
7007 10528185 11119663 11868707 12545594 13281856 14259812 15129789 16035783 17219534 18699338
6998 18699338 20582666 23056705 25547311 27898459 29676359 30466257 30301027 29327827 27792561
6989 27792561 25816008 23534020 21203591 19167771 17305327 15575350 14297217 13169887
6981 13169887 12175254 11157336 10264988 9377320 8713392 8241768 7715016 7201679 6791033
6972 6791033 6566064 6380449 6299532 5927468 5771389 5530841 5385087 5314026 5253852 5049984
6962 5049984 4875284 4825940 4739958 4729328 4727278 4597963 4514787 4508060 4481664 4478439 4384274 4341784
6950 4341784 4217687 4120749 4212286 4060576 4019125 3902824 3748716 3525715 3608508 3680603
6940 3680603 3595101 3512893 3354042 3355903 3352084 3251686 3233395 3212702 2929999 2687751 2648270
6929 2648270 2581887 2669468 2723323 2523332 2505142 2521063 2402926 2337476 2243001 2191145 2310045
6918 2310045 2311578 2167521 2127468 2004677 2096503 2146225 1979835 1815848 1719352 1788365 1736019
6907 1736019 1611963 1497642 1331672 1441731 1637014 1534882 1544653 1458636 1493016 1499488 1587104
6896 1587104 1497506 1336702 1482816 1540489 1499424 1627688 1578802 1586594 1622178 1834045 1774754
6885 1774754 1756703 1728977 1725689 1688304 1742277 1717514 1722704 1894849 1920511 1804968 1860796
6874 1860796 1843219 1847493 1861674 1859791 1701895 1724471 1818406 1782801 1970634 1836102 1755415
6863 1755415 1652175 1655375 1596653 1584068 1658575 1799663 1684137 1759601 2028843 2079489 2118620
6852 2118620 2212619 2151470 2181029 2223340 2308494 2313542 2132378 2261671 2353342 2267056 2052022
6841 2052022 2275742 2311896 2208247 2190968 2126407 2071886 1884127 1794862 1842143 1879835 1927421
6830 1927421 1930017 1913279 1867372 1570827 1492739 1366885 1306602 1328536 1395378 1415730 1372435
6819 1372435 1339080 1301440 1191229 1166971 1191091 1290795 1190222 1275240 1428821 1308229 1174955
6808 1174955 1237457 1272109 1310747 1277684 1361450 1352672 1327200 1273946 1256023 1399094 1479448
6797 1479448 1537722 1503168 1487821 1519507 1493819 1485101 1522441 1786686 1781154 1599344 1461863
6786 1461863 1474153 1456571 1295810 1528682 1356938 1165010 1110771 1122310 969873 786161
6776 786161 835149 897337 848002 759883 705113 736367 725502 720962 592985 494619 599528
6765 599528 577991 713277 751469 652236 618765 735717 639369 538504 540968 446352 455295
6754 455295 510409 521551 595479 607304 622545 568677 591320 614053 441085 456426 426691
6743 426691 380791 352099 361185 248728 321112 280530 417948 621065 651230 573077 507842
6732 507842 457314 430839 430805 411936 422384 409467 388706 310399 255508 268992 278160 319126
6720 319126 284200 182890 363863 475218 421835 440643 492321 504859 557298 425571 537123
6709 537123 533964 443956 488964 575185 523403 660769 918248 933945 869861 934301 1012198
6698 1012198 727604 854397 897322 710621 671430 387123 453673 562055 633286 632131 505034
6687 505034 447604 386896 514352 510637 611573 688833 737106 493805 359283 529219 665718
6676 665718 533410 486052 485444 456198 514303 531500 363473 271642 548525 706428 582996
6665 582996 458416 625048 497886 504538 670812 698579 595476 535468 522403 441979 481438
6654 481438 438603 487868 495681 496662 302865 629997 619828 516406 423017 500025 640213
6643 640213 439098 440808 363682 309161 346926 365110 338502 463736 550174 458668 575056
6632 575056 402519 220416 234797 337047 355374 393020 475512 446048 557150 320060 230521
6621 230521 180058 109715 200944 582319 481532 464862 438807 315038 392653 420148 360344
6610 360344 283099 345818 412990 379282 265512 271529 296769 244511 298726 301591 317681 486154
6598 486154 409750 448164 480719 499674 514935 510205 593754 458875 379866 394404 523226
6587 523226 379532 454201 596310 678891 564553 431602 344159 477524 491346 443427 331195
6576 331195 474165 522172 461304 480520 317218 373809 418754 257327 277933 217628 147435
6565 147435 309564 280270 406137 397829 267367 428637 436133 275632 323773 550556 681229
6554 681229 687350 422047 415107 520854 324062 427973 380149 524414 600681 443783 362078
6543 362078 266777 367868 463736 441334 502663 582582 515854 379123 539305 579378 606430
6532 606430 564594 510892 524401 608497 481866 481996 440797 422470 410095 483814 540438 523861
6520 523861 510495 491079 536370 520433 499304 472560 369795 320715 303331 448004 497751
6509 497751 472560 354341 364928 389550 354348 396108 370277 527600 429731 405038 483669
6498 483669 625592 579938 584549 540625 498073 406236 440943 435504 382617 351143 327173 508529
6486 508529 376050 356374 296696 123484 213458 297469 410678 500102 476081 468224 350428
6475 350428 294272 435834 408619 359015 500929 566190 586060 619284 647733 445989 349784
6464 349784 532043 619967 430852 507002 660066 557884 486856 343934 330931 477125
6454 477125 483526 579574 634208 586574 533476 598110 449695 345371 435185 427170 537615
6443 537615 575942 700411 782440 734662 580727 441519 472017 622268 687723 727112 714632
6432 714632 608578 640258 514652 524830 509247 469790 578275 439885 317581 389526 584385
6421 584385 541490 509397 541251 710285 634372 657087 693816 540511 581966 481607 477216
6410 477216 338241 345204 410987 403384 465498 580184 747926 711936 659177 884522 771657
6399 771657 861856 871649 746384 789605 771110 940226 1017401 1052970 996721 1073488 957525
6388 957525 918462 870023 829881 820041 825349 864519 794920 786155 631302 628073 760056 647685
6376 647685 658700 785664 899785 687683 670282 658817 712722 829729 845305 924631 908504
6365 908504 715796 771741 808657 778410 711211 704646 622048 784321 810001 788991 801046
6354 801046 851528 956481 894407 974902 1036729 1034972 970565 1022807 1017387 1010310 899854 945981
6342 945981 908603 840608 895411 910422 990498 894792 936625 1127895 966600 1024396 1021620
6331 1021620 1148925 1060437 1020533 970558 1006968 964622 1133984 1090277 1073471 951951 986022
6320 986022 1138297 1120697 953795 949018 1121202 1130907 1166813 1040042 1092466 1223499 1165259
6309 1165259 952238 1171790 1124782 1032109 1077285 1068792 961073 1051979 1127272 1270863 1246778
6298 1246778 1135001 1244819 1445249 1409342 1357811 1396261 1248539 1158008 1249734 1327207 1316984
6287 1316984 1233070 1212940 1297657 1425892 1438721 1248165 1221530 1244597 1165516 1255693 1250582
6276 1250582 1348200 1153919 1131508 1333049 1388918 1652185 1541624 1365359 1356461 1248518
6266 1248518 1136996 1209727 1476592 1283171 1325681 1425653 1424528 1317380 1301148 1327871 1255361
6255 1255361 1404060 1385242 1450266 1477913 1341853 1485681 1470271 1380472 1486087 1447427 1528013
6244 1528013 1489598 1627775 1565521 1409324 1332576 1455910 1430534 1252076 1299628 1453994
6234 1453994 1415487 1403046 1345683 1434243 1484473 1492744 1484624 1544431 1524252 1516552 1459104 1549403
6222 1549403 1526120 1509665 1511465 1627522 1666542 1599664 1505223 1504385 1570278 1562381 1538661 1634680
6210 1634680 1757497 1750038 1643284 1679538 1749044 1690419 1824925 1876208 1860714 1871029 1789799
6199 1789799 1849012 1943254 1852443 2034589 2049414 1966834 2007286 1986064 2012118 1924499 1833163
6188 1833163 1942029 1944169 1955214 1984867 2034093 2080398 2114908 2218968 2266620 2229475 2213294
6177 2213294 2312794 2217423 2147925 2504940 2483097 2454504 2425809 2352907 2406114 2528598 2569854
6166 2569854 2653509 2650917 2709335 2857081 2773518 2644954 2782981 2806223 2798704 2819566 3004538
6155 3004538 3093227 3039152 2935851 2995623 3195402 3069156 3113460 3333923 3211122 3185552
6145 3185552 3215239 3164487 3293048 3327413 3334230 3392999 3479703 3600086 3504213 3601483 3595003
6134 3595003 3583430 3432030 3514301 3593816 3681755 3857482 3854801 3893061 3938719 4003568 3989791
6123 3989791 4082854 4019829 4074029 4105234 4170813 4221816 4389049 4489729 4492313 4498392 4433328
6112 4433328 4569173 4791823 4831006 4805827 5002132 5088388 5035204 5022882 5123824 5309720
6102 5309720 5449607 5676488 5830442 6007442 5987832 6079633 6470089 6476969 6629858 7017749
6092 7017749 7173413 7299903 7650033 7965936 8236390 8459774 8882171 9342135 9772814 10480141
6082 10480141 11092109 11699923 12568549 13520841 14721938 16022706 17397520 18853397 20602395
6073 20602395 22901812 25647612 29066238 32178820 34443323 34962461 33707378 31850979
6065 31850979 29771249 28441212 27922735 28020287 28503647 29672664 31630874 33562161 34692911
6056 34692911 34369607 32489356 29187348 25787484 22993425 20998323 19550779 18348299
6048 18348299 17113362 16214028 15481473 14933374 14421438 14249124 14001455 13865933 13951609
6039 13951609 14097958 14139060 14370479 14610143 14962244 15438210 15831015 16534461 17279633 18161705
6029 18161705 19124331 20261196 21726888 23175607 24734493 26624239 28655851 31240059
6021 31240059 34544810 38682859 42997537 46565166 48561253 48233430 45695958 42798472
6013 42798472 40484995 39201418 38780102 39125811 40429657 42378738 44827012 46963142
6005 46963142 47707230 46111482 42362674 37400183 33221881 29946527 27458667 25449209
5997 25449209 23680182 22126274 20864253 19667570 18598306 17788698 17305200 17052226 16606726
5988 16606726 16162307 16035329 16018899 15858939 15870493 15610116 15549098 15630809 15540172 15416713
5978 15416713 15360520 15431247 15391728 15535022 15436406 15445671 15301847 15292369 15589577 15464264 15464287
5967 15464287 15550916 15643039 15758352 15825615 15736276 15758040 15692787 15867901 15823682 15765515 15602105
5956 15602105 15584049 15575834 15635940 15721509 15592382 15814368 16116320 15840202 15852022 15874474 15827579
5945 15827579 15843370 15969777 15868111 15905136 16031652 16041511 15947822 15894533 16047975 15992114 15890200
5934 15890200 15956583 15928564 15874599 15904823 15896393 15976431 15970715 15878994 15687044 15587726 15623659
5923 15623659 15535344 15495956 15298107 15206899 15110020 15021191 15095948 15081793 14863231 14951469 15017901
5912 15017901 14981151 14889028 14817644 14903569 14828355 14761928 14817512 14793807 14807606 14832907 14870942
5901 14870942 14958258 14837731 15019335 14947122 14851714 15055592 15116248 14948221 15007722 15086681
5891 15086681 15116643 15124343 15081034 15132048 15153329 15169587 15354769 15412351 15531321 15712962 15803495
5880 15803495 15936639 16267306 16338004 16583251 16957233 17115948 17215528 17396069 17636263 17947050
5870 17947050 18142737 18444454 18608160 18877581 19240231 19535655 19815928 19998880 20152864
5861 20152864 20447278 20838000 21167489 21503094 21876531 22223011 22654321 23131996 23482547
5852 23482547 23963613 24710582 25371490 26194264 27041641 28011592 29006442 29976821 31159578
5843 31159578 32406284 33621311 35253397 37149658 39097807 41177005 43260001 45533152
5835 45533152 47945122 50393594 52823635 55316976 57557411 59854285 62128812 64317541
5827 64317541 66626664 68801431 70614311 72086905 72966949 73352749 73434570 73442220 73499548
5818 73499548 73729402 74279623 75047546 75573225 76022962 76136802 75742605 74878506 73662645
5809 73662645 72503901 71535695 70460164 69601755 69171877 68718588 68408570 68099272 67802525
5800 67802525 67326071 66885816 66512642 66288328 66462279 66591042 66665136 66874249 67071940 66765750
5790 66765750 65576815 64135352 62260421 60044958 57418692 54366201 51373144 48737579
5782 48737579 46272692 44106950 42175216 40540728 39096179 37595204 36293617 35213846
5774 35213846 34437468 33656777 33055346 32439811 31895326 31769167 31316930 30777530 30526341
5765 30526341 30302171 30035820 29784440 29542520 29456165 29467096 29236436 29254163 29290667 29272894
5755 29272894 29576657 29908440 30265262 30716524 31295539 32028403 32847266 33897289 35015137
5746 35015137 36213529 37897299 40105248 42858228 46011601 48633719 49741470 49227577
5738 49227577 47822725 45666643 42943333 40250274 38202926 36610004 35208726 34073811
5730 34073811 33495616 32799166 32383003 32194073 32449685 32982957 33670802 34433554 35399887
5721 35399887 36587770 37962747 39421623 41245238 43512102 46704437 49995499 52111506
5713 52111506 52604093 51790118 49927034 47295014 44259882 41203302 38772147 36679409
5705 36679409 35069242 33815401 32756148 31932927 31269845 30876072 30598652 30574051 30822182
5696 30822182 31308590 31962678 32543761 33756231 35328399 37625976 39640731 40979383 41150027
5687 41150027 40250563 38901182 37060519 35073927 33000706 31404530 30403249 29673970
5679 29673970 28881473 28337635 27993188 27858828 27893237 27867320 28213467 28620625 29098861 29799730
5669 29799730 30514096 31399781 32604785 34220809 36362056 38667583 41111604 42278097
5661 42278097 41955613 40895089 39260858 37172601 34803295 32856615 31288215 29899678
5653 29899678 28972586 28017088 27220221 26708926 26128427 25600269 25403834 25219893 24990032
5644 24990032 24995595 25036095 25079738 24935905 24990843 25284925 25559612 25705656 25719183 25957113
5634 25957113 26230968 26251792 26391459 26619432 26794716 27139113 27313519 27469904 27593725 27633063
5624 27633063 27741334 27952923 28287155 28465616 28559939 28607419 28789897 29097059 29201123 29417464
5614 29417464 29529744 29693702 29850618 30118066 30200829 30362306 30426819 30459557 30510129 30449877
5604 30449877 30430043 30284279 30271701 30151244 30154144 29939967 29855101 29938773 29962504 29840669 29845535
5593 29845535 29878702 29821408 29862010 29900702 29782273 29676769 29653165 29525372 29415277 29277523
5583 29277523 29058336 28861934 28625442 28521656 28444826 28401398 28257091 28132331 28041847 27884098
5573 27884098 27658970 27429321 27375253 27291018 27131755 26915055 26823682 26508268 26439788 26298009
5563 26298009 26087365 25967548 25892495 25711843 25751821 25902948 25756082 25617982 25406869 25492893
5553 25492893 25660185 25715387 25713413 25601845 25549229 25648661 25665843 25583095 25540334 25689026 25691706
5542 25691706 25662653 25787248 25973569 26013772 26079402 26281554 26536239 26786126 27379868 27979663
5532 27979663 28346768 28770668 28957180 29068942 28808286 28426192 27986881 27503438 27275059
5523 27275059 26902166 26742885 26625521 26625143 26763937 26684385 26802812 27216517 27946587 28734138
5513 28734138 29334980 30158541 30489342 30418820 29724658 28725060 27400837 26343779 25589364
5504 25589364 24799326 24149794 23717357 23332074 22748557 22389352 22172815 21794734 21527463
5495 21527463 21468678 21465275 21381611 21198388 20783465 20766502 20779520 20650601 20720609 20545204 20543061
5484 20543061 20494347 20535142 20395308 20217971 20278367 20488155 20470347 20481303 20376359 20386263 20464747
5473 20464747 20524158 20592746 20497268 20531099 20674954 20707106 20805251 20847731 20940008 20952908 20815987
5462 20815987 21065351 21238940 21390791 21464600 21376906 21490273 21525071 21586499 21625975 21735982
5452 21735982 21899595 21981200 21994932 22028627 22212290 22468818 22770874 22948834 23019787 23050827
5442 23050827 23026696 23111035 23372725 23519064 23750492 23992745 23951287 24025303 24259811 24540359
5432 24540359 24741606 24938169 25093599 25132463 25050901 24939604 25090478 25260009 25387415 25464483
5422 25464483 25534756 25543626 25625860 25735754 25841835 25937562 26137799 26480365 26544504 26679355
5412 26679355 26725263 26834207 26772533 26679252 26575253 26674623 26619830 26565523 26576930 26544139 26625913
5401 26625913 26691362 26745634 26714160 26871023 26751169 26889796 27292662 27500244 27570985 27622480
5391 27622480 27688648 27709024 27602657 27621291 27686083 28012412 28248504 28345104 28579855 28751843
5381 28751843 29007634 29256045 29653889 29978474 30198602 30263749 30533048 30658058 30962971 31229830
5371 31229830 31573808 31772824 31932876 31981928 32003315 32089196 31912800 31776985 31678322 31397263
5361 31397263 31213078 31182278 30906906 30817192 30894503 30875012 30878695 30793954 30391903 29924576 29498990
5350 29498990 29051546 28519435 28174920 27667812 27415374 27097445 26564449 26275230 26028202
5341 26028202 25688323 25344495 24967125 24529107 24077013 23749237 23272584 23064320 22825777
5332 22825777 22484681 22264918 21877485 21680534 21443499 21201674 21172288 20953286 20808084 20561728
5322 20561728 20308956 20335537 20307223 20215802 20230855 20164717 20038803 19938624 20055891 20067200
5312 20067200 20231363 20249468 20127844 20363100 20472925 20472526 20750720 20555033 20551390 20796343
5302 20796343 20907716 20882162 20809246 20935616 20769013 20593997 20568953 20622866 20616278 20546853 20643870
5291 20643870 20822077 20871243 21080038 21341323 21430192 21513695 21745278 21882020 21763013 21953697
5281 21953697 22160389 22359132 22383144 22544187 22739609 22892310 23089852 23050331 23199335 23368100
5271 23368100 23464524 23500455 23537141 23645464 23762114 23828920 23879796 23950726 23990031 24182216 24388556
5260 24388556 24562512 24623828 24606532 24746561 24764059 24945316 24900399 24989815 25042504 24935291
5250 24935291 25028955 25249548 25265117 25348344 25472105 25483383 25637818 25784399 25736336 25959891
5240 25959891 26203950 26090559 26079929 26458068 26507370 26546822 26629824 26932256 27177772 27405317
5230 27405317 27620626 28058452 28590136 29002547 29209891 29054983 28743136 28528344 28278169
5221 28278169 27987971 27774952 27409419 27348939 27292542 27184414 27063237 26788677 26789677 26816866
5211 26816866 26872159 26990517 26851871 26843992 26893277 26675746 26589036 26511831 26594146 26739721 26634936
5200 26634936 26717536 26634540 26613686 26597310 26768466 26740234 26899302 26998763 26926362 26947500 27036254
5189 27036254 27229943 27248224 27712468 27972856 28243362 28672727 29070566 29695418 30297626 30745011
5179 30745011 31417684 31622319 31763327 32030355 31959899 31682786 31474377 31423439 31374292 31262613
5169 31262613 31376393 31511110 31478401 31462005 31448010 31683158 32113308 32589840 32769627 33101995
5159 33101995 33718581 34338086 34879159 35561405 36379096 37289643 38407088 39839247 41069168
5150 41069168 42013704 42712274 43230386 43543222 44072976 44788598 45733395 47200066 49081172
5141 49081172 51329373 53842291 56155660 57950073 59010065 60021469 60721181 61713800
5133 61713800 63331756 65382645 67211195 69343425 71620467 73955858 76565570 79469751
5125 79469751 82417627 85121499 87842052 90867901 94200880 97593218 101141884 105262779
5117 105262779 110041151 115402537 121059717 126021136 129577903 131235637 130882304 129422000
5109 129422000 127414332 125389531 123266493 120141281 116131385 111884763 107829720 104377669
5101 104377669 101524141 99621761 98279903 97162480 96760145 97056933 98627804 101088847
5093 101088847 103776435 105806359 106882128 106705356 105712168 104054926 102345477 100556618
5085 100556618 99052568 97320018 95768634 94492901 93431106 92795579 92450886 91918794
5077 91918794 91445013 90582387 89283823 87838640 86305635 84215099 81586613 78944626
5069 78944626 76744327 74904800 73099533 71703606 70898963 70589241 70309309 70608834 71437266
5060 71437266 72797326 74741438 77085771 79805353 82846307 86484899 90333813 94024646
5052 94024646 97791902 101098349 103141444 104302347 105169179 104918411 103229700 101111731
5044 101111731 99254891 98002663 96866163 95727085 94325065 93011272 91759071 90587728
5036 90587728 90820778 92456213 95162368 98724526 102516374 106120311 110197862 114161872
5028 114161872 117907253 120856502 123238942 125232039 127631422 130547203 133329275 135119068
5020 135119068 136596554 137679057 137156282 135764553 133540172 130330869 126595004 122853583
5012 122853583 118226428 112802165 106352865 99567394 92949093 87294433 83218860 80625199
5004 80625199 79396041 78806683 78615028 78265420 77296039 75496253 73498863 71199710 68859070
4995 68859070 66936882 65900168 65233774 64260476 62603559 60964089 59540804 57890934
4987 57890934 56784182 55649444 54311519 52400543 50262346 47901217 45961001 44506456
4979 44506456 43687740 43344297 43126312 43048057 42606471 41254169 39618126 37635708 35453833
4970 35453833 33646247 32123178 31033078 30010702 29067817 28058330 27197475 26335804 25705805
4961 25705805 25168591 24784802 24302491 23759182 23190889 22824129 22676570 22442945 22095630
4952 22095630 21905557 21729331 21569500 21345656 21349412 21029091 21017622 21127830 21095602 21047559
4942 21047559 20722550 20520058 20534916 20702631 20679948 20562654 20427180 20436996 20444876 20382020 20366039
4931 20366039 20584826 20800284 20716507 20935811 21161817 21325114 21560791 21763364 22050833 22528102
4921 22528102 23061476 23702432 24374845 25136228 25968625 27168048 28713923 30456166 32422519
4912 32422519 34857470 37812281 41066173 44455876 47803403 50691616 53196716 55551934
4904 55551934 56033099 53751166 49378110 44376776 40092362 37039208 34924663 33122504
4896 33122504 31539633 30446427 29884518 29651215 29470805 29746590 29959007 30604667 31869865
4887 31869865 33450351 34826350 36151198 37014484 37139009 36856220 36848250 37362143 38423079
4878 38423079 39657819 40864671 41278403 41619153 42825673 44185316 46241795 49224477
4870 49224477 52481091 56411853 60505976 65121654 69993686 74077239 75871026 72539852
4862 72539852 66804782 62974236 60882230 59863954 59097873 57830603 56771199 56163130
4854 56163130 56357879 57679193 60546097 64320984 67396633 67346513 62794712 56662281 51897098
4845 51897098 48089575 44664300 41324594 38642908 36359526 34650048 33725082 32891362
4837 32891362 32052882 30983222 29724371 28516517 27760242 27291968 26929464 26615348 26321724
4828 26321724 26139819 25940476 25731365 25842047 26034507 26116945 26334117 26693054 27006900 27520454
4818 27520454 28272357 29113056 30240145 31556730 32967043 34880258 37240740 39577852
4810 39577852 41543294 42358815 42584793 42553114 42710784 43022252 43845405 45574553 48164898
4801 48164898 51299750 54026515 55825815 56774280 57537510 57895952 58348449 58607928 58456633
4792 58456633 57704569 56669718 55571408 55188021 55617195 57409164 60365705 63188732 65861821
4783 65861821 68202745 70639804 73413026 76936391 80569100 82977178 83157627 82286224
4775 82286224 80168033 77309920 74982917 73313791 72264846 71273267 69903899 68534562
4767 68534562 67598870 67046413 66958517 67165446 67581138 68325422 68995971 69848569 71134228
4758 71134228 72732433 73896511 74266444 74219954 74008566 73591979 73807624 75157995 77548883
4749 77548883 80628819 84228353 88518025 94222876 102509499 113478259 126667360 139138726
4741 139138726 147428253 150358311 147482196 140283989 130501010 119521773 108600051 98901066
4733 98901066 91458984 85874862 81356430 77864235 75447870 73940627 73668104 73370940
4725 73370940 72162532 70014468 67267740 64185783 61066294 58423909 56588591 55484209
4717 55484209 54917164 54863101 55104002 55599814 56618484 58204471 60206990 63134309 66918802
4708 66918802 71461904 76299932 80605006 83831133 85355906 84311992 81176293 77232265
4700 77232265 72981805 69235185 66483453 64561127 63557425 63374870 64097699 65356348
4692 65356348 67325556 70094357 73294989 77771019 83728282 90856721 98515257 105913826
4684 105913826 112490141 119140700 126628329 135361029 143683250 149481128 152923948 152191238
4676 152191238 144733720 133050605 120102422 106704339 94060726 83595022 75251414
4669 75251414 68194801 62117601 56694854 51808543 47681925 44177093 41225006 38977720
4661 38977720 37141814 35381933 33919431 32623547 31503538 30449213 29680745 28753068
4653 28753068 27644698 26953792 26412977 25782814 25087191 24488947 24010038 23496318 23086713
4644 23086713 22645846 22302616 22012105 21595104 21331469 21219202 20932119 20649349 20270698
4635 20270698 19890193 19567370 19315640 19081181 18761339 18286361 18120624 17877009 17468611
4626 17468611 17055027 16855514 16837745 16612773 16234726 16053815 15851291 15641910 15532207 15119424
4616 15119424 15090646 14988039 14751399 14777535 14699352 14501238 14483098 14401018 14514380 14534819
4606 14534819 14382845 14137578 14006749 14129031 14186020 14164277 14170378 14117220 14211020 14209311 14302776
4595 14302776 14515236 14446233 14486594 14548036 14679205 14807916 14929907 15101244 15159799 15330870
4585 15330870 15312683 15553400 15866464 16315133 16786446 17340371 17827990 18593877 19587525 20565064
4575 20565064 21726831 23030632 24270387 25816027 27329183 29221200 31032355 33458883
4567 33458883 36810824 40831826 45130494 48854238 51013714 51560718 50897579 49151685
4559 49151685 47263669 46063391 45725970 46281713 48065640 50785299 53773148 55924510
4551 55924510 56592114 55824452 54073946 51435627 48992201 47501898 47277936 48191352 49699234
4542 49699234 50861441 50901813 49683407 47738419 45350621 42921671 41110044 39970608
4534 39970608 39663943 40229438 41278670 42595690 43314948 42885208 41127034 38641421 35670631
4525 35670631 32741096 30284619 28280612 26725399 25310373 23839295 22742165 21582922
4517 21582922 20866412 20092519 19445738 19044416 18613243 18301875 18099734 17968194 17648059
4508 17648059 17429315 17333505 17304987 17280091 17259228 17071055 16851871 17017236 17093551 17138481
4498 17138481 17346383 17423385 17459811 17719374 18097277 18197410 18428716 18845714 19429642 20100787
4488 20100787 20847638 21575515 22342051 23366928 24541207 25800729 27423960 29311602 31484256
4479 31484256 33941749 36451469 39407035 42998139 47615843 53432823 59536309 64687368
4471 64687368 67443579 67607237 65372180 62179791 59915094 59775616 61496441 64835635
4463 64835635 68813557 71355071 70836524 67912224 63156724 58214339 55134180 53504527
4455 53504527 53162770 53951595 55741994 58191263 61066041 63290899 64259922 63715039 61851398
4446 61851398 59367270 57627270 57057390 57709215 58969779 59929745 59408337 56588623 52061923
4437 52061923 46617257 41250854 37205211 34330072 31945935 29993506 28411780 26889404
4429 26889404 25563303 24642844 23704274 22621506 21543573 20819346 20067455 19201883 18403382
4420 18403382 17761550 17241693 16774352 16189245 15728092 15188633 14839952 14646099 14367255
4411 14367255 14029516 13763837 13542726 13340012 13045905 12500991 12210216 12171975 11783700 11585943
4401 11585943 11488517 11198150 11083146 11041157 11149982 10917686 10756905 10589936 10520494 10255073
4391 10255073 10162234 10055903 9853186 9692105 9493460 9412821 9288475 8952570 8785415 8681201
4381 8681201 8684009 8529200 8516641 8443600 8405297 8431342 8315499 8332220 8270834 8315329 8209851
4370 8209851 8113461 8063400 8091929 8060149 8076495 8083737 8010936 7722896 7753034 7769525 7536672
4359 7536672 7406059 7369303 7191563 7035838 6961461 6930138 6987437 7001434 6923130 7024077 6955195
4348 6955195 6748258 6593399 6608187 6586883 6615048 6696980 6542432 6437364 6486602 6576377 6614514
4337 6614514 6527455 6421380 6451578 6449899 6301724 6452887 6484616 6578462 6652745 6599172 6534290
4326 6534290 6532281 6718824 6949746 6810149 6849237 6956277 7085959 6954436 6737037 6637539
4316 6637539 6504323 6387775 6404741 6599820 6519107 6532532 6514101 6612802 6696488 6668565 6773566
4305 6773566 7044762 7090169 7229335 7519926 7745244 7811964 7978528 8040770 8055247 8078817
4295 8078817 7997245 7879408 7894787 7913578 7654292 7533648 7612902 7587001 7701171 7588710
4285 7588710 7571445 7629224 7597066 7611310 7718184 7742286 7696214 7886019 7935508 8124916 8076737
4274 8076737 8001106 8076493 8263534 8265477 8304817 8372834 8478504 8581804 8892965 9096844 9341800
4263 9341800 9499769 9612490 9781026 9792672 9840700 9965658 10208164 10459775 10422282 10352927
4253 10352927 10544834 10601120 10795988 10852463 10929072 11118247 11224626 11529655 11856804 12047210
4243 12047210 12349527 12492961 12888119 13198582 13383831 13550456 13708415 13801736 13936876 13892409
4233 13892409 13921272 14113615 14280802 14348178 14442712 14448206 14624974 14686762 14914762 15053300
4223 15053300 15169294 15209369 15320476 15449816 15533116 15506519 15608709 15816259 15829676 15866764
4213 15866764 16093981 16392628 16780622 16996033 17254979 17494507 17788620 18124807 18421565
4204 18421565 18733458 19066581 19297106 19603294 19975326 20229136 20410372 20756706 21041435
4195 21041435 21207284 21529009 21847991 22171554 22464806 22780711 23108569 23830709 24431999
4186 24431999 25153161 26083431 27010672 27947472 28603132 29443300 30509783 31560112 32329745
4177 32329745 33542343 34958594 36619043 38266459 39807317 41812877 43648177 45652977
4169 45652977 47810563 50248734 52808707 55614990 58321959 61374258 64392844 68153291
4161 68153291 72195659 76794071 82355407 88802383 96051991 104387494 113618777 124181497
4153 124181497 136445877 150847456 167506059 186057228 206431895 229139873 254141549
4146 254141549 283571843 319800505 364708838 416305824 468203111 508102042 523888874
4139 523888874 510711101 474737219 427878048 381537608 341188442 308278345 283242840
4132 283242840 264536569 251072561 240426873 230226613 218019980 202675226 184980260
4125 184980260 167016875 151013941 138175648 127394098 117999770 109470465 101763324
4118 101763324 94686739 88413580 83052235 78535682 74486583 71375040 68642865 65948796
4110 65948796 63569918 61520833 59669256 57940915 56263653 54667994 53291993 51974949
4102 51974949 50575188 49235782 47909771 46722261 45411802 44223116 42828497 41444120
4094 41444120 40211085 39225798 38178122 37088795 36113178 35095261 34062111 33079803 32192696
4085 32192696 31399603 30463835 29473514 28542790 27909864 27095913 26670470 26147889 25740213
4076 25740213 25385742 25085945 24755518 24538350 24212488 23725244 23392294 23070800 22986882 22844504
4066 22844504 22578766 22284699 22204659 22259245 22034310 21944285 21763611 21600319 21650251 21705622
4056 21705622 21996085 22505077 22893292 23017453 22702487 22405497 22111194 21491418 20770225
4047 20770225 20052160 19400136 18885980 18452990 18031953 17577293 17153977 16948867 16598114
4038 16598114 16299862 15878423 15729736 15506514 15204554 14942920 14899899 14652288 14526720 14421110
4028 14421110 14358170 14241604 14173658 14100549 14090737 14184924 14043997 13779045 13635349 13524057
4018 13524057 13331600 13160880 13008068 12983799 12830858 12421242 12390148 12265111 12257108 12026240
4008 12026240 11811233 11692089 11675163 11348989 11246787 11378725 11276825 11191556 11185395 11055780
3998 11055780 10837294 10681037 10575544 10401979 10200932 9909866 9984220 9993186 9587731 9562093
3988 9562093 9385182 9279702 9089595 8954594 8875118 8768769 8709220 8525614 8290578 8293872
3978 8293872 8237993 8411634 8301977 8093262 8066387 8131334 8141308 8103488 8166992 8078453 7898617
3967 7898617 7781044 7656411 7456953 7293999 7245654 7233554 6979452 6642628 6486330 6175841
3957 6175841 6085850 6082381 5942196 5767174 5650927 5439615 5273917 5152927 5087627 4904133
3947 4904133 4791552 5025297 4922645 4648404 4688826 4546470 4435294 4214077 4254998 4334127
3937 4334127 4347809 4317311 4380970 4209550 4051689 4167294 4028730 4031934 3873868 3869339 4030414
3926 4030414 4182414 4055277 4044955 4071337 3988031 3846576 3936931 3889624 3775800 3757244 3559664
3915 3559664 3448567 3271966 3212834 3252083 3223414 3337391 3242984 3279351 3295872 3059206 2950989
3904 2950989 2978703 3107075 2911065 2943686 2930569 2909459 3080988 3141953 3215752 3194307 3069004
3893 3069004 2924527 2912490 2835454 2914979 2865000 2928536 2961085 2970940 2896885 2695313 2625746
3882 2625746 2687423 2710280 2758150 2708963 2556977 2610287 2790320 2849686 2943661 3121730 3025412
3871 3025412 2898303 2915972 2821764 2871096 2853313 2850789 2839116 2995778 3160104 3257323 3231004
3860 3231004 3218089 3230969 3315668 3549905 3697911 3927817 4090149 4429867 4859779 5003871
3850 5003871 4997453 5212628 5143994 4909145 4759092 4629479 4580553 4693606 4538956 4419813
3840 4419813 4287004 4213095 4085203 3835084 3683535 3447477 3218442 2993096 2951168 2840331
3830 2840331 2767388 2711902 2653796 2669968 2561655 2552342 2400995 2476814 2450831 2393105 2259522
3819 2259522 2263626 2144916 2054144 2048277 2016691 2005261 2118382 2104919 2043435 1945872 1745143
3808 1745143 1697776 1745424 1781017 1634748 1679570 1828734 1826873 1753312 1845680 1828352 1789585
3797 1789585 1711859 1733986 1808262 1811356 1681968 1675545 1754968 1744129 1676430 1718240 1653533 1646166
3785 1646166 1724131 1590062 1608902 1521505 1375870 1431738 1493624 1569981 1541200 1568289 1655069
3774 1655069 1537664 1584335 1632817 1551834 1555662 1456197 1522500 1368286 1360641 1449004 1536027
3763 1536027 1620134 1622099 1712738 1726980 1657285 1637011 1776977 1651470 1535567 1521576 1451813
3752 1451813 1359484 1442400 1382305 1290657 1228827 1134071 1340652 1120438 1110762 1194992 1260399
3741 1260399 1238671 1219378 1174002 1145995 1120187 1165346 1304682 1362153 1325170 1119391 1113156
3730 1113156 1178304 1257605 1226921 1197641 1134911 1333464 1398522 1305581 1306662 1179421 1141336
3719 1141336 1135676 1137177 1103552 1028001 901650 986941 1044266 1029687 1042563 956445 972924 1029446
3707 1029446 1050294 1165345 1309420 1190159 1120444 1112124 1217386 1184467 1129182 998283 1025408
3696 1025408 999297 1003786 1042736 939721 1005516 1075959 1082751 1043019 839946 885001 923052
3685 923052 868474 1026414 1168054 1086300 1114374 1137153 1107624 1029683 1044079 1040311 1141939
3674 1141939 994964 993696 1093157 1103351 1116344 1118149 1203230 1052494 891490 843252 946050
3663 946050 984879 1057419 927746 973074 1042797 1090152 1172461 1207854 1264466 1161139 1176859
3652 1176859 1228215 1109593 1107323 1082189 1089942 920114 1062367 1003952 1017829 1057052 955255
3641 955255 966364 957582 987465 918742 878824 886323 863922 777848 829048 884181 1021099 1092340
3629 1092340 812111 764952 926788 1020965 972946 918802 872203 1080585 1072019 1063453 1059146
3618 1059146 1122518 1156840 1289222 1182063 1018502 1211629 1315805 1255963 1114441 951838
3608 951838 1074952 1247685 1211379 1286957 1090101 1062462 1065292 1073681 1066183 1203333 1152183
3597 1152183 1066093 1146076 1182437 1179299 1178511 1346385 1220265 1078835 1172948 1115974 1023191
3586 1023191 1098363 1048936 1033446 1028012 948320 926575 922955 891519 871034 929150 908603 866955
3574 866955 790485 805256 791516 920416 875171 961276 1035885 918869 965864 937945 1035579
3563 1035579 1181008 991565 1074935 1239074 1216988 1122779 1060923 916639 996226 901899 994327
3552 994327 1146697 1095381 977416 1037337 1166792 1279004 1165876 1141680 1009977 1105088
3542 1105088 1118895 1102251 1120983 1075605 1223618 1069018 1113695 1062425 1093349 949962 1098579
3531 1098579 1092577 1036319 1130467 1010020 837430 868747 906841 999011 983787 921041 917953
3520 917953 1024375 988247 1009912 971541 972799 1039907 1036635 919961 958449 973530 970213 1095580
3508 1095580 1094542 1168507 1084432 1028826 881029 1069706 1090437 1068588 1034985 1076149 1102929
3497 1102929 1125158 1114580 1055662 1181424 1189733 1010848 1016746 1082653 1194997 1167793 1094124
3486 1094124 1062056 1083023 1088282 1057222 1065293 1122779 1262814 1434598 1329821 1127518 1152839
3475 1152839 1021719 1149525 1164938 1178955 1123063 966778 898479 1053805 1283007 1164951
3465 1164951 975619 1211734 1173059 1061390 1090467 1051994 1050232 1023467 954338 1228432 1145705
3454 1145705 1095746 1077896 1055346 1130796 1138032 1110731 1098966 1223694 1260512 1010410 863178
3443 863178 969436 1059575 1121482 1235338 1256600 1270352 1324350 1212798 1308145 1212221 1026483
3432 1026483 1238060 1367355 1262229 1157175 1352387 1279036 1351390 1500384 1369677 1526792
3422 1526792 1503487 1416672 1598768 1775848 1610772 1505361 1598247 1738849 1865784 1714019
3412 1714019 1546598 1470904 1498245 1536402 1586543 1500613 1343554 1436836 1531964 1597159 1501761
3401 1501761 1438215 1508075 1655028 1685025 1773676 1844526 1899045 1793702 1756893 1852156 1963572
3390 1963572 1935921 1962865 2023623 2229725 2372978 2654680 2968214 2994138 3028261 2832769
3380 2832769 2736875 2686536 2651317 2597450 2598829 2630405 2485449 2275306 2248264 2230743 2196750
3369 2196750 2250239 2115408 2109774 2012294 2135856 2223846 2331224 2433002 2363771 2287305 2304689
3358 2304689 2360576 2496624 2577047 2514344 2693855 2861698 2976591 3016464 2950541 2920050 2746088
3347 2746088 2576670 2489761 2433100 2457623 2485763 2560092 2631146 2555184 2631674 2567359 2598564
3336 2598564 2563777 2467580 2580271 2639760 2647535 2659614 2800606 2805080 2837602 2938051 2987307
3325 2987307 3026049 3013884 2919194 2982720 2983115 2938791 3127801 3059576 3117275 3402206 3753916
3314 3753916 3784011 3606316 3728282 3740623 3784926 3945965 4083947 4177504 4207680 4183403 4204167
3303 4204167 4186696 4205699 4190415 4274903 4393727 4453421 4499059 4533904 4788603 4794516 5052842
3292 5052842 5432114 5643921 5604199 5738844 6004415 6183283 6257222 6161228 6263135 6579995
3282 6579995 6886040 6992941 6975627 6801631 6923202 6635974 6553698 6541336 6439537 6406554
3272 6406554 6376130 6359191 6550695 6592278 6754994 6809663 6810257 7095683 7375184 7687415 8054495
3261 8054495 8252846 8450715 8685032 8662685 8699446 8860620 8838123 8832411 8913946 9131957 9128170
3250 9128170 9309064 9470703 9591886 9753262 9958745 9740825 9902526 10054337 9923967 10078371
3240 10078371 10354659 10717074 11011980 11381534 11525596 11968296 12297189 12531603 12951380
3231 12951380 13295724 13468121 13712387 13572266 13052960 12451130 11932356 11511178 11045376
3222 11045376 10570609 10176850 9639703 9408452 9333845 9281610 9283371 9121393 8998616 8842948
3212 8842948 8917728 9019556 8917617 8899101 8840070 8820221 8831977 8826600 8761851 8645574 8402883
3201 8402883 8444988 8480908 8318604 8207677 8344665 8410001 8248763 8064304 8064462 7984272 7757864
3190 7757864 7690344 7780065 7933004 8120742 8298081 8661100 8743837 8816208 8991787 9308606
3180 9308606 9690829 10018825 10194040 10553308 10645285 10790371 11172402 11426178 11798712 11908593
3170 11908593 11835984 11494008 11037046 10460077 9711108 9052686 8627445 7985823 7829018 7501215
3160 7501215 7044968 6977135 6864614 6857392 6693169 6551196 6787655 7054841 7081137 7045578
3150 7045578 7247425 7446314 7704658 7816946 8142696 8634871 9179656 9521310 9303608 9106846
3140 9106846 8638429 8027202 7476904 6763531 6125055 5757709 5367816 5035752 4902444 4801692
3130 4801692 4468684 4220341 3927440 3733275 3599900 3568152 3659818 3540975 3282192 3151473
3120 3151473 3175718 3045924 3046837 3120019 3012508 2889964 2793241 2670283 2646296 2624235 2402624
3109 2402624 2307378 2138989 2263981 2370341 2246853 2268174 2227725 2266433 2166920 2063064
3099 2063064 2035115 2129063 2182104 2002890 1874379 1750984 1826983 1780989 1750505 1796280 1713300
3088 1713300 1654299 1652617 1853808 1899430 1820963 1682921 1584401 1563825 1574086 1543327 1687741
3077 1687741 1747329 1608989 1372334 1439532 1525897 1415659 1399610 1511420 1373199 1302421
3067 1302421 1337842 1179164 1258501 1325100 1222939 1225415 1292764 1314626 1287805 1377191 1207007
3056 1207007 1363022 1389284 1159046 1083639 1047411 1151951 1051866 959518 928883 1027065 990382
3045 990382 981076 1011058 1054246 1172803 1157970 1162957 1045634 979936 1043781 1013944 1022504 939095
3033 939095 932290 1036897 1079202 1053758 953235 805552 891418 1051019 1082164 1041901 965109
3022 965109 972387 918482 723122 832428 879389 813456 704223 712479 851759 901816 1019314
3011 1019314 1046717 1019761 939645 994812 1095823 1207306 1162400 965414 881030 949594 913404
3000 913404 1045171 1135784 1220129 1091823 1066368 1131604 1170959 1202494 1127309 1143263 1183577
2989 1183577 1088093 895165 844263 793544 835707 904309 946656 972478 1048671 1029834 951118
2978 951118 975609 1019323 1001925 1069118 1127077 1151999 1171180 1129480 1114558 1257771 1189147
2967 1189147 1224631 1271950 1190148 1214531 1253421 1195455 1239981 1349751 1448955 1312549 1275848
2956 1275848 1404548 1397034 1279773 1308856 1361931 1244811 1096894 1143426 1245575 1260051 1429935
2945 1429935 1301612 1273085 1383920 1380682 1488447 1619496 1663155 1589853 1469939 1417809 1333886
2934 1333886 1431152 1519120 1633987 1733525 1757707 1769576 1697364 1785360 1880864 1952358 1863578
2923 1863578 1966611 1863575 1887167 2062583 1945207 1968748 2030381 2036642 2127021 2074062 2009874
2912 2009874 1981676 1989926 2143815 2333676 2280229 2300710 2088031 2209609 2402432 2238550
2902 2238550 2329921 2258600 2430437 2610837 2537095 2597129 2669798 2687592 2771262 2889831 2987044
2891 2987044 2908520 2878785 3018033 3043189 2969266 2918494 2712710 2671846 2622597 2399418 2429505
2880 2429505 2404041 2368282 2490004 2352956 2329194 2416250 2397736 2419505 2463485 2424847 2505237
2869 2505237 2584194 2593051 2564894 2541064 2455531 2396699 2427614 2510979 2602337 2454313 2414597
2858 2414597 2429395 2376004 2281887 2065759 2000159 2052415 2172361 1960491 1897631 1891007 1938137
2847 1938137 1903922 1825932 1939784 1978417 1720303 1521420 1472635 1726236 1767569 1466032
2837 1466032 1420080 1259694 1289136 1439315 1482003 1368011 1363168 1187718 1254260 1127526 1084931
2826 1084931 1192452 1047072 1146215 1205322 1058809 932763 881830 985276 993250 856990
2816 856990 804441 895129 829300 884992 975435 905254 785329 806635 889224 795404 825234
2805 825234 816999 880590 782533 724158 833600 872430 784825 725830 603961 635691 617095
2794 617095 513461 512524 621064 613908 533516 482537 422586 470468 438550 508472 682031 487557
2782 487557 442757 445119 443455 429366 286108 346776 444980 456120 435410 565301 585753 423599
2770 423599 379629 463323 553764 492477 531872 419007 324837 203010 356087 329284 335629
2759 335629 460086 437100 510765 518490 370156 439819 445685 375412 345931 372532 444161 412934
2747 412934 354759 327700 343449 56931 218636 133082 151646 143793 146018 238688 200876 132233
2735 132233 73233 30493 62427 31116 148609 105560 28649 -6544 32902 2357 119574
2724 119574 88811 79649 61889 107069 165961 141344 316807 82304 69841 -32876 -64556
2713 -64556 38894 -54647 -122856 -35186 -40375 2497 -27868 165563 131193 117444 292987
2702 292987 91062 22980 20080 93788 59990 240714 296438 246123 161907 104469 -32622
2691 -32622 58676 118979 215023 45944 46922 144005 56747 141040 69234 -17105 24245 54831
2679 54831 150610 152420 180473 91577 129574 76350 -78393 -167752 -122165 116376 -5162
2668 -5162 -75318 -129153 -110463 -196507 -232452 -138092 -12355 -38716 76457 154442 172595 266000
2656 266000 113091 -101595 -60246 212196 341549 235286 218251 147909 204490 33718
2646 33718 -39478 30328 159389 -17196 -40612 -3138 50507 -21581 -22885 21693 83065 47326
2634 47326 -7743 95966 140828 124319 -20035 77418 23015 -34825 -5694 -45658 30630
2623 30630 190890 230063 123949 169414 -72210 -41066 150733 99233 -20766 56455 73275
2612 73275 -55908 -19386 -42305 -116058 -120757 10523 -43585 -108943 -165481 -69951 -59338 51953
2600 51953 -5191 -68505 -112264 -62709 69932 124410 101556 7498 -27137 -96612 -43140 -60785
2588 -60785 88376 89502 33776 38251 -12763 70816 37478 -65794 8659 -18225 -88221 26524
2576 26524 61633 42918 -81081 147763 31573 -198556 -123441 92126 95355 12713 74309
2565 74309 -125410 -73308 143621 18420 -154841 -182710 -52643 -50646 -150788 43131 101481
2554 101481 18639 35088 41832 -71075 -21096 17020 53115 -26858 -44440 -38837 48447 -9469
2542 -9469 69879 16897 -189612 -23154 96264 -28313 -65907 -27853 6214 49399 54363
2531 54363 53230 13835 -21439 -69764 -69339 -187118 -181205 -246768 -257269 -206288 -154671 -129232
2519 -129232 -66054 -36679 -182946 -238975 -276009 -174377 -162500 -99596 -22697 -61471 -175047
2508 -175047 -281452 -298315 -281254 -153477 -35357 -107739 -81311 -20748 -113288 -72199 -219501
2497 -219501 -165841 -124435 -116989 -50587 80253 18500 73809 -5825 -134113 -187587 -135647
2486 -135647 -48839 -32502 -60734 -62978 -57962 -42947 -88775 22929 42306 -60269 29746 116774
2474 116774 -3519 -34056 -24684 31086 70525 36958 -122146 12666 -63536 -160963 45932
2463 45932 234894 106233 -26057 69953 -84032 -49983 -77912 49538 -70535 -303437
2453 -303437 -111244 108793 -43966 -191970 -202994 -143261 77422 130557 16963 4454
2443 4454 -52985 -130070 -206309 -81412 8459 -34770 -103786 -89973 -15068 92987 53501 -66390
2431 -66390 19890 -51065 -88106 -16944 -109837 -159293 -104474 116117 212301 181819 -20359
2420 -20359 -54423 76974 165523 -67370 -93649 -111330 -81660 44144 179994 137480 -13703
2409 -13703 -2325 42374 -46768 -133493 -70570 -38157 -164486 -174413 -265491 -119714 -78481 -67153
2397 -67153 69849 7290 -177643 -109341 -119222 -14971 9200 34086 116812 58193 145739
2386 145739 78014 21665 32179 72872 -67520 67952 13498 183493 72551 -21168 107498
2375 107498 -20103 31944 -44294 5420 21925 11998 145450 64235 -97844 -60586 -384
2364 -384 -19131 33495 210369 262123 196573 200068 226984 208461 132256 28647 113992 143797
2352 143797 188628 101592 6918 -42438 -90860 118714 105513 176812 42970 30333 146530
2341 146530 181803 120501 -90262 -197394 3012 9487 23443 74019 -81341 -25235 171777
2330 171777 129457 99891 41974 -6136 155879 176203 33271 8096 81138 81728 107342 134271
2318 134271 161120 65273 92728 206832 50497 10118 -20341 -118374 37338 10498 -40832
2307 -40832 120221 115203 40763 93576 92485 121791 173976 147798 70309 118914 169445 137578
2295 137578 163417 172145 159595 139323 122883 171729 394645 194298 -40465 -65656 130577
2284 130577 96570 44350 60520 101744 123862 209737 7399 -59248 -107300 33418 73383
2273 73383 96320 149696 210843 188304 59342 210733 8499 42374 162618 202053 205075
2262 205075 247945 261092 201047 205964 347310 290505 209987 129649 169185 257804 125997
2251 125997 104274 330388 184561 107076 144100 186974 224307 233172 316652 459245 281879
2240 281879 229651 164393 138001 288573 208725 75093 55706 134334 203994 279723 227052
2229 227052 303481 315313 102402 212014 305075 269941 271338 329745 303033 244544 122397
2218 122397 218919 221237 213548 220782 219088 316416 398074 341465 171922 274300 346730 402169
2206 402169 350655 403538 476276 506690 512653 476744 412507 399138 280469 299991 292792 606780
2194 606780 622010 569040 650814 533143 476672 524275 579787 587431 695359 753551 757832 653871
2182 653871 735505 730225 667797 762261 725768 814286 867898 803625 738948 602022 749586
2171 749586 681704 686632 641572 885412 989043 904557 792775 751812 854040 1006436 991979
2160 991979 995250 843323 922954 983207 940140 1051857 1134452 1248150 1084008 1156502 1201922
2149 1201922 1143802 1124831 1143098 1222156 1077276 955861 972843 1104257 1262444 1199559 1129171
2138 1129171 1153678 1367953 1500852 1568589 1788521 1891821 1761795 1823732 1884191 2059908
2128 2059908 2076994 2283049 2439451 2502397 2767399 2896499 2993203 3066505 3324093 3526735
2118 3526735 3558534 3742277 4013722 4128825 4477477 4876515 5143078 5576011 5952914 6597245
2108 6597245 7265753 7952208 8553046 9126290 10027200 10955121 12233514 13745386 15427753
2099 15427753 17234079 19597284 22266175 25567939 29279703 34758259 41193006 46359611
2091 46359611 48137971 41744194 33094925 26521031 22117220 18816868 15922784 13596485
2083 13596485 11636594 10139855 9005372 8349828 7590889 7049123 6754416 6338643 5911628
2074 5911628 5655797 5348795 5055597 4582861 4182401 3945052 3732692 3534974 3310380 3112592
2064 3112592 3060210 3103190 2906276 2705120 2587968 2573164 2686263 2473735 2440640 2318813
2054 2318813 2299613 2262050 2230522 2066432 1983496 1976499 1826109 1679684 1587918 1578896 1455543
2043 1455543 1370643 1378365 1405554 1290614 1186115 1233563 1123721 953275 1034154 933017 900666
2032 900666 952138 753414 648334 663761 709281 741061 579051 468821 713090 635127 538294
2021 538294 556350 827435 732695 606560 670297 596791 549779 578050 637050 469382 491558
2010 491558 564815 451351 315715 476394 522157 565602 631208 436982 381845 501430 341824
1999 341824 362525 285108 327521 275724 163375 145010 149038 267195 167488 226843 180023
1988 180023 349704 324051 267461 218127 269059 282314 371045 397238 333847 227161 225166
1977 225166 240486 237689 138374 182906 203047 113928 81166 212374 409576 323159 219637
1966 219637 132283 169541 341203 287076 257846 320549 169008 219051 212578 202768 108034 97526
1954 97526 75263 54090 113436 162448 6319 32950 159773 184148 196540 111774 151007
1943 151007 100987 55752 187627 155266 143232 69498 91234 -65131 -74996 59726 62154
1932 62154 -10477 -55116 237108 318656 253792 335182 174418 -55730 24290 14758 6111 123640
1920 123640 150054 186179 69504 -38161 5469 129243 -82781 117300 127774 -78265
1910 -78265 -9274 103636 -75514 -84653 165019 -27263 1131 -15108 -78826 31603 33560
1899 33560 -161824 -89194 23955 -153177 -166667 -81640 -35737 50871 275 190517 104287
1888 104287 43094 -75835 -168663 -28737 35311 30466 -147470 41750 118718 65138 -11301
1877 -11301 97975 90037 -159108 -184024 -100216 -40018 -190729 -158438 -6727 102525 30070
1866 30070 -55249 -177578 -251700 -178044 -7156 101296 49411 -64164 -54624 -119427 -160340
1855 -160340 -147596 -46915 -96723 -20740 81793 -67465 -132028 -144483 -32710 19558 23563
1844 23563 -31577 -52511 12718 -6159 5858 -34139 -105385 -114322 -120882 -41892 54537 55392 42600
1831 42600 174308 181829 91895 146083 207803 305673 93501 71348 189267 167446 161262 153789
1819 153789 262763 189539 105132 41403 29424 46652 13623 86401 -83441 -166916 -115582
1808 -115582 -51436 -109007 -19132 -50833 -43667 -29690 -40708 66998 -74910 21860 -104374
1797 -104374 -165089 -133440 -12818 80968 35150 -64038 59314 -35335 -114351 6453 4203
1786 4203 -81463 15298 -20665 14163 -87137 -26384 -46302 4904 79955 3779 -33953 54304
1774 54304 -35236 -43538 46691 -50674 -203584 -179329 -170894 -180428 -94332 3012 -45133 -52225
1762 -52225 -10366 -30644 114642 159998 179993 48993 -98058 -31870 86375 4014 115824
1751 115824 176376 26955 -179060 -133497 -174059 -69288 87379 12935 -79363 59583 31506
1740 31506 -101893 -122667 26686 -40588 -13348 73331 -64592 -66582 -40224 -151369 -144817
1729 -144817 -81836 -27108 103227 -14336 -104009 -74774 34985 76971 79683 22628 -100631
1718 -100631 -154478 -29118 -93308 -201538 -176726 -111498 27862 18719 -28786 135660 165127
1707 165127 84891 169260 185507 135582 42825 173616 117332 70698 80365 117059 -17144
1696 -17144 -1825 -27110 -6855 -56845 -84449 -143770 -112382 -10445 50662 98275 41054 -106531
1684 -106531 -75893 -178587 -162673 -192896 -172230 -113858 -110256 -90361 55464 127005 92617
1673 92617 -24563 -80345 -65320 -80504 -67537 -55349 -89967 -92162 -120559 -44809 -58407 -89449
1661 -89449 -63987 175 134822 74586 103594 -22068 -44759 -57770 22201 2402 -63806
1650 -63806 -76907 -69441 25582 62082 -108681 -95224 83216 -73748 -33639 229279 246314
1639 246314 77128 -160484 -81021 32430 125649 -121983 -186618 -163701 -157641 -202223 -76769
1628 -76769 -49013 73788 681 -5910 -116715 29443 -178200 -171406 -153514 -228255 -301655
1617 -301655 -205589 -129123 -52797 -81350 -98351 -80952 -74458 -89705 13840 49875 53619 163540
1605 163540 31912 1280 -33069 -33931 -120433 -83521 53103 68796 18290 -16882 -55560 10220
1593 10220 -163784 -264403 -210939 -21928 95699 90695 89698 -31707 5466 10044 -160729
1582 -160729 -111707 -37827 -5005 49156 93536 -11575 -79462 -165448 -141201 -89969 -961
1571 -961 16843 -88987 -54239 48744 -4271 -30012 -19058 -29181 -120698 -158995 -215634 -169869
1559 -169869 -41226 56468 -114769 -4149 3905 -100240 -109452 -83655 -92686 -16691 93344
1548 93344 108856 -210959 -136614 -105111 -150303 -208790 -336781 -156708 -119997 -68826 -39929
1537 -39929 -48947 131693 34421 -167574 -286093 -127553 1812 -66343 -31939 -2448 44294
1526 44294 40687 43636 72679 99617 129835 -16384 -31376 -30012 -145173 -249037 -242102 -189494
1514 -189494 -77043 10540 -119316 -39750 -65379 69003 61305 -59299 -115739 -192607 -201307
1503 -201307 -225014 -181551 -119719 -178599 -300845 -181844 -259396 -151718 30689 44549 41219
1492 41219 -130441 29389 104526 27429 70197 -54478 17066 12565 32592 90350 -13136
1481 -13136 72351 -6244 -160805 -120703 -29069 -121728 -189961 -143347 -193111 -169317 -18552
1470 -18552 183881 114440 -10418 -117795 -103402 -79586 -104105 -130117 -178407 -181723 -232417
1459 -232417 -132430 -30003 22887 -127100 -109020 45989 119273 63588 -112134 75708 239315
1448 239315 69494 145760 173018 164279 -30291 -196942 -62175 -43333 3791 -38171 -35217
1437 -35217 -80225 -203777 -24090 -185845 -64528 -258246 -246384 -46396 -53380 2490 -39360
1426 -39360 -190697 -179056 -74152 -156768 42 64372 -20407 92464 23278 -109094 -57597
1415 -57597 -31177 -6464 6188 -59591 -128372 -132885 3214 -181446 -136162 -97675 -55290 -20658
1403 -20658 -93651 -213400 -154367 -181756 -193410 -67793 -50357 -103576 -80046 -24808 -23840 -24213
1391 -24213 -81689 -56351 -213815 -161675 -180652 -194053 -65536 35009 99984 113942 -41502
1380 -41502 -19186 2367 -21796 -103075 22142 104750 -3343 -3816 -49190 -10340 -123488 -149483
1368 -149483 116412 2121 3777 -37675 -114648 -89947 -136325 130223 123622 -22248 17034
1357 17034 -68500 -210894 -98424 36842 109159 100621 81834 134110 -102951 -200684 10257
1346 10257 -175597 -257952 -57901 -82531 -121346 -122932 -146799 -88286 51272 -26225 66533
1335 66533 -80732 33676 40297 -1278 -36448 -122336 -143218 17300 7227 -22843 -58334
1324 -58334 69166 -1654 -71580 -12021 -63385 -42059 -76778 -64829 -48533 -16231 -70018 17313
1312 17313 60533 95637 132256 -6841 -5613 22514 47971 -33655 -37216 -6458 -51038 -107946
1300 -107946 -196895 -36935 65677 5943 135807 82058 -71835 -49593 -10423 -4523 -97895
1289 -97895 -24771 -65360 42016 32171 143818 32894 149758 41260 -36702 13775 -41408
1278 -41408 40164 75669 91372 17411 115715 36007 20406 -9917 -30239 -76631 -75678 -111170
1266 -111170 2192 30189 -113172 -161178 -15639 78304 -8947 -146175 -122504 -60032 142213
1255 142213 159496 7499 -71118 11008 137874 33973 -35872 48615 71323 33809 45468
1244 45468 64128 -34288 -153214 -66043 -52717 9781 -98349 19938 -24520 14954 -24796
1233 -24796 59612 16367 127535 44513 -80486 17025 37009 -7761 40716 17849 19919 70617
1221 70617 61075 47602 -71016 16830 -22355 83598 134960 84671 86290 94360 96278 41738
1209 41738 -24813 13783 40303 35465 -67213 -129278 -114793 -264555 -149185 -67088 -65972 5537
1197 5537 16963 -33936 3581 -37510 -142895 -64289 -82156 -2251 -10831 -12838 33498 37985
1185 37985 89300 173979 79874 118850 131493 -38184 67689 8853 13069 104043 -24841
1174 -24841 68244 189327 178856 50941 78517 106249 -61645 27821 -105637 -134459 -46035
1163 -46035 -21073 -73269 -182583 -116968 -213777 -147034 -8153 -84213 -8335 -24640 48423
1152 48423 133718 91331 -73505 -31909 -98647 -134592 -16505 6309 -12616 52561 105136
1141 105136 115503 142673 10449 110769 53808 -105302 -245403 -115948 43853 95639
1131 95639 -93090 -79331 -94267 103127 144535 -9528 -141729 -60156 231965 192309 80081
1120 80081 48558 -5763 19550 86481 -61122 -146637 -37312 -117882 -151613 -106637 -37516
1109 -37516 -100678 -31878 -61807 -159030 -69123 -76116 -147867 -34060 -137600 -218660 -197650 -263498
1097 -263498 -61868 128985 221381 166828 -44981 -103718 -63386 -62606 -94294 -47750 -42058 -49161
1085 -49161 6997 83343 -23273 -57221 27415 52076 -79739 -104787 -56874 -80016 -88900 -8435
1073 -8435 93912 2498 -141505 20376 161 -81559 98547 178698 162450 28226 -44506
1062 -44506 -129424 -231118 -127031 18009 79733 79385 -63228 -62485 684 211656 260
1051 260 -32819 -128848 -131413 -148161 -53927 -50594 -55868 -115579 -57911 15778 -85355 -175617 -172322
1038 -172322 -68534 -73747 -136292 -31117 -115887 -180542 6695 104503 41902 76105 30676
1027 30676 -42658 -85003 -140582 4399 17852 -63216 -19767 -167920 -215181 27973 -192751
1016 -192751 -85738 -46750 -52988 165978 211567 138047 76554 133663 85260 -73146 -231210
1005 -231210 -149364 -48016 -114316 -136405 -121251 -25748 18243 -131572 -54675 -58653 -107755
994 -107755 -80547 -17527 80774 99848 -4874 -14686 71461 148611 85481 -35900 92266
983 92266 281786 294341 68004 1820 162426 57697 118112 191730 72134 72136 -30008 173932
971 173932 234081 95645 23747 -50567 -47183 -149387 -138676 10883 -57634 -10045 157169
960 157169 99751 -135988 -187740 -102339 -96329 -48418 4584 -60868 -128376 -163529 -108290 -115357
948 -115357 -173986 -229066 -164169 -25103 30400 18352 -20238 2238 17259 -45042 32759 49240
936 49240 83777 30866 84706 58380 -19823 -87123 -196193 -254355 -126805 -141033 -28551
925 -28551 -122823 -152944 94764 -49307 -80663 72437 21431 -118212 -109681 98505 43235
914 43235 49934 126773 100569 24068 19434 88870 -20800 -163565 -88090 39860 138740 149832
902 149832 10497 61258 12101 -36522 -101167 -53937 -134034 41095 100690 66759 57114 -57775
890 -57775 -117338 1893 -118854 -69310 -48518 -56066 -14524 -98705 -50234 -23029 -70002 75093
878 75093 124029 71950 20122 -58895 -126241 -48345 -36081 -85545 64901 29939 31277 -62502
866 -62502 -54468 -8745 33514 50250 -33750 -34852 -22006 -35317 50052 56051 55741 -17360 -60794
853 -60794 -144876 -86150 -31951 -134301 -166091 -128514 -51397 -23986 92442 135503 106917 97620
841 97620 -50892 -74388 -42073 87034 153030 224299 108077 63526 25216 42706 231356
830 231356 85547 -14089 3244 121734 112883 86272 -65823 -39001 53349 -58268 14256
819 14256 -19155 -32529 73448 -59438 43442 53141 -95413 -9296 52663 45052 43483 183944
807 183944 75695 -44786 -88072 -2219 103156 156823 79774 27753 78111 -85154 -111349
796 -111349 -99134 -149836 -22235 137957 49893 -52064 -56839 27701 -76808 -29974 19813
785 19813 129615 -74651 4261 7435 -9697 39818 3350 183187 80603 23828 81456
774 81456 12399 -66397 -71466 50574 126224 210012 176889 138936 -1123 -128669 -67345 -50146
762 -50146 -26227 -109505 -134325 -33954 -42444 -42892 37295 19206 -37720 2623 -49675 -31285
750 -31285 65156 137932 245363 -9209 -724 33517 -32365 -8140 19694 76722 91467 8964
738 8964 -22071 30262 13213 20522 55113 -99290 -145907 -93629 -37663 -34942 -124627 -85162
726 -85162 5798 32648 210355 143834 65567 1848 39240 -21270 -123302 -200100 -20940
715 -20940 124496 167296 -75843 -144339 78892 118119 -86016 -82201 -119118 -190749 3462
704 3462 2333 -25701 35613 -53417 -3816 73568 61405 45197 -7560 -130501 -163168 -158006
692 -158006 -89870 -65362 -195113 -60706 -119867 -154874 -112610 -69530 -104186 -27232 42016
681 42016 2622 -30624 -40049 65257 -90035 -103656 6766 -42942 -28896 -1083 134243
670 134243 249859 28526 28439 131786 194175 155087 62306 13584 -95494 -99898 -166836 -40213
658 -40213 -120154 -77213 22523 140683 25878 -68394 -163597 -39146 5960 -9051 68221
647 68221 118160 90826 52423 104453 83923 -106422 34150 29149 83489 114995 162432 202489
635 202489 -29611 -59854 46606 -43283 -9388 39229 -115007 -98043 114590 192059 27372
624 27372 -183484 -14396 117596 50586 -23541 704 215658 145649 -28554 -42213 -4722
613 -4722 149812 122098 69608 11728 -69134 -75437 -29708 107899 89607 -30267 -30093 89771
601 89771 41383 181781 134677 91053 17224 35734 31585 -32392 -117907 21387 49820 221827
589 221827 78307 -13892 -121683 -82610 -103005 -234086 -178747 -132799 -86258 -132981 -26257
578 -26257 36830 -28721 -9456 68064 64399 35435 -22347 -60213 30261 -139483 -211310 -90480
566 -90480 -12755 71501 -5208 -200983 -153939 80056 -31592 -109602 -141930 34999 108883
555 108883 765 11676 -15839 60314 78753 -12765 -64225 -5248 96419 97140 46187 21663
543 21663 124096 37405 47696 -40587 -52355 -55473 -4656 18046 -26571 14089 -61160 81837
531 81837 -16252 -4869 24134 -113852 11835 -11213 -81930 21749 133057 41761 -75746
520 -75746 -98945 -63957 963 -41239 19776 97150 -57857 14325 -85964 -180042 -138150 -35619
508 -35619 78 1181 56197 -55339 -33759 -6782 -35477 -5712 13550 -71801 98213 88770
496 88770 32440 114847 69727 145363 148630 254345 145301 184492 299567 211782 138696 73097
484 73097 106706 106488 155559 146181 13908 20235 163820 269634 48444 28173 202721 65459
472 65459 74637 171207 274425 32903 121449 185355 159090 37756 89329 100307 41025 152689
460 152689 169690 24960 118729 167898 -38374 -86959 33397 38443 -15777 -42524 32663
449 32663 -18118 6018 168601 136196 201058 94085 132332 70025 -8949 50288 139294 150531
437 150531 92827 -50160 129083 115035 178764 138754 295278 202646 165539 46973 -3247
426 -3247 22084 -47068 -65334 84139 64707 110644 167609 -46843 7062 -9359 186588 50940
414 50940 -10768 13656 39904 -51008 -137185 -42093 -107660 -347 192960 154124 21856
403 21856 5682 40388 107978 186244 122905 -68235 -76119 1435 -77777 -31297 38804 98401
391 98401 63284 193604 155471 1969 -90069 -52658 33609 113492 27907 31178 159337 268531
379 268531 196258 209524 209949 62026 37438 -39390 7591 51294 -77561 79966 43861 33331
367 33331 -52755 -64499 79881 113398 26648 -90187 156891 121962 -8827 -304 -93182
356 -93182 -120053 -63445 -157768 -34655 -35764 54953 64770 42873 -49048 -42496 64243 69401
344 69401 58012 118823 39761 55324 147034 80127 56472 120787 18470 111860 121002 119321
332 119321 136506 156209 225381 64009 48515 -125854 -48874 48279 194484 177511 185079
321 185079 160919 -19025 -21115 23631 129840 -11913 -212 121334 75964 271957 207300
310 207300 63253 -30638 76533 -55123 -137395 1241 52847 -30817 160720 35909 -11258
299 -11258 63155 -19672 173592 63198 1538 58313 36949 118317 162471 46361 134826
288 134826 118976 -53014 -125331 18146 -32299 -62286 67249 86262 20960 -36332 30967
277 30967 36125 -64345 -79190 142131 230117 268800 228055 76960 -39977 -19008 -45771
266 -45771 16818 168213 188665 163630 48926 22312 109389 39442 98944 -41537 35574
255 35574 73265 -33707 169516 143225 113496 -42687 -36230 28363 87426 160978 199000 50808
243 50808 -71484 -76890 -2395 -15832 72947 30521 125392 206424 145128 -16994 29353 169394
231 169394 176804 65084 102164 93378 36083 -68932 -63224 -38400 -53692 103424 181055 172355
219 172355 160506 247479 268767 133372 21816 60805 -1865 30351 41516 135469 113177
208 113177 -51270 -35306 22408 -36546 -14963 198381 125543 50026 35133 134400 97834
197 97834 78767 125476 189125 50754 19783 33352 14766 26822 -26806 173 -57253 25268
185 25268 -9929 -88840 119642 70368 905 54869 82419 4157 -71895 91926 144512 196834
173 196834 195382 322153 209211 321263 315569 331275 265673 283158 124591 -8584 28783
162 28783 -12649 115393 136972 145418 77237 96045 81586 -26199 -78305 126014 117644 -44968
150 -44968 -3963 119531 43101 50140 24974 46898 50012 -48720 -52442 40700 215864 88405
138 88405 242653 291660 297078 129756 132679 80101 50210 109874 130889 -72006 -81460 59555
126 59555 35055 37952 26701 59181 70980 -73416 20327 155819 -14434 -15080 18046 70434
114 70434 77848 34369 48203 131064 136675 43110 3849 -50628 -3707 69057 28135 13995
102 13995 -26821 -35670 33338 -16368 -29648 73155 116335 96640 96014 61600 80064 118858
90 118858 45385 8083 58536 28566 66475 155082 135113 151281 152182 177401 159497 171368
78 171368 121840 227401 249266 251331 234943 315747 138637 -11820 72407 216877 114985
67 114985 138076 124334 88080 159394 152095 114792 189188 156977 138745 92744 -43412 -92580
55 -92580 -14638 139918 124801 92618 40802 124696 148630 103495 79061 94904 65494 55684
43 55684 46492 24773 71110 143290 178283 73739 166190 110078 85030 91169 11235 72558
31 72558 82796 100017 51086 -24372 -34865 16618 62782 32328 126019 201182 173291 119189
19 119189 46124 -21838 1804 86070 85619 88045 54455 93351 99989 109210 83420 41291 89335
6 89335 182987 157256 132345 67066 96819 229926
0 229926
$$ Imaginary data points
##PAGE= N=2
##DATA TABLE= (X++(I..I)), XYDATA
16383 -1651996 -1544646 -1427332 -1417421 -1532069 -1421591 -1385271 -1331419 -1315345 -1269878 -1137546
16373 -1137546 -1101414 -1049399 -1022576 -1032105 -1029798 -1077174 -1087691 -1112125 -1045748 -911578 -860862
16362 -860862 -903642 -812742 -654406 -769482 -630459 -460616 -503072 -565599 -535771 -541756 -331304
16351 -331304 -302358 -217494 -193721 -347234 -276716 -194116 -185303 -173881 -153644 -129017 -110550
16340 -110550 -84303 -9212 -108462 -45915 11192 44193 82212 155655 219005 284047 410015
16329 410015 334803 338060 300536 437514 551138 600227 585659 557680 648881 779238 735565
16318 735565 663679 683139 753825 788493 772722 721798 788556 845484 889674 952605 1007316
16307 1007316 960575 1032435 1163372 1164498 1142270 977074 1044750 1165173 1214304 1239607 1367579
16296 1367579 1297825 1191417 1347747 1475652 1475421 1488267 1473380 1517455 1430887 1524230 1628224
16285 1628224 1625073 1580910 1652189 1617658 1805996 1738777 1739035 1833542 1947373 1951444 1758588
16274 1758588 1726969 1913594 2001923 2080001 2151974 2104315 2075789 2050062 2006121 1982760 2168291
16263 2168291 2223453 2275280 2310257 2279058 2239745 2265837 2143755 2155958 2325451 2387491 2303256
16252 2303256 2344937 2386938 2457027 2466622 2447612 2415945 2495857 2455108 2608513 2753445 2671623
16241 2671623 2688794 2770421 2635319 2642958 2765971 2802542 2785245 2747830 2741004 2728167 2748189
16230 2748189 2677452 2754479 2845501 2896319 2927058 2938439 3054310 3129894 3045063 2934054 2986260
16219 2986260 2897784 3039628 3169641 3121211 3156769 3117471 3219848 3202600 3134677 3103002 3094325
16208 3094325 3319366 3386826 3267939 3249235 3239651 3192824 3196448 3336504 3318656 3326703 3368442
16197 3368442 3475860 3429648 3210419 3306177 3455018 3379430 3380623 3514909 3389480 3380047 3462047
16186 3462047 3407614 3615540 3679983 3564569 3576823 3533375 3602651 3614707 3600641 3644248 3710156
16175 3710156 3689682 3650524 3571644 3569028 3576381 3581948 3704968 3711621 3671183 3835361 3820354 3828503
16163 3828503 3550258 3623269 3581179 3691465 3650034 3624347 3815984 3860617 3778633 3732176 3753792
16152 3753792 3847099 3781227 3665435 3704231 3631890 3604485 3658881 3774857 3806991 3902281 3799506
16141 3799506 3894170 3959072 4029772 3870553 3804342 3824256 3806640 3805381 3860906 3747941 3888645
16130 3888645 4040719 4159614 4083700 4165106 3989063 3940347 3956810 3954238 3913358 3927621 4015214
16119 4015214 3938013 4003657 4035461 3883218 3929696 3805268 3953877 4040416 4204497 4015089
16109 4015089 3978858 4034154 3883111 4151151 4048323 3927460 3938044 4036427 3972009 3942339
16099 3942339 3946510 4015192 4059426 3960866 4034046 4197039 4142507 4100553 4078913 3996124 3959867
16088 3959867 4023935 3963584 4232657 4235721 4283741 4190788 4021383 4253788 4148684 4096983 3954751
16077 3954751 4084536 4070214 4069493 4115643 4101255 4228325 4400240 4231731 4211895 4278109 4185832
16066 4185832 4062248 3951508 4115645 4237427 4251237 4066600 4061032 3991856 3968979 4123687
16056 4123687 4150390 4085981 4080931 4227180 4307765 4213584 4186348 4190828 4199604 4148484 4296681
16045 4296681 4263837 4398589 4171682 4122995 4120660 4157398 4202128 4108144 4191071 4337208 4357607
16034 4357607 4232904 4315484 4084719 4016232 4144392 4223237 4278895 4214772 4328117 4173502
16024 4173502 4133198 4130066 4125303 4128959 4158984 4235312 4223892 4283018 4336512 4226687 4025073
16013 4025073 4073101 4156386 4213095 4289182 4154266 4149117 4236770 4288827 4212436 4192382 4251155
16002 4251155 4277752 4233664 4104877 4065310 4063532 4122475 4152429 4098646 4128708 4251895 4248452
15991 4248452 4284650 4323159 4009684 3972721 4102801 3958247 4042603 4117912 4117354 4099805 4185210
15980 4185210 4223073 4151012 4194752 4103182 4071784 4101634 4144294 4240180 4173404 4198209 4229376
15969 4229376 4106393 4191975 4151743 4166365 4108165 4067125 4203436 4148938 4107896 4084021 4044395
15958 4044395 4077035 4208480 4209954 4188912 4268686 4244225 4283128 4245925 4190479 4155109 4120654
15947 4120654 4148222 4090663 4338072 4350662 4092310 4087727 4165085 4223569 4271019 4319039 4272298
15936 4272298 4169429 4125889 4156176 4331098 4316946 4260509 4197484 4212747 4049834 4101112 4121801
15925 4121801 4133121 4192868 4232146 4233968 3989595 4057385 4069249 4122398 4280118 4195133 4165948
15914 4165948 4330568 4306742 4189607 4169382 4028992 4055023 4029722 4111173 4350999 4359276 4101364
15903 4101364 4109670 4085358 4090241 4166212 4246632 4340467 4233471 4213488 4312224 4248623 4250515 4434052
15891 4434052 4498518 4227754 4241343 4258755 4306164 4256428 4145708 4229270 4212424 4067733 4191252
15880 4191252 4179523 4266163 4212355 4230041 4322266 4364278 4165991 4209359 4228834 4174238 4290001
15869 4290001 4226204 4150075 4169205 4287458 4271553 4175455 4133544 4241532 4147095 4129317 4154405
15858 4154405 4164642 4123261 4222565 4288005 4248733 4070484 4181799 4050687 4108719 4206475 4301687
15847 4301687 4046772 3949348 4196415 4296125 4273315 4248332 4130759 4183159 4224044 4169692 4187988
15836 4187988 4155445 4121326 4231103 4117561 4139199 4130544 4219498 4183879 4226013 4329915 4389967
15825 4389967 4396861 4304436 4329649 4399539 4374850 4250466 4195880 4266679 4308216 4276756 4418827
15814 4418827 4407947 4381912 4280950 4256739 4319833 4225691 4276739 4276666 4157208 4157018 4202412 4221015
15802 4221015 4202127 4228736 4309029 4400472 4326094 4140315 4088777 4192222 4232032 4315910 4287026
15791 4287026 4365793 4290115 4361558 4306836 4259294 4243991 4141600 4154563 4137204 3949512 3882498
15780 3882498 3837761 3828397 4067398 4321947 4159668 4142791 4381355 4341491 4332418 4301133 4286770
15769 4286770 4133817 4323279 4340375 4303559 4183423 4233871 4308773 4310094 4238561 4196918 4402659
15758 4402659 4541232 4421429 4321585 4323850 4273975 4366880 4455907 4304127 4269414 4321293 4270039
15747 4270039 4174491 4061468 4104947 4260711 4209436 4296049 4351096 4371592 4326771 4294645 4340750
15736 4340750 4358503 4325327 4240369 4253283 4172697 4225475 4209323 4108346 4293466 4399866 4276758
15725 4276758 4308258 4363154 4404370 4220466 4141985 4190256 4278206 4236558 4292865 4301071 4299582
15714 4299582 4103823 4202239 4003256 3986190 4271394 4369641 4299479 4366363 4326001 4166917
15704 4166917 4350496 4406895 4355352 4241944 4297990 4306627 4155918 4097422 4011118 4248299 4223140
15693 4223140 4276407 4339252 4472711 4273135 4249528 4286181 4348168 4304152 4174870 4226791 4247816
15682 4247816 4342958 4344721 4381172 4250148 4271023 4299243 4334717 4230711 4238849 4266318 4216604
15671 4216604 4300519 4471741 4418209 4354962 4311016 4179346 4187173 4271672 4310586 4310147 4265794
15660 4265794 4229975 4213941 4233611 4319506 4404937 4346435 4486503 4265046 4039262 4163794
15650 4163794 4258428 4220070 4228666 4363488 4378115 4349519 4333039 4385246 4429677 4365632 4355009
15639 4355009 4162336 4243867 4314008 4380139 4586452 4514300 4442983 4422204 4410165 4339944 4356214
15628 4356214 4255750 4219734 4375922 4319791 4440667 4314668 4261328 4187465 4120750 4186483
15618 4186483 4191104 4217158 4295708 4220460 4488945 4483314 4301705 4358290 4380304 4377011 4375034 4421749
15606 4421749 4351267 4299840 4305638 4410702 4320996 4192273 4207007 4197246 4272354 4426742 4521578
15595 4521578 4401881 4320463 4408865 4496451 4476070 4446982 4393579 4401269 4346675 4355271 4324125
15584 4324125 4307304 4259422 4249616 4372010 4450944 4439755 4386303 4266202 4219567 4325479 4318242
15573 4318242 4256231 4397790 4485509 4296294 4313024 4437058 4436389 4457851 4356376 4328575 4380493
15562 4380493 4339247 4386300 4274779 4238634 4261094 4328112 4190836 4265937 4207686 4395388 4363132
15551 4363132 4317215 4346419 4291811 4356237 4367856 4454619 4518763 4512795 4551859 4494803 4378992
15540 4378992 4303060 4291449 4424143 4453529 4430405 4496070 4457616 4267569 4279503 4403948 4417526
15529 4417526 4455617 4329708 4372843 4397927 4422156 4585851 4419497 4333299 4320576 4345079 4315826
15518 4315826 4352891 4355252 4313389 4330375 4371716 4394887 4454678 4434885 4388003 4296003 4279106
15507 4279106 4217034 4148906 4217082 4239960 4329859 4367426 4379732 4328368 4423001 4352404 4381690
15496 4381690 4439284 4492611 4521923 4508045 4539095 4547980 4452183 4454758 4456642 4561162 4519688 4452667
15484 4452667 4413155 4383524 4455143 4560423 4338648 4267840 4324733 4291957 4382306 4356966 4370709
15473 4370709 4336091 4087610 4091320 4176516 4142776 4291978 4224083 4258133 4381219 4361286 4303870
15462 4303870 4497393 4450906 4508984 4500694 4521393 4625251 4557990 4504676 4438557 4448863 4496377
15451 4496377 4537846 4529345 4407764 4503724 4405324 4371050 4361567 4386634 4438980 4567447 4494811
15440 4494811 4473439 4504770 4513954 4441864 4460243 4396805 4475797 4429242 4449067 4353569 4392489
15429 4392489 4380392 4272025 4389287 4369517 4481313 4709932 4531475 4268074 4315629 4425120
15419 4425120 4402943 4327733 4391786 4294862 4366127 4458412 4438719 4549414 4686766 4529245 4728906
15408 4728906 4658552 4630285 4546431 4458270 4421168 4523697 4517596 4306550 4318593 4453095 4478701
15397 4478701 4518628 4382963 4383723 4448856 4530566 4487428 4585102 4566493 4589624 4450277 4356441
15386 4356441 4491943 4496449 4391055 4352776 4345876 4495483 4583818 4573722 4608544 4553870 4536488
15375 4536488 4532141 4583794 4643484 4633318 4563077 4541655 4441287 4381347 4239143 4349026 4470234
15364 4470234 4478324 4543386 4598538 4594906 4526713 4454078 4564603 4342456 4364910 4493825 4330738
15353 4330738 4337041 4427178 4495999 4599792 4535171 4525556 4644993 4512439 4317471 4573611 4663831
15342 4663831 4567640 4526434 4400448 4413530 4494860 4694693 4856401 4785710 4640959 4496650
15332 4496650 4467315 4599401 4690107 4624337 4540748 4404011 4420295 4427160 4559444 4624783 4571343
15321 4571343 4651645 4454970 4388351 4469406 4506109 4661968 4434782 4429315 4420692 4508682 4639526
15310 4639526 4430579 4480416 4573570 4513559 4630628 4603379 4525460 4643186 4514121 4545371
15300 4545371 4691212 4678007 4668943 4499051 4378820 4379214 4454724 4585742 4468743 4539359 4650780
15289 4650780 4577535 4528199 4412571 4370644 4373996 4379178 4309168 4320415 4372085 4343038 4366922
15278 4366922 4469792 4396949 4423858 4586787 4377933 4313825 4404269 4443251 4432245 4536854
15268 4536854 4532136 4485155 4546430 4520039 4482137 4544128 4551467 4622750 4581774 4508283 4365599
15257 4365599 4477110 4522840 4478411 4461514 4560787 4512227 4550264 4550973 4524057 4626496 4629720
15246 4629720 4631959 4607735 4639201 4444098 4218716 4194813 4333733 4555669 4629082 4500093
15236 4500093 4477918 4532536 4535710 4502949 4637343 4661702 4567681 4560315 4600575 4572232 4575245 4636269
15224 4636269 4752866 4575874 4551162 4690027 4610473 4673821 4679471 4588356 4634852 4506936 4537876
15213 4537876 4577931 4563166 4643941 4451217 4369544 4412922 4651345 4638168 4586186 4637776 4612805
15202 4612805 4624932 4644390 4811754 4685650 4667486 4716156 4649550 4657320 4695086 4662340 4394023
15191 4394023 4455552 4570296 4614099 4731569 4614194 4482243 4452402 4409045 4492143 4494886 4495536
15180 4495536 4538894 4439575 4419346 4576097 4624993 4540755 4420370 4465430 4603912 4713422
15170 4713422 4640644 4645736 4532211 4434773 4546857 4508721 4343691 4515344 4697031 4810417
15160 4810417 4724772 4553298 4536455 4550175 4532235 4410523 4439132 4444810 4480928 4573729 4723964
15149 4723964 4818607 4939094 4872363 4699157 4618076 4675627 4682149 4685811 4559883 4677318 4607148
15138 4607148 4491766 4608989 4706473 4493129 4544778 4548346 4596967 4664016 4643942 4674904 4632455
15127 4632455 4580814 4594035 4599248 4591742 4580011 4532862 4560748 4660336 4875374 4815832 4700213
15116 4700213 4713071 4749491 4647711 4596331 4574873 4607229 4587695 4484388 4387310 4417685 4576946
15105 4576946 4663275 4682033 4760904 4882072 4784351 4642172 4471070 4607398 4713238 4710709
15095 4710709 4758198 4617850 4548017 4552276 4662782 4719939 4706052 4622309 4626573 4652330 4581072
15084 4581072 4622692 4597300 4775153 4687536 4630768 4705377 4613781 4640367 4588418 4632995 4684839
15073 4684839 4636614 4681423 4588764 4649712 4792846 4780738 4829659 4808263 4627746 4566101 4664107
$$ [...]
##END NTUPLES=NMR SPECTRUM
##END=
