##TITLE=1H_TG-2340-E 
 CDCl3
 8 sc, 
 1.09.2022
##JCAMPDX= 6.0         $$ Bruker NMR JCAMP-DX V2.0
##DATA TYPE= NMR SPECTRUM
##DATA CLASS= NTUPLES
##ORIGIN= UXNMR, Bruker Analytische Messtechnik GmbH
##OWNER= root
$$ XWIN-NMR		Version 3.5
$$ Thu Sep  1 09:47:17 2022 Russian Standard Time (UT+4h)  she@DPX200
##.OBSERVE FREQUENCY= 200.1313499994
##.OBSERVE NUCLEUS= ^1H
##.ACQUISITION MODE= SIMULTANEOUS
##.ACQUISITION SCHEME= undefined
##.AVERAGES= 8
##.DIGITISER RES= 18
##SPECTROMETER/DATA SYSTEM= spect
##.PULSE SEQUENCE= zg30
##.SOLVENT NAME= CDCl3
##.SHIFT REFERENCE= (INTERNAL, CDCl3, 0, 15.7326)
##AUDIT TRAIL= $$ (NUMBER, WHEN, WHO, WHERE, WHAT)
$$ ##TITLE= Audit trail, XWIN-NMR		Version 3.5
$$ ##JCAMPDX= 5.01
$$ ##ORIGIN= Bruker BioSpin GmbH
$$ ##OWNER= she
$$ F:/spectra/data/she/nmr/H-F/1/pdata/1/auditp.txt
$$ ##AUDIT TRAIL=  $$ (NUMBER, WHEN, WHO, WHERE, WHAT)
(   1,<2022-09-01 09:46:00.56 +0400>,<she>,<DPX200>,
      <created by zg, POWCHK disabled, PULCHK disabled
       configuration hash MD5:
       00 E9 B6 7A A2 85 ED C7 34 08 36 98 17 FE 4E 26
       data hash MD5: 16K
       76 22 74 BF A8 3A D4 67 18 CE 69 37 21 76 37 34>)
(   2,<2022-09-01 09:46:02.84 +0400>,<she>,<DPX200>,
      <Start of raw data processing
       efp BC_mod = 2 LB = 0.24 FT_mod = 6 PKNL = 1 PHC0 = -18037.42 PHC1 = 13.60069 SI = 16K 
       data hash MD5: 16K
       7A DF C6 04 AB D0 B6 BE 43 AD 30 02 05 B2 A3 FA>)
(   3,<2022-09-01 09:46:18.04 +0400>,<she>,<DPX200>,
      <pk PHC0 = -0.3530217 PHC1 = -2.4 
       data hash MD5: 16K
       E9 74 64 0E D0 31 54 99 A7 B3 CE B6 5B 0F ED 50>)
(   4,<2022-09-01 09:46:21.20 +0400>,<she>,<DPX200>,
      <abs ABSG = 5 
       data hash MD5: 16K
       FF B3 55 ED 59 58 BF 87 93 20 9B D3 04 BE 68 6B>)
$$ ##END=
$$ 
$$ hash MD5
$$ 43 1E 73 5D 26 A8 84 7E 8A F6 A7 08 56 75 D5 41
##$RELAX= 
##$RELAX= 
##$RELAX= 
##$RELAX= 
##$RELAX= 
##$RELAX= 
$$ Bruker specific parameters
$$ --------------------------
##$DU= <F:/spectra>
##$EXPNO= 1
##$NAME= <H-F>
##$PROCNO= 1
##$TYPE= <nmr>
##$USER= <she>
##$AMP= (0..31)
100 100 100 100 100 100 100 100 100 100 100 100 100 100 100 100 100 100 
100 100 100 100 100 100 100 100 100 100 100 100 100 100 
##$AQSEQ= 0
##$AQ_mod= 1
##$AUNM= <au_zg>
##$AUTOPOS= <>
##$BF1= 200.13
##$BF2= 200.13
##$BF3= 200.13
##$BF4= 200.13
##$BF5= 200.13
##$BF6= 200.13
##$BF7= 200.13
##$BF8= 200.13
##$BYTORDA= 1
##$CFDGTYP= 0
##$CFRGTYP= 5
##$CHEMSTR= <none>
##$CNST= (0..31)
1 1 145 1 1 1 1 1 1 1 1 1 1 1 1 1 1 1 1 1 1 1 1 1 1 1 1 1 1 1 1 1 
##$CPDPRG= <>
##$CPDPRG1= <>
##$CPDPRG2= <>
##$CPDPRG3= <>
##$CPDPRG4= <mlev>
##$CPDPRG5= <mlev>
##$CPDPRG6= <mlev>
##$CPDPRG7= <mlev>
##$CPDPRG8= <mlev>
##$CPDPRGB= <>
##$CPDPRGT= <>
##$D= (0..31)
0 1.2 0 0 0 0 0 0 0 0.06 0 0.03 0 0 0 0 0.0002 0 0 0 0 0 0 0 0 0 0 0 0 
0 0 0 
##$DATE= 1662011160
##$DBL= (0..7)
120 120 120 120 120 120 120 120 
##$DBP= (0..7)
150 150 150 150 150 150 150 150 
##$DBP07= 0
##$DBPNAM0= <>
##$DBPNAM1= <>
##$DBPNAM2= <>
##$DBPNAM3= <>
##$DBPNAM4= <>
$$ [...]
##$SUBNAM3= <"">
##$SUBNAM4= <"">
##$SUBNAM5= <"">
##$SUBNAM6= <"">
##$SUBNAM7= <"">
##$SUBNAM8= <"">
##$SUBNAM9= <"">
##$SW= 18.0517283424941
##$SWIBOX= (0..15)
0 0 2 0 0 0 0 0 0 0 0 0 0 0 0 0 
##$SW_h= 3612.71676300578
##$TD= 16384
##$TD0= 1
##$TE= 0
##$TE2= 300
##$TE3= 300
##$TEG= 300
##$TL= (0..7)
0 120 120 120 120 120 120 120 
##$TP= (0..7)
150 150 150 150 150 150 150 150 
##$TP07= 0
##$TPNAME0= <>
##$TPNAME1= <>
##$TPNAME2= <>
##$TPNAME3= <>
##$TPNAME4= <>
##$TPNAME5= <>
##$TPNAME6= <>
##$TPNAME7= <>
##$TPOAL= (0..7)
0.5 0.5 0.5 0.5 0.5 0.5 0.5 0.5 
##$TPOFFS= (0..7)
0 0 0 0 0 0 0 0 
##$TUNHIN= 0
##$TUNHOUT= 0
##$TUNXOUT= 0
##$USERA1= <user>
##$USERA2= <user>
##$USERA3= <user>
##$USERA4= <user>
##$USERA5= <user>
##$V9= 5
##$VALIST= <valist>
##$VCLIST= <CCCCCCCCCCCCCCC>
##$VD= 0
##$VDLIST= <DDDDDDDDDDDDDDD>
##$VPLIST= <PPPPPPPPPPPPPPP>
##$VTLIST= <TTTTTTTTTTTTTTT>
##$WBST= 1024
##$WBSW= 4
##$XGAIN= (0..3)
0 0 0 0 
##$XL= 0
##$YL= 0
##$YMAX_a= 266621
##$YMIN_a= -435401
##$ZGOPTNS= <>
##$ZL1= 120
##$ZL2= 120
##$ZL3= 120
##$ZL4= 120
##$ABSF1= 15.7546
##$ABSF2= -2.29725
##$ABSG= 5
##$ABSL= 3
##$ALPHA= 0
##$AQORDER= 0
##$ASSFAC= 0
##$ASSFACI= 0
##$ASSFACX= 0
##$ASSWID= 0
##$AUNMP= <proc_1d>
##$AZFE= 0.1
##$AZFW= 0.1
##$BCFW= 0
##$BC_mod= 2
##$BYTORDP= 0
##$COROFFS= 0
##$CY= -3
##$DATMOD= 1
##$DC= 0
##$DFILT= <>
##$DTYPP= 0
##$F1P= 0
##$F2P= 0
##$FCOR= 1
##$FTSIZE= 16384
##$FT_mod= 6
##$GAMMA= 0
##$GB= 0
##$INTBC= 1
##$INTSCL= 3.70164e-10
##$ISEN= 128
##$LB= 0.24
##$LEV0= 0
##$LPBIN= 0
##$MAXI= 10000
##$MC2= 0
##$MEAN= 0
##$ME_mod= 0
##$MI= 1.114404
##$NCOEF= 0
##$NC_proc= -5
##$NLEV= 6
##$NOISF1= 3.799351
##$NOISF2= 2.8
##$NSP= 0
##$NTH_PI= 0
##$NZP= 0
##$OFFSET= 15.73257
##$PC= 1
##$PHC0= -18037.77
##$PHC1= 11.20069
##$PH_mod= 1
##$PKNL= yes
##$PPARMOD= 0
##$PSCAL= 0
##$PSIGN= 0
##$REVERSE= no
##$SF= 200.130007798866
##$SI= 16384
##$SIGF1= 3
##$SIGF2= 2
##$SINO= 5.538805
##$SIOLD= 16384
##$SREGLST= <1H.CDCl3>
##$SSB= 0
##$STSI= 16384
##$STSR= 0
##$SW_p= 3612.71676300578
##$SYMM= 0
##$S_DEV= 0
##$TDeff= 16384
##$TDoff= 0
##$TI= <>
##$TILT= no
##$TM1= 0
##$TM2= 0
##$TOPLEV= 0
##$USERP1= <user>
##$USERP2= <user>
##$USERP3= <user>
##$USERP4= <user>
##$USERP5= <user>
##$WDW= 1
##$XDIM= 16384
##$YMAX_p= 287802355
##$YMIN_p= -158861
$$ End of Bruker specific parameters
$$ ---------------------------------
##NTUPLES= NMR SPECTRUM
##VAR_NAME=  FREQUENCY,     SPECTRUM/REAL,   SPECTRUM/IMAG
##SYMBOL=    X,             R,               I
##VAR_TYPE=  INDEPENDENT,   DEPENDENT,       DEPENDENT
##VAR_FORM=  AFFN,          ASDF,            ASDF
##VAR_DIM=   16384,         16384,           16384
##UNITS=     HZ,            ARBITRARY UNITS, ARBITRARY UNITS
##FACTOR=    0.220516191357247, 1,           1
##FIRST=     3148.5592956603, 0,             0
##LAST=      -464.157467345482, 0,           0
##MIN=       -464.157467345482, -158861,     0
##MAX=       3148.5592956603, 287802355,     0
$$ Real data points
##PAGE= N=1
##DATA TABLE= (X++(R..R)), XYDATA
$$ [...]
9470 344618 310973 302489 335710 357476 389536 395395 393720 379171 391635 412145 444639 473785
9458 473785 509469 534386 538726 518659 549275 583476 587785 582178 582528 609307 579710 544387 526733
9445 526733 527454 500253 530625 566752 557752 588700 595217 643358 618729 590669 551757 539426
9433 539426 506964 456965 498110 495191 541404 522451 477374 488906 555583 582875 569952 588621
9421 588621 597997 622785 635216 589277 616860 651742 659208 674414 771463 795061 826991 821479
9409 821479 790667 772546 773877 803777 820569 811644 773215 776668 779194 803960 803172 788467 770526
9396 770526 680151 656835 634982 656551 713701 682917 657675 679509 692021 667107 650005 663629
9384 663629 602379 587794 576472 637490 633211 602318 632568 590452 640296 657838 644922 663172
9372 663172 692555 680397 716146 679660 713216 744119 733415 749695 798017 867720 801991 807235
9360 807235 820888 839683 826640 797116 822044 794857 786110 782637 763608 744981 764111 790059
9348 790059 757841 750069 756430 794178 806625 761835 800288 784458 755948 817823 814779 735818
9336 735818 748285 738163 777452 803464 829171 867518 849975 784477 736795 786221 836624 853021
9324 853021 902348 925333 944760 904957 882701 899546 899115 921872 941341 937465 897491 942985
9312 942985 970179 935417 994489 1021980 993650 1015797 1020228 1011013 976100 993857 1041410 1014409
9300 1014409 994611 1044171 1014218 1031834 1055737 1049700 1108381 1121732 1149826 1096983 1113641 1161469
9288 1161469 1195633 1225935 1231600 1149715 1125435 1180506 1193557 1206375 1195842 1233751 1249054 1244154
9276 1244154 1257408 1296764 1324415 1291055 1276274 1286530 1329010 1367048 1323188 1305063 1324937
9265 1324937 1327024 1329704 1351908 1287585 1295065 1332786 1334377 1368015 1468322 1463585 1509876 1560513
9253 1560513 1618883 1693285 1742911 1763380 1817739 1982009 2034494 2027989 1997039 2059444 2117827
9242 2117827 2135482 2176139 2136652 2055510 1984465 1861514 1859844 1882752 1866399 1874773 1845239 1829078
9230 1829078 1833570 1825615 1798390 1791151 1813071 1833285 1801788 1840542 1919983 1980330 2016596 2100898
9218 2100898 2137388 2187859 2255449 2325836 2379352 2427326 2458383 2468667 2573742 2666739 2769553
9207 2769553 2732575 2720873 2681532 2646933 2622991 2542618 2415376 2341107 2317060 2263902 2239946
9196 2239946 2267206 2255088 2266929 2313898 2282814 2279089 2340267 2356265 2348665 2367864 2425248 2394961
9184 2394961 2356823 2368921 2435516 2523813 2498582 2554410 2557380 2556619 2565206 2620170 2625443 2602880
9172 2602880 2647113 2667222 2582547 2641410 2691056 2675450 2731337 2733100 2730100 2733308 2727594 2730582
9160 2730582 2798533 2865574 2887311 2927655 3001362 3070039 3066316 3100925 3153680 3210885 3255558 3287320
9148 3287320 3308565 3365690 3414177 3474350 3526323 3607506 3631374 3696555 3806815 3846426 3925570
9137 3925570 4009751 4096282 4102672 4132271 4218062 4355017 4440827 4519343 4657102 4761241 4846474
9126 4846474 5000625 5109068 5215116 5335867 5468634 5570432 5710250 5835500 5972309 6206033
9116 6206033 6448216 6626651 6804320 7107702 7349458 7577213 7869972 8145586 8495545 8856832
9106 8856832 9201289 9601759 10033406 10494870 10999703 11525137 12068764 12559432 13136081 13781716
9096 13781716 14562786 15373715 16234068 17148359 18192301 19444320 21018297 22991496 25110499
9087 25110499 27209872 29533476 32385648 35715775 38979952 41302637 42060241 42459213
9079 42459213 43841787 46222657 49101277 51066643 50437038 47718600 43810443 39647064
9071 39647064 36322095 33930622 32413224 31516423 30967953 30196804 29110090 27976596 27100057
9062 27100057 26590991 26338196 26310945 26514107 27014365 27718063 28683759 30140037 31880429
9053 31880429 34169056 36993365 39966745 42752408 45578780 48181084 50305184 52322662
9045 52322662 55281955 59105610 63026729 65407499 66163262 66967230 67280362 66354559 63805145
9036 63805145 58988232 53382528 48865741 45467151 42938169 40907750 38980390 37631007
9028 37631007 37157735 37190794 37379997 36757342 34981253 32519910 29768654 27223760 25118376
9019 25118376 23492736 22337717 21453192 20742548 19944564 19052844 18235815 17558643 17019318
9010 17019318 16574422 16327418 16210953 16188524 16338809 16614652 17164995 17905186 18830819 19925844
9000 19925844 21095095 22163000 23104514 23927384 24603240 25478291 26707953 28101819 29344034
8991 29344034 29807693 29865705 29854112 29374280 28270009 26280446 23578762 20724068 18297290
8982 18297290 16309813 14772744 13569546 12626857 11937434 11366630 10939013 10479839 9977550
8973 9977550 9419697 8865374 8374812 7950681 7527683 7287951 7013746 6768578 6511338 6305833
8963 6305833 6123401 5976460 5881764 5726797 5637574 5511668 5395327 5304676 5210504 5053278
8953 5053278 4927298 4868478 4776569 4713125 4682933 4582127 4548099 4486838 4423492 4361817 4357354
8942 4357354 4345145 4314268 4333755 4344786 4294479 4278572 4322462 4308354 4294381 4280336 4282862 4334495
8930 4334495 4349878 4378789 4324732 4345598 4343219 4328017 4402140 4444320 4458804 4509559 4543991 4579923
8918 4579923 4614658 4640107 4727664 4737908 4754662 4838138 4911539 4997773 5110378 5179804 5244551
8907 5244551 5336847 5449810 5506130 5588490 5731353 5851712 5944287 6025207 6150320 6258969
8897 6258969 6376763 6528094 6638399 6750147 6956830 7135018 7344488 7533487 7676664 7898248
8887 7898248 8101262 8296794 8534658 8773102 9045204 9280115 9550022 9859331 10134615 10503032
8877 10503032 10872044 11290804 11669012 12079785 12519754 12971396 13513651 14115561 14801196
8868 14801196 15738504 16786357 18058918 19519601 21007353 22425497 23900639 25734456
8860 25734456 28001776 30511599 32886898 34724415 36416715 37881512 38392476 37427380
8852 37427380 35350156 33272535 31709284 30796524 30480205 30798341 31293825 31556468 31446710
8843 31446710 31227915 31161147 31322410 31696863 32338497 33177864 34134294 35372517 36827547
8834 36827547 38175274 39201990 39900953 40535906 41615572 43415453 46014159 49312298
8826 49312298 53214031 57462315 61857216 65342183 68007229 69241343 68091250 65068738
8818 65068738 61141158 57800239 55461766 54041225 52897538 51011361 48257539 45825702
8810 45825702 43979683 42700023 41868724 41468553 41502744 42074930 42944104 43839614 44502754
8801 44502754 44658339 44125460 43056626 41972095 41232636 41006225 41358840 42051325 42630373
8792 42630373 42836983 42542807 42235868 42686837 43762362 45212816 46547214 47385841 46962440
8783 46962440 44966204 42092167 38443492 34913085 31968616 29712484 28177191 27238807
8775 27238807 26822716 26727286 26605722 26194803 25638272 25243147 25061845 25124924 25406593 25609282
8765 25609282 25529219 25032183 24138935 22887003 21329377 19718458 18272472 17010165 15996035
8756 15996035 15166198 14455704 13866395 13339339 12845952 12334739 11920927 11562885 11273918
8747 11273918 11010353 10721871 10523218 10317989 10147242 10049090 9944687 9829155 9705299 9707803
8737 9707803 9670316 9631870 9646104 9643992 9687121 9810348 9902299 10004394 10085885 10179759 10272160
8726 10272160 10421097 10572275 10715429 10922281 11106356 11376733 11655494 12004465 12394951
8717 12394951 12868622 13414857 14082512 14904990 15941516 17258767 18826926 20765172 22936913
8708 22936913 25089519 26938812 28581290 30713334 33679991 37240114 40520350 42356183
8700 42356183 41586113 38804048 36298162 34402511 32933574 31369085 29772582 28591138
8692 28591138 27375132 26007059 24693496 23672724 22943691 22360703 21839454 21318324 20839345
8683 20839345 20600600 20563323 20817006 21483905 22343403 23188702 23739513 24113168 24803569 25922671
8673 25922671 27755620 30169689 32966987 35455367 36935028 37207021 36008907 33789000
8665 33789000 31358981 29360579 28151070 27557436 27410804 27470172 27179277 26299855 24678001
8656 24678001 22748163 20965958 19426546 18146715 17189980 16448335 15826702 15345979 14848498
8647 14848498 14385555 14096527 13941607 13976424 14198987 14518584 14820285 14912727 14853098 14966841
8637 14966841 15319901 15724375 15899495 15515297 14962217 14515315 14185710 13798158 13292584
8628 13292584 12653863 12054338 11509394 10862550 10178563 9596569 9060681 8607401 8135600
8619 8135600 7708678 7240576 6745570 6373570 6022429 5652374 5320742 5091413 4853184 4635839
8609 4635839 4457623 4271267 4139989 3987922 3833360 3709973 3541299 3446338 3381776 3242307
8599 3242307 3133055 3061223 2968796 2812255 2751724 2691689 2650813 2590702 2549123 2492140 2417509
8588 2417509 2335034 2275679 2266571 2211821 2159663 2041644 2015829 2027702 1981293 1971914 1891512 1796894
8576 1796894 1820607 1756027 1761403 1729437 1676844 1638906 1629705 1571037 1571378 1569598 1557966 1589945
8564 1589945 1583393 1597070 1558687 1587538 1580179 1559651 1518483 1501925 1499263 1521764 1520111 1465501
8552 1465501 1435417 1463168 1469638 1415160 1398743 1310728 1241840 1194384 1160092 1101077 1105492 1078327
8540 1078327 1044898 957267 949234 947814 941558 914900 921190 906225 849811 787898 781829 805521
8528 805521 822253 788799 792678 814358 750760 718518 761456 711279 665882 658444 616801 616269
8516 616269 660557 618861 611417 618089 591955 595404 550283 593454 542254 502165 503405 559689
8504 559689 505203 511737 489723 464667 471764 501408 544211 520330 516118 477415 529365 552360
8492 552360 519897 538892 563314 530460 526738 587370 572969 579488 545925 489654 453206 479831
8480 479831 484590 485242 488292 429964 380653 381316 365921 394416 382901 390926 417715 378823 399621
8467 399621 380867 395186 447600 441243 432806 460611 491356 428229 474646 469910 470479 502585 459683
8454 459683 498336 520470 502153 472090 412769 408555 442734 480598 469241 444612 425637 397855
8442 397855 433426 407842 380723 380822 351273 358748 320441 319659 327718 307431 373797 350069 288343
8429 288343 266803 258288 257211 305100 268905 276180 317327 275964 268499 293988 278971 277236 253295
8416 253295 289788 261692 247833 261154 271009 285000 236932 199184 172987 207002 241107 230501
8404 230501 194726 228996 223776 203277 169490 165306 158462 143863 152559 67153 113822 173796
8392 173796 175924 184733 131025 144936 192561 176060 142557 118837 81902 105903 59881 52503
8380 52503 103240 73212 84695 84374 97881 140002 100591 97262 58568 65658 101499 164657 70403
8367 70403 39943 67172 27018 46827 6911 15602 10460 86906 67859 97697 97357 67490 82798
8354 82798 73958 79269 70100 44853 50672 48895 43476 27623 46269 74942 84004 31861 64880
8341 64880 73484 73360 77187 73281 94983 102431 96001 80269 96348 77200 98172 41243 57028
8328 57028 70655 108452 103980 71565 90651 89027 80857 87589 46787 57569 41410 45855 84590
8315 84590 63937 55239 102255 156467 111020 113827 128810 116965 152821 131333 101917 160877
8303 160877 166256 141834 147484 119555 90124 153036 99768 64952 135081 84878 89755 114793
8291 114793 55729 83966 108163 74757 58430 29007 53534 84380 56440 26739 22969 644
8279 644 -14583 -30271 16839 43144 23036 -9465 -8719 -17435 -17978 18681 48397 53653 14152
8266 14152 47577 28826 32171 500 -42077 -45849 -21900 -51403 -71125 -22537 -35679 -66310
8254 -66310 -50653 -80028 -28568 -7608 -38990 -3448 -2205 29854 53888 -22381 -62448 -71513
8242 -71513 -48498 -57660 -52963 -26807 -9453 -16499 -112119 -144057 -45036 -10080 -4919 24319 -37602
8229 -37602 -49761 -43228 -30975 -52199 -37685 -30524 -48935 -40383 -45489 -92857 -63712 -86911 -52200
8216 -52200 -43203 -19478 -43004 -89247 -156257 -122682 -129570 -57078 -53525 -81668 -114932 -91136
8204 -91136 -72469 -54722 -110281 -113398 -73052 -88164 -87790 -67106 -38278 -51465 -81018 -14528
8192 -14528 403733 221711 33549 19897 3173 -38093 -35634 -58583 -99697 -128347 -64958
8181 -64958 -50354 -46297 -71707 -53378 -63726 -94704 -100876 -110976 -77183 10190 20370 -49338
8169 -49338 -35004 -71144 -58666 -78292 -81511 -110273 -76096 -57906 -58984 -71970 -106308 -69337
8157 -69337 -53164 -61198 -79361 -78569 -69407 -53684 -105051 -105882 -71178 -83483 -110021 -140769 -71218
8144 -71218 -54688 -60852 -83934 -56651 -50351 -60524 -107895 -113386 -73628 -60284 -29869 -36740 -30869
8131 -30869 -34934 -46337 -66090 -101726 -93418 -132782 -90569 -96743 -119698 -151676 -133449 -76293
8119 -76293 -39722 -51272 -41269 -74829 -131973 -147386 -141123 -80618 -78735 -71538 -112703 -127325
8107 -127325 -158861 -152133 -80021 -62876 -81026 -50184 -80689 -98723 -102314 -106340 -108051 -71712
8095 -71712 -75622 -91274 -147976 -88815 -61014 -136281 -108985 -118836 -126142 -152801 -126393 -64142
8083 -64142 -72702 -106546 -72585 -39857 -45590 -57984 -65260 -138378 -105172 -119023 -121985 -70722 -84128
8070 -84128 -94830 -98997 -131696 -156553 -108725 -68048 -45393 -87132 -83516 -93740 -140657 -118799
8058 -118799 -68119 -110163 -78443 -62599 -71105 -38867 -40252 -84528 -97096 -59399 -66416 -69243
8046 -69243 -126638 -89984 -38114 -71195 -96618 -59666 -69515 -94919 -87797 -101768 -113279 -94804
8034 -94804 -105617 -105947 -93249 -93150 -77195 -63333 -69890 -62056 -82806 -83920 -97411 -130714 -97879
8021 -97879 -65471 -73569 -129587 -87358 -81641 -77402 -99406 -105699 -116334 -97558 -31235 -80257 -125864
8008 -125864 -137992 -114753 -90397 -88084 -106243 -111386 -101528 -98134 -115629 -103230 -108571 -98455 -92749
7995 -92749 -89493 -85279 -90739 -100189 -126148 -95975 -77258 -107734 -110192 -122414 -131608 -80751 -103343
7982 -103343 -115192 -137197 -81248 -83344 -61207 -16359 -30565 -66580 -42981 -40253 -92159 -87447
7970 -87447 -68669 -44957 -43803 -76740 -71688 -32321 13675 -14935 5790 -8058 -57484 -70253
7958 -70253 -86615 -57568 -109318 -81495 -87255 -44696 -61878 -78253 -89361 -91330 -55059 -39870
7946 -39870 -40046 -45971 -65595 -54185 -12337 -9166 -54192 -83479 -86119 -69201 -41929 -33495 -28841
7933 -28841 -46839 -66390 -91634 -94559 -105673 -86259 -68590 -94411 -44022 -43448 -94762 -20092
7921 -20092 -37348 -54647 -99504 -98014 -76972 -38395 -69979 -66119 -83375 -48185 -18173 -66950
7909 -66950 -112672 -135742 -49395 -11387 -16415 -39889 -58631 -79111 -84128 -93649 -48598 -47911 -83789
7896 -83789 -113085 -86425 -110941 -81485 -81784 -109429 -113253 -104663 -85556 -55732 -133508 -71687 13698
7883 13698 -3741 -29784 -62842 -65741 -79458 -96884 -127142 -82422 -50770 -68601 -7601 -25896
7871 -25896 -57375 -81527 -39678 -21011 -28163 -51035 -27906 -42810 -55876 27735 -1595 -103455
7859 -103455 -96410 -42629 -3524 30296 3314 -2150 -18205 -78527 -77124 -76468 -82058 -58693 -19381
7846 -19381 -19833 -35633 -53594 -81238 -69846 -75020 -52237 -44624 -3867 -34055 -36740 -26528 -64308
7833 -64308 -11777 15844 -68249 -80692 -118940 -87653 -66198 -1703 -25540 -20417 -31697 -32350
7821 -32350 -60231 -59963 -60773 -12498 2761 -40592 -93504 -52761 -26368 7585 21036 -14102 -47511
7808 -47511 -34422 5019 -522 -78260 -15183 -21945 -46355 -36648 -34867 6356 -4825 -16053 -57337
7795 -57337 -37119 -41918 -35515 -62551 -39120 -89367 -67467 -25449 18995 -29416 11895 10764
7783 10764 -47087 -81064 -87926 -76314 -90560 -62293 -51819 -72647 -47150 -47811 -21266 -22718 -56823
7770 -56823 -24348 -28127 -44284 -61552 -42627 -30908 -58191 -27379 -8535 8791 -34673 -30431
7758 -30431 -28899 -1294 -27953 -25430 23918 -10272 -39823 -31679 -24543 -25609 -26044 -33002 -19230
7745 -19230 -13433 2918 -17219 -55815 -9041 -13063 -34508 -79764 -17548 -66237 -78784 -31184
7733 -31184 -71581 -50128 -60090 -47911 -45964 -46783 -80465 -50146 -10796 -4870 -4968 -26917 3736
7720 3736 -26368 -91186 -72133 -114291 -50871 -10981 -26665 -70595 -33615 -35511 -59726 -77062
7708 -77062 -98018 -65453 -45497 -27547 -39674 -34066 -13101 -53903 -79269 -76660 -91663 -48051
7696 -48051 -32507 8496 6965 -65003 -65433 -53454 -64475 -51467 -37431 -40773 -23716 12385 -15635
7683 -15635 -18814 -40964 -72006 -22287 10965 -6569 9519 90061 48839 -9803 -22693 -27567
7671 -27567 -41074 -40223 17205 -13106 8082 40555 17191 23546 14268 62457 31165 18223 61475
7658 61475 64415 36609 17818 23809 67441 39613 51290 93906 66617 41183 16414 25515
7646 25515 30430 35689 34466 50354 40493 19270 22020 28897 16924 -6385 -5925 -3380 22865 4775
7632 4775 28329 18613 31590 76275 59393 72492 107842 182451 123669 99607 66913 76776
7620 76776 142724 177016 157255 152959 175071 125785 154722 117892 96840 132138 197074 212947
7608 212947 143232 192090 194107 139241 175827 217861 244669 227711 232665 252135 243599 312060
7596 312060 381025 389712 389994 412409 449319 398260 404086 394282 394612 397205 330724 316787 310664
7583 310664 283455 210680 219332 204862 186594 190379 206159 194475 162101 143177 114903 82082
7571 82082 87182 111617 135834 101871 77570 83048 78791 77383 99121 116687 113388 141835 169453
7558 169453 154020 152499 192063 189318 194153 211792 190027 174638 188770 173307 131710 131691 199428
7545 199428 221275 153685 142060 141597 171798 179547 157719 119524 108170 128063 123648 105200
7533 105200 75415 79256 181276 225703 161220 201897 185266 136812 140667 143387 146637 193259
7521 193259 221418 250106 254783 303595 311315 319120 334231 368942 405770 433315 423587 452654
7509 452654 525963 544883 550446 546503 489657 475161 433798 366886 360515 319638 314839 354790
7497 354790 316916 243586 228782 206333 244089 250140 228183 228408 200253 185395 176940 134689
7485 134689 158735 200672 178622 139382 159241 181415 152689 136209 163718 170463 177414 185454
7473 185454 125751 105051 140358 107676 121744 149165 120009 128781 175774 230520 255795 239688
7461 239688 198576 161186 183946 203842 159377 197238 231498 248112 258535 247184 227096 213175
7449 213175 220662 221252 236261 217467 192630 209345 167799 153779 183221 172180 194988 149165
7437 149165 156016 152500 161008 178627 170955 179403 195588 165201 129223 78086 95411 124240 149389
7424 149389 112010 85908 99865 107983 74135 62066 100459 124838 141742 139933 138021 115541
7412 115541 136868 125768 101709 134645 128239 115089 137973 101637 81100 37730 68930 116883
7400 116883 93990 77261 72661 111448 100361 95340 91924 130244 121987 103314 130403 82417
7388 82417 117765 108121 175984 140394 94692 96476 133699 145339 115459 119377 117176 122686 114024
7375 114024 117329 115333 83763 95423 108286 132556 108507 132936 169742 141215 136975 132485
7363 132485 138983 137419 186179 151762 129708 114689 128902 123658 103176 119815 72080 93675
7351 93675 165714 185451 179130 160243 140977 152155 174813 141461 160380 154687 194771 226851
7339 226851 156371 147714 162476 195748 210414 184825 159479 155108 153799 202283 226623 231237
7327 231237 204844 240540 174378 192675 217571 227410 205733 219946 262583 315929 306743 245003
7315 245003 206611 182433 269144 269291 338347 341674 309537 310233 286066 286829 265367 259730 304664
7302 304664 309808 317607 270631 266472 279996 280429 222921 221215 230819 299896 299468 256615 233502
7289 233502 216227 213512 251812 250928 258926 273740 294712 353479 352310 320946 314485 384779 427281
7276 427281 430470 431930 349097 323587 367195 389928 422614 404726 409340 389053 406210 367047
7264 367047 312587 338035 424987 494270 470188 436518 458316 495075 501644 462170 468529 487708
7252 487708 511448 474147 458274 467838 426483 452386 502960 486799 469294 510377 502843 498351
7240 498351 467375 516297 531325 532205 564089 501575 478292 537753 512442 504377 570354 597464
7228 597464 582059 578331 635574 699352 737238 732824 739855 725971 734896 757721 748004 795940 817157
7215 817157 795192 743211 755930 807349 835484 752184 771836 802281 801985 845554 880110 927694
7203 927694 954103 957109 970666 987918 999708 1028780 980526 992423 1008735 1050063 1076280 1095027
7191 1095027 1109381 1163273 1221885 1245319 1308213 1337374 1356501 1436755 1483848 1567999 1609264
7180 1609264 1652246 1720074 1751391 1762747 1800875 1865752 1986506 2078840 2080710 2112554 2171345
7169 2171345 2172835 2232151 2287337 2302022 2354268 2404794 2496667 2552006 2614193 2729534 2850694
7158 2850694 2970227 3050593 3056319 3114476 3199574 3264212 3354301 3475019 3542147 3617921 3733707
7147 3733707 3870214 3978598 4106923 4291075 4469467 4711751 4887064 5072523 5276126 5481888
7137 5481888 5708892 5969608 6250359 6598747 6953960 7393782 7809604 8228494 8681274 9199797
7127 9199797 9666453 10158200 10681954 11357235 12235624 13281962 14475622 15910910 17634200
7118 17634200 19787331 22314871 25502944 29515544 34731238 41308012 49284303 57729450
7110 57729450 65106323 69451478 69305461 65140192 58026035 50050761 42352270 35694191
7102 35694191 30182000 25820169 22450044 19833326 17767639 16158140 14788862 13638321
7094 13638321 12602675 11716103 10956951 10346487 9776856 9256657 8885162 8596001 8368189
7085 8368189 8256812 8154834 8010904 7802763 7620598 7476737 7347603 7296118 7248186 7272031
7075 7272031 7365691 7431026 7517067 7655293 7910459 8160920 8493030 8867124 9409415 10027383
7065 10027383 10613803 11100865 11626204 12086385 12669488 13493852 14616480 16208353 18196149
7056 18196149 20449113 22798268 24777528 25968514 26204977 25717044 24792024 23471582 22024894
7047 22024894 20336953 18510470 16825422 15219903 13628075 12259353 10936621 9781843
7039 9781843 8856539 8034301 7282854 6679682 6116651 5636182 5259435 4979350 4666903 4438894
7029 4438894 4218387 4013341 3804463 3578951 3437808 3310542 3149750 2997639 2899601 2767535
7019 2767535 2616307 2526108 2449512 2348836 2303278 2265147 2162852 2126713 2101642 2073155 2049743
7008 2049743 2042330 1959207 1941278 1896422 1806443 1752470 1722973 1641133 1535095 1484544 1432036
6997 1432036 1350599 1293923 1312885 1335668 1311228 1298582 1296115 1271894 1264474 1231909 1247601 1245907
6985 1245907 1190985 1152617 1126028 1162273 1132772 1116831 1128042 1120710 1129410 1156314 1157611 1166179
6973 1166179 1151555 1229355 1282227 1267868 1259590 1299432 1255266 1128639 1046326 1091939 1101392 1029306
6961 1029306 1023274 961489 889958 787717 750492 741933 705405 674829 686751 680479 658118 628281
6949 628281 605416 594569 591298 504887 472698 463874 508805 474182 496083 482799 463051 466829
6937 466829 450566 415337 426069 422169 429946 473381 444883 442919 474512 486038 528726 506993
6925 506993 470847 420495 384367 424607 414532 385518 324788 338295 323447 288839 259171 253189
6913 253189 276643 297868 276236 261092 193137 204807 222000 189464 200029 199832 223856 251254
6901 251254 189199 194200 210500 200059 212507 226121 190667 203079 222916 173120 208527 194752
6889 194752 213772 212246 239186 260881 248219 221381 225975 287261 279897 221860 227860 233643 209430
6876 209430 199240 218221 220145 174331 172679 197242 197674 253101 235442 210401 179759 166160
6864 166160 136744 131580 140667 176402 194244 212564 196633 164909 191765 195420 210263 205839
6852 205839 210116 177842 171723 150058 198104 190182 164414 195612 219849 208902 252632 251163
6840 251163 225766 216269 255221 282666 237534 246793 304397 293708 301810 374877 321885 320963 352069
6827 352069 377202 325611 297756 297673 298698 295653 268583 301147 350537 348921 326410 329913 362947
6814 362947 363978 431637 439290 441790 519699 482510 467870 441740 507497 506275 501292 483798 464041
6801 464041 451540 412497 350587 324995 394858 373789 326341 306148 330254 301898 268433 280997
6789 280997 295352 315447 286035 251592 227944 219692 233191 231545 231998 252715 177837 204365
6777 204365 177260 160390 207635 206012 179799 227542 235445 252009 290552 268802 236177 301635
6765 301635 332336 325070 327461 343803 372015 365142 364238 360245 373948 417431 408430 441344 454791
6752 454791 510057 550164 508429 496561 445132 450773 413682 379584 350778 338316 306041 275427
6740 275427 238373 255416 280572 304712 337583 312937 263755 248441 225331 250456 205164 253556
6728 253556 279372 255390 255401 237742 250634 273428 242064 274713 266627 270167 273403 308625 308916
6715 308916 279130 346445 361788 331472 384697 422648 497248 520220 486033 481399 454476 412032
6703 412032 402113 436169 347139 265756 297046 302744 310790 223494 194865 226440 191629 143580
6691 143580 133040 187111 220886 243798 242322 134782 77777 123527 162228 218385 201730 183815
6679 183815 194082 174878 178973 235293 206913 181189 186417 200613 197291 184673 170855 166207
6667 166207 227224 234870 210945 269889 264769 268118 263707 231231 256632 246996 269544 240443 208611
6654 208611 248358 238379 266549 283303 274400 260627 306014 192195 189873 265620 238500 212769
6642 212769 219204 203290 210805 204364 225153 238478 191586 153689 184119 184312 191213 209827 199884
6629 199884 188343 183275 128972 112159 160408 177814 165725 155754 151028 171573 187822 150673
6617 150673 196206 195258 163839 201342 201495 179952 187404 172703 152936 138063 98699 100579 106579
6604 106579 110943 120752 162802 239106 216823 161303 187255 269597 238439 185155 187351 152718
6592 152718 151451 146847 143906 173647 167572 153092 96743 126198 166857 147521 155278 179337 132089
6579 132089 161093 118573 66258 92884 136614 139392 161179 156385 153014 127265 122872 87418
6567 87418 69559 117485 117804 164900 117726 119546 119357 125120 109884 117126 141351 135142 117744
6554 117744 121203 176087 192392 162467 167365 168056 140690 154270 170051 163193 153864 153662 102468
6541 102468 103001 78257 77181 76410 104014 106949 148600 110840 84716 123395 119473 74620 37745
6528 37745 75785 152653 130947 106647 161491 177481 130907 110819 88237 115599 91608 55302
6516 55302 83989 55635 105470 81296 57045 94774 139634 133260 113502 158769 159416 145958
6504 145958 134935 153936 188236 135473 130620 116349 178619 143762 162476 157629 136294 155137
6492 155137 134796 92383 117401 176005 143550 140862 132388 110696 104503 150865 170889 159958
6480 159958 217538 214664 212593 175924 185944 202029 216903 166829 162305 173311 177900 181528 192366
6467 192366 248612 210063 231882 228785 236242 223835 191109 199595 195028 222554 231841 255103 269447
6454 269447 212507 193848 201599 181967 221720 222616 203796 223213 205381 214877 264431 295264
6442 295264 287946 277975 240262 195885 187358 233800 234302 266572 254543 244311 251797 275144 246847
6429 246847 240008 239062 293039 325501 358606 356448 307712 321605 330596 312913 301242 301158 279444
6416 279444 259109 311882 359045 352565 308679 333347 344154 291897 256657 258288 291989 286235
6404 286235 353111 414260 356916 400002 373581 352861 359224 350865 319963 349020 360321 345039
6392 345039 444472 460796 450460 422616 460824 443380 436651 469371 452359 389467 339759 340021
6380 340021 350191 305796 319011 326824 301126 257402 254803 290029 304625 281092 293071 232557
6368 232557 209805 238183 289948 325241 338961 284926 292730 315011 322548 334005 359604 385217
6356 385217 398055 402114 384351 394181 374542 379966 368007 390053 434132 365830 396359 379815
6344 379815 422466 414309 408298 396672 366730 438046 458686 459262 451165 451852 451364 466299 410306
6331 410306 433723 444993 438098 406682 413110 392523 418132 406887 415303 448507 469484 480837
6319 480837 446545 467521 497349 533378 527528 496634 512055 499833 521296 534430 581630 570456
6307 570456 588154 583544 543600 528972 507759 555164 571174 575660 592449 579219 550690 547846
6295 547846 540325 540544 568396 573261 546863 530072 530363 534828 553146 532730 555521 562141 503663
6282 503663 514119 512843 529098 563204 554889 587669 618642 622699 598939 660504 657824 639388
6270 639388 625980 650692 673903 720281 722432 652156 692195 727356 709314 771342 770199 729469
6258 729469 763998 786318 830364 779724 787830 851250 845268 875319 999086 1059166 1082487 1173900
6246 1173900 1189218 1143026 1097970 1065122 1018685 958844 902554 816739 824373 858778 839249 816970
6234 816970 787992 746954 714121 671123 666432 697209 738619 706416 646924 667258 700301 669903
6222 669903 665521 675539 636610 682172 695801 677513 730414 665150 645702 695357 664221 658118
6210 658118 709616 728947 704859 719914 724947 731784 763742 743233 723237 716543 709076 677117
6198 677117 720638 726516 717838 774720 752712 712117 721315 703141 766260 805895 795166 755997
6186 755997 743705 780136 754861 735392 748133 741591 784804 779812 836342 868113 911763 888034
6174 888034 870269 848852 842394 908762 928616 924083 920081 924661 906313 903854 929883 1037854
6162 1037854 1056412 1080368 1088050 1084487 1097922 1083291 1059428 1061745 1056782 1110910 1114022 1113068 1174941
6149 1174941 1182337 1165783 1180389 1245777 1231097 1273078 1310654 1302317 1330004 1355076 1422878 1443762
6137 1443762 1495454 1563514 1595488 1595886 1603897 1661389 1677187 1693589 1773254 1807744 1731703 1681608
6125 1681608 1751304 1798318 1806642 1841080 1927289 1996133 2029546 2053519 2087605 2135545 2170934 2204459
6113 2204459 2216526 2256854 2342947 2429477 2511796 2542741 2615470 2695924 2708015 2747567 2806317
6102 2806317 2863379 2985091 3020034 3101780 3237431 3370599 3488573 3633533 3782541 3888497
6092 3888497 4064506 4211290 4393333 4612374 4820666 5100982 5392306 5675254 6044988 6513538
6082 6513538 7048785 7654542 8382973 9260042 10334698 11684069 13392653 15448636 17690706
6073 17690706 19622713 20526031 20280505 19286193 18143702 17139634 16429031 16032295 16088656
6064 16088656 16648894 17781691 19304271 20733727 21331614 20786579 19227033 17322056 15512892
6055 15512892 13929219 12532586 11254085 10289135 9552624 8993057 8580928 8297767 8093357
6046 8093357 7915772 7794327 7748632 7714682 7697704 7724701 7753478 7783568 7906953 8033719 8256889
6035 8256889 8524898 8831441 9222386 9678174 10220709 10919171 11702697 12657783 13771064
6026 13771064 15243894 17131538 19474372 22303758 25095643 27015888 27343965 26321976
6018 26321976 24748586 23179575 21973483 21187829 20865085 21225589 22335146 24141760 26150641
6009 26150641 27446181 27326554 25681301 23122905 20456431 17958369 15749196 13823572
6001 13823572 12165905 10850305 9801951 8990942 8368789 7838836 7370365 6889927 6528116
5992 6528116 6318786 6001011 5751510 5529760 5307907 5123062 5041087 4943413 4823514 4689541
5982 4689541 4597269 4521303 4420491 4329351 4266058 4148331 4079610 4007958 3949545 3882774 3793803
5971 3793803 3682932 3635474 3596704 3487379 3445291 3398645 3361125 3364618 3355544 3337579 3283903
5960 3283903 3227447 3156829 3131127 3115989 3109087 3095069 3116954 3103062 3110126 3142277 3133646 3171050
5948 3171050 3110726 3142701 3167580 3112736 3083386 3117976 3193299 3209063 3206781 3200370 3183624 3219269
5936 3219269 3276468 3331406 3366534 3375416 3380338 3415908 3460364 3446369 3427096 3425446 3504031 3493431
5924 3493431 3466336 3494072 3496558 3526184 3577897 3646817 3680868 3741082 3791274 3874782 3863719 3894359
5912 3894359 3907642 3932671 3932010 3954901 3942104 3952880 3944360 3964084 4036011 4074331 4098626 4109184
5900 4109184 4072170 4131522 4158859 4217169 4333295 4410564 4508047 4601431 4727395 4902438 5076252
5889 5076252 5262889 5381623 5477507 5534126 5517358 5551592 5515202 5510339 5584543 5616962 5705070
5878 5705070 5717323 5757980 5817089 5875441 5989947 6104323 6222874 6296694 6393196 6535553 6602580
5867 6602580 6721192 6921979 7119317 7319829 7435882 7662772 7911483 8214897 8579190 8973818
5857 8973818 9385904 9766484 9975985 10065942 10138017 10129086 10211347 10345030 10431173 10538259 10721983
5846 10721983 10891459 11060555 11288899 11475799 11699294 11979900 12232329 12564000 12949541
5837 12949541 13345395 13797641 14332412 14934125 15549135 16230804 16969684 17859364 18878794
5828 18878794 19987654 21310168 22827823 24531364 26341498 28161552 30009945 31937390
5820 31937390 33991533 36043635 38054490 39929190 41609215 42997177 43943030 44277847
5812 44277847 44129932 43670543 43020877 42147327 41003715 39672101 38175873 36623554 35009925
5803 35009925 33450904 32015876 30662215 29385957 28163604 27024130 25909592 24795445
5795 24795445 23714009 22725048 21760087 20945354 20185050 19267982 18503627 17773602 17094426
5786 17094426 16531757 16066049 15709453 15375148 15202297 15081717 15097767 15188590 15364228 15535301
5776 15535301 15732820 15957524 16117898 16015145 15683031 15228674 14833215 14488747 14185284
5767 14185284 13860632 13535229 13221066 12948910 12742153 12497728 12331011 12205059 12203979 12261871
5757 12261871 12366944 12537549 12852749 13299556 13861726 14601168 15496302 16668160 18176660
5748 18176660 20110710 22378734 24681614 26261123 26417026 25358682 23984482 22559858
5740 22559858 21079512 19607097 18251855 17081112 15995009 15064236 14334070 13813089 13476415
5731 13476415 13219342 13176336 13280454 13492234 13835482 14349300 15103602 16045606 17292515
5722 17292515 18929035 21083298 23522513 25733064 26835244 26427835 25089246 23510498
5714 23510498 21859029 20218461 18585014 17191665 15898931 14691116 13699475 12958052
5706 12958052 12450594 12087838 11909798 11860196 11931485 12123331 12490624 13038176 13816964 15013298
5696 15013298 16531135 18156131 19552167 20157269 19662125 18659938 17547549 16405063
5688 16405063 15223169 14199897 13238268 12398573 11603726 10920912 10415285 10068933 9859145
5679 9859145 9715019 9682075 9794705 9943290 10218353 10678028 11227783 11940103 12938441 14310250
5669 14310250 15993725 17751828 19067747 19332438 18493312 17237195 15969196 14608940
5661 14608940 13280399 12075980 10991478 9992142 9021894 8239652 7640661 7096259 6706172
5652 6706172 6382358 6090087 5792182 5504266 5295403 5163409 5036820 4832026 4739445 4589038
5642 4589038 4462960 4365904 4273982 4214436 4203478 4134199 4061319 4015009 3876882 3842053 3793103
5631 3793103 3759112 3698600 3604579 3577777 3570692 3569811 3486978 3415464 3321058 3289863 3214071 3140832
5619 3140832 3100932 3104386 3030560 3003986 2967211 2990913 2954140 2947374 2975380 2926386 2925325 2942971
5607 2942971 2926483 2910015 2909163 2927816 2963375 2923191 2912392 2894239 2875151 2889371 2864836 2827663
5595 2827663 2825073 2808242 2803321 2854772 2855640 2804162 2793256 2797094 2809766 2810509 2830946 2861616 2866668
5582 2866668 2828103 2808586 2812627 2784134 2776822 2776743 2726603 2622902 2659502 2671757 2614619 2596517
5570 2596517 2518597 2487750 2495359 2457593 2416242 2344300 2306047 2325881 2288744 2255885 2287338 2304249
5558 2304249 2321930 2339437 2358869 2339879 2307502 2274553 2231455 2175944 2117976 2020387 1950897
5547 1950897 1990140 1978239 1966929 1963252 1925773 1889979 1867755 1851190 1810640 1767642 1762423 1766309
5535 1766309 1707472 1683888 1689648 1648485 1675518 1641280 1591157 1590507 1538994 1524443 1530602 1488051
5523 1488051 1426365 1401907 1369689 1363151 1388794 1324215 1340361 1336485 1311939 1343613 1320470 1258763
5511 1258763 1288192 1252618 1264984 1211129 1252857 1273473 1246674 1304235 1217828 1194090 1231362
5500 1231362 1194224 1205296 1211019 1197215 1222261 1162325 1128202 1191925 1186712 1155974 1192825 1174680
5488 1174680 1127193 1137221 1178957 1142636 1133452 1112217 1142838 1141606 1115363 1148025 1134673 1125743
5476 1125743 1152510 1174987 1189186 1221424 1223258 1187676 1182315 1197243 1212769 1157163 1141372 1191274
5464 1191274 1194260 1196544 1290228 1280662 1228260 1296141 1276858 1300620 1326114 1291766 1292682 1309335
5452 1309335 1333657 1371652 1410848 1456523 1459074 1475301 1535960 1601016 1592560 1584132 1603215 1591858
5440 1591858 1621386 1616755 1570589 1542817 1585761 1617087 1627827 1681906 1677976 1732190 1737325 1789075
5428 1789075 1800974 1809795 1867811 1935938 1973229 2001804 2049641 2079910 2140703 2156972 2288264
5417 2288264 2374659 2423649 2456730 2510359 2596163 2671801 2784306 2855473 2900923 3011527 3109608
5406 3109608 3152152 3194525 3296642 3327759 3414677 3490451 3524371 3539921 3618853 3717421 3751784
5395 3751784 3738470 3773282 3815585 3833190 3890481 3947388 3983400 4095235 4140528 4216361 4341691
5384 4341691 4494071 4622047 4800795 4922347 5002055 5200741 5280571 5472900 5625209 5821678
5374 5821678 6058635 6273776 6510658 6843768 7226983 7654151 8127986 8733184 9381364 10064833
5364 10064833 10731658 11423241 11985449 12446890 12877969 13305235 13742423 14127816 14595704
5355 14595704 15061701 15554854 16095035 16633044 17094403 17566915 18008215 18399636 18964535
5346 18964535 19484348 19910467 20281224 20474839 20587904 20640556 20548343 20244184 19801391 19277546
5336 19277546 18650831 17938130 17193572 16464689 15815288 15225123 14578434 14004226 13465195
5327 13465195 12854704 12320638 11793987 11336988 10945933 10622378 10204098 9764954 9285894
5318 9285894 8775313 8341921 7969864 7617667 7335049 6995121 6610409 6259282 5901005 5645309
5308 5645309 5376658 5088588 4924528 4812143 4676966 4543365 4421614 4364032 4349012 4240737
5298 4240737 4122529 3989951 3908212 3833376 3743353 3656101 3556899 3510589 3499122 3440948 3378839
5287 3378839 3347739 3280671 3231952 3274046 3213859 3121556 3088445 3032187 3019070 2974583 2874279
5276 2874279 2766395 2668683 2613148 2535983 2500356 2445640 2316341 2254833 2152056 2102609 2052529
5265 2052529 2033806 1978253 1881144 1841304 1789404 1758846 1741788 1784540 1749717 1696078 1667054
5254 1667054 1589086 1571579 1577139 1557064 1530612 1512876 1467707 1477867 1405101 1393429 1385269 1361145
5242 1361145 1366475 1357021 1338962 1327618 1349549 1367167 1357581 1382968 1382298 1337056 1321316 1282487
5230 1282487 1321114 1348547 1363502 1361766 1386534 1357471 1369522 1370249 1363910 1358587 1359089 1391456 1387861
5217 1387861 1410504 1404627 1420102 1423925 1462888 1433573 1470271 1454023 1453382 1474567 1527669 1525448
5205 1525448 1522456 1533539 1560176 1585420 1644825 1641929 1709822 1771943 1759659 1788439 1780168 1800068
5193 1800068 1918829 1955903 1956020 2007670 2058123 2136344 2173914 2208777 2226656 2285744 2371383 2433393
5181 2433393 2494823 2637060 2694073 2726599 2790854 2872496 2995258 3091202 3163120 3289631 3370872
5170 3370872 3508639 3654481 3861183 4074663 4235364 4453077 4773865 5081437 5391891 5756384
5160 5756384 6257153 6884918 7647846 8332563 8987302 9355214 9464199 9507929 9568496 9682336
5150 9682336 9971394 10393494 10979417 11901511 13049756 14337843 15432418 15977873 16032367
5141 16032367 15991397 16000587 16147840 16491786 16908552 17126016 17285045 17630086 18204197 18977810
5131 18977810 19578031 20083512 20515361 20852728 21301695 21847467 22163070 21921324 21286314
5122 21286314 20652131 20202419 20129260 20423970 20915210 21298114 21276881 21202094 21213735 21249200
5112 21249200 21130966 20849489 20333535 19601906 18822192 18257443 17815363 17408797 16930283
5103 16930283 16407359 16136823 16206722 16468166 16839554 16832851 16132959 15049657 13961841 12960875
5093 12960875 12081331 11394717 10811784 10437349 10218535 10272554 10416413 10354315 10072841 9475077
5083 9475077 8871033 8246181 7621315 7141638 6731260 6308822 5895474 5515830 5301378 5174453
5073 5174453 5015405 4919563 4917213 4885216 4846067 4857854 4846944 4929584 5022866 5173122 5267506
5062 5267506 5327280 5352138 5222239 5098012 5011747 4939350 4856112 4741696 4616064 4542068 4492191
5051 4492191 4462969 4401526 4354061 4386772 4382283 4443785 4601428 4781159 4970505 5198924 5438621
5040 5438621 5754690 6055558 6262406 6287789 6189056 5947795 5705042 5547502 5418058 5215304
5030 5215304 4994087 4791180 4612963 4451300 4332285 4136750 3968856 3826185 3769208 3727456
5020 3727456 3667097 3692565 3686045 3740043 3821499 3947340 4076964 4155836 4085204 3952836 3826105
5009 3826105 3666705 3494198 3376206 3207707 3056544 2949200 2830060 2707465 2637937 2532553
4999 2532553 2446784 2331259 2259121 2229657 2190146 2144858 2154206 2206496 2236982 2176382 2121094
4988 2121094 2043911 1962489 1897917 1815660 1732375 1748747 1705366 1635929 1645742 1588487 1568348 1494546
4976 1494546 1444305 1459364 1471251 1459715 1433006 1420401 1482179 1519935 1586919 1632553 1682010
4965 1682010 1662755 1560715 1546992 1477833 1447330 1427371 1353761 1314312 1328691 1286922 1281332
4954 1281332 1266383 1232812 1208327 1201951 1207516 1201777 1207896 1140488 1158413 1157103 1133700 1156494
4942 1156494 1125185 1099856 1103559 1027391 1062719 1056910 996101 1013660 1028001 1016299 982658 997674
4930 997674 994061 1006238 993613 962930 939630 890173 884082 917144 884588 843566 884866 888309
4918 888309 867688 837767 879608 863020 823616 839206 855846 868246 880041 863025 802236 844045
4906 844045 838859 823235 785676 764566 754404 717649 705391 709086 721391 720932 731884 733801 711380
4893 711380 718934 682531 684161 691565 661349 680055 715449 702830 674263 711430 661097 686054
4881 686054 652121 677409 713823 668882 696054 713872 741558 744692 725233 748489 745138 773332
4869 773332 831783 794265 758622 714246 671401 705484 740837 718654 735990 738623 734196 748300
4857 748300 829226 893401 866202 883273 898426 886886 898907 836105 885797 894452 886098 908035
4845 908035 909363 958851 990313 1012258 980290 968530 978518 1019043 1023009 1015749 972826 951575
4833 951575 870754 903853 880498 923590 915533 875828 876843 863937 915026 916720 944386 896763
4821 896763 918521 954678 992687 1000657 995046 968495 1027297 1046077 1030928 1094877 1101938 1078400
4809 1078400 1095017 1177831 1207048 1183901 1222391 1250643 1239707 1229878 1298023 1357015 1376942 1396444
4797 1396444 1408257 1378711 1408245 1447252 1501091 1531573 1559549 1560894 1600092 1653348 1701414 1784304
4785 1784304 1786909 1858710 1855113 1929515 2013502 2023274 2049504 2103520 2108143 2181092 2181716 2254048 2300323
4772 2300323 2246475 2360784 2434639 2512373 2544706 2561550 2646810 2772144 2891545 2967885 3064090
4761 3064090 3183934 3248324 3340541 3435838 3584013 3685289 3786588 3900919 3991243 4153708
4751 4153708 4299388 4426533 4661479 4883213 5087582 5297953 5550614 5844430 6140986 6498838
4741 6498838 6996011 7543920 8203784 8916377 9819980 10935314 12287341 14012682 16203116
4732 16203116 18734808 21037066 22153933 21776383 20697731 19486861 18267750 17162072
4724 17162072 16289734 15553501 15071592 14926698 15068167 15564668 16423749 17638289 19289263
4715 19289263 21563664 24514621 28000183 31691830 34838806 37033696 38260229 37869619
4707 37869619 35604301 32622466 29572091 26597755 23866692 21636954 19702669 18071247
4699 18071247 16901033 16251259 16009227 16152819 16579601 17432297 18918417 20913604 23106856
4690 23106856 24924052 25245770 23951741 21999128 19955632 17910966 15985525 14265575
4682 14265575 12651034 11291693 10066431 9093530 8343527 7739193 7235557 6820145 6413772
4673 6413772 6098186 5816164 5563142 5267080 5034024 4880239 4701414 4553129 4385359 4255622
4663 4255622 4135175 4067819 3991131 3828519 3788088 3734270 3642759 3599622 3517089 3453877 3446388
4652 3446388 3444379 3369964 3308246 3294615 3304092 3216681 3150046 3068892 3024619 3013386 2942352 2899525
4640 2899525 2896082 2899010 2887923 2899894 2847702 2849673 2859561 2895918 2927354 2972121 2974367 2931339
4628 2931339 2953589 2986412 2993565 2926086 2973936 2969300 2968767 2999128 3024243 3075449 3092189 3149572
4616 3149572 3154933 3156996 3196878 3221439 3263894 3347596 3425668 3471509 3488005 3586810 3642112 3716088
4604 3716088 3803952 3901471 4010372 4094851 4174377 4312223 4421559 4525563 4611718 4700236 4836619
4593 4836619 4948513 5139695 5348107 5522484 5686801 5876782 6139761 6386001 6691516 6948102
4583 6948102 7191167 7609948 8073812 8584427 9145829 9846723 10743812 11795591 12948879
4574 12948879 14445016 16365633 18807021 21672414 24632169 26908629 27822914 27473475
4566 27473475 26527807 25435027 24520495 23983406 23776665 24129662 25150434 26848438 28789892
4557 28789892 30199374 30409914 29532883 28162942 26847639 25854055 25383010 25466984 25987868
4548 25987868 26801925 27281878 26956650 25848212 24530150 23210911 22039242 21167546 20654555
4539 20654555 20440057 20804906 21591801 22575233 23069669 22614151 21316161 19636537 17879500
4530 17879500 16217363 14708016 13212518 11896504 10703984 9763952 8994931 8413555 7980187
4521 7980187 7630920 7266586 6969049 6627673 6295516 6012086 5756314 5530375 5305233 5177712
4511 5177712 5089407 5001612 4862605 4716016 4570670 4430339 4207417 4026205 3903232 3719192
4501 3719192 3657381 3497313 3374613 3319935 3184130 3141580 3102239 3024506 2986341 2919109 2853491
4490 2853491 2771297 2782344 2742431 2671762 2603430 2561384 2516559 2507251 2437010 2462661 2458265 2388839
4478 2388839 2371002 2382494 2352519 2283512 2244434 2261916 2267642 2214024 2205094 2293037 2319274 2268271
4466 2268271 2268086 2260530 2177355 2121452 2118887 2119289 2094161 2040931 1983922 1931463 1999824 2018668 2012402
4453 2012402 2013212 2035334 2047110 2059906 2091623 2260837 2396722 2524806 2781228 2931424 3073656
4442 3073656 3177701 3118794 3020522 2890056 2794425 2658578 2525043 2369867 2274266 2187427
4432 2187427 2120437 2002180 1981289 1997738 1972811 1940255 1925891 1953386 1935852 1865779 1848380
4421 1848380 1876909 1835394 1880055 1893897 1928660 2004088 2053095 2065388 2042541 2050224 2093884 2036777
4409 2036777 1991367 1982391 2014886 2069578 2155487 2117301 1974976 1919228 1965519 1931021 1905466
4398 1905466 1929539 1931021 1954838 1933148 1952231 1976891 1967693 2011869 2068384 2085372 2127408 2262472
4386 2262472 2331280 2463372 2561910 2663603 2750141 2846826 2960772 3088798 3236777 3321233
4376 3321233 3292151 3202241 3118570 3090843 3144405 3148369 3155985 3133235 2997824 2813182 2680282
4365 2680282 2576708 2531975 2433854 2402285 2356217 2375290 2349302 2346557 2312450 2301458 2270650
4354 2270650 2208552 2148827 2103627 2095258 2113725 2092270 2092187 2071740 2074679 2068854 2077589 2087918 2047739
4341 2047739 1953876 1930171 1941302 1972844 1980272 1996972 1990372 2024929 2036781 2122863 2181772 2263744
4329 2263744 2340807 2403616 2477491 2504425 2569131 2604554 2635840 2706980 2748518 2786748 2857821
4318 2857821 2875046 2885974 2900415 3004766 3062444 3068132 3122115 3149694 3202373 3264704 3294655
4307 3294655 3372907 3415543 3459180 3510956 3524878 3524587 3560390 3570361 3538584 3542314 3574182 3578094
4295 3578094 3663197 3689828 3646404 3614340 3591855 3620419 3639700 3682803 3655031 3615433 3638913
4284 3638913 3588792 3571412 3583003 3628341 3504237 3453512 3449403 3447837 3426742 3459888 3522904 3620691
4272 3620691 3719213 3747512 3759896 3828729 3861117 3868039 3944987 3967243 3914476 3979351 3994368 4006444
4260 4006444 3994883 3981708 3989011 4046235 4092030 4166190 4206487 4334704 4416133 4463727 4508354
4249 4508354 4669760 4761289 4890652 5002978 5099475 5189738 5217303 5288443 5375103 5410720 5434907
4238 5434907 5492639 5585903 5693851 5794926 5962513 6154688 6368325 6606893 6842745 7097538
4228 7097538 7346488 7589058 7778899 7918472 8105324 8274491 8419514 8664023 8856255 9065482
4218 9065482 9230382 9390129 9501619 9720560 9960409 10204072 10433324 10659809 10962063 11295522
4208 11295522 11713396 12032113 12431595 12815019 13201635 13541330 13821839 14170691 14497250
4199 14497250 14819535 15164176 15544346 15875167 16239320 16807565 17340842 18003597 18664095
4190 18664095 19437862 20283650 21186088 22147288 23114059 24061391 25099102 26170326 27306837
4181 27306837 28502110 29839401 31282749 32839501 34584954 36446957 38351772 40424983
4173 40424983 42577643 44950623 47571184 50632635 53986065 57960738 62689914 68488924
4165 68488924 75395237 83865451 93983696 106494030 122083772 142329026 167961522
4158 167961522 199970512 235058723 267560291 286057776 287802355 275858153 257287691
4151 257287691 236599493 212200004 186094065 160492107 138628581 119889392 104429705
4144 104429705 91627913 81406401 73006192 66301339 60520762 55652648 51341806 47644928
4136 47644928 44357914 41551176 39087146 37042557 35323412 33901093 32690116 31704598
4128 31704598 30818848 30057556 29237707 28418793 27454401 26428655 25372805 24426022 23463577
4119 23463577 22656574 21799627 21049851 20335635 19590233 18793475 18062481 17383990 16717767
4110 16717767 16072919 15521999 15015531 14505818 14047836 13675575 13390204 13201285 12992382
4101 12992382 12808874 12682694 12545617 12392090 12191172 11956454 11744649 11510395 11321615
4092 11321615 11107194 10867291 10700472 10558648 10402780 10271814 10109713 9972714 9750989
4083 9750989 9607303 9494983 9328929 9173521 9079458 8973607 8848056 8790345 8711234 8630015
4073 8630015 8525906 8466393 8382411 8329093 8206501 8111509 8001246 7946227 7936960 7925361 7847894
4062 7847894 7814636 7853048 7889407 7910740 7936044 7964297 8030678 8009383 8032450 8053445 8085662
4051 8085662 8085884 8090779 7990605 7922371 7765923 7638333 7495589 7342675 7266251 7206656 7119060
4040 7119060 7098014 7086955 7096580 7110331 7100799 7116909 7156205 7186193 7158525 7140370 7170205 7160653
4028 7160653 7074978 6974096 6885607 6798861 6721120 6592806 6537739 6436554 6359515 6261872 6165322
4017 6165322 6098978 6111994 6177153 6322344 6527958 6837003 7072413 7214046 7054241 6679561
4007 6679561 6284686 5899401 5569082 5284067 4953585 4699129 4550902 4358706 4241961 4093921
3997 4093921 3949700 3799906 3586233 3441371 3370152 3269468 3198611 3093857 2999693 2961339
3987 2961339 2927689 2857462 2819631 2785863 2742604 2720356 2731670 2684809 2651625 2624142 2615846 2572033
3975 2572033 2585662 2484628 2451812 2439373 2359747 2304727 2255841 2195169 2097639 2046188 1949931
3964 1949931 1888231 1882627 1833604 1749480 1709100 1646211 1627766 1660726 1638912 1578829 1541305 1572035
3952 1572035 1565777 1530357 1504796 1509096 1522296 1506462 1478636 1473710 1506928 1503124 1504768 1489828
3940 1489828 1546216 1603566 1623945 1625724 1633347 1647878 1667582 1610327 1507209 1411664 1391543 1318034
3928 1318034 1233086 1227515 1225749 1301816 1295106 1249188 1212044 1217685 1158234 1139893 1181751 1189901
3916 1189901 1157212 1118443 1137254 1126686 1119277 1142153 1105807 1096006 1061732 1061992 1028996 1020479
3904 1020479 1062765 1092922 1039587 1027545 1057725 1037318 995352 949914 1035250 1069269 1088845
3893 1088845 1124060 1117706 1146882 1200242 1193533 1172770 1240183 1279560 1242414 1219926 1213237 1193296
3881 1193296 1191045 1157497 1188804 1211731 1227003 1277866 1309025 1344607 1403140 1527750 1650714
3870 1650714 1770280 1889770 2034758 2223765 2362745 2461805 2520869 2484096 2426437 2332802
3860 2332802 2173029 2072646 1962830 1859248 1786810 1770495 1765708 1667082 1564327 1473943 1353206
3849 1353206 1271375 1200298 1167759 1158856 1113540 1019934 984322 989451 908696 884140 893915 849126
3837 849126 861499 875875 857701 813719 831852 790122 801222 788174 790175 807600 756208 770666
3825 770666 717029 664543 626165 591523 640189 612852 628479 664969 628034 602397 616179 634070
3813 634070 633343 642385 604106 606508 615622 616405 619940 615203 632042 604217 555998 566666 548655
3800 548655 590633 543567 494348 470271 474935 471502 453921 445541 484791 506443 451186 412557
3788 412557 465987 428527 464484 441777 497628 570012 583369 621004 632477 617071 587892 633963
3776 633963 586896 608259 602349 548945 600579 597556 542980 553635 563388 544269 505074 515239
3764 515239 551306 549935 549012 524461 514048 580291 591566 623572 580620 563742 556578 568104
3752 568104 577937 547407 550376 514924 540576 499252 508573 533006 578144 551756 538035 538016 526670
3739 526670 542535 550100 563201 576513 573974 609390 555137 564971 574696 589400 637547 608249
3727 608249 620837 600548 577962 542067 519733 573687 580508 590668 584681 589699 580741 608035
3715 608035 641891 628651 702375 683116 632064 632337 673529 674671 704911 695056 640775 605312
3703 605312 662245 696382 732909 748774 737176 753190 731637 716100 742451 752926 682018 675538
3691 675538 711876 699809 734658 767005 737330 750252 720753 644532 702032 728857 747231 727470
3679 727470 702677 704818 733319 750163 750442 726635 728370 747931 768086 757099 733389 745458
3667 745458 736094 760629 816311 819730 811841 831151 855714 836484 812624 748113 722964 748819
3655 748819 796979 801238 779908 771655 761124 757180 788289 774150 766131 744224 717717 736685
3643 736685 743721 804354 826114 798200 809668 806536 789146 782270 763033 784444 751055 756618
3631 756618 768239 825336 852594 834079 852558 843556 876129 855202 885927 894504 888058 863953
3619 863953 806294 811287 862774 832902 813475 799069 770039 800309 771611 744694 761551 772331
3607 772331 799072 829772 834030 797772 825464 837319 856112 872488 879342 863715 829383 823803
3595 823803 840307 852349 826406 876987 868355 806362 838774 860313 866463 905617 914561 933323
3583 933323 903373 893727 833309 789801 817971 820865 776601 815519 816415 835830 803204 787193
3571 787193 777837 772811 762539 776748 802690 836258 856467 885794 867430 822488 875279 911278
3559 911278 884926 937890 936143 933449 931695 922185 906040 912262 926219 920306 881337 928171 922345
3546 922345 919570 959331 917235 958803 938207 893780 935057 907833 961278 1007476 1002972 996279
3534 996279 961749 917423 888410 951760 933168 931518 949882 923448 880673 914539 945040 951403
3522 951403 972989 973573 999511 1012903 999322 997071 964524 966674 979980 1003580 1006450 998034 1004801
3509 1004801 1060495 1061732 1042936 1058532 1101136 1086995 1084387 1102542 1095679 1088827 1091334 1078795
3497 1078795 1116614 1117245 1152002 1124681 1111583 1137861 1134309 1124409 1106549 1112176 1127739 1110588
3485 1110588 1157215 1169495 1213929 1220982 1205108 1221030 1214000 1266643 1271782 1240181 1330046 1313478
3473 1313478 1308246 1395029 1384880 1408301 1411116 1418826 1396940 1318673 1287575 1305314 1325305 1330079
3461 1330079 1359189 1355631 1361346 1361090 1383763 1393002 1363302 1416043 1384566 1371337 1404978 1444432
3449 1444432 1414670 1386489 1429784 1487325 1504571 1510446 1514394 1548951 1576455 1633675 1653557 1696850
3437 1696850 1708111 1776045 1835537 1883923 1928558 1984431 2078506 2215223 2429366 2626411 2875730
3426 2875730 3191404 3446486 3550038 3492455 3273946 3037652 2863272 2725576 2601628 2494728
3416 2494728 2419437 2403420 2327463 2327637 2273146 2290488 2326115 2283978 2270718 2326732 2384533 2448867
3404 2448867 2495246 2612074 2826079 2973956 3134722 3321039 3634788 3952375 4351119 4839081
3394 4839081 5418677 5838807 5975804 5687617 5286283 4929861 4585739 4251942 3924566 3734940
3384 3734940 3532571 3306039 3176271 3077817 2973831 2907933 2868385 2783513 2730176 2750226 2722902
3373 2722902 2704162 2676687 2743352 2820082 2869132 2950293 3024760 3128297 3244783 3454402 3723556
3362 3723556 3981917 4213263 4272949 4232741 4041830 3844759 3671397 3593962 3539568 3454693
3352 3454693 3356777 3299225 3130000 3020843 2946204 2867034 2783217 2655393 2665245 2651339 2656786
3341 2656786 2576395 2579747 2578217 2613746 2608511 2625113 2639079 2665940 2715988 2723544 2808055 2862878
3329 2862878 2867294 2893378 2901299 2932228 3005761 3048800 3082995 3126479 3212893 3254431 3309467 3346716
3317 3346716 3304620 3271303 3258319 3207316 3231566 3251925 3323705 3302142 3300042 3377705 3422752 3436584
3305 3436584 3500855 3561513 3619449 3621499 3676115 3745105 3825064 3888529 3940941 3974285 4003645 4050761
3293 4050761 4101128 4122947 4110716 4087818 4103495 4185081 4228027 4258914 4333640 4396460 4458372
3282 4458372 4581357 4645323 4743762 4865846 5035842 5101050 5270741 5399734 5563287 5729809
3272 5729809 5911597 6090332 6225654 6294859 6377948 6488906 6578404 6710998 6863970 7034124
3262 7034124 7261684 7490510 7704405 7958655 8282133 8610821 9008571 9401909 9764528 10236531
3252 10236531 10725257 11249488 11722379 12090536 12398880 12502172 12398727 12141932 11668624
3243 11668624 11045210 10388776 9726090 9150308 8640405 8206996 7821367 7445673 7092421
3234 7092421 6832094 6536588 6333141 6175204 6006620 5900771 5723047 5574310 5427451 5346899
3224 5346899 5216713 5134671 4979255 4821988 4709183 4623221 4482403 4356180 4275288 4179639
3214 4179639 4111014 4058340 3954833 3873776 3872792 3860217 3818520 3767425 3698807 3587682 3478925
3203 3478925 3442653 3377035 3260312 3202014 3138806 3102858 3059902 2984720 2918966 2866698 2885415
3192 2885415 2826447 2758803 2778953 2744137 2693204 2677107 2627599 2590371 2542584 2558184 2614987
3181 2614987 2567762 2492922 2447513 2420132 2420456 2405163 2417976 2382566 2359134 2312210 2265911 2222567
3169 2222567 2189638 2182251 2110393 2119753 2036227 2048751 2055752 2033488 1996623 1947676 1961507 1947854
3157 1947854 1928398 1875348 1883288 1859857 1839801 1870367 1847474 1797456 1837782 1877491 1845702 1744661
3145 1744661 1733572 1778442 1746528 1726105 1705406 1722283 1724233 1672146 1657473 1678748 1681455 1666574
3133 1666574 1670518 1625136 1560088 1545094 1566002 1585271 1512561 1509958 1520982 1498904 1523525 1500323
3121 1500323 1479826 1461424 1459911 1474357 1447147 1425072 1397060 1401573 1410006 1402496 1387475 1349638
3109 1349638 1379066 1422908 1394420 1382256 1407419 1413688 1411351 1336354 1355896 1363309 1303187 1280557
3097 1280557 1284519 1279027 1279848 1282872 1284039 1268144 1234093 1271663 1257074 1219766 1237118 1205384 1197949
3084 1197949 1226288 1262106 1243522 1256771 1240059 1187723 1196942 1199473 1192459 1131045 1117200 1123595
3072 1123595 1122085 1097883 1143934 1101282 1148834 1152763 1141206 1158442 1180788 1152747 1137168 1138806
3060 1138806 1099112 1083569 1126479 1194780 1191850 1134568 1131663 1155326 1129112 1129400 1123135 1113238 1047750
3047 1047750 1100043 1139216 1092108 1077472 1072970 1075899 1101991 1079165 1067606 1045195 1057239 1062907
3035 1062907 1085541 1102113 1121528 1131087 1083993 1040033 1044032 1046536 1084521 1089734 1084761 1087644 1045932
3022 1045932 1082399 1074759 1089415 1105881 1134414 1107767 1119369 1118857 1165009 1186851 1189397 1171707
3010 1171707 1167672 1185130 1193229 1230320 1278869 1256087 1302398 1299950 1289932 1331803 1250234 1272216
2998 1272216 1317727 1367554 1337715 1322519 1353559 1330113 1350064 1416254 1445404 1438453 1407550 1418548
2986 1418548 1396506 1440376 1509546 1514121 1493388 1479573 1517398 1570390 1592157 1631952 1637810 1703690
2974 1703690 1704098 1720312 1739957 1736226 1764545 1789280 1748477 1758987 1747154 1773302 1768970 1749501
2962 1749501 1797845 1800839 1797168 1813706 1827537 1823641 1862329 1935309 1964414 1990945 2021880 2060758
2950 2060758 2092786 2075631 2128861 2174103 2216239 2241826 2310154 2347567 2391385 2452000 2523745
2939 2523745 2594915 2632324 2666448 2744904 2768100 2820503 2878246 2922589 2941523 3006674 3027807
2928 3027807 3039343 3032772 3036304 3089768 3098932 3165145 3192640 3252116 3286749 3312954 3344563 3373781
2916 3373781 3457397 3589829 3670328 3789101 3949702 4019010 4139804 4311782 4463083 4612658
2906 4612658 4730523 4760348 4804477 4782157 4646979 4524730 4384980 4293188 4162987 4170937 4074292
2895 4074292 4007699 4047154 3973704 4003164 4042823 4041186 4056920 4091283 4079292 4087297 4088467 4123709
2883 4123709 4216788 4231678 4267325 4321391 4327302 4352705 4358325 4316186 4225676 4092231 3960553
2872 3960553 3847303 3782350 3716067 3581082 3536108 3443103 3334270 3203392 3175783 3196664 3141948
2861 3141948 3109375 3096993 2980565 2952816 2907492 2906706 2843538 2740218 2698189 2672987 2635238
2850 2635238 2567911 2501377 2397536 2301665 2268097 2214170 2104062 2060226 1984187 1929428 1872031
2839 1872031 1875017 1871769 1797129 1770123 1754214 1702707 1703677 1611218 1618715 1538099 1507043 1523760
2827 1523760 1503784 1470406 1435603 1400246 1367641 1377817 1352872 1349950 1275796 1237088 1268944 1241429
2815 1241429 1235194 1165501 1078825 1065748 1094394 1084747 1091560 1058699 1013957 1022858 1020689 999260
2803 999260 940623 897420 859597 844985 887979 873101 864816 862791 762102 712559 743731 761468
2791 761468 737841 721699 689929 688884 671962 687884 720874 691413 650273 644543 669962 679888
2779 679888 633001 663707 668421 609011 573187 567746 565735 553914 503723 533484 533637 461846 475885
2766 475885 488608 451800 445300 418987 474170 524950 454780 381730 377091 360036 371471 439155
2754 439155 454898 428000 414144 412695 343280 320445 361583 368091 397912 365301 309174 270274
2742 270274 287050 344816 376688 346263 281601 295662 285943 261652 221834 261306 238337 239726
2730 239726 255982 255699 272280 255311 269240 219332 199244 198638 216439 248778 218909 214746 210204
2717 210204 244740 237665 165057 136171 180181 202569 212642 251621 222779 165617 151150 169572
2705 169572 166798 157387 148888 125637 139682 151619 112922 159981 148756 189922 183959 144789
2693 144789 165920 180453 103734 100551 109641 48798 72064 92947 93816 126143 126634 108593 126871
2680 126871 50486 78524 146887 133326 127171 142863 139221 104114 110642 174401 128051 77815
2668 77815 105697 117927 98509 93047 58647 75992 97339 114165 94058 127630 125476 54803
2656 54803 20295 16325 17154 49071 56657 76265 63509 62039 71622 63553 72349 62861 107008 92137
2642 92137 62473 64462 46297 27465 24320 65461 73644 73111 72279 83328 121896 84233 21210
2629 21210 85776 73907 23267 34492 54460 48512 106229 78807 61865 78420 102184 96197
2617 96197 47853 89299 53399 33238 27125 45894 41703 9399 -19217 35519 12170 -41302
2605 -41302 -47866 -44622 -13222 47110 61016 54442 30742 51393 65851 55875 36885 45680 49993
2592 49993 65806 60473 73573 77342 67802 16097 -54759 -9690 -3081 -32193 -22428 6498 21121
2579 21121 -5368 13158 45798 59067 74390 45923 -7235 -3344 42331 34628 1873 21049
2567 21049 14097 -31635 -37926 30165 46379 55215 -3514 -50732 -34117 -1073 -27215 -29582 -51204
2554 -51204 -44739 2542 8630 16184 17025 -385 13433 45914 4083 -10935 -1115 -20783 -8492
2541 -8492 -29871 -11892 -33199 -55979 -13649 -23813 -53475 -77678 -34399 -15233 -16834 -17254 -55200
2528 -55200 -48780 -40792 11454 5451 -1259 28672 -31332 -58384 -73182 -104390 -68112 -47447 -57270
2515 -57270 -1755 -13307 -7238 -56920 -20205 -29258 -3278 5156 20170 -23007 -3845 -24495
2503 -24495 -25870 -2722 -28179 -80852 -49669 -59795 -38569 27207 42411 2302 -33671 -30155
2491 -30155 -47583 -25522 -56020 16839 -1752 -18347 -42751 -80071 -76746 -24544 -31253 -6898
2479 -6898 12073 -6724 -54166 -78710 -52845 -49538 -39450 -44231 -85508 -33988 -48590 -71031
2467 -71031 -39855 -59075 -51138 -32424 19211 2499 -24508 -64811 -104990 -63000 -49113 -33856
2455 -33856 -40773 -45466 -66306 -82262 -34832 20285 30008 -68745 -42800 -33850 -39930 -48259 -46575
2442 -46575 -24041 -17496 -61626 -48895 -23139 14171 37626 -5015 -29345 -56906 -13553 7050
2430 7050 -14867 -37772 -50551 -13565 6502 -22836 -61410 -47807 -42764 -60406 -23290 924
2418 924 -14205 -64629 -81683 -56071 -41441 -36816 -30958 -52966 -51835 -53282 -40512 -80277 -52667
2405 -52667 6355 -30579 -37711 -18439 -67750 -94491 -55503 -40343 -47565 -35569 -50258 -109042
2393 -109042 -81279 -51170 -59828 -25432 8716 -25877 -65092 19289 21742 23675 39150 32430
2381 32430 18298 45970 46743 30829 57431 42654 61494 62080 104112 55132 34444 38002 52307
2368 52307 23602 -11764 -2977 -7221 757 -2445 -48083 -6641 5566 3677 -4898 3623 -683
2355 -683 -23761 10435 -7088 -69874 -35990 -26323 -54602 -78643 -94756 -19905 -26401 3967 9781
2342 9781 7092 -50271 -36233 -56494 -84844 -75949 -60810 -16969 -42337 -63193 -1669 -16854
2330 -16854 16000 7034 27945 22059 6466 3783 22296 -33819 -17820 4470 29426 40312
2318 40312 1245 16119 6481 -58963 -78742 -73450 -38292 -25063 -64811 -25430 19011 20784
2306 20784 17394 33130 36167 43907 -15588 -37237 7313 46045 38113 17897 562 49502 30216
2293 30216 13659 -7908 -28491 -40954 -3576 -12990 -8819 28846 981 21633 40792 -7995
2281 -7995 1121 -20276 502 -36366 -68253 -71969 -33488 43144 35067 59165 13128 1793 83195
2268 83195 62339 49888 61814 62463 58891 49409 36115 24571 50637 54368 19135 24450 15759
2255 15759 17698 54324 52612 86989 71692 3259 -1818 -7977 23296 50288 15461 8187 1680
2242 1680 -4884 20175 26358 10330 -11752 1181 11346 64233 50233 65293 72129 38035 50967
2229 50967 25295 49236 71641 63182 91800 52014 58698 144057 145221 145158 123047 91489 111668
2216 111668 67866 54616 35281 62433 75582 136608 114145 110268 139466 115165 79519 83289
2204 83289 85280 100473 101724 63771 133691 130104 140305 118163 136712 145630 223967 207940 187098
2191 187098 172643 128523 150632 179085 219141 195999 206689 214799 232987 248350 223255 208317
2179 208317 264280 299937 292731 305864 329574 347940 320532 326075 336600 343214 355974 359894
2167 359894 413558 402954 426258 429672 404424 432912 471455 511671 534454 532179 568628 613924
2155 613924 605436 607095 674252 668434 625563 668259 712284 725110 735959 774914 804839 869812
2143 869812 838435 859914 931261 1053951 1076212 1120442 1153197 1217767 1280100 1333868 1372090
2132 1372090 1481413 1645893 1736597 1868324 1972072 2049128 2234881 2375087 2550174 2720119
2122 2720119 2945962 3122882 3300017 3518895 3795272 4104826 4554606 5167422 5882110 6746761
2112 6746761 7886656 9308049 11231033 13771743 17084233 20423410 23053390 22003857
2104 22003857 17695372 13985306 11094798 8994467 7501722 6429681 5581628 4935023
2096 4935023 4330988 3929221 3630113 3425600 3175934 2999377 2802206 2575905 2324164 2112697
2086 2112697 1971542 1821045 1676469 1578002 1583901 1534375 1449751 1412955 1339749 1250835 1123380
2075 1123380 1105247 1027273 969911 967868 922859 889392 876793 844888 800503 773957 739132 718077
2063 718077 688021 648876 614507 601105 594656 558833 536592 482427 449920 431130 487421 512967
2051 512967 466099 390159 440642 450302 393929 416606 443899 419176 404971 343618 326814 327093
2039 327093 328635 296536 324579 306524 244631 265391 278639 234489 227632 248926 210969 256151
2027 256151 244360 220878 192850 232310 215443 194588 135002 146969 139157 129538 158791 135503
2015 135503 97349 148205 131888 108708 93872 105451 85808 86186 84177 64499 108287 55162
2003 55162 54549 105138 123416 88202 86475 61700 36587 96534 103984 59613 61174 14707 12272
1990 12272 52302 35102 3275 7941 40886 64513 77536 58983 46486 91316 83258 73292
1978 73292 77351 50389 48845 82066 86288 37126 7539 17394 45170 -8839 -37243 -26037 45987
1965 45987 58788 28578 85230 79153 34959 25153 48759 27142 8499 8098 26500 32610 36937
1952 36937 -16499 -10897 -27782 -4641 43546 72032 28247 -1972 59155 15566 44836 -7450
1940 -7450 -27823 -66177 -23913 -41974 -21945 4325 31892 6660 1507 -17803 -16190 -16634 -16017
1927 -16017 20460 4365 7614 14100 11248 -15106 10000 11446 15618 -21507 -16542 -11504 19885
1914 19885 -6548 -58573 -82508 -63939 923 -13036 -27786 -35287 -48227 -33963 -13276 -60820
1902 -60820 -51147 -35523 -31939 -68111 -86423 -82038 -70643 -62300 -37666 7419 -39253 -59874 -27627
1889 -27627 -62656 -33103 -3512 -11392 5816 2456 15769 8082 21545 -8893 -20674 -272
1877 -272 1001 -80504 -93373 -42680 -896 -27699 -39084 29915 63927 -4908 -37925 -70115
1865 -70115 -56472 -54393 -36969 -34246 -24404 -2587 -45584 -26437 -9743 -46027 -39019 -29345 -833
1852 -833 -25775 -45451 -71706 -48483 -17234 -16750 16346 23229 23789 32043 27736 10711 47083 63058
1838 63058 121788 112862 39989 2819 12412 -17777 805 47698 44250 59888 45905 62561
1826 62561 84960 49941 2485 -53102 -38149 356 -10019 22061 18268 -31542 16293 23416
1814 23416 -18783 4306 9959 27067 -18673 -19104 -16560 -5298 36598 -7959 -18235 -47639 -61952
1801 -61952 -65225 -65098 -24026 -21753 -36178 4724 29816 -9048 27488 46568 -46880 -74891 -23327
1788 -23327 3648 28636 4337 17550 40179 3799 -22839 -22518 -23757 12832 18405 8195 -9136
1775 -9136 -8780 -4926 -2545 4649 -19589 -29398 -37154 -38424 -29923 -14695 -43665 -61156 -83835 -32113
1761 -32113 -49592 -34033 -14464 -56602 -6725 -30546 -28463 -54565 -37520 -7195 -46344 -32411
1749 -32411 27373 -28145 -43089 -42544 -70657 -41994 -18874 -1835 -35667 24425 31994 -21231
1737 -21231 -18342 51903 37747 9273 -47669 -38589 -34606 -47132 -21796 -8990 670 2952 -36049
1724 -36049 -59493 -42560 1398 10268 -1911 14083 -36058 -42487 -59636 -54364 -74498 -101250
1712 -101250 -104678 -67737 -17037 -39312 -31150 -14199 -42146 -65715 -26307 -31148 -25572 -45130
1700 -45130 -30336 -43968 -82965 -92992 -77578 -66754 -19818 -2210 -4472 -11766 -17658 8594
1688 8594 15447 -27005 -25008 -55133 -60866 -46866 -41181 -9547 -19347 -21854 -26995 -17028 -65869 -53478
1674 -53478 -10870 -2689 -17669 -11300 -4338 -17608 -71498 -35623 -5983 -30989 -52682 -266
1662 -266 32604 -33207 -3417 17032 -23110 -8040 -50687 -27964 -72353 -78473 -60204 -41835
1650 -41835 -16146 -45322 -53879 -39584 17734 10392 3528 15818 -471 -5205 -22322 -40759 -95914
1637 -95914 -97803 -123211 -81692 -2432 -13925 9801 -21405 -91887 -43199 -19074 -31971 -33554
1625 -33554 -83028 -99530 -59876 -75526 -90519 -69459 -76404 -76902 -96683 -42521 2017 26379
1613 26379 20187 3755 -63982 -59418 -51123 -48494 -70414 -78903 -54723 -47929 -49230 -7209 -55690
1600 -55690 -52752 -25816 -22710 -15270 -35631 -53009 -17468 -36827 -29883 20847 24626 -33224 -20905
1587 -20905 28889 36680 2040 -32510 -24388 -30738 3918 -5675 -6356 -48256 -56095 -19692 -784
1574 -784 -40898 -16715 -1442 14147 13012 58222 26089 -10706 -46414 -30766 -50183 811
1562 811 34776 45967 8330 -32977 -46976 -30306 -4148 -5268 -30405 -6487 -37958 -9587
1550 -9587 -9399 -64563 -17351 -59182 -55819 -49911 -55809 -43808 -51213 -41436 -31367 -49582 -17734
1537 -17734 -20360 -66894 -67166 -51429 -96097 -84706 -75406 -57371 -72045 -40552 4588 -53814 -24845
1524 -24845 -9925 -16957 -17532 659 8363 -54051 -40876 -58386 -49298 -107835 -54690 -20674 -41445
1511 -41445 -47650 -20113 57106 11064 -94311 -47047 -48292 -27089 -10852 -25010 -57572 -84897
1499 -84897 -108535 -64100 -13387 -2258 -8048 -21302 26080 -12141 27649 -7386 -27326 -5649
1487 -5649 -47402 -66101 -16923 -13916 -60887 -21724 13994 -21666 39043 23517 17175 34805
1475 34805 12140 28470 -22877 -65981 -100812 -62972 -53101 -37822 -74318 -70349 -42042 -65773
1463 -65773 -48446 -15797 -17792 38537 78333 54250 35554 59946 19700 -6448 -50196 -68447
1451 -68447 -9434 6724 32885 -6765 -34976 -91989 -112687 -70949 9148 8984 -35733 -16533
1439 -16533 -40740 -71538 -90904 -65721 -16598 2443 -14732 -46521 2398 -3005 -32531 -71505
1427 -71505 -32939 -22874 -17756 -40395 -10760 -13737 -68239 -72535 -70916 -61680 -14803 -41850 -20296
1414 -20296 -37224 -68485 -32045 -33224 -13199 1497 820 19472 23140 -25441 -2525 3639 3786
1401 3786 8353 -23155 -63292 -16975 -6186 -23680 -63724 -42298 -27044 -47272 -61615 -41137
1389 -41137 -14267 -26171 -4199 11095 43167 18479 -44763 -12930 -2106 31257 39808 32174
1377 32174 18712 -40360 -17473 41376 54072 -6475 -62708 -30186 -30942 -48903 -51289 -15824
1365 -15824 -67039 -52512 3948 -67161 -45111 -95291 -71944 3909 -4238 609 -56774 -90191
1353 -90191 -69815 -78805 -54467 -96020 -73981 -6663 1836 -42254 -11320 -533 -29721 -30233 15393
1340 15393 5628 23939 -14911 -15219 -10037 -70355 -61568 -75550 -40483 -31635 -30371 -25275 35872
1327 35872 38392 -1170 11323 24404 9765 -11516 -22227 -34224 -42778 405 -18256 -55220
1315 -55220 -51611 4696 -27155 -53295 857 -18250 -58109 -12328 13016 29446 50798 37494
1303 37494 17318 21417 14948 -820 -10739 -25114 -38505 -36365 -38765 -13258 -2802 -9062 10372
1290 10372 24418 11986 47061 41610 6738 45361 37137 35493 51804 -15107 -47339 -59599
1278 -59599 -44986 29883 -7525 31259 26606 28601 59233 -11895 -16972 22458 9670 -26357
1266 -26357 -23851 -29347 -15434 -31056 -3024 15795 -34101 -18207 5134 5101 2471 51495 25016
1253 25016 25228 66953 57553 10983 -9175 -26364 -49373 -72763 -59224 -52853 -32173 -17369 -8675
1240 -8675 -5193 -35157 -39931 -28958 -20983 10669 5584 -14610 -47380 -45827 -10925 -14911 51940
1227 51940 4282 9162 -17117 -8116 -28693 -3870 -9329 -42906 -56098 -47997 -27398 -48288 -40223
1214 -40223 -13995 33781 -13224 -745 14236 24995 -15290 -25718 19743 56514 63016 -6975
1202 -6975 -28420 -47545 -15257 25428 21021 -7144 1440 5459 -54061 -33773 -50327 -13179 4488
1189 4488 -12045 -66216 -58438 -37681 -37987 -36193 -93894 -104235 -96672 -51016 15935 64513 72425
1176 72425 -12310 389 -56235 -66807 -60283 -51449 21885 22357 39910 4142 24186 29539 18924
1163 18924 21380 -17432 -17848 -9956 -16690 8918 -8304 16528 62338 46972 16823 34384 11928
1150 11928 11435 35613 31662 -3787 -22084 38739 1874 -66094 -60398 -22113 8428 8581 -18292
1137 -18292 -41426 12477 1459 49053 57827 9856 -27041 -30949 -14237 27398 24858 -2966
1125 -2966 -8482 -33624 -21479 -24614 -71297 -54699 -9505 -22912 -12220 -6368 4904 24522 64430
1112 64430 6347 -39183 -43546 -36572 -30822 -32795 -46428 -72170 -7596 30977 8810 -35719 -32806
1099 -32806 -31398 -9857 43852 17474 -10351 -34059 -46028 -17881 -26316 10738 10872 -44422 -655
1086 -655 30320 48512 11138 19370 7611 -16289 -1833 31825 28451 23345 33325 77599 82014
1073 82014 21699 -22013 -91883 -46979 -2062 6734 26216 19563 23891 10877 -12514 -59397
1061 -59397 -79433 -28757 50609 36517 7373 -6862 42384 16430 -46014 -42940 -12939 45602
1049 45602 22467 30325 9134 -15989 -12905 -20317 -7285 -5919 -48781 -61532 -69153 -41801 3837
1036 3837 27936 -7324 -51823 -46152 -26561 9688 3285 24201 58549 69296 41779 24733
1024 24733 27362 51819 -32343 -32240 -2139 12719 32660 -6298 -54681 -36068 6576 3505 29804
1011 29804 12582 1407 -2410 -2822 -35218 -4086 -6046 -4065 -17024 -40099 -41296 12047 49355
998 49355 76806 73314 22394 -16851 4971 56396 29695 17984 20856 33952 10315 43875
986 43875 18475 -30968 -22651 -46649 -18729 -3924 -55104 -58011 8359 -15503 7137 -24020
974 -24020 49030 40642 4621 -8465 -14171 16074 4789 15010 20851 -22451 -8757 18048 11706
961 11706 55362 39958 5006 499 10356 32061 37219 2342 -22818 -51030 -16753 -2841 19887
948 19887 56278 43449 -30898 -49121 -1219 8635 28437 85223 80135 4922 -27458 16028
936 16028 -8104 -56823 -44102 -548 20332 -1137 7001 -38450 -38267 23611 10415 5937 -20745
923 -20745 53628 52771 17557 -7730 -32787 -39123 22008 17863 -56932 -10768 2967 -19566 -3612
910 -3612 -13076 -19858 -13955 -5707 19054 25937 9158 9891 40455 21862 8019 -6431 -6704 16684
896 16684 32038 -13441 -1871 1359 -21224 -7848 -32281 -38519 4866 23183 -14826 -18882 1581
883 1581 4584 -27419 -38983 -16036 2522 -46335 -38505 -20871 37039 39144 -14082 -19143 -32359
870 -32359 -54513 -29701 -9429 -49562 -50825 -42304 8805 -2795 -30312 -13158 30097 2803
858 2803 1090 -126 -13670 -17570 23576 49402 42843 6766 -8508 -41998 -82040 -39115 -48691
845 -48691 -230 13169 12692 6350 33140 50313 23643 22883 15636 29210 59114 22036 60309
832 60309 44341 4565 -6040 29887 66617 44075 -7064 -28230 -26822 -7003 27642 -7649
820 -7649 -6342 -35596 -23474 16744 29590 11235 -8296 -22630 -14873 13356 -40343 -32846 5211
807 5211 -26776 -25648 -80389 -44659 -6941 -48974 -34269 13319 35905 40558 11576 34117 76209
794 76209 45601 6921 -3296 -56251 -12554 51916 -6852 1003 19763 -34336 -60855 -21215
782 -21215 -26244 18530 17769 -19236 33530 -20421 -9879 -167 -39991 -14070 30597 51014 53692
769 53692 -1713 -8355 12166 47624 62977 28181 -9562 17741 28735 44188 18495 -34147
757 -34147 -32934 -793 21710 19900 3590 2140 31484 23908 25318 25150 25940 21776 19523 -51321
743 -51321 -25680 9563 3608 5873 77074 51872 -13816 -50236 46215 49968 -17772 48923 24501
730 24501 -9450 5546 -13603 -8331 18958 42116 -13504 -4877 -2565 -34233 13625 42797 15808
717 15808 19722 21855 9795 6042 -12667 6440 15351 -3334 -13342 39227 51583 11014 -1832
704 -1832 -7850 37504 11499 -22801 -16752 -15399 22993 -2955 -46355 -70827 31813 22116 324
691 324 -23452 36820 28863 9237 23717 45363 35414 36154 68276 20021 32139 62348 -18404
678 -18404 -3988 -12878 -16788 24228 26833 25108 20446 13279 39785 62650 69375 46940 1797
665 1797 12390 3445 56231 62443 44006 10484 26744 -13994 -62871 2731 43875 -1452 -11738
652 -11738 2472 47072 91683 46448 -1638 -644 -8615 -17729 -15541 -9383 -39848 -55607 -45018
639 -45018 3046 46064 20108 -11265 40208 49620 24171 -2476 -6451 -7683 33024 -14760 22203
626 22203 42799 17752 30403 20482 -3685 32403 41717 31146 35722 46937 27518 27897 -10387
613 -10387 -28146 -63987 -24091 47183 3995 411 30718 9128 -11502 32859 36770 -11004
601 -11004 20006 45209 27632 17668 -8297 -59161 -37806 20335 51074 57235 7869 54910
589 54910 25767 23434 37830 58398 48823 65509 -18774 22541 25665 383 -15836 -50606 -58854
576 -58854 -22960 56008 67276 13863 66692 34415 14903 -12495 40726 72780 79034 59373
564 59373 2500 -2160 35459 36583 32068 38914 -3565 17634 -7178 18345 12859 10961 -48710
551 -48710 14418 -5978 32529 42912 66893 36578 -1839 7286 -1355 -18463 19339 13713 -23377
538 -23377 -22288 -2459 -9251 18236 -3 -15893 -1388 -31178 41012 18326 43142 28349
526 28349 14622 -2204 -32920 -37504 -3361 -49488 -58552 -19982 -6155 11943 214 17230
514 17230 -379 6502 20261 38312 27059 -58055 -29596 1011 8120 -36321 -21045 -20205 -9354
501 -9354 -21034 -16546 -14217 27087 54771 45188 27876 47788 17940 -6477 -16433 -49829 7727
488 7727 26950 49073 41832 6155 16152 55001 43503 24966 25147 45592 31308 -32177 -7136
475 -7136 37105 9223 21520 13776 -29262 -54868 -32784 13362 -6886 -35659 -36915 -1027 65508
462 65508 7321 -42996 -34761 3758 8801 -27958 -8299 42758 2233 -26218 2234 38706
450 38706 48917 40848 76338 21957 -36323 28464 6113 -21344 4484 29635 57042 71531
438 71531 66459 27798 18987 26813 -6505 46793 19591 19309 -36717 7554 5232 -2741 -28797
425 -28797 -34722 -5154 51568 56286 -12363 25054 -22407 7273 22161 34801 39779 31012 22867
412 22867 46879 38211 -16927 13193 62093 88793 102215 44397 67263 95191 78725 106839
400 106839 51950 70211 102948 82259 19333 24473 30139 64361 98450 60748 45849 87790
388 87790 106752 44592 40820 82848 80033 80724 121413 127235 89997 89897 22615 3334 48905
375 48905 34596 49816 -1111 69390 87271 101293 59353 64121 126831 74392 50106 102505
363 102505 116110 119639 113347 64196 54987 74022 105536 110585 73155 43860 57134 52126 89904
350 89904 101223 50043 80674 91374 84767 102508 118731 76756 54599 40500 84455 97201
338 97201 81543 36091 39859 52532 69281 65018 57629 91414 127784 118141 60263 47008 33810
325 33810 69332 124636 32823 47880 82629 76890 85330 70501 94228 64466 56026 66190 32577
312 32577 53337 71015 65039 55089 27775 59788 109175 134964 151474 97153 65519 86722
300 86722 64204 16698 4617 64486 104580 75886 68609 33793 26198 30208 26949 42881 94461
287 94461 122626 110474 121228 107672 78261 70495 87117 52154 92204 105281 75269 -15490
275 -15490 47223 70669 29478 4356 12746 44637 65565 48772 65393 86796 55541 96117
263 96117 92238 65810 72625 84971 128570 87317 105169 88627 19439 54462 78177 48650
251 48650 49366 20860 54164 42168 61256 79874 74905 86700 52025 37626 76985 79564 86651
238 86651 61770 65841 81906 63963 80181 90253 113047 109923 120993 110666 77122 70073 93163
225 93163 109132 123999 76480 57213 54792 53035 45394 66581 63893 77430 98036 83121 69606
212 69606 82166 69048 69797 119616 84513 84386 77365 42242 43474 75762 103215 96901 95409 86302
198 86302 73840 94960 127491 126867 97925 64134 58659 67230 95529 85478 101259 89275 50344
185 50344 67576 112557 59226 58130 74730 102417 87500 75895 81686 61521 30988 65711
173 65711 89790 77733 75888 108531 97532 76999 50135 33458 83865 68334 38021 29275
161 29275 35293 33251 98630 82244 61516 55310 34232 11970 44451 62187 48818 81654 128614
148 128614 84324 94954 101267 106717 142745 103867 93094 67425 83631 82567 96434 74439
136 74439 58225 100258 71497 50640 44964 18152 60882 63651 91243 73827 51846 58587 68799
123 68799 98642 76069 81031 111748 101219 69975 38819 78036 56351 64877 47517 93681
111 93681 93019 73484 110196 100844 96581 87713 97143 99126 118403 94569 115359 83581 67312
98 67312 62033 58414 61619 105102 71617 79732 74103 77041 89378 89034 51666 57431 41564 25371
84 25371 -1649 -12131 24851 51341 46431 20868 47534 46882 75903 107085 108517 71820 66625
71 66625 47809 51865 79509 73380 77377 77922 75246 93915 67936 83772 130517 160418 147828
58 147828 112343 76241 98907 120091 85624 90704 49121 77261 88935 73965 81301 77300 70685
45 70685 32894 54971 64309 90499 98387 57198 64401 83322 101143 89949 86217 105847 76541
32 76541 91671 64414 71001 95708 72790 59348 85000 89322 80763 103955 82382 65637 64926
19 64926 49626 69931 85997 52151 75905 101188 84138 96570 119051 65223 51765 45042
7 45042 47405 73101 70068 82556 88821 74815 87501
0 87501
$$ Imaginary data points
##PAGE= N=2
##DATA TABLE= (X++(I..I)), XYDATA
16383 -439253 -399406 -398814 -388797 -344665 -363508 -388446 -383150 -369536 -349496 -344837 -349926 -338852
16371 -338852 -314332 -261611 -265235 -292223 -271565 -251901 -259293 -223268 -167337 -173140 -154098 -157559
16359 -157559 -143099 -145987 -114839 -116090 -107453 -107946 -90869 -49036 -57713 -37983 9027 19287 -6953
16346 -6953 -18721 4516 14018 -12001 13198 28454 61050 71731 54981 63434 73228 99040
16334 99040 118291 122184 164147 137459 121932 151299 111349 155751 163606 189214 197483 180072
16322 180072 202012 222612 219514 220492 251195 300511 321667 334452 329740 327090 313370 301233
16310 301233 299432 311900 366311 388145 376426 362961 400040 413600 427158 442295 446625 442365
16298 442365 461801 466337 444073 448045 494120 491099 469023 453479 487569 507442 505024 502374
16286 502374 519746 561736 569720 569832 563822 581054 593115 577386 601677 610919 598102 590945 612069
16273 612069 621490 666033 702212 681328 694985 720389 685597 678008 697589 693398 674477 695897
16261 695897 747740 751214 762469 814003 808561 788742 795741 811148 811463 818545 869571 859274 870599
16248 870599 909045 874988 833465 850784 862382 834482 794637 880168 938237 921775 872862
16237 872862 826361 859288 914532 947711 947851 938144 917802 918642 896530 910018 934569 978513
16225 978513 971982 997346 1016089 1012199 1058315 1034467 1007943 1023704 1007007 998368 997031 1051717
16213 1051717 1089560 1067817 1106384 1131294 1113147 1102833 1083545 1091245 1080277 1050174 1072113
16202 1072113 1070943 1071930 1092482 1103199 1118274 1093822 1095437 1118763 1115690 1113706 1140738 1164089
16190 1164089 1134405 1180530 1226982 1191143 1166772 1179509 1155994 1174484 1205417 1207487 1186399
16179 1186399 1186601 1152466 1166168 1159046 1139523 1157081 1122339 1156311 1207352 1177423 1171989 1157294
16167 1157294 1143908 1200058 1202522 1169657 1171277 1213122 1235542 1188887 1201453 1201638 1251319 1252752
16155 1252752 1247157 1217727 1247177 1228909 1184089 1144932 1162596 1230388 1262906 1299837 1258787
16144 1258787 1194415 1242106 1286666 1226934 1204235 1261286 1287145 1306694 1302699 1299422 1294295 1254092
16132 1254092 1341426 1333310 1336972 1323105 1293830 1309674 1276418 1253325 1254064 1236795 1248408 1238276
16120 1238276 1269549 1245909 1282642 1280654 1252800 1287011 1285866 1331571 1366738 1322598 1271911 1263455
16108 1263455 1242532 1279329 1340649 1284992 1303376 1295051 1269474 1283300 1312196 1317747 1304136 1308384
16096 1308384 1336058 1348303 1370038 1350696 1315959 1303323 1328075 1329756 1311017 1300063 1320427
16085 1320427 1346704 1323254 1292535 1253928 1292662 1269463 1319514 1385708 1372348 1389748 1375458
16074 1375458 1318561 1324661 1319645 1322044 1348915 1411452 1397679 1335174 1311345 1337089 1376331 1338727
16062 1338727 1318350 1308579 1341327 1387874 1377562 1370318 1380296 1357208 1305533 1306634 1343289 1327288
16050 1327288 1320161 1327720 1335990 1346044 1377218 1379878 1362133 1350123 1334502 1340039 1359117 1303362
16038 1303362 1275344 1288639 1289571 1349248 1349582 1327837 1283710 1324371 1360223 1410143 1455028 1376961
16026 1376961 1368833 1356631 1350149 1363973 1317678 1311595 1322837 1325853 1368122 1356381 1333648 1318935
16014 1318935 1308746 1329201 1376526 1379237 1352038 1369040 1353294 1382540 1382432 1360445 1388603 1374905
16002 1374905 1376586 1362393 1351769 1311224 1317809 1341904 1321254 1345261 1355856 1356355 1367711 1372691
15990 1372691 1342364 1351992 1363662 1378788 1391637 1414287 1402696 1390722 1367781 1346649 1354853 1357639
15978 1357639 1404066 1392524 1351634 1399349 1359473 1349193 1351529 1361373 1341074 1326629 1341439 1364962
15966 1364962 1381057 1396424 1326104 1348178 1364840 1364892 1380566 1373444 1421702 1391699 1396189 1391825
15954 1391825 1344789 1309350 1368700 1390473 1308759 1326234 1384924 1357123 1383005 1403134 1422700
15943 1422700 1408139 1407631 1408679 1381159 1359650 1428587 1433093 1426871 1420765 1401410 1373701 1384080
15931 1384080 1371047 1328152 1341095 1310455 1357631 1402271 1386233 1386002 1362950 1379436 1367510 1377163
15919 1377163 1410734 1414422 1414497 1350050 1348728 1385397 1394932 1426584 1446594 1400879 1355768 1385969
15907 1385969 1386026 1376764 1340346 1327159 1344196 1340814 1357228 1342604 1370070 1405437 1384712 1404676
15895 1404676 1380842 1402313 1425416 1390518 1406284 1393806 1379438 1351075 1367948 1404088 1381222
15884 1381222 1351515 1349212 1390290 1422144 1378538 1402575 1355945 1364530 1356698 1363125 1416425 1428442
15872 1428442 1369292 1361391 1390703 1369267 1360348 1368995 1390810 1351672 1322594 1371538 1351425 1368208
15860 1368208 1414766 1402525 1431685 1408355 1407733 1364237 1350667 1353311 1379481 1378523 1398231 1372146
15848 1372146 1421127 1420754 1381903 1376046 1348080 1316404 1334882 1385443 1374834 1356718 1372172 1366374
15836 1366374 1384528 1347300 1316702 1337017 1359986 1350975 1390860 1416746 1435172 1389265 1386539 1420643
15824 1420643 1417007 1381930 1390176 1424979 1415018 1430473 1412005 1404203 1401572 1404006 1375870 1374070 1398247
15811 1398247 1438935 1419716 1403849 1390095 1370344 1362288 1375178 1356620 1405490 1389034 1390026 1404556
15799 1404556 1398570 1328501 1282124 1357094 1427485 1442665 1462753 1388515 1374063 1386441 1401989
15788 1401989 1369660 1376303 1426094 1471571 1432831 1389900 1391155 1373380 1392451 1374409 1402158 1363232
15776 1363232 1332924 1392958 1402726 1403278 1375011 1351615 1390146 1338933 1343062 1388438 1395847 1364339
15764 1364339 1337292 1361283 1361374 1401655 1423415 1396325 1379574 1393121 1374477 1323179 1360572 1371553
15752 1371553 1330903 1348872 1384884 1389595 1391373 1428485 1418791 1354125 1344927 1361552 1395142 1411178
15740 1411178 1424618 1354702 1371440 1360219 1381867 1422834 1394175 1394685 1400186 1422755 1405967 1424157
15728 1424157 1423492 1439002 1434508 1435932 1396019 1406058 1380291 1362105 1365274 1428245 1437895 1399720
15716 1399720 1373529 1391230 1435250 1461487 1455568 1387324 1440182 1409672 1383451 1410891 1395673
15705 1395673 1409267 1439809 1397067 1385203 1411317 1379656 1389637 1380898 1377537 1398658 1366088 1373332
15693 1373332 1401661 1409467 1400860 1382667 1323371 1335786 1360854 1391782 1390287 1368839 1336243 1378493
15681 1378493 1423221 1439061 1376653 1397813 1413923 1409407 1384090 1353087 1406706 1398276 1374131 1378751
15669 1378751 1422998 1471683 1429767 1398634 1406093 1367089 1432991 1433988 1433375 1374220 1375391 1429784
15657 1429784 1390152 1444730 1489951 1426619 1382847 1363314 1312154 1370596 1393209 1425271 1452833
15646 1452833 1382152 1336859 1340323 1355730 1376345 1402819 1429634 1365545 1340184 1388411 1363207
15635 1363207 1356900 1362618 1399739 1429125 1432077 1399950 1442688 1453009 1426188 1451269 1427618 1461977
15623 1461977 1392880 1393723 1462769 1427557 1443981 1419359 1415798 1421469 1429365 1440891 1442352 1450194 1497611
15610 1497611 1519625 1480286 1446032 1430342 1440103 1400136 1391363 1415913 1412680 1398391 1422421 1404558
15598 1404558 1380962 1424096 1444654 1462449 1416447 1389593 1456498 1436270 1380414 1405163 1438089
15587 1438089 1452638 1457020 1427691 1356641 1375532 1397945 1403055 1435344 1413562 1403978 1405120 1389693
15575 1389693 1408263 1395656 1416032 1425609 1423263 1408561 1427498 1462955 1428216 1405400 1437800 1428725
15563 1428725 1388223 1414370 1400761 1444820 1466406 1457057 1419698 1450539 1469731 1442700 1453096
15552 1453096 1415220 1466389 1499039 1459450 1374123 1408723 1426159 1464413 1474145 1447990 1444025 1497143
15540 1497143 1449443 1466424 1472197 1453053 1474435 1477104 1491633 1442053 1456902 1451123 1442075 1411373
15528 1411373 1459421 1468386 1462975 1437912 1435500 1383261 1356958 1386671 1390177 1436639 1445224 1428234
15516 1428234 1439895 1423218 1455040 1448251 1443723 1436508 1400161 1444501 1474393 1470816 1465457 1494750
15504 1494750 1472095 1489219 1475429 1457455 1434386 1442136 1470794 1461444 1451501 1428977 1454257 1408086
15492 1408086 1423136 1458301 1452308 1391412 1351661 1429228 1425875 1438390 1502372 1498791 1456634 1442537
15480 1442537 1377012 1385743 1428739 1403630 1426270 1471575 1465852 1440134 1448220 1457414 1386988 1357738
15468 1357738 1362813 1415555 1468525 1432373 1445946 1463458 1467241 1468256 1444279 1467965 1442841 1460421
15456 1460421 1503661 1475272 1459989 1461903 1488393 1492149 1466944 1433576 1435777 1405103 1433542 1437684
15444 1437684 1463934 1430474 1433243 1506146 1491011 1427916 1450124 1458054 1459954 1496276 1461687 1448611
15432 1448611 1436725 1449452 1468152 1400876 1447867 1467365 1467117 1454416 1450665 1455749 1450136 1455063
15420 1455063 1472903 1481320 1458022 1460197 1427892 1401800 1430744 1412259 1399263 1389289 1442309 1490629
15408 1490629 1462852 1479033 1479848 1478615 1453210 1493509 1499532 1484092 1464613 1451655 1517162 1519019
15396 1519019 1477531 1456812 1458619 1468067 1433119 1432327 1467205 1482551 1504298 1476473 1417930 1418863
15384 1418863 1433872 1424387 1366367 1347710 1413826 1418995 1413671 1423585 1422047 1446110 1466972 1438665
15372 1438665 1469861 1532158 1498552 1511077 1484573 1426622 1435778 1458431 1434493 1387737 1385432 1382229
15360 1382229 1372165 1423546 1474308 1474838 1446943 1457365 1451678 1433718 1444562 1481414 1518795 1532907
15348 1532907 1512382 1478608 1492396 1489557 1434130 1460201 1415347 1464234 1483924 1469157 1525262
15337 1525262 1569042 1516082 1450291 1470748 1520783 1460293 1460611 1462762 1471966 1447865 1428742 1487065
15325 1487065 1457580 1442144 1446196 1447554 1452143 1475552 1481431 1462979 1499268 1533945 1505921 1503512
15313 1503512 1482476 1464307 1441149 1469736 1521848 1522518 1443466 1460510 1516034 1522866 1500835 1535928
15301 1535928 1516131 1527120 1553995 1544762 1528439 1454753 1469332 1508792 1471160 1425916 1437906
15290 1437906 1456311 1497957 1451299 1433043 1465851 1442722 1431189 1469020 1484022 1485281 1478545 1493447
15278 1493447 1490178 1479780 1501994 1448788 1432183 1495868 1491993 1456439 1456601 1467180 1474641 1513702
15266 1513702 1496133 1492553 1503278 1527930 1576800 1492957 1482350 1491540 1488059 1464377 1417384 1502748
15254 1502748 1537963 1551905 1551600 1519388 1449949 1434393 1464348 1492615 1520349 1539444 1559140 1526193
15242 1526193 1568796 1532259 1525047 1449987 1426430 1481197 1471982 1447586 1494637 1483681 1527065 1518353
15230 1518353 1507772 1487080 1456194 1444101 1462538 1523516 1548300 1496569 1454034 1476905 1515355
15219 1515355 1514829 1474004 1454238 1507482 1475306 1511049 1562598 1504327 1465994 1469287 1444066 1458213
15207 1458213 1522389 1505940 1523819 1516853 1523516 1534360 1539215 1531248 1526478 1523006 1520446 1521257 1525059
15194 1525059 1493371 1518827 1515657 1503263 1537214 1526631 1512250 1516083 1466504 1458609 1462247 1458425
15182 1458425 1454464 1480674 1488300 1487328 1429783 1442022 1460116 1439820 1399503 1445882 1456450 1451431
15170 1451431 1453615 1474614 1476682 1469652 1525546 1491432 1469956 1475691 1543154 1531026 1515783 1561098
15158 1561098 1539534 1491137 1476590 1473606 1475189 1502158 1506123 1512698 1503478 1470429 1475807 1437722
15146 1437722 1431553 1499842 1488802 1481433 1511911 1525364 1519653 1543404 1487775 1430502 1419266 1420286
15134 1420286 1429493 1447522 1507471 1551780 1562322 1517646 1517012 1499571 1490232 1543661 1555768 1504598
15122 1504598 1497765 1528458 1539941 1525942 1475732 1468369 1459713 1476212 1482248 1477370 1450820 1428675
15110 1428675 1523994 1566268 1493397 1486998 1524047 1510197 1551487 1533195 1477248 1466998 1499069
15099 1499069 1554099 1533787 1504459 1497470 1534796 1523811 1517709 1549414 1473754 1481172 1515391 1535767
15087 1535767 1549586 1566172 1554318 1526313 1551807 1514728 1523397 1519152 1548180 1518511 1521250 1580178
15075 1580178 1532657 1532121 1473921 1432104 1485212 1507792 1515695 1513294 1484316 1460467 1507384 1514569
15063 1514569 1490947 1503560 1479494 1472281 1543687 1537999 1556216 1517003 1477103 1513272 1494557 1491879
15051 1491879 1506245 1567112 1567302 1503867 1499583 1570204 1554908 1575428 1563353 1515012 1505827 1528180
15039 1528180 1561548 1531475 1522481 1542788 1479769 1496716 1465666 1497209 1507328 1524721 1519938 1522157
15027 1522157 1516845 1520870 1538852 1515824 1562508 1518237 1511752 1492762 1497473 1557928 1531945 1532942
15015 1532942 1540752 1520378 1546522 1525243 1503325 1481404 1534969 1549187 1552050 1523946 1555800 1586553
15003 1586553 1557426 1541182 1509718 1501304 1533688 1550678 1561262 1550870 1495924 1482051 1494452
14992 1494452 1482107 1511416 1506608 1489996 1509721 1523568 1459045 1482214 1529549 1525183 1523335 1523365
14980 1523365 1515252 1536747 1543080 1526242 1523001 1483916 1524523 1551715 1549631 1542432 1500337 1534933
14968 1534933 1522940 1534350 1575749 1525808 1525992 1545136 1572944 1636139 1586810 1521484 1540724 1522291
14956 1522291 1510418 1509287 1551294 1538140 1572062 1583501 1550937 1516427 1529769 1522387 1529041 1547294
14944 1547294 1536731 1511255 1508297 1480818 1521123 1544024 1564532 1525880 1535299 1525672 1496632 1507044
14932 1507044 1532431 1545449 1523259 1508126 1513797 1492019 1506581 1560771 1572994 1565872 1515386 1503328
14920 1503328 1544473 1524777 1561980 1517895 1534728 1556603 1520012 1498673 1551991 1573015 1547042
14909 1547042 1534364 1539008 1542239 1508158 1543275 1533588 1544846 1532920 1541369 1481661 1507375 1482306
14897 1482306 1488610 1498975 1523890 1513451 1540028 1551925 1569010 1543144 1566014 1585825 1587645 1581144
14885 1581144 1551137 1503325 1502926 1465280 1494038 1541986 1570803 1511425 1510571 1546994 1559845 1595917
14873 1595917 1579532 1561412 1544044 1532603 1576007 1610646 1560037 1516796 1552496 1606952 1639635
14862 1639635 1548838 1597538 1614932 1582938 1565415 1536458 1583724 1579262 1579148 1521942 1536837 1601085
14850 1601085 1584294 1566827 1609932 1560764 1582996 1611521 1531242 1478527 1538836 1517617 1516261
14839 1516261 1521018 1526821 1547780 1530011 1561097 1555265 1570942 1578680 1577221 1613609 1567817 1580689
14827 1580689 1621781 1623018 1588954 1593491 1589067 1576732 1565885 1574290 1542813 1606387 1625065 1607080
14815 1607080 1576769 1547859 1512345 1513634 1560682 1536614 1534100 1535380 1558010 1594628 1597578 1588113
$$ [...]
##END NTUPLES=NMR SPECTRUM
##END=
