##TITLE=1H_TG-2340-D4
 CDCl3
 8 sc, 
 18.08.2022
##JCAMPDX= 6.0         $$ Bruker NMR JCAMP-DX V2.0
##DATA TYPE= NMR SPECTRUM
##DATA CLASS= NTUPLES
##ORIGIN= UXNMR, Bruker Analytische Messtechnik GmbH
##OWNER= root
$$ XWIN-NMR		Version 3.5
$$ Thu Aug 18 10:07:52 2022 Russian Standard Time (UT+4h)  she@DPX200
##.OBSERVE FREQUENCY= 200.1313499994
##.OBSERVE NUCLEUS= ^1H
##.ACQUISITION MODE= SIMULTANEOUS
##.ACQUISITION SCHEME= undefined
##.AVERAGES= 8
##.DIGITISER RES= 18
##SPECTROMETER/DATA SYSTEM= spect
##.PULSE SEQUENCE= zg30
##.SOLVENT NAME= CDCl3
##.SHIFT REFERENCE= (INTERNAL, CDCl3, 0, 15.7381)
##AUDIT TRAIL= $$ (NUMBER, WHEN, WHO, WHERE, WHAT)
$$ ##TITLE= Audit trail, XWIN-NMR		Version 3.5
$$ ##JCAMPDX= 5.01
$$ ##ORIGIN= Bruker BioSpin GmbH
$$ ##OWNER= she
$$ F:/spectra/data/she/nmr/H-F/1/pdata/1/auditp.txt
$$ ##AUDIT TRAIL=  $$ (NUMBER, WHEN, WHO, WHERE, WHAT)
(   1,<2022-08-18 10:05:59.92 +0400>,<she>,<DPX200>,
      <created by zg, POWCHK disabled, PULCHK disabled
       configuration hash MD5:
       00 E9 B6 7A A2 85 ED C7 34 08 36 98 17 FE 4E 26
       data hash MD5: 16K
       F8 28 FA 23 CD BD 07 7C 19 DF 9D 99 53 56 30 1B>)
(   2,<2022-08-18 10:06:02.21 +0400>,<she>,<DPX200>,
      <Start of raw data processing
       efp BC_mod = 2 LB = 0.24 FT_mod = 6 PKNL = 1 PHC0 = -18035.85 PHC1 = 6.80068 SI = 16K 
       data hash MD5: 16K
       41 D2 AF F1 E0 EC F1 1D F0 99 E3 06 B5 60 D9 88>)
(   3,<2022-08-18 10:06:16.26 +0400>,<she>,<DPX200>,
      <pk PHC0 = -0.0640585 PHC1 = 0 
       data hash MD5: 16K
       1D E8 8D 70 12 C6 4F D7 C3 98 CF 96 EE 0D F0 A8>)
(   4,<2022-08-18 10:06:21.32 +0400>,<she>,<DPX200>,
      <abs ABSG = 5 
       data hash MD5: 16K
       A8 0A 5D 9A 34 5A 4A 0F D3 55 07 07 6F EC 97 AD>)
(   5,<2022-08-18 10:07:02.09 +0400>,<she>,<DPX200>,
      <pk PHC0 = -1.400048 PHC1 = -8.940697e-08 
       data hash MD5: 16K
       B7 57 C0 10 EA 93 D3 8A 1F 66 18 A4 20 2C E3 46>)
(   6,<2022-08-18 10:07:06.23 +0400>,<she>,<DPX200>,
      <abs ABSG = 5 
       data hash MD5: 16K
       92 5E CE 54 F5 EB 05 78 5A 18 6C 83 7F E8 B3 AD>)
$$ ##END=
$$ 
$$ hash MD5
$$ 9F CB C6 7E 92 DB 45 CB 2D E5 7C E9 C9 94 09 88
##$RELAX= 
##$RELAX= 
##$RELAX= 
##$RELAX= 
##$RELAX= 
##$RELAX= 
$$ Bruker specific parameters
$$ --------------------------
##$DU= <F:/spectra>
##$EXPNO= 1
##$NAME= <H-F>
##$PROCNO= 1
##$TYPE= <nmr>
##$USER= <she>
##$AMP= (0..31)
100 100 100 100 100 100 100 100 100 100 100 100 100 100 100 100 100 100 
100 100 100 100 100 100 100 100 100 100 100 100 100 100 
##$AQSEQ= 0
##$AQ_mod= 1
##$AUNM= <au_zg>
##$AUTOPOS= <>
##$BF1= 200.13
##$BF2= 200.13
##$BF3= 200.13
##$BF4= 200.13
##$BF5= 200.13
##$BF6= 200.13
##$BF7= 200.13
##$BF8= 200.13
##$BYTORDA= 1
##$CFDGTYP= 0
##$CFRGTYP= 5
##$CHEMSTR= <none>
##$CNST= (0..31)
1 1 145 1 1 1 1 1 1 1 1 1 1 1 1 1 1 1 1 1 1 1 1 1 1 1 1 1 1 1 1 1 
##$CPDPRG= <>
##$CPDPRG1= <>
##$CPDPRG2= <>
##$CPDPRG3= <>
##$CPDPRG4= <mlev>
##$CPDPRG5= <mlev>
##$CPDPRG6= <mlev>
##$CPDPRG7= <mlev>
$$ [...]
##$SUBNAM2= <"">
##$SUBNAM3= <"">
##$SUBNAM4= <"">
##$SUBNAM5= <"">
##$SUBNAM6= <"">
##$SUBNAM7= <"">
##$SUBNAM8= <"">
##$SUBNAM9= <"">
##$SW= 18.0517283424941
##$SWIBOX= (0..15)
0 0 2 0 0 0 0 0 0 0 0 0 0 0 0 0 
##$SW_h= 3612.71676300578
##$TD= 16384
##$TD0= 1
##$TE= 0
##$TE2= 300
##$TE3= 300
##$TEG= 300
##$TL= (0..7)
0 120 120 120 120 120 120 120 
##$TP= (0..7)
150 150 150 150 150 150 150 150 
##$TP07= 0
##$TPNAME0= <>
##$TPNAME1= <>
##$TPNAME2= <>
##$TPNAME3= <>
##$TPNAME4= <>
##$TPNAME5= <>
##$TPNAME6= <>
##$TPNAME7= <>
##$TPOAL= (0..7)
0.5 0.5 0.5 0.5 0.5 0.5 0.5 0.5 
##$TPOFFS= (0..7)
0 0 0 0 0 0 0 0 
##$TUNHIN= 0
##$TUNHOUT= 0
##$TUNXOUT= 0
##$USERA1= <user>
##$USERA2= <user>
##$USERA3= <user>
##$USERA4= <user>
##$USERA5= <user>
##$V9= 5
##$VALIST= <valist>
##$VCLIST= <CCCCCCCCCCCCCCC>
##$VD= 0
##$VDLIST= <DDDDDDDDDDDDDDD>
##$VPLIST= <PPPPPPPPPPPPPPP>
##$VTLIST= <TTTTTTTTTTTTTTT>
##$WBST= 1024
##$WBSW= 4
##$XGAIN= (0..3)
0 0 0 0 
##$XL= 0
##$YL= 0
##$YMAX_a= 529042
##$YMIN_a= -797617
##$ZGOPTNS= <>
##$ZL1= 120
##$ZL2= 120
##$ZL3= 120
##$ZL4= 120
##$ABSF1= 15.73808
##$ABSF2= -2.313769
##$ABSG= 5
##$ABSL= 3
##$ALPHA= 0
##$AQORDER= 0
##$ASSFAC= 0
##$ASSFACI= 0
##$ASSFACX= 0
##$ASSWID= 0
##$AUNMP= <proc_1d>
##$AZFE= 0.1
##$AZFW= 0.1
##$BCFW= 0
##$BC_mod= 2
##$BYTORDP= 0
##$COROFFS= 0
##$CY= -3
##$DATMOD= 1
##$DC= 0
##$DFILT= <>
##$DTYPP= 0
##$F1P= 0
##$F2P= 0
##$FCOR= 1
##$FTSIZE= 16384
##$FT_mod= 6
##$GAMMA= 0
##$GB= 0
##$INTBC= 1
##$INTSCL= 0
##$ISEN= 128
##$LB= 0.24
##$LEV0= 0
##$LPBIN= 0
##$MAXI= 10000
##$MC2= 0
##$MEAN= 0
##$ME_mod= 0
##$MI= 1.114404
##$NCOEF= 0
##$NC_proc= -5
##$NLEV= 6
##$NOISF1= 3.799351
##$NOISF2= 2.8
##$NSP= 0
##$NTH_PI= 0
##$NZP= 0
##$OFFSET= 15.73808
##$PC= 1
##$PHC0= -18037.31
##$PHC1= 6.80068
##$PH_mod= 1
##$PKNL= yes
##$PPARMOD= 0
##$PSCAL= 0
##$PSIGN= 0
##$REVERSE= no
##$SF= 200.130006698683
##$SI= 16384
##$SIGF1= 3
##$SIGF2= 2
##$SINO= 5.538805
##$SIOLD= 16384
##$SREGLST= <1H.CDCl3>
##$SSB= 0
##$STSI= 16384
##$STSR= 0
##$SW_p= 3612.71676300578
##$SYMM= 0
##$S_DEV= 0
##$TDeff= 16384
##$TDoff= 0
##$TI= <>
##$TILT= no
##$TM1= 0
##$TM2= 0
##$TOPLEV= 0
##$USERP1= <user>
##$USERP2= <user>
##$USERP3= <user>
##$USERP4= <user>
##$USERP5= <user>
##$WDW= 1
##$XDIM= 16384
##$YMAX_p= 524865306
##$YMIN_p= -364140
$$ End of Bruker specific parameters
$$ ---------------------------------
##NTUPLES= NMR SPECTRUM
##VAR_NAME=  FREQUENCY,     SPECTRUM/REAL,   SPECTRUM/IMAG
##SYMBOL=    X,             R,               I
##VAR_TYPE=  INDEPENDENT,   DEPENDENT,       DEPENDENT
##VAR_FORM=  AFFN,          ASDF,            ASDF
##VAR_DIM=   16384,         16384,           16384
##UNITS=     HZ,            ARBITRARY UNITS, ARBITRARY UNITS
##FACTOR=    0.220516191357247, 1,           1
##FIRST=     3149.66206077147, 0,            0
##LAST=      -463.05470223431, 0,            0
##MIN=       -463.05470223431, -364140,      0
##MAX=       3149.66206077147, 524865306,    0
$$ Real data points
##PAGE= N=1
##DATA TABLE= (X++(R..R)), XYDATA
$$ [...]
7066A7971655j052706r47408q29254p67535p20443o20971n62024m87095l86098
7057A1598121l14098k87355k13799j60784j25525j38242j02591q0097j23055j18812
7047I933763o7714m2618m8426m9226r7225j81407k27136k78118j19977r9246k2020
7036H700650N5432Q7852J40086J51752J89909K83889J37389J61956K01926J78220
7026A0289061K47580K79789K39177L42477L84830M60228O03648O75159Q42924
7017A4364873R50663J195410J489584J759720K062181K263794K460931K789911
7009B9337067L259964L976138N082116O205962P011761O263575L668926P2030
7001F4877539l866058o316565p412039p200823o471347n463232m295677l335230
$$ plain form
7066 17971655 16918949 15971541 15142287 14374752 13654309 13033338 12471314 11984219 11598121
7057 11598121 11284023 10996668 10782869 10622085 10496560 10358318 10255727 10175630 10052575 9933763
7047 9933763 9866049 9823431 9775005 9725779 9628554 9447147 9220011 8941893 8821916 8722670 8700650
7036 8700650 8756082 8843934 8984020 9135772 9325681 9609570 9746959 9908915 10110841 10289061
7026 10289061 10536641 10816430 11055607 11398084 11782914 12243142 12846790 13521949 14364873
7017 14364873 15315536 16510946 18000530 19760250 21822431 24086225 26547156 29337067
7009 29337067 32597031 36573169 41655285 47861247 54873008 61136583 64805509 64877539
7001 64877539 61011481 54694916 47282877 40082054 33610707 28147475 23851798 20516568
6993B0516568k658223k007001j530585j265888j031423q85548q21755o34695o22338
6984I059112n83090m76345m35713l39768l58125l06761k62195k36520k39616k42080
6974E578899k79108k87403k17990j86890j65983j84531j68566k19540j69047j75714
6964C524127j47388j95168j10189q6457r8881n0917j8894j8202m9213M3225o036
6953B786007j7035k1888M0387O3571j3625K919o0833k8448l1181j4311j6157K2772
6941B712178l3097M7274M6385J6048L4305m7587P9064J20567Q6366r801n0714
6930C000988q4450k01155l03038k57280k49422j49916j44252j02588o8523j35358
6920A305006r4527l5731r396o4662q0716J2160m2506n1555n3716n5637j1554l6081
$$ plain form
6993 20516568 17858345 15851344 14320759 13054871 12023448 11137900 10316145 9681450 9059112
6984 9059112 8476022 7999677 7563964 7224196 6866071 6559310 6297115 6060595 5820979 5578899
6974 5578899 5299791 5012388 4794398 4607508 4441525 4256994 4088428 3868888 3699841 3524127
6964 3524127 3376739 3181571 3071382 2984925 2886044 2835127 2816233 2798031 2748818 2792043 2786007
6953 2786007 2768972 2747084 2787471 2851042 2837417 2840336 2779503 2751055 2719874 2705563 2689406 2712178
6941 2712178 2679081 2726355 2772740 2788788 2823093 2775506 2854570 2975137 3061503 3051702 3000988
6930 3000988 2916538 2715383 2412345 2155065 1905643 1755727 1611475 1508887 1440364 1305006
6920 1305006 1210479 1174748 1165352 1100690 1019974 1032134 989628 938073 884357 828720 817166 781085
6908G81085l2919o9613J8225j9412m8592l0014q940o615n4123L8164m143M3414
6896F06517l7770j6978l1003J7170J1439n5740n7417l1972O2386K2126l0892j4740
6884D43126L3929k3633J0529l5175P154l481p623L0936L1456j96P7920N1552l5604
6871E80890l7039l6451k1863J8163j2883r4903k6549k9410J6711k0603J3917k6514
6859C23466j9746J2714R830K6944j2567k8566k6529l3978J6561M250k9878J3096
6847B55597J0101N6977k2608K0418j434k2930K2002Q335j6041J3110k3488k08
6835B99831N7025k2099K8946K2389K9971N450K3640k2093j0193J8378k3378n1260
6823C56607n097N486j0680N1997J1148n2298K2992M112L124j4809j1177Q882J4482
$$ plain form
6908 781085 748166 678553 696778 677366 628774 598760 589820 583205 529082 567246 563103 606517
6896 606517 568747 551769 520766 537936 549375 493635 436218 404246 466632 488758 457866 443126
6884 443126 477055 453422 463951 428776 435930 432449 424826 455762 487218 487022 564942 616494 580890
6871 580890 543851 507400 485537 503700 490817 395914 369365 339955 356666 336063 349980 323466
6859 323466 303720 316434 326264 353208 340641 312075 285546 251568 268129 272379 242501 255597
6847 255597 265698 322675 300067 320485 319051 296121 318123 326458 310417 323527 300039 299831
6835 299831 356856 334757 363703 386092 416063 421513 445153 423060 412867 431245 407867 356607
6823 356607 351510 356996 346316 398313 409461 357163 380155 384267 387391 372582 361405 370287 384769
6810C84769J2669j3333r2864o6983j3387J1821N4532J4321m9612j5864O116J5338
6798B47523J0071l2447k1580N3998M3687k1928j020K8851P6561k1120k5352K7490
6786C64734m5945n8730l1307k0997K4654Q233M3066J7827l135K0117j076m2234
6774B75207m830n118R5207M2305q0508L8533O6134j1194J6002k3769L339L7767
6762D49075M4999m1957j2108L6991k8454k5066n9737n595K8282P369n6478J3725
6750C51046j7909J3966K7217P176o1929j8720K1460j551m466m1457L0813M021
6738C09667l2092K9408K8267p012k5735M2548j3283k2901K4891k9195N0361K1317
6726C76241O546j5178R465J626l9535j9831L9308J3176n3194J6553L0493j9251
$$ plain form
6810 384769 397438 384105 291241 224258 210871 222692 277224 291545 241933 226069 232185 247523
6798 247523 257594 225147 203567 257565 301252 279324 278304 307155 383716 362596 337244 364734
6786 364734 318789 260059 228752 207755 232409 240642 283708 301535 298400 318517 317441 275207
6774 275207 270377 265259 360466 402771 322263 360796 426930 415736 431738 407969 411308 449075
6762 449075 494074 452117 440009 477000 448546 423480 363743 358148 386430 393799 337321 351046
6750 351046 333137 347103 374320 381496 319567 300847 322307 320756 316290 274833 305646 309667
6738 309667 277575 306983 335250 328238 302503 345051 331768 308867 333758 304563 354924 376241
6726 376241 382787 367609 377074 378700 339165 319334 358642 371818 318624 335177 365670 346419
6714C46419J2423J8573K8330J0683J6162O466O8171m4516K0862j0966j8128J6685
6702D71164L8486j5812j8411R7454J7622j6667k8071J3849L796j5516P0172P4332
6690F92398M2308k618M1720O2993L9688Q8056M9295O9323L2799j2646j18994j04540
6678H79782p5970j0952m2702m5588j7868j7802m9816R123l5074O438k8380k9022
6666E42169J6638m8654J3371p884j7749K6234J8540l0050J4715K7789N884Q313
6654E69316L1437k4906k9869K8098P334J0910j4897J4560k97K1385Q722K0484
6642F42277L4272k8749l1590J1246R845J7322J3178j3509q274j4484j0954L7646
6630F58226j7618k1806K2402K3974L8823n0077M4014J0811M75n492K9562j7735
$$ plain form
6714 346419 358842 377415 405745 416428 432590 439056 507227 462711 483573 472607 454479 471164
6702 471164 509650 493838 475427 572881 590503 573836 545765 559614 563410 547894 618066 692398
6690 692398 734706 732088 773808 836801 876489 964545 1013840 1083163 1115962 1103316 984322 879782
6678 879782 803812 792860 750158 704570 686702 668900 619084 628207 593133 599571 571191 542169
6666 542169 558807 510153 523524 515640 497891 524125 542665 512615 527330 555119 561003 569316
6654 569316 600753 575847 545978 574076 581410 592320 577423 591983 591686 613071 621793 642277
6642 642277 676549 647800 616210 627456 637301 654623 667801 654292 646018 631534 620580 658226
6630 658226 640608 618802 641204 665178 704001 653924 697938 708749 709224 703732 733294 715559
6618G15559m1173K1796J1792K7816K1744j1723J1757K2127M1192k4165J873n940
6606G92655N9438J4934N6599J4164J226K3343K6344k5225q3922r156m0415m0269
6594G89716k998K6250l914k4873j1948N2183J063k1738j9012Q375n9894n6989
6582F76221K1044K1291J853j5738M7668N4058m9613k4876J0491j9832N8260K9818
6570H10645r657J0268R111J0877k5616J2263K9958m703n74j6120k5962P9323P44
6557H80557L813P479P3658N2098K0981m4546P899k289J5877K2871J4983M0557
6545A093938Q778K101M1841Q097n87Q497R0777r746l5055L7606Q2742j8199j26
6532A310664j7703j6834P2601O0331P619p281K887J7510N5901M8901j0408N2594
$$ plain form
6618 715559 674386 696182 707974 735790 757534 745811 757568 779695 820887 796722 798595 792655
6606 792655 852093 867027 923626 937790 939016 962359 988703 963478 879556 870400 829985 789716
6594 789716 786718 812968 809054 784181 772233 824416 825479 803741 784729 793104 733210 676221
6582 676221 697265 718556 720409 704671 752339 806397 756784 731908 742399 722567 780827 810645
6570 810645 800988 811256 820367 831244 805628 817891 847849 843146 842572 826452 800490 879813 880557
6557 880557 884370 891849 965507 1017605 1038586 994040 1001939 999650 1015527 1038398 1053381 1093938
6545 1093938 1102716 1104817 1146658 1154755 1154168 1162665 1253442 1243696 1208641 1246247 1328989 1310790 1310664
6532 1310664 1292961 1276127 1348728 1409059 1416678 1409397 1412284 1429794 1485695 1534596 1524188 1576782
6520A576782L2564k5056N2738j4107L7782N3580N6441O6303n0905N507O9478O4505
6508A925612N8309R998N4490O459K2513O4554R9670K7327N7746J9692P1162P6733
6496B494265L7948L0222O5122K3569M1628O0540L7036O1003J16370M9177L3191
6485C050071R6065M8302J05193M9274J2377R4115Q0142J11391R0413P8888P8678
6474C894909Q3125O9781J30482R1199P4367J01584J23957R0539R3795J28621R0348
6463D972707J07058J51433Q7747J33397R8487K01583J14675J42562J85229J69976
6453F364854J75759J87049J41132J56669K14999J65521K00026K57737K29500J89049
6443H282295J61795K04370K51543K92551L12769K91397K67999K94471L23747K52698
$$ plain form
6520 1576782 1609346 1584290 1637028 1622921 1660703 1714283 1770724 1837027 1786122 1791629 1861107 1925612
6508 1925612 1983921 1993919 2048409 2054868 2077381 2141935 2241605 2268932 2326678 2346370 2417532 2494265
6496 2494265 2532213 2562435 2627557 2651126 2692754 2753294 2790330 2851333 2967703 3016880 3050071
6485 3050071 3146136 3194438 3299631 3348905 3361282 3455397 3535539 3646930 3737343 3816231 3894909
6474 3894909 3978034 4047815 4178297 4269496 4343863 4445447 4569404 4659943 4753738 4882359 4972707
6463 4972707 5079765 5231198 5318945 5452342 5550829 5752412 5867087 6009649 6194878 6364854
6453 6364854 6540613 6727662 6868794 7025463 7240462 7405983 7606009 7863746 8093246 8282295
6443 8282295 8444090 8648460 8900003 9192554 9505323 9796720 10064719 10359190 10682937 10935635
6433A0935635K97028L18798L10340K65704L20850L19839L77328K88969L11944
6424A3746435L37952L13809L02553K53999K87040K41871K22864K08705K31074
6415A6146302J66352J58131J61919Q3396J17709N1237l729K0251n7888j39831
6405A6703849j10504j46116j55245j67441k06544k60809k78456k92666l24756
6396A4761312l15278l17516l42316l85518l86114l69728m18144l80483l45719
6387A1500496l29106l58896l64493l73019l79023l65157l03417k91944l10136
6378H425305l50300k35502k75159k53098k66690k60687k11194k28754j78570j76082
6368E989269k03391j93811j80317j56952k20081j54891j35087j20349r8552j10468
$$ plain form
6433 10935635 11232663 11551461 11861801 12127505 12448355 12768194 13145522 13434491 13746435
6424 13746435 14084387 14398196 14700749 14954748 15241788 15483659 15706523 15915228 16146302
6415 16146302 16312654 16470785 16632704 16716100 16833809 16885046 16881317 16901568 16843680 16703849
6405 16703849 16593345 16447229 16291984 16124543 15917999 15657190 15378734 15086068 14761312
6396 14761312 14446034 14128518 13786202 13400684 13014570 12644842 12226698 11846215 11500496
6387 11500496 11171390 10812494 10448001 10074982 9695959 9330802 9027385 8735441 8425305
6378 8425305 8075005 7839503 7564344 7311246 7044556 6783869 6572675 6343921 6165351 5989269
6368 5989269 5785878 5592067 5411750 5254798 5034717 4879826 4744739 4624390 4525838 4415370
6358D415370r9847l2519n9983j62961j55322p5181o4016q1826r0782p3770p7699
6347C441464r8717j55595j44112p4635j08142p6763q9768o7389p7389o4635p5798
6336B408521l1501n3856q0217k3432j9686J5691r4755k7875K1830m8884l8954
6325B026882J4648n6994j3772K9483o4185j7303L9130j1547l2749P73L197q9475
6313A828088n1153m042m3427j6491k6475k0864K9312j7972p0225k5595n8032k6833
6301A496291p5518m3843J5907m9925M3527k8710q1272k3915r919J1671j6311N6707
6289A294690k8350k1645m2055L0657K3570k9678l4461L6261Q394K6309M1596k967
6277A302321o2987J669J2506K0356l5663K160K4952J8286l8553l2145n2886Q0206
$$ plain form
6358 4415370 4315523 4283004 4223021 4060060 3904738 3829557 3765541 3683715 3592933 3519163 3441464
6347 3441464 3342747 3187152 3043040 2968405 2860263 2783500 2693732 2626343 2548954 2484319 2408521
6336 2408521 2377020 2323164 2242947 2219515 2199829 2215520 2120765 2092890 2114720 2065836 2026882
6325 2026882 2041530 1984536 1970764 2000247 1936062 1918759 1957889 1946342 1913593 1914366 1917563 1828088
6313 1828088 1776935 1772893 1729466 1712975 1686500 1665636 1694948 1676976 1606751 1581156 1523124 1496291
6301 1496291 1420773 1376930 1392837 1342912 1386439 1357729 1276457 1252542 1242623 1254294 1237983 1294690
6289 1294690 1266340 1244695 1202640 1233297 1256867 1227189 1192728 1228989 1237383 1263692 1305288 1302321
6277 1302321 1239334 1241003 1253509 1273865 1238202 1240362 1265314 1283600 1245047 1212902 1160016 1240222
6265A240222n209j4638J2656K0904O40J8292J1393n8154P831K5086M4217j7953
6253A285287k3748l2961J0005J4890J6531K0733K8673Q66p715L535k3334J140
6241A293902j1228K3073K0033K5950J2147k6836l0011P388L9225L1885N1267k0244
6229A416551k2615N3802M8424N5251J14257K741K1546M4756J00453M5122Q4187
6218A964475Q3545J05017J09709K10063J42079m4493j53724j90320j28495j31827
6208A966029j55593j08096n7719p8695m8365k3740J9003J3969k2348l521k0077
6197A480847m4435n6448J6442J4295j7436M2140M6107k1351M12j5046L9356J0257
6185A495140m9644j6877M0668K1640L8212L4083j102l7279k9219N8480M1162l9663
$$ plain form
6265 1240222 1235013 1220375 1233031 1253935 1254575 1272867 1284260 1226106 1233937 1259023 1303240 1285287
6253 1285287 1261539 1228578 1238583 1253473 1270004 1290737 1319410 1320276 1312561 1316096 1292762 1293902
6241 1293902 1282674 1305747 1325780 1351730 1363877 1337041 1307030 1314418 1353643 1385528 1436795 1416551
6229 1416551 1393936 1447738 1496162 1551413 1665670 1668411 1689957 1734713 1835166 1880288 1964475
6218 1964475 2048020 2153037 2262746 2472809 2614888 2570395 2416671 2226351 2097856 1966029
6208 1966029 1810436 1702340 1644621 1565926 1517561 1493821 1512824 1526793 1504445 1500924 1480847
6197 1480847 1436412 1379964 1396406 1410701 1393265 1435405 1481512 1460161 1460573 1445527 1484883 1495140
6185 1495140 1445496 1428619 1469287 1490927 1529139 1563222 1562120 1524841 1495622 1554102 1595264 1555601
6173A555601j8275J8447J2567P88Q4376k7963n2324J9514M1738j2026n5207N8282
6161A625518j4588Q855l0850M1702J9087K9572J4139J698j499J1651M8682m693
6149A749274l1938o884O7440r382K8377R9870l8387m248j0173l7410K6169M1880
6137A874588Q3846Q0695n82J644R470L7732O8729K9578K8485R522M9953r644p867
6124B256149M2091N8533J5309P2380N153r670Q3563O8187P2851N486j5172Q4915
6112B739775O3972L596O2422J46634k3432N4827R4367O1935j36Q5131R0647O9597
6100C449335J19988N9929O8472j5442M3623K4495L8966Q2393N1021J06561J50787
6089D180128P5836N3502J27401J14362R5234J26248J53719J28497J03976J86554
$$ plain form
6173 1555601 1537326 1555773 1568340 1569128 1653504 1625541 1573217 1592731 1634469 1622443 1567236 1625518
6161 1625518 1610930 1619785 1588935 1630637 1649724 1679296 1693435 1695133 1693634 1705285 1753967 1749274
6149 1749274 1717336 1710452 1777892 1768510 1796887 1896757 1858370 1854122 1843949 1806539 1832708 1874588
6137 1874588 1958434 2039129 2038547 2040191 2049661 2087393 2156122 2185700 2214185 2223707 2273660 2264016 2256149
6124 2256149 2298240 2356773 2372082 2444462 2449615 2439945 2523508 2591695 2664546 2670032 2654860 2739775
6112 2739775 2803747 2807343 2869765 3016399 2992967 3047794 3142161 3204096 3203960 3289091 3379738 3449335
6100 3449335 3569323 3629252 3697724 3682282 3725905 3750400 3789366 3871759 3922780 4029341 4180128
6089 4180128 4255964 4309466 4436867 4551229 4646463 4772711 4926430 5054927 5158903 5345457
6079E345457J48250J20294Q5210R6486J02651J94457J57575K06708K41779J82017
6069F880884J57436J80340J73866J93919K16727J89001K68377L60631L51580M25054
6059I397815M46799N21050M59005N66393O78409P87976R13453J143252J305075
6050A6219227J377940J485081J628415J907097K307655L047082L796167M450751
6042C6219415L806073J648361r86170k539639k834819k404087j569063o54351
6034C0685720M30003J494684K542629L200697K514348J14452k648948m196529
6026C4137056m457645l947649l238615k427495j698932j268326q34708o98029
6018A5565657n35698m40802l23571k09031j53138o2251O645M7028J54920K61608
$$ plain form
6079 5345457 5493707 5614001 5699211 5795697 5898348 6092805 6250380 6457088 6698867 6880884
6069 6880884 7038320 7218660 7392526 7586445 7803172 7992173 8260550 8621181 8972761 9397815
6059 9397815 9844614 10365664 10824669 11391062 12069471 12857447 13770900 14914152 16219227
6050 16219227 17597167 19082248 20710663 22617760 24925415 27972497 31768664 36219415
6042 36219415 40025488 41673849 40687679 38148040 35313221 32909134 31340071 30685720
6034 30685720 31115723 32610407 35153036 38353733 40868081 40982533 38333585 34137056
6026 34137056 29679411 25731762 22493147 20065652 18366720 17098394 16263686 15565657
6018 15565657 15029959 14589157 14265586 14056555 13903417 13841166 13847811 13894839 14049759 14311367
6008A4311367L03180M05308M20732M77944O50358P76991J002299J141030J374001
5999B0863210J606065J798228J933939K231825K647421L358321M269359N320876
5991D4029244N606231L724795L73139k643661l835782l766685l016144j794468
5983C8676669m72228R18237K331363L550437L824009J847401j693871m784467
5975D4197550o048026n939852n087227m030326l080439k317711j819050j404580
5967A4470339j142165r81892p75325o73287n94210n44772m33608m30757l18309
5958H576014l23206l20025k70885k73779l13350k74181k41864j87874j28786j99135
5948F042929j93693j66242j20287r5817p7843q5429n3233j45586j24814p7792
$$ plain form
6008 14311367 14614547 15019855 15440587 15918531 16568889 17345880 18348179 19489209 20863210
5999 20863210 22469275 24267503 26201442 28433267 31080688 34439009 38708368 44029244
5991 44029244 49635475 53360270 53733409 51089748 47253966 43487281 40471137 38676669
5983 38676669 38204441 39122678 41454041 45004478 48828487 50675888 48982017 44197550
5975 44197550 38149524 32209672 27122445 23092119 20011680 17693969 15874919 14470339
5967 14470339 13328174 12346282 11570957 10897670 10303460 9758688 9325080 8894323 8576014
5958 8576014 8252808 7932783 7661898 7388119 7074769 6800588 6558724 6370850 6242064 6042929
5948 6042929 5849236 5682994 5562707 5466890 5389047 5303618 5250385 5104799 4979985 4902193
5938D902193j04216p3010j22118p0597j11584p5245l3417n2297q1160j1877l3748
5927D132924l2441p0495o9660K4951k8589r2143q7858j6475o0672p4394l9160
5916C585988o566M617l8223l7624j8622k9599m023Q234J3736K529m074J00217
5904C576590K0537K8696P175M989K1294K1841O2697J6833N1431l6892o889O4692
5892C832994K5037M4356O7773N4648L1551M3482M0011Q0346K5999l8396J1192
5881D218993P065M1133R689M0516K931P2704P5165N5033M5818P6008O6742N4293
5869D766090R1383O2191O0278P2436N1169j243L3857J03265l689N0319J00475
5858E386531J06145Q0004M6076M611j0684J6020M3662M6851P5750K0406P0712
$$ plain form
5938 4902193 4797977 4724967 4602849 4532252 4420668 4345423 4312006 4259709 4178549 4166672 4132924
5927 4132924 4100483 4029988 3960328 3985279 3956690 3864547 3776689 3760214 3699542 3625148 3585988
5916 3585988 3579422 3584039 3545816 3508192 3489570 3459971 3455948 3464182 3477918 3480447 3476373 3576590
5904 3576590 3597127 3625823 3632998 3637987 3659281 3681122 3743819 3760652 3812083 3775191 3768302 3832994
5892 3832994 3858031 3902387 3970160 4024808 4056359 4099841 4139852 4220198 4246197 4207801 4218993
5881 4218993 4226058 4267191 4276880 4317396 4320327 4393031 4468196 4523229 4569047 4645055 4711797 4766090
5869 4766090 4857473 4919664 4979942 5052378 5103547 5102304 5136161 5239426 5235737 5286056 5386531
5858 5386531 5492676 5572680 5618756 5623367 5612683 5628703 5672365 5719216 5794966 5815372 5886084
5847E886084J03552O3569J16109Q5272J00473J34803J07840J32701J35990J06250
5837F972643J39026J46094J44124J77729K04172K02143J75582K13071K81941L02577
5827H959102L10908K72543J76593Q8186N7207j6667Q9690Q5260N3023K14588J60428
5816A0450861J97133K19568K50385K93724L30534L07937L34785L23535M09516
5807A3117978M18496M58214N17791N11170N78466O19061O53357P30805Q02837
5798A8408175Q54778R26218P48948M77140L19751J42411Q6288J34216K29720M16131
5788B2743776O00420O97434P74832Q77152J032526J049047J066902J178108J208246
5779C1228443J386454J510787J687081J838109K130180K325138K686048K982885
$$ plain form
5847 5886084 5989636 6053205 6169314 6254586 6355059 6489862 6597702 6730403 6866393 6972643
5837 6972643 7111669 7257763 7401887 7579616 7783788 7985931 8161513 8374584 8656525 8959102
5827 8959102 9270010 9542553 9719146 9807332 9864539 9847872 9937562 10022822 10075845 10290433 10450861
5816 10450861 10647994 10867562 11117947 11411671 11742205 12050142 12384927 12708462 13117978
5807 13117978 13536474 13994688 14512479 15023649 15602115 16221176 16874533 17605338 18408175
5798 18408175 19262953 20189171 20938119 21415259 21735010 21877421 21963709 22097925 22327645 22743776
5788 22743776 23344196 24041630 24816462 25693614 26726140 27775187 28842089 30020197 31228443
5779 31228443 32614897 34125684 35812765 37650874 39781054 42106192 44792240 47775125
5771D7775125L404388L843231M244850M655539M911359M905187M767908M601092
5763H3108679M413153M290154L941236L359514K250310Q35012q18503k330247
5755I9049308l461849m358033m863570n075869n091084n061147m885750m628170
5747F1623836m161991l635276l097144k688851k438545k304202k240176k194690
5739C8862961k055242j822448j509647j240893j002445p79876o23085m94477l50621
5730B8984227k81346k07893k19169n6997Q9781K45832M85603O30711O20377M06461
5720C0697587R2224l10331p14186r07870r70205q53196o96614m57763j09016J50673
5710B5921303M88590Q01017J002726J104538J282196J518709K065613K843261
$$ plain form
5771 47775125 51179513 55022744 59267594 63923133 68834492 73739679 78507587 83108679
5763 83108679 87521832 91811986 95753222 99112736 101363046 102198058 101379555 99049308
5755 99049308 95587459 91229426 86365856 81289987 76198903 71137756 66252006 61623836
5747 61623836 57461845 53826569 50729425 48040574 45602029 43297827 41057651 38862961
5739 38862961 36807719 34985271 33475624 32234731 31232286 30452410 29829325 29334848 28984227
5730 28984227 28702881 28494988 28275819 28218822 28308603 28554435 29040038 29670749 30291126 30697587
5720 30697587 30789811 30479480 29765294 28857424 27887219 27034023 26337409 25879646 25770630 25921303
5710 25921303 26409893 27210910 28213636 29318174 30600370 32119079 34184692 37027953
5702C7027953L724495M461610M319771K016361j211933l870697n046139m904934
5694C6516487m236196l249063k402186j621318j088050p58791n54923k49726N531
5685B2361765J87647M57054P85031R73184J154381J326665J522309J848897K291525
5676C2908458L112286M095526M873138M442444J836765j636657m320680n372477
5668C9938803n165489m432072l417237k443210j711298j179253p19346m74259
5660B0396639j34123M6584L18368N28325O63468P73465R37750J204294J668259
5651B6403029K278426K949015L288029K508509M12481j917610l427790l821114
5643B8672975l516650k899001k200161j554776j056935o87068n41555l47710j22130
$$ plain form
5702 37027953 40752448 45214058 49533829 51550190 50338257 46467560 41421421 36516487
5694 36516487 32280291 29031228 26629042 25007724 23919674 23160883 22605960 22356234 22361765
5685 22361765 22549412 23006466 23791497 24764681 25919062 27245727 28768036 30616933 32908458
5676 32908458 36020744 40116270 44989408 49431852 51268617 49631960 45311280 39938803
5668 39938803 34773314 30341242 26924005 24480795 22769497 21590244 20870898 20396639
5660 20396639 20262516 20309100 20627468 21155793 21819261 22592726 23530476 24734770 26403029
5651 26403029 28681455 31630470 34918499 37427008 37839489 35921879 32494089 28672975
5643 28672975 25156325 22257324 20057163 18502387 17445452 16758384 16216829 15869119 15746989
5634A5746989N6050J94801M34952O37534Q09111R03590R76945J193404J453820
5625B2407196J935131K585862L327198L642241K656027R2063k405348l967587
5617C0272783m401356l975760l259251k502214j847385j348403j111414r18837
5609A0908163q02761o26947n47498n19820m14126l36273l49976l16622l00250
5600F693890k76015k20577k59757j85327k15758k20938j47222j10611j52456j36085
5590D769144j82083j52849j03434l6966j09939j31359q2652r3806j71286p3546
5580C631224j60988p9171o5456o6244o3535j8812l0167o8385K1701K58N996n0589
5568C055832n9419m1158L9148m6844l6330l4149O504k8129N742k3906l7213J068
$$ plain form
5634 15746989 15803039 15997840 16432792 17070326 17879437 18783027 19759972 20953376 22407196
5625 22407196 24342327 26928189 30255387 33897628 36553655 36645718 34240370 30272783
5617 30272783 25871427 21895667 18636416 16134202 14286817 12938414 11827000 10908163
5609 10908163 10105402 9478455 8930957 8411137 7997011 7660738 7310762 6994140 6693890
5600 6693890 6417875 6197298 5937541 5752214 5536456 5315518 5168296 5057685 4905229 4769144
5590 4769144 4587061 4434212 4330778 4293812 4183873 4052514 3969862 3876056 3704770 3631224
5580 3631224 3470236 3391065 3325609 3259365 3195830 3177018 3146851 3078466 3100167 3100425 3106421 3055832
5568 3055832 2996413 2955255 2994403 2947559 2911229 2877080 2883584 2855455 2861197 2837291 2800078 2801146
5556B801146L4087k0268k5294j0824K8692N2831l6067j5923J5894r858K0273M0687
5544B875376j6933M0626J0653K3949L9406l3070J7422J311O25l8580j4688p388
5532B898709K5605J8087K83P5374k1275J5200N137L3825j1053L9201L3907K328
5520C115328M1866K3537J6422J3132j5647p6891k8838J263k502N5k0251Q596k7772
5507C048298p6669n3482k3948o4115J0162j7405o5148J1802J1885K8150m4060
5496B765470j0556K1023O453n4365j2864j0407o4027k1989j4717j4604l4187o1844
5484B493386r815o966j3953p4093l1675j6319m0226j9050l6106o4476o245n5933
5472B118529k7626j847o2608k8275m1642K6934n7945j8425k0855M8012J6855n7888
$$ plain form
5556 2801146 2835233 2814965 2789671 2778847 2807539 2860370 2824303 2808380 2824274 2814416 2834689 2875376
5544 2875376 2858443 2899069 2909722 2933671 2973077 2940007 2957429 2958740 2959365 2920785 2906097 2898709
5532 2898709 2924314 2942401 2942684 3018058 2996783 3011983 3017120 3050945 3039892 3079093 3113000 3115328
5520 3115328 3157194 3180731 3197153 3210285 3194638 3117747 3088909 3090172 3087670 3087725 3067474 3076070 3048298
5507 3048298 2971629 2918147 2894199 2830084 2840246 2822841 2757693 2769495 2781380 2809530 2765470
5496 2765470 2754914 2775937 2782390 2728025 2715161 2704754 2640727 2618738 2604021 2589417 2555230 2493386
5484 2493386 2483571 2476605 2462652 2388559 2356884 2340565 2300339 2281289 2245183 2180707 2174462 2118529
5472 2118529 2090903 2089056 2026448 1998173 1956531 1983465 1925520 1907095 1886240 1934252 1951107 1893219
5460A893219O0859n6974m4756j1817K4256l0033p7098M3853K5514q290j1736m333
5448A802664j2735J8900R815L0055K2565l012m2751R192P753R256K7792K5187
5436A904681N1147o34o5066K8146N0078k0181N0604N9724l7707j7923J9035m0782
5424A981122k9670m688M9194K0767M738J1166N4979R5628L7207m352P1802N0445
5412B338338j5422n6295J6569N5777l8002K0913J0596L4101K7233l1686N3051
5401B415173K8558j2109n6918O717Q1281L1038L8071O7741M6898L5820K1953Q8841
5389B793064P2291M8388L6620M3695N671Q1626N5842K301J10193J02288K2591
5378C374570L6528R9070J03865L8401P6589O6568P6565J17517O7330J19677Q6701
$$ plain form
5460 1893219 1954078 1897104 1852348 1840531 1864787 1834754 1757656 1801509 1827023 1818733 1806997 1802664
5448 1802664 1789929 1808829 1818644 1848699 1871264 1868252 1825501 1834693 1842446 1851702 1879494 1904681
5436 1904681 1955828 1955194 1890128 1918274 1968352 1948171 1998775 2058499 2020792 2002869 2021904 1981122
5424 1981122 1951452 1946764 1995958 2016725 2021463 2032629 2087608 2183236 2220443 2216091 2287893 2338338
5412 2338338 2322916 2266621 2283190 2338967 2300965 2321878 2332474 2366575 2393808 2362122 2415173
5401 2415173 2443731 2431622 2374704 2381421 2462702 2493740 2531811 2599552 2646450 2682270 2704223 2793064
5389 2793064 2865355 2913743 2950363 2994058 2999729 3081355 3137197 3139498 3249691 3351979 3374570
5378 3374570 3411098 3510168 3614033 3652434 3729023 3795591 3872156 3989673 4057003 4176680 4263381
5367D263381J27747K04135J72999J69462J49590J87173K04121K04255K93442K71577
5357F247882L22400L13948K12718J08268O7169P0371M5638J22149Q0991Q9996
5347G681530R2715J22671J84382Q1082J26803J48896J77383J94421J99281J93168
5337I202332K91088K31475K07296K94743L58324L05305K88756J60886J36429J86408
5327A1663042K20940K52888L03946M21800L85726L31172M02481M11800M68175
5318A4861970N18255N22876N74663O26332P42383Q22660R63267J093969J266905
5309B1993280J481110J759486K054784K217181J961171J432484Q48338N96476
5301C4344310M78820N24243P19684R76247J261011J492210J704109J860050J716314
$$ plain form
5367 4263381 4391128 4595263 4768262 4937724 5087314 5274487 5478608 5682863 5976305 6247882
5357 6247882 6570282 6884230 7096948 7205216 7272385 7342756 7388394 7510543 7591534 7681530
5347 7681530 7774245 7896916 8081298 8162380 8289183 8438079 8615462 8809883 9009164 9202332
5337 9202332 9493420 9724895 9932191 10226934 10585258 10890563 11179319 11340205 11476634 11663042
5327 11663042 11883982 12136870 12440816 12862616 13248342 13579514 13981995 14393795 14861970
5318 14861970 15380225 15903101 16477764 17104096 17846479 18669139 19632406 20726375 21993280
5309 21993280 23474390 25233876 27288660 29505841 31467012 32899496 33747834 34344310
5301 34344310 34823130 35347373 36067057 37043304 38304315 39796525 41500634 43360684 45076998
5292D5076998J263307M79490j46837o77305r18027r34133q86056p33896m05416
5283D2118125j79072j47792k51040q02720j374340j715080j821278j772522j568443
5274C2485838j275171j025037p80239o29198n19557l55936n58557j119860j665001
5265B4557282k014570k046320j889926j688333j382856j112997q68579q21630
5257A2732071o73463n82143n17046n06574m21775l23686k76333k81715l00888
5248H848448j75697j12947q1121l9252m1335N3941J0888K8184j01962k33771k49488
5237G905888k53317k62135j89934j68643r2206n0467r5037n9633n0599r0576j56037
5226F437304j26961j56181j63873j86522j50765j37794k0739p17m2893j15547
$$ plain form
5292 45076998 46340305 46819795 46672958 45995653 45077626 44143493 43257437 42523541 42118125
5283 42118125 41939053 41791261 41540221 40737501 39363161 37648081 35826803 34054281 32485838
5274 32485838 31210667 30185630 29405391 28776193 28256636 27900700 27342143 26222283 24557282
5265 24557282 22542712 20496392 18606466 16918133 15535277 14422280 13553701 12732071
5257 12732071 12058608 11476465 10959419 10452845 10031070 9707384 9431051 9149336 8848448
5248 8848448 8672751 8559804 8478683 8439431 8398096 8452037 8462925 8491109 8389147 8155376 7905888
5237 7905888 7652571 7390436 7200502 7031859 6939653 6889186 6794149 6734516 6683917 6593341 6437304
5226 6437304 6310343 6154162 5990289 5803767 5653002 5515208 5494469 5493752 5450859 5335312
5216E335312j37054j60163k20773k91718k98105j85681j88983j17675q4795j16104
5206C534261j98633p0730K9842o1895p8909j7603j1138J2507q7839q0664K1579
5195B990778j4786k5676o728j0301L6546J1688k8420j8559J039k4434M4712N981
5183B961840p9183M4147j0325N1124K1777K4979P4533J5599l4744R0011Q0978
5172C240736m0731K5122M6212K5423M1861N5481N7674L6411Q5879M6786N6680
5161C677534L8646O9487L5238R7442P7636R9361J30104L9882N2266Q6135J14414
5150D518145J17505Q3416J54415J49239J32620R3330J59176J34642J51867J43230
5140E837585J33800J41911K84510K55460K11242K47662K75403K88241L40627L82048
$$ plain form
5216 5335312 5198258 5038095 4817322 4525604 4227499 4041818 3852835 3735160 3650365 3534261
5206 3534261 3335628 3264898 3294740 3232845 3153936 3136333 3125195 3137702 3049863 2969199 2990778
5195 2990778 2975992 2950316 2943588 2933287 2969833 2981521 2953101 2934542 2935581 2911147 2955859 2961840
5183 2961840 2882657 2926804 2916479 2967603 2989380 3014359 3088892 3104491 3069747 3159758 3240736
5172 3240736 3200005 3225127 3271339 3296762 3338623 3394104 3451778 3488189 3574068 3620854 3677534
5161 3677534 3716180 3785667 3820905 3918347 3995983 4095344 4225448 4265330 4317596 4403731 4518145
5150 4518145 4635650 4719066 4873481 5022720 5155340 5248670 5407846 5542488 5694355 5837585
5140 5837585 5971385 6113296 6397806 6653266 6864508 7112170 7387573 7675814 8016441 8398489
5130H398489M25850M40972M52937N09751N49872O27276P14868Q27733R56731J162412
5120A5066891J442419J667896J408993Q54397K02941l1769o3731J09667M07037
5111B1064741Q23233J288954J809811K390909K789695K412932J004937l05176
5103C3280036q18353n49541M8935P21682J057078P13126N01817O31969J053552
5094C6640301J209168Q20406P48315P94920O66504P06341R57182P34391n95895
5085D2681633j647052j855944j438817n84702L95285J265873J375474L21966l36000
5076D0177716m78446m44199q85227r61353r41433j451263j569291j280201q02282
5067C1364021o85305j011725r75408p01096j49264N12647J024369N90422r24182
$$ plain form
5130 8398489 8824339 9265311 9718248 10227999 10777871 11405147 12120015 12947748 13904479 15066891
5120 15066891 16509310 18177206 19586199 20440596 20643537 20611768 20548037 20657704 21064741
5111 21064741 21887974 23176928 24986739 27377648 30167343 32580275 33585212 33280036
5103 33280036 32461683 31912142 31961077 32682759 33739837 34452963 34954780 35586749 36640301
5094 36640301 37849469 38669875 39418190 40213110 40879614 41585955 42543137 43277528 42681633
5085 42681633 41034581 39178637 37739820 37155118 37550403 38816276 40191750 40513716 40177716
5076 40177716 39699270 39255071 38369844 37408491 36467058 35015795 33446504 32166303 31364021
5067 31364021 30678716 29666991 28691583 27990487 27841223 28353870 29378239 29968661 29044479
5058B9044479k088583k564948k420633j992115j590663j028642n11225j67127
5050A6680543K44784L18148N6654p16908j352389j615632j496916j305666j075107
5041I737511q55501n99325n26139m41848l06849l03125k89350k66072j93734j54956
5031E800612j10011j30206j82220j18733l4541n3498q4928j03294p6329j54257
5021D752595j84422j11063r6603r5273k0904m2542j4585N0888O8041o515P0100
5010D369717Q1688J25986J69236R5740J81965K36779K48735J72552P4691j17167
5000E639922k97230k65164k98475k64043k06903j50857o0333p2081N154L067N9249
4989D092306J34835J02398J59870K04542K08790K38797K65894L63279L70961M77760
$$ plain form
5058 29044479 26955896 24390948 21970315 19978200 18387537 17358895 16847670 16680543
5050 16680543 16925327 17243475 17300129 16583221 15230832 13615200 12118284 10812618 9737511
5041 9737511 8882010 8282685 7756546 7314698 7007849 6704724 6415374 6149302 5955568 5800612
5031 5800612 5690601 5560395 5378175 5259442 5224901 5171403 5086475 4983181 4906852 4752595
5021 4752595 4568173 4457110 4360507 4265234 4244330 4201788 4187203 4238091 4306132 4299617 4369717
5010 4369717 4451405 4577391 4746627 4842367 5024332 5261111 5509846 5682398 5757089 5639922
5000 5639922 5342692 5077528 4779053 4515010 4308107 4157250 4096917 4024836 4029990 4033057 4092306
4989 4092306 4227141 4329539 4489409 4693951 4902741 5141538 5407432 5770711 6141672 6619432
4979F619432M38445K37312r9019l25843n45931n68862n16090m14476m12650l53284
4969D059034k36681j62944q6964q7754p6989j7997O6301O1240O1386Q1684Q9078
4958C749394J09345J97627J76868K03043K28258K8163j79328k47925l24652l10413
4948C630380l03964k28980j46672j43720j34821o6898o9651j7988J198j6246l6057
4937B466581l3620P6629L4750N9966O7760m6687M5427L842j34867n0052l014m3924
4925B442791j10110j47176k0981l7578n5578k1043o0500M35K554O6067K3235M2316
4913B124432j015K9051K285N2616M2787K5321L7101n3745k2828n5204j25079j29609
4901A926113p5157n2174p0345m000j3564k6923L3161j0923m9827l8104k9122J4756
$$ plain form
4979 6619432 7057877 7295189 7196170 6870327 6324396 5755534 5239444 4824968 4412318 4059034
4969 4059034 3822353 3659409 3572445 3484691 3407702 3389705 3456006 3517246 3578632 3660316 3749394
4958 3749394 3858739 4056366 4233234 4436277 4664535 4692698 4513370 4265445 3940793 3630380
4948 3630380 3326416 3097436 2950764 2807044 2672223 2605325 2535674 2517686 2518884 2502638 2466581
4937 2466581 2432961 2509590 2544340 2604306 2672066 2625379 2670806 2674648 2539781 2489729 2486715 2442791
4925 2442791 2332681 2185505 2164524 2126946 2071368 2050325 1989825 1990260 1992814 2058881 2082116 2124432
4913 2124432 2123417 2152468 2154753 2207369 2250156 2275477 2312578 2258833 2236005 2180801 2055722 1926113
4901 1926113 1850956 1798782 1728437 1724437 1710873 1683950 1717111 1706188 1656361 1618257 1589135 1603891
4889A603891k6385k6979q0601l8341l0317m969j9639q3373j97R95q955j7677k8034
4876A239419M1646k688k2480O0709m9571m6510n2353m106Q752J787J2858o9942
4864A117521m0066L9336P760k0188K1415L55n9030L8027K6516k3305l6650N6413
4852A128104N048m746n735M9625M56k3305K3674k0031j4654j2382k9664N8132
4840A154522J7958L7295o571L7442j7540J602J8298N7882j0422o0680M794M869
4828A239449Q359j113l3749M0135K7391J6589j7632N2024m6689J7847K1312P3785
4816A397708Q2785k7604K5967n0929l5956j7371l970M7615O995o5100J0945J02772
4804A473857M5771m1646M0057Q9870L5685p8728K128J2228L9394J9192J4059M561
$$ plain form
4889 1603891 1577506 1550527 1469926 1431585 1401268 1396299 1376660 1293287 1293090 1294085 1285130 1267453 1239419
4876 1239419 1281065 1278377 1255897 1316606 1267035 1220525 1168172 1164066 1172818 1174605 1187463 1117521
4864 1117521 1077455 1116791 1124551 1104363 1125778 1126133 1067103 1105130 1131646 1108341 1071691 1128104
4852 1128104 1133152 1128406 1122671 1172296 1172752 1149447 1173121 1153090 1138436 1126054 1096390 1154522
4840 1154522 1172480 1209775 1203204 1240646 1223106 1224708 1243006 1300888 1290466 1229786 1234580 1239449
4828 1239449 1247808 1246695 1212946 1253081 1280472 1297061 1279429 1331453 1284764 1302611 1323923 1397708
4816 1397708 1480493 1452889 1478856 1427927 1391971 1374600 1370630 1418245 1425240 1360140 1371085 1473857
4804 1473857 1519628 1477982 1518039 1607909 1643594 1564866 1566994 1579222 1618616 1637808 1651867 1656428
4792A656428L3663P474O2787O7122M7833J7519j4140k0859K6206K9516M6215l0287
4780A929477O3502P7090K5265N303M0366R0056P8764J3246j0589K9624M1219L6459
4768B419782P0879P4570J5242P7024M6149K5985M9840q64K2456P8954J05714N7919
4756C043650J0989J0638Q1497Q0387J07561P1087J43647J22342P0323Q1443N3062
4745C876626M8620O1133N7298J01598O8400N9633P7157R8722L6164J16875R3820
4734D696046J30225J51102K00327J19488J01277J28824J84070J39946Q0625J95772
4724F127702J38122J39248J72238K15492K57044K63138K44374K60876K83904K95593
4714H397731K64218L25979K57411L42811L39116L82360M09609M26402N23844N56907
$$ plain form
4792 1656428 1690091 1697565 1760352 1827474 1875307 1892826 1878686 1857827 1884033 1913549 1959764 1929477
4780 1929477 1992979 2070069 2095334 2100637 2141003 2231059 2309823 2323069 2312480 2342104 2383323 2419782
4768 2419782 2490661 2565231 2580473 2657497 2703646 2729631 2779471 2778607 2801063 2880017 2985731 3043650
4756 3043650 3054639 3065277 3146774 3227161 3334722 3405809 3549456 3671798 3742121 3823564 3876626
4745 3876626 3925246 3986379 4043677 4145275 4213675 4273308 4350465 4449187 4485351 4602226 4696046
4734 4696046 4826271 4977373 5177700 5297188 5398465 5527289 5711359 5851305 5931930 6127702
4724 6127702 6265824 6405072 6577310 6792802 7049846 7312984 7557358 7818234 8102138 8397731
4714 8397731 8661949 8987928 9245339 9588150 9927266 10309626 10719235 11145637 11669481 12226388
4704A2226388N99454P02500R59904J153091J266309J430488J549219J595723J774516
4695B3257592K056635K483844L265214M172341M913361M263222J034873k155320
4687D3291762l724709l926361l255638k373976j280370l00890M81628J158072
4679C0069518J576556J942480K468416K845611L385401M312535N507051O639628
4671E8747196O845901N076421L143546N52247l701594p161058q407335p752362
4663D7342962o375616m791260l332103k096111j044127l29088O2782L39824O86483
4654C0463746J183764J916699K787582L928823M745702L634577m15272m111809
4646D4133812n855481n891593n174889m240461l153715k242954j654362j251841
$$ plain form
4704 12226388 12825842 13528342 14488246 15641337 16907646 18338134 19887353 21483076 23257592
4695 23257592 25314227 27798071 31063285 35235626 40148987 44412209 45447082 43291762
4687 43291762 39567053 35640692 32385054 30011078 28730708 28429818 28911446 30069518
4679 30069518 31646074 33588554 36056970 38902581 42287982 46600517 52107568 58747196
4671 58747196 65593097 70669518 73813064 74365311 70663717 63502659 55095324 47342962
4663 47342962 40967346 36176086 32843983 30747872 29703745 29374657 29437439 29777263 30463746
4654 30463746 31647510 33564209 36351791 40280614 45026316 48660893 48245621 44133812
4646 44133812 38278331 32386738 27211849 22971388 19817673 17574719 15920357 14668516
4638A4668516j002970q63024p03016o28414n49015m67705m73633m15517l88073
4629I177149l69201k86054k63725k60066k19711k15441k17401j40545j62332j45209
4619F897464j22190j10059n6684o4185k6900r2258j35842j02135n6106o6000p0796
4608E994309n5540k7476K3796J651k6361p6542j7086q7846l0794m2371m1126m2530
4596E572084k4613N7779J2832j762N5632N0680M7204J28683O4585K8422J14238
4585F105764L6070L8134R3834L2972n5021K3807O6887P8844P6268Q3601J23986
4574F705146J49071J64600J58790J38152J85046K72270K06748J22750J04231J16336
4564H323140J37784J64188J63041K16913K29851K68263K63499K60870L15030L26897
$$ plain form
4638 14668516 13665546 12802522 12099506 11471092 10922077 10454372 9980739 9565222 9177149
4629 9177149 8807948 8521894 8258169 7998103 7778392 7562951 7345550 7205005 7042673 6897464
4619 6897464 6775274 6665215 6608531 6544346 6517446 6425188 6289346 6187211 6131105 6065105 5994309
4608 5994309 5938769 5911293 5935089 5936740 5910379 5833837 5816751 5728905 5698111 5655740 5614614 5572084
4596 5572084 5547471 5605250 5618082 5616320 5671952 5722632 5769836 5898519 5963104 5991526 6105764
4585 6105764 6141834 6179968 6273802 6306774 6251753 6275560 6342447 6421291 6497559 6581160 6705146
4574 6705146 6854217 7018817 7177607 7315759 7500805 7773075 7979823 8102573 8206804 8323140
4564 8323140 8460924 8625112 8788153 9005066 9234917 9503180 9766679 10027549 10342579 10669476
4554A0669476L59156L49252L29369M25615N04052N03907O15172N83361O76980
4545A5016340O84132P62984R49007J093290J354826J603030J824587J972232K088108
4536B7348536K263816K628856L242666M183711N275372N868177N100929K136891
4528E8048954j218998l223953l701253l170703k094991n64050R19256K421414
4520D7415676L866836M700130L969652J147612k105322m073772m210461l395269
4512D7315082k010881k42284J476126K504561K140269O1824k342117l683816l792765
4503D1425999l265680k338501j220517j53411J022046K050620K626303J784463
4495D1931322n96587l184964m451115m584778m197794l419721k655244k035369
$$ plain form
4554 10669476 11028632 11377884 11707253 12132868 12636920 13140827 13755999 14339360 15016340
4545 15016340 15700472 16463456 17412463 18505753 19860579 21463609 23288196 25260428 27348536
4536 27348536 29612352 32241208 35483874 39667585 44942957 50811134 55912063 58048954
4528 58048954 56829956 53606003 49904750 46734047 44639056 44075006 44994262 47415676
4520 47415676 51282512 55982642 59952294 61099906 58994584 54920812 50710351 47315082
4512 47315082 45304201 45061917 46538043 49042604 51182873 51244697 48902580 45218764 41425999
4503 41425999 38160319 35821818 34601301 34447890 35469936 37520556 40146859 41931322
4495 41931322 41334735 38149771 33698656 29113878 24916084 21496363 18841119 16805750
4487A6805750j539845j208154r87098p82450n94531n88870n24844m87796m22156
4478I670006m15109l29077k86952l64738k68488l04604k51733k68109k23914k33715
4468F723567j92455j85187j72766j54592r5010p8603j42586q8399p5708j21642
4458E416619p5498o2500p2693m9923n1284j1934m3076m9213o4404q9466Q320J5342
4446D870290q4459m7665J702K9849r018k9239j0331r528p068K1749j2098L8524
4434D752708M7818O9813J20662J13765J08520J37486J32930J96180J93447L42718
4424F216047L21178L35831K07095L1345q1160j49800j07404m9360r4403p6616
4414F552753j76039j60232k54313j52360j23243j19679r0760P092K1426J8450
$$ plain form
4487 16805750 15265905 14057751 13070653 12288203 11693672 11104802 10579958 10092162 9670006
4478 9670006 9254897 8925820 8638868 8274130 8005642 7701038 7449305 7181196 6957282 6723567
4468 6723567 6531112 6345925 6173159 6018567 5923557 5844954 5702368 5613969 5538261 5416619
4458 5416619 5341121 5278621 5205928 5156005 5104721 5092787 5049711 5000498 4936094 4846628 4854948 4870290
4446 4870290 4785831 4738166 4739868 4769717 4760699 4731460 4721129 4711601 4704533 4726282 4714184 4752708
4434 4752708 4800526 4870339 4991001 5104766 5213286 5350772 5483702 5679882 5873329 6216047
4424 6216047 6537225 6873056 7080151 7111496 7030336 6880536 6773132 6723772 6629369 6552753
4414 6552753 6376714 6216482 5962169 5809809 5686566 5566887 5476127 5483219 5504645 5523095
4404E523095R2256O5994N5053N4389k30M9285M3975J05292R5578J12213J35028
4393F331928N7737O7542J01031J07850J21212J45854P7120J20049J26788J50535
4383G407646J70477J93681J94683J88257J92749K24911K45048J77642J95086J75800
4373I365980K29707K19005L12568K54180K89030K70807L17388K31310J91823K21893
4363A1903691J71017K04257K05977J74695P2456O0693J1532J9584p4598j33174
4353A2616130j67312k36726k43489j97550k12932j67156j92104j61797k21412
4344A0815652k01532k99826k24542k54073k17325k03266k25599k76479k41664
4335H671346k44342k11812j77131j62451j91985j77597j94317j58874j82815j64446
$$ plain form
4404 5523095 5615351 5681345 5736398 5790787 5790557 5839842 5883817 5989109 6084687 6196900 6331928
4393 6331928 6389665 6457207 6558238 6666088 6787300 6933154 7010274 7130323 7257111 7407646
4383 7407646 7578123 7771804 7966487 8154744 8347493 8572404 8817452 8995094 9190180 9365980
4373 9365980 9595687 9814692 10127260 10381440 10670470 10941277 11258665 11489975 11681798 11903691
4363 11903691 12074708 12278965 12484942 12659637 12732093 12792786 12804318 12823902 12749304 12616130
4353 12616130 12448818 12212092 11968603 11771053 11558121 11390965 11198861 11037064 10815652
4344 10815652 10614120 10314294 10089752 9835679 9618354 9415088 9189489 8913010 8671346
4335 8671346 8427004 8215192 8038061 7875610 7683625 7506028 7311711 7152837 6970022 6805576
4325F805576j40835q5245p9669k7940q7171k1483j14731o2416l6967r5929j25494
4314E927696q1634j8286j10307n2798r156k6116r896q958J7900j9038M1470L8494
4302E689371N1087J2978R112L037l6780m3585o516K5188O4799J32544N6173J6679
4290E974087J54579J34083M4202J64103J81769P7799J14408J01173J17940J08858
4280G173001N2020R7725J57621J01472J49367J79289J72361J08179J9810q6882
4270H123963j6760p4570J5202L9319l7800J2030n628o4549j31425k7830K0047
4259G851999L2133L1648N0117j3401l5995J1904j8434K3532P6102N0718O1599
4248H121922Q0704J24717N6902P1970J20407N6463P6219J02079K3244N3262N0474
$$ plain form
4325 6805576 6664741 6579496 6499827 6471887 6384716 6363233 6248502 6186086 6149119 6053190 5927696
4314 5927696 5846062 5827776 5717469 5664671 5655515 5629399 5619503 5610545 5628445 5609407 5650877 5689371
4302 5689371 5740458 5753436 5762548 5765585 5728805 5685220 5678704 5703892 5768691 5901235 5957408 5974087
4290 5974087 6128666 6262749 6306951 6471054 6652823 6730622 6845030 6946203 7064143 7173001
4280 7173001 7225021 7322746 7480367 7581839 7731206 7910495 8082856 8191035 8210845 8123963
4270 8123963 8107203 8032633 8047835 8087154 8049354 8061384 8055756 7991207 7859782 7831952 7851999
4259 7851999 7884132 7915780 7965897 7952496 7916501 7928405 7909971 7933503 8009605 8060323 8121922
4248 8121922 8202626 8327343 8384245 8456215 8576622 8633085 8709304 8811383 8834627 8887889 8938363
4237H938363Q0383Q6541J07057J57921J21942J46063J96611J48884K25191J31755
4227A0340711K22588J83909J85784J22050J49055J74362K26820L24046L17931
4218A2247256L09263L53642L06746L70586K93564K91831L12518K72815K54072
4209A5012293L08994K47270L37341K96138L49111K87833L58195K92385L53226
4200A7842786L01159L17015M30816N54818N81347N24678N00034M59001M80506
4191B1992160M51964N06715N79159N95169O85691O65041P30800O88710P70866
4182B7666275Q16549R17448R22402J020299J041068J139341J055184J025524J064466
4173C6668556J030940J034799J164228J220070J546450J733075J964167J992416
$$ plain form
4237 8938363 9018746 9105287 9212344 9370265 9492207 9638270 9834881 9983765 10208956 10340711
4227 10340711 10563299 10747208 10932992 11055042 11204097 11378459 11605279 11929325 12247256
4218 12247256 12556519 12910161 13216907 13587493 13881057 14172888 14485406 14758221 15012293
4209 15012293 15321287 15568557 15905898 16202036 16551147 16838980 17197175 17489560 17842786
4200 17842786 18143945 18460960 18891776 19446594 20027941 20552619 21052653 21511654 21992160
4191 21992160 22444124 22950839 23529998 24125167 24810858 25475899 26206699 26895409 27666275
4182 27666275 28482824 29400272 30322674 31342973 32384041 33523382 34578566 35604090 36668556
4173 36668556 37699496 38734295 39898523 41118593 42665043 44398118 46362285 48354701
4165D8354701K236304K286460K428705K640801K796534K876916K974943K953060
4157F9548424L128955L407856L916222M339048M925530N557373O283565P142963
4149A08249936Q160872R206166J0868171J2892673J5539882J8129118K0219576
4142B03266394K2026332K4681199K9412218L7561123M7962733N8361041N8934287
4135D82205327L7175036N484943k5581535l7604873l3268375k6428020k6524595
4128C75457908l2383279l9326722m1049987l7446749l1681709k5392140j9736284
4121A48441038j5137754j2300878j0360226r225326q189917p279595o198204n414338
4113G4334800m792889m465445m051456l590435k961514k633698k271565k207256
$$ plain form
4165 48354701 50591005 52877465 55306170 57946971 60743505 63620421 66595364 69548424
4157 69548424 72677379 76085235 80001457 84340505 89266035 94823408 101106973 108249936
4149 108249936 116410808 125616974 136485145 149377818 164917700 183046818 203266394
4142 203266394 225292726 249973925 279386143 316947266 364909999 423271040 482205327
4135 482205327 519380363 524865306 499283771 461678898 428410523 401982503 375457908
4128 375457908 343074629 303747907 262697920 225251171 193569462 168177322 148441038
4121 148441038 133303284 121002406 110642180 101416854 93226937 85947342 79749138 74334800
4113 74334800 69541911 65076466 61025010 57434575 54473061 51839363 49567798 47360542
4105D7360542k046071k050106j885001j879107j814190j780803j765479j727234
4097C2412551j559465j529260j337188j296290j111107j129554r88778p83184
4089B2677725o42670o65169o27123o52272o14774o44338n06681l91747k56956
4080A7675995l55398l09590l37995n73657p81560q17037p87615o80681p08683
4071A2323779n87462o33706n51096n34690m50776l93041l62003l27551k59175
4062H224279k84829k38964l01026k33206j83385k89135k51900k21623k76551k22556
4052E721104k37866k34250k14986j91955j16776j96281j98827j85453k39065n0112
4042C855533o9071o4920j24324m9243p8336r0358k7056Q416K2394K684o0339p4893
$$ plain form
4105 47360542 45314471 43264365 41379364 39500257 37686067 35905264 34139785 32412551
4097 32412551 30853086 29323826 27986638 26690348 25579241 24449687 23460909 22677725
4089 22677725 22035055 21369886 20742763 20090491 19475717 18831379 18324698 17932951 17675995
4080 17675995 17320597 17011007 16673012 16099355 15317795 14500758 13713143 13032462 12323779
4071 12323779 11736317 11102611 10551515 10016825 9566049 9173008 8811005 8483454 8224279
4062 8224279 7939450 7700486 7399460 7166254 6982869 6693734 6441834 6220211 5943660 5721104
4052 5721104 5483238 5248988 5034002 4842047 4725271 4528990 4330163 4144710 3905645 3855533
4042 3855533 3786462 3721542 3597218 3547975 3469639 3379281 3352225 3360641 3383035 3385719 3325380 3250487
4030C250487j5779K2903j4394o176p2320o8179j21006j33903o5572q2317r7678
4019B596066l5331j7329l7788o0778j33014j38807k1090p0916m8997j7020P4430
4008B089426R4297J8110J7583Q5514J90724J91266J11541N0943r3234j25324j03677
3997B527169o2540r937l5291q2585j88212j67987j53742j10246j34381l0347K5744
3986A577645M0603k108N6746K2041R3616O5981L2144J00530J60494K01923K32190
3975B581805L17387M67030J89095l8315k54631l96537m29170k83790k36607k16540
3965A699727j70556r7919p3370m4174m0697m6920J2371m0412p7913l6496o4592
3954A019049n0223n3139m8333p2548m2003l1193J7984k3996J3467K5864k2706
$$ plain form
4030 3250487 3234708 3257611 3243217 3237041 3164721 3096542 2975536 2841633 2776061 2693744 2596066
4019 2596066 2560735 2543406 2505618 2444840 2311826 2173019 2151929 2081013 2032016 2014996 2089426
4008 2089426 2183723 2201833 2219416 2304930 2495654 2686920 2798461 2849404 2756170 2630846 2527169
3997 2527169 2464629 2454692 2419401 2336816 2148604 1980617 1826875 1716629 1582248 1551901 1577645
3986 1577645 1618248 1616140 1672886 1694927 1788543 1854524 1886668 1987198 2147692 2349615 2581805
3975 2581805 2899192 3366222 3555317 3517002 3262371 2865834 2436664 2152874 1916267 1699727
3965 1699727 1529171 1431252 1357882 1313708 1273011 1226091 1238462 1198050 1120137 1083641 1019049
3954 1019049 968826 915687 867354 794806 752803 721610 739594 715598 729065 754929 732223
3943G32223M4654K3710l9431l3300N7229J3026l980k2416r4261l6647k1561k4273
3931E94973l7611K1755L7968j2883j4199R5128N5346P6819O7281L0298P2221l6596
3919I50500p1482q427l4973q2950o2274m1673j35958k5615K604j365m1665j8420
3907D28302m5799m1491n9065p047L4736l8336k828k0308j4722J5341J07602K2575
3895C78960r1224l9446N3367M5465j9823O15J8236o90L8789R3897k7559j5133
3883D35454k9196L1281o413j0086O2748L6936N2727p231L4664k9571Q082P8500
3871F57895j6691P571N8659L1555M4496M1025Q3864J8357L5532J4827n262n6384
3859I15444M813N1652O8770q101P4027P0711P3671O2914Q6313J86078K42124J92194
$$ plain form
3943 732223 776877 800587 761156 727856 785085 798111 794131 771715 677454 640807 619246 594973
3931 594973 557362 579117 617085 604202 590003 685131 740477 817296 884577 914875 987096 950500
3919 950500 879018 870591 835618 752668 690394 648721 512763 487148 489752 488387 446722 428302
3907 428302 382503 341012 281947 274900 309636 271300 268472 248164 233442 248783 356385 378960
3895 378960 287736 248290 301657 347122 327299 327914 346150 345460 384249 478146 450587 435454
3883 435454 406258 437539 431126 421040 483788 520724 573451 566220 600884 571313 579395 657895
3871 657895 641204 648775 707434 738989 783485 824510 908374 926731 962263 977090 971828 915444
3859 915444 920257 971909 1040679 1032578 1106605 1177316 1250987 1313901 1400214 1586292 1828416 2020610
3847B020610K44777L72355L27426J76892j1263j90329j59531j45881j05814j29324
3837B399918j53308k05507j57530j16012j23241r2314j0795n4944k4837M8854
3827A510284N6707l6507j20005j95948j74611k03780j39792n590r1269q9075o3345
3816D47069l0257n6089l3444m0370l6016J610m2626J6388K8365K970k9862m5350
3804A82388m9893j0956L9752j3926N6316j8478o4669L405l8917n2057Q035Q086
3792D9086n3841n6206j1596o128R035n7497n6429M2650k5280o3474M5731M1410
3780a42539p562n3046J6976P4396o870p2756j9092j7370J383O379M9175k8502
3768a99428k8766K6076R060k155K8897N6520k5057j5942K7365l316j2150J2397
$$ plain form
3847 2020610 2265387 2637742 2965168 3142060 3130797 2940468 2780937 2635056 2529242 2399918
3837 2399918 2246610 2041103 1883573 1767561 1644320 1552006 1541211 1486267 1461430 1510284
3827 1510284 1566991 1530484 1410479 1214531 1039920 836140 696348 690758 599489 510414 447069
3816 447069 416812 360723 327279 286909 250893 252503 209877 226265 254630 257600 227738 182388
3804 182388 132495 121539 161291 147365 203681 185203 120534 123939 85022 32965 41000 49086
3792 49086 -4755 -60961 -72557 -78685 -69650 -127147 -183576 -140926 -166206 -229680 -183949 -142539
3780 -142539 -150101 -203147 -186171 -111775 -118645 -191401 -210493 -227863 -226480 -220101 -170926 -199428
3768 -199428 -228194 -202118 -193058 -195213 -166316 -109796 -134853 -150795 -123430 -126746 -138896 -126499
3756a26499r700n526l4562q595K2283N591j2834K1405m1659j9787J7166N6378
3744a36339l4519l1139L1322l5638m239k3404M0709J2591j3671J3133p625m8245
3732b37064k2354k682N2940j563o8483O8694K1249o5572p147j6049k6172J7854
3720b86349M2303p3807J3697K1401J622l644K6911L6672M1189m1958p1438J5658
3708b77743l1310L0132P665q173M5552n215m8920N6113O7822m435m1834O780j68
3695b03734L3730M256l1176m8845R136L5534m1096M7718J233k0834m7296M3645
3683b17729R978L7400k504j3650j0529J9137J2603k9993k1253M6344m653P761
3671a67088J8265k8054K0709k624J257k8382J7065J7165m9602k8982j283J2o5664
$$ plain form
3756 -126499 -136199 -141725 -176287 -184882 -162599 -157008 -169842 -148437 -190096 -209883 -192717 -136339
3744 -136339 -170858 -201997 -170675 -206313 -210552 -233956 -193247 -180656 -194327 -181194 -188819 -237064
3732 -237064 -259418 -262100 -209160 -210723 -279206 -210512 -189263 -254835 -261982 -278031 -304203 -286349
3720 -286349 -244046 -317853 -304156 -282755 -281133 -284777 -257866 -221194 -180005 -221963 -293401 -277743
3708 -277743 -309053 -278921 -271256 -279429 -233877 -239092 -288012 -231899 -164077 -168512 -210346 -203566 -203734
3695 -203734 -170004 -165748 -196924 -245769 -236633 -201099 -242195 -194477 -193244 -214078 -261374 -217729
3683 -217729 -207751 -170351 -172855 -186505 -197034 -177897 -165294 -195287 -216540 -170196 -174849 -167088
3671 -167088 -148823 -176877 -156168 -158792 -157535 -185917 -168852 -151687 -201289 -230271 -231554 -231542 -297206
3658b97206L27L9088M75m3189K5590Q9981O037k4156k6609K0090J0777j087J370
3645a98512j241p1390K9618K7625l277m7066L4616L387m5599j4554K5016O709
3633b54668k4062N4531J4201k2783j3685k8320n0151p19L9271k6670k4898K7845
3621c10108J1131K6305j0234L4672J0725r022k3364l7733r12m189M1475j9387
3609b90641J6879J0939l4905K3797j9876l8442J3323l5810N8641K8392l0427k3297
3597c21427K6364q397r50J385K1990N3598k4097l1014J7660M9356K4028K3828
3585a67676L650p6455m6412L1982N3195K6506l1336p842L2435j6287k1212L2508
3573a86944J4937k688j732l3756K1214K1008l5773j1511j3040k387M5328m1736
$$ plain form
3658 -297206 -296879 -257791 -257316 -300505 -274915 -184934 -178897 -203053 -229662 -209572 -198795 -199882 -198512
3645 -198512 -199753 -271143 -241525 -213900 -217177 -264243 -229627 -226240 -271839 -286393 -261377 -254668
3633 -254668 -278730 -224199 -209998 -232781 -246466 -274786 -324937 -325656 -286385 -313055 -337953 -310108
3621 -310108 -298977 -272672 -282906 -248234 -237509 -246531 -269895 -307628 -308540 -312729 -271254 -290641
3609 -290641 -273762 -262823 -297728 -273931 -293807 -332249 -318926 -354736 -296095 -267703 -298130 -321427
3597 -321427 -295063 -303460 -304410 -303025 -281035 -227437 -251534 -282548 -264888 -215532 -191504 -167676
3585 -167676 -164026 -240481 -286893 -254911 -201716 -175210 -206546 -214388 -181953 -198240 -219452 -186944
3573 -186944 -172007 -174695 -176427 -210183 -188969 -167961 -203734 -215245 -228285 -230672 -185344 -227080
3561b27080j8888L5275J8399k5489J0331l024L4144K8481o7905j4462K918l3058
3549b60358j404L7405K9564j9291l693K5370K0492j5845l1940J8529J7550k6186
3537b09807M8684r078n0618j410Q026j6424J9393M594J2116J8938j4777n304k0396
3524b16063j444j1028Q585K867j638n039M4550m6217l438J3948J4141j3874o916
3511b21566O6041l010o0503l4835q156L9579j0207K3502J8232r952q075K1504
3499a87446k0260r223J7423M0231L1586n482j7783K7204l7823m6703k460M2841
3487a67895K9173j450L1892M494q279k2605N3902j9619l2582p704j41J9847j7856
3474a38823L3058o6484J5058j1539J5244l457j0264J7638Q735l5923N3150N836
$$ plain form
3561 -227080 -245968 -210693 -192294 -217783 -207452 -210476 -176332 -147851 -215756 -230218 -227300 -260358
3549 -260358 -261762 -224357 -194793 -214084 -217777 -192407 -171915 -187760 -219700 -201171 -183621 -209807
3537 -209807 -161123 -170201 -220819 -222229 -214203 -230627 -211234 -206640 -194524 -175586 -190363 -195667 -216063
3524 -216063 -217507 -228535 -219950 -217083 -218721 -223760 -179210 -225427 -228865 -214917 -200776 -214650 -221566
3511 -221566 -155525 -158535 -219038 -253873 -262029 -222450 -232657 -209155 -190923 -200875 -208950 -187446
3499 -187446 -207706 -216929 -199506 -159275 -127689 -133171 -150954 -123750 -161573 -208276 -210736 -167895
3487 -167895 -138722 -140172 -108280 -103786 -112065 -134670 -80768 -100387 -132969 -140673 -140814 -120967 -138823
3474 -138823 -105765 -172249 -157191 -168730 -153486 -156943 -167207 -149569 -140834 -176757 -123607 -117771
3462a17771k168M2393r413l2725K0546m079j1192o221l786O159n8367j6148M4331
3449a48441O2848k9236N0046n033j433k5369n44k720j3268K2043J1606K9086M8877
3436a538j3690k5350O472p044M506P129K7195M185K643O22l3972J6396K1168J0809
3422A9531M9337M0386p0262M2769N453J0253L2068L2397n160P767P8294Q721p892
3409B43662l8063J5885O5178J2389O8241N6573J7702O7825J32454P2563R6652
3398H11061J39114J77755J14502M0945p6321r0265j69187r8513l9267j8296L6603
3387H28131M3234K6529J0313m2098p6854l6127K1271l7652j5085l7543n863J28459
3375H06715K4848O0162P9660M9500M8168Q8297Q9654J60725K24101K35462K77392
$$ plain form
3462 -117771 -119939 -77546 -86959 -119684 -99138 -103217 -114409 -120630 -124416 -118257 -176624 -192772 -148441
3449 -148441 -85593 -114829 -64783 -69816 -71249 -96618 -97162 -99882 -113150 -91107 -79501 -50415 -1538
3436 -1538 -15228 -40578 -34106 -41150 -36644 -29515 -2320 1865 4508 5130 -28842 -12446 8722 19531
3422 19531 68868 109254 38992 81761 87214 97467 129535 161932 156772 164539 242833 251554 243662
3409 243662 205599 221484 286662 299051 367292 423865 441567 509392 641846 714409 811061
3398 811061 950175 1127930 1242432 1283377 1207056 1116791 947604 849091 809824 791528 828131
3387 828131 871365 897894 908207 866109 789255 753128 774399 736747 721662 684119 678256 806715
3375 806715 831563 891725 971385 1020885 1069053 1157350 1247004 1407729 1631830 1867292 2144684
3364B144684K76707n462k22122k98405k85907k77588k46107j73901n9993m6237
3354H05669q0152n8804m868J6587K8916n1039J3753l9973j2802l4734n353N6297
3342F33497Q8466K5584J3359R9875O5411R3015N7876N5798J34528J90153R3562
3331A551124P241j60757k43549j34187p7166q5734l9661q5304r4061m1163K5393
3320F22176o182j248k0069o5407K863M1079L0522k6659j4903j6271q565K4189
3308E61525K5699l446J5255l4758l4097K5473M7339Q642l8400l965j765M3714
3296F11216P3353l4361Q349P5840k0281l920j7210J165M1139j9705q26L1887K682
3283G49328N825N3866k2054N5703O7051J4683L745l6780L6574L8716l6687k7653
$$ plain form
3364 2144684 2421391 2415929 2193807 1895402 1609495 1331907 1085800 911899 851906 805669
3354 805669 725517 666713 661845 678432 707348 656309 670062 630089 617287 582553 577200 633497
3342 633497 721963 747547 760906 860781 926192 1019207 1077083 1132881 1267409 1457562 1551124
3331 1551124 1558365 1397608 1154059 1019872 942706 856972 817311 732007 637946 596783 622176
3320 622176 615994 614746 594677 529270 532133 573212 603734 577075 562172 545901 537336 561525
3308 561525 587224 583778 599033 564275 530178 555651 602990 611632 573232 569267 567502 611216
3296 611216 684569 650208 658557 734397 714116 710196 692986 694151 735290 715585 714759 746646 749328
3283 749328 755153 809019 786965 842668 909719 924402 928147 891367 927941 966657 929970 902317
3271I02317n597K1605O4268j5793M8884Q5201N3234K6151J03028O4485L0103L3523
3259A411409n9180K4405L65N0755J05415L7089M6252L2084N4300R7524J19780
3248A920198P4259K3039L6594N9253j5655J2076j2881p0024j13170m8929q9393
3237A775367j00024j42441p2701m6247l4630p2268p0115l1854o3110o9531l2041
3226A040405K535q9818q8039q6402k3685K3343k8483m8196m7522P926j7921n2529
3214E91614N6758o5737o7147j6162k2502P107l1996m1772K5514k2928O2744l5773
3202D39720j9792j7212m8776p4216J5340q069j6242L2160k4451K7729j7880l1285
3190B57026k247o0303l5203J0620P777k3303K5893M2931M230j4015l1334o9545
$$ plain form
3271 902317 896720 918325 982593 966800 1015684 1100885 1154119 1180270 1283298 1347783 1377886 1411409
3259 1411409 1352229 1376634 1376999 1427754 1533169 1570258 1616510 1648594 1702894 1800418 1920198
3248 1920198 1994457 2017496 2054090 2113343 2097688 2109764 2096883 2026859 1913689 1864760 1775367
3237 1775367 1675343 1532902 1460201 1413954 1379324 1307056 1236941 1205087 1141977 1072446 1040405
3226 1040405 1042940 953122 865083 778681 754996 778339 749856 701660 654138 662064 644143 591614
3214 591614 648372 582635 515488 499326 476824 483931 451935 410163 435677 412749 475493 439720
3202 439720 419928 402716 353940 279724 295064 286995 270753 302913 278462 306191 288311 257026
3190 257026 254779 194476 159273 169893 177670 154367 180260 223191 227421 213406 182072 112527
3178A12527J1597K6970m9175N563o1181N3019j4677q278J2264p084k9703Q338
3166F0180J7459n6108L523k2777M9635L4124K479k2208m8327N919k3580k0649
3154b0330L1471j5436m704j8795r962L7332N678r957q633L5571j5192K8184j06
3141C5121p2082q345j0198n029N1998R254j8292K58J281L416L6396n6241R239
3128b3224R287p830m1593j5182K5719k3383P3505Q179p826M912l2969J1025J1788
3115g592l6590M193K9k5948j8960L8615K5248m2262p999l621J8834j7868K203
3102g1718M4433n6452k6957J3274N9139Q164k6585l2318l996K5981K848J0193
3090e3994m7695L091M9526J4755k9499m6620R328k040k789q839J4344M3198k2844
$$ plain form
3178 112527 124124 151094 101919 107482 46301 99320 84643 76365 88629 81545 51842 60180
3166 60180 77639 21531 25054 2277 51912 86036 88515 66307 17980 23899 319 -20330
3154 -20330 11141 -4295 -8999 -27794 -37756 -424 5254 -4703 -13336 22235 7043 35227 35121
3141 35121 -36961 -45306 -55504 -60533 -8535 719 -17573 -17315 -16034 -12618 23778 -32463 -23224
3128 -23224 -13937 -21767 -63360 -78542 -52823 -76206 -2701 5478 -2348 2564 -30405 -19380 -7592
3115 -7592 -44182 -39989 -39960 -65908 -84868 -46253 -21005 -63267 -71266 -74887 -56053 -73921 -71718
3102 -71718 -27285 -83737 -110694 -97420 -38281 -30117 -56702 -89020 -93016 -67035 -64187 -53994
3090 -53994 -101689 -98598 -49072 -34317 -63816 -110436 -101108 -103148 -105937 -114776 -100432 -57234 -80078
3077h0078k0237n06L8701p394l965j9051j3124J8956L9590L8079M371j8375n7523
3064h0556P706j4342L5140P922k2700q8942q033M5632k4692R0102M4387o7741
3052g6117p688M081j2471J6464k1146L5405J316j5758l5407R062K5104j9911k8750
3039a25816O7367J919m0494k4379O4339K7086l2087k4665n191k3681j4213M2970
3027h6845K5181j524m54n057L117K4451l1606m3792R763L9408j1816k4173j0095
3014a13442M8330L803j8675M913J2699L7247q247Q104p728k0439K83q448L4428
3001b7172L4931k9847m7709K2040k4911L6230L5336J0231r07m1266K3863N121
2989d060k8814j8135k2876O0182m4151N7966o144k1195K89J5742k9950n0991L3282
$$ plain form
3077 -80078 -100315 -100821 -62120 -69514 -73479 -92530 -105654 -86698 -47108 -9029 -4658 -23033 -80556
3064 -80556 -72850 -87192 -52052 -44130 -66830 -155772 -163805 -118173 -142865 -52763 -8376 -76117
3052 -76117 -83805 -79724 -92195 -75731 -96877 -61472 -60156 -75914 -111321 -102259 -77155 -97066 -125816
3039 -125816 -58449 -56530 -97024 -121403 -57064 -29978 -62065 -86730 -91921 -115602 -129815 -86845
3027 -86845 -61664 -63188 -63642 -68699 -65582 -41131 -72737 -116529 -106766 -67358 -79174 -103347 -113442
3014 -113442 -65112 -61309 -79984 -75071 -62372 -25125 -33372 -25268 -32996 -53435 -53152 -61600 -27172
3001 -27172 7759 -22088 -69797 -47757 -72668 -36438 -1102 9129 8222 -33044 -9181 -4060
2989 -4060 -32874 -51009 -73885 -13703 -57854 112 -6032 -27227 -26938 -11196 -41146 -92137 -58855
2976e8855O1860L9420o8405n781j332J853L8610l373j0130J5978l2466K6782K1900
2963B6061N070J7313k0839N5925k9757J6631m794J5402J0658k4279j6579Q824
2951E9636k7723J2948N5662l6828K0331j01J257R325L5342K0016K8916l4878J6822
2938A60725L2677j5765J4388N5614j056n2160o021M4016N7659O1841j0611j661
2926C39646j8582K3465L0225l2659N068M7117j5628j8520j0503K022J4389j0340
2914C55700q498K7001M2853J6626n824j4365O192M179n649J4819N5053m617M5006
2901E28476L5350R962O8030K9109N6552N8614K049n3870l8000p8028p8667l357
2889E36220o0856p2786k3880J8912K5204n3941l4065R709j3168j0406J4349j3492
$$ plain form
2976 -58855 3005 42425 -25980 -31761 -33093 -31240 7370 3997 -6133 9845 -22621 4161 26061
2963 26061 31131 48444 27605 83530 53773 70404 65610 81012 91670 67391 50812 59636
2951 59636 31913 44861 100523 63695 84026 83925 85182 94507 129849 149865 178781 143903 160725
2938 160725 193402 177637 192025 247639 246583 194423 188402 232418 290077 351918 341307 339646
2926 339646 321064 344529 374754 342095 347163 394280 378652 360132 349629 351651 366040 355700
2914 355700 347202 374203 417056 433682 427858 413493 419685 423864 418215 433034 488087 483470 528476
2901 528476 563826 573788 641818 670927 727479 786093 788142 734272 696272 618244 539577 536220
2889 536220 475364 402578 378698 397610 422814 368873 334808 344517 331349 320943 335292 321800
2877C21800L4056m2345O278M264k1468L9635l80m133L031n388J9877l4839N058
2864C25446R135k9273J226k3418l1048J6760L628o1897j3161j0329k2451m6960
2852A17658j0164Q7102k0404r580n7054o705O596l074O656l221M3400n0095j5645
2839H5470j3910k7510M792K8229r771j5602j0802L8065j9399k4974l6864L7769
2827C5493j5450q844J4580k3009L4194L0990r770r869p5315j8458N6207p507j9982
2814a6740M8182l4601K496k2229k8267J6437M5840j4830k4902J5339k7920M1681
2802D86J153m2286J1978j759J816K32p8715L8130r081j7941J2570L2255J4159
2789c7003m3673n347M657M1440k627n4257L062L1099j6555P425L0182L908n726
$$ plain form
2877 321800 355856 313511 319789 324053 302585 342220 341840 337707 340738 335350 355227 320388 325446
2864 325446 334581 305308 306534 283116 252068 268828 272456 210559 197398 187069 164618 117658
2852 117658 107494 194596 174192 164612 107558 100853 107449 104375 111031 107810 151210 101115 85470
2839 85470 71560 44050 48842 77071 67300 51698 40896 78961 59562 34588 -2276 35493
2827 35493 20043 11199 25779 2770 36964 67954 58184 48315 -27000 -45458 10749 3242 -16740
2814 -16740 31442 -3159 -663 -22892 -51159 -34722 11118 -3712 -28614 -13275 -41195 486
2802 486 1639 -40647 -28669 -30428 -28612 -28380 -107095 -68965 -78046 -95987 -83417 -51162 -37003
2789 -37003 -80676 -86023 -81366 -39926 -42553 -96810 -93748 -62649 -79204 -71779 -41597 -37689 -43415
2776d3415O257k9841p6361O035M3201j6534q409K7871j215O161j1181J2655J1186
2763g3590k5283J3298j3321n5181N2103L4829j4588j3707k2528N7493O015l7905
2751i2365j1863j8696j1282j0644K5868L5775k5773J7200J1520j8487l6498K0773
2739a14472k9119l5391L5337K2203j4821M194k738K7204J4004m6139P884L7537
2727i4317k4547o0730P4679j8133Q852k147J1807k3217k4979j5437L068L2141
2715a32960O518P715j826O863m0759l2508M541M6042J9337l063L1547n7096o664
2702a52313J4482j0580M5502R456q031l229k6350j9996M5020m2922J412P1062
2690g6487L8089n7208k543o120k3195j0196j695R085l320j786m2712K6892M3442
$$ plain form
2776 -43415 -37158 -66999 -143360 -137325 -94124 -110658 -119067 -91196 -92411 -86250 -97431 -84776 -73590
2763 -73590 -98873 -85575 -98896 -154077 -101974 -67145 -81733 -95440 -117968 -60475 -54460 -92365
2751 -92365 -104228 -122924 -134206 -144850 -118982 -83207 -108980 -91780 -80260 -98747 -135245 -114472
2739 -114472 -143591 -178982 -143645 -121442 -136263 -132069 -134807 -107603 -93599 -139738 -131854 -94317
2727 -94317 -118864 -179594 -104915 -123048 -114196 -116343 -104536 -127753 -152732 -168169 -165101 -132960
2715 -132960 -126442 -118727 -120553 -113690 -154449 -186957 -182416 -136374 -117037 -120100 -88553 -145649 -152313
2702 -152313 -137831 -148411 -102909 -93453 -101484 -104713 -131063 -151059 -106039 -148961 -147549 -76487
2690 -76487 -38398 -95606 -98149 -104269 -127464 -137660 -139355 -130270 -133590 -135376 -178088 -151196 -107754
2677a07754m2915K0531L6031m53J2380J0183P480n4738K2974m420l8629K6210
2665a13120J2460k8181k8778l3884L3195N6169k117J5256K785n3317k1418J4958
2653a45992J3371K3732L3591j9331P144k271J0858L3265k5312L9845p734j2529
2641e1363j7910j4762J5925m8926L8759J9217Q16q05J3657K012o4546j8791L0246
2628i6471r674k1797q720K193M8660J3224j1994K8669l502n5129K3128l008K5424
2615f8997L111J3377O853m1547Q498L5968j0805n247l1628k7820L913k6370O5206
2602g5488M7951k846m5764j5386N990k2012N815j1502L9604q938L1836J7174l8821
2589g2387P470k172j5985o1051p936J085P3228K4053k6437L1375J630J6892o507
$$ plain form
2677 -107754 -150669 -130138 -94107 -94560 -82180 -71997 -64517 -119255 -96281 -100701 -139330 -113120
2665 -113120 -100660 -128841 -157619 -191503 -158308 -102139 -104256 -89000 -86215 -139532 -160950 -145992
2653 -145992 -132621 -108889 -75298 -94629 -87485 -89756 -78898 -45633 -70945 -31100 -38834 -51363
2641 -51363 -69273 -84035 -68110 -117036 -78277 -59060 -58244 -59049 -45392 -43380 -107926 -126717 -96471
2628 -96471 -106145 -127942 -136662 -134469 -85809 -72585 -84579 -55910 -59412 -114541 -91413 -94421 -68997
2615 -68997 -65886 -52509 -45656 -87203 -78705 -42737 -53542 -58789 -90417 -118237 -114324 -140694 -75488
2602 -75488 -27537 -30383 -76147 -91533 -85543 -107555 -101740 -113242 -73638 -82576 -50740 -33566 -72387
2589 -72387 -64917 -67089 -83074 -144125 -152061 -150976 -77748 -53695 -80132 -48757 -47127 -30235 -36742
2576c6742L7288l753K3347j9900p9976o6594K0736L7909k8322L3080p370k3126
2564a13423K1291K1564L9044j1111J6346j5780n075l4117m8862J7204k7707O578
2552a34048M8255Q5614p9403n2854R884L4317J0581l6140L4275q774J0409M3465
2540c4419l9307K0473k3910j5633J1224l3634j6699j3513J4885J3438L770O0278
2528e3047L468p1858q107O3631Q095N86L3813n6850O873M4646J3570j3431k6441
2515e5052K9021k2262J9394J875J8109o3800l8089L9433K224r656j5853M0420
2503e4236J011N110o1680J7726L6758J6892J796j315l5663k3802N3923m7396M3571
2490d7305K9958k8979k5398j7325l1601J2101M3431M3442m996j7501K0699m8755
$$ plain form
2576 -36742 546 -3207 20140 240 -79736 -146330 -125594 -87685 -116007 -82927 -90297 -113423
2564 -113423 -92132 -70568 -31524 -42635 -26289 -42069 -47144 -81261 -130123 -112919 -140626 -134048
2552 -134048 -85793 -179 -79582 -132436 -122552 -88235 -77654 -113794 -79519 -88293 -77884 -34419
2540 -34419 -73726 -53253 -77163 -92796 -81572 -115206 -131905 -145418 -130533 -117095 -113325 -53047
2528 -53047 -49579 -121437 -129544 -65913 -57818 -57232 -23419 -80269 -73396 -28750 -15180 -28611 -55052
2515 -55052 -26031 -48293 -28899 -27024 -8915 -72715 -110804 -71371 -69147 -78803 -94656 -54236
2503 -54236 -53225 -48115 -109795 -92069 -55311 -38419 -36623 -37938 -73601 -97403 -43480 -90876 -47305
2490 -47305 -17347 -46326 -71724 -89049 -120650 -108549 -65118 -21676 -26672 -44173 -23474 -72229
2478g2229K5230q192m0960l1110L2227M4606j6723m6054j3361L7124k08J5312
2466g4338N4615m7157m3334j3905K530l326M887L7927N957L8161l4635j8323J1644
2453g9297J5482O5597o5875j0642j828R80j2489J4414K1863J8885k3363O189k267
2440e2351K1314o180k3032L492n987N8866J4813p594l7094k6877K5645J0527l688
2427b8146j0488k5366l9229J5394P1874J8722J4460j7124o0788R506K6731j0956
2415c5410P359K4269P0741l4830J1879M62o0127l1758p631R117q881j26P971l1067
2401g8032N7237o954J0130J9538M063k4420J478L798l9883M7155l113j5050k1893
2388d5946L4848k6085L1503J7336n5581j1596J3638L9773Q601J2443k4987o767
$$ plain form
2478 -72229 -46999 -55191 -96151 -127261 -95034 -50428 -67151 -113205 -126566 -89442 -89650 -74338
2466 -74338 -19723 -66880 -110214 -124119 -121589 -124915 -120028 -82101 -76144 -37983 -72618 -90941 -79297
2453 -79297 -63815 1782 -64093 -74735 -76563 -75583 -88072 -73658 -51795 -32910 -56273 -50084 -52351
2440 -52351 -31037 -37217 -60249 -56757 -62744 -3878 10935 3341 -33753 -60630 -34985 -24458 -28146
2427 -28146 -38634 -64000 -103229 -87835 -15961 2761 17221 97 -60691 -51185 -24454 -35410
2415 -35410 -28051 -3782 66959 32129 44008 44470 -15657 -47415 -55046 -45929 -54810 -54936 -46965 -78032
2401 -78032 -20795 -27749 -17619 1919 5982 -18438 -16960 -13162 -53045 -5890 -9003 -24053 -45946
2388 -45946 -11098 -37183 -5680 11656 -43925 -55521 -41883 -2110 6491 18934 -6053 -12820
2376a2820Q507J5128J3419K921n327J109J0957j3509K8358K3079k1384m73k0718
2363B9247J4175l7021k1786O200n845j5620J3875K1129j5460J0951J2523J6933
2351B9301p840n3537J600P904k0307j6954J1846K1579K6455m5542l4900J2229
2339f8166K1095M0483j0815O934K3871Q719m179q978j5827N690l3784J933k6581
2326e9605P662L1175k3077M301r4n6043P5253O0639k4494r8722N0332M4788k2499
2313a0384K0468o5052j5110M7433K4436k7193J7028o358K7275l8390J703K9816
2301E672j6139K7646K7966o137j8429L5458J8571n2753k5160M0365j8970k9224
2289a1134M4774m5969J4422M749M1528n879m5351j6989j6153L3916j037j9733
$$ plain form
2376 -12820 -4313 10815 24234 27155 21828 22937 33894 20385 48743 71822 50438 49965 29247
2363 29247 43422 6401 -15385 -9185 -15030 -30650 -16775 4354 -11106 -155 12368 29301
2351 29301 21461 -32076 -30476 -22572 -42879 -59833 -47987 -26408 47 -45495 -80395 -68166
2339 -68166 -47071 -6588 -17403 -10469 13402 22121 17942 8964 -6863 -1173 -34957 -33024 -59605
2326 -59605 -51943 -20768 -43845 -39544 -39638 -95681 -20428 40211 15717 -83005 -32673 12115 -10384
2313 -10384 10084 -54968 -70078 -22645 1791 -25402 -8374 -14732 12543 -25847 -24144 5672
2301 5672 -10467 17179 45145 39008 20579 56037 74608 21855 -3305 37060 18090 -11134
2289 -11134 33640 -12329 2093 6842 48370 42491 -2860 -19849 -36002 -2086 -3123 -22856
2277b2856L5508K9849R037l2968n986Q0588j2065j3424J0723k5479l87M9261N8410
2264A60211m6280n754l4808p7274L6524J7392K9835j2452l4056L4791K0296O133
2252I4558k1383j8599L1640m0462K5132Q250n55J2329N157m0079M1030N086r410
2239I2694K9898k7095l9395R669r596M2750k1129l836P979j0705K6418J5540L7967
2226A51159j2513m3277N4712J3929k3553P898r527J941m8669R13r585O273P0154
2213A59855M5654k3317o9895K6720J2928q331q821K45k1097k2702k698K289L0331
2200A21161O500K2472L6745J3679M6446L1659K079j9988o568l0164J5231M2649
2188B81901j4237l7081L7297M3959j5385J1818o127P5721M4336m594m8540k9542
$$ plain form
2277 -22856 12652 42501 51538 18570 12584 93172 81107 67683 78406 52927 52540 101801 160211
2264 160211 113931 108177 73369 -3905 32619 50011 79846 67394 33338 68129 88425 94558
2252 94558 73175 54576 86216 45754 70886 79136 78581 90910 96067 55988 97018 102104 92694
2239 92694 122592 95497 56102 65771 56175 98925 77796 73960 81939 71234 97652 113192 151159
2226 151159 138646 95369 150081 164010 140457 148355 138828 140769 92100 93013 83428 89701 159855
2213 159855 205509 182192 112297 139017 151945 143614 134793 135038 113941 91239 88541 90830 121161
2200 121161 127661 150133 186878 200557 247003 278662 280741 260753 254185 224021 239252 281901
2188 281901 267664 230583 267880 311839 296454 308272 302145 377866 422202 417608 369068 339526
2176C39526j4461P83N0457M480p1811O63J8781M5555M0719j9961K2201R952K7844
2163D54728Q740J7640O1503j3077J5778P178K1547k116L1993L4142M4154L336
2151F85546J5274k3659M3096m972J1245K3189O3807N0566Q5407M8141m6604n2684
2139H98352N4409L461O1820M4922O2834J01958L2398L4156K1396J25742R8411
2128A539859N0839J01508N9635O7517Q6109N7994Q6527J27771J04128J68661K30789
2117B681337K19547K44933K74342K37639K24252K70267L63488M79805O27704Q08260
2107F431574Q24637Q29074J012009J267741K006393K695138L305506J921934j825745
2098A8468261l260867l113385k632021k093738j392915r46477p62113n37775l35773
$$ plain form
2176 339526 325065 325848 376305 380785 308974 309637 328418 373973 414692 394731 416932 426884 454728
2163 454728 463468 481108 542611 529534 545312 552490 574037 571921 603914 638056 682210 685546
2151 685546 700820 677161 720257 715285 726530 749719 813526 864092 949499 997640 951036 898352
2139 898352 952761 956222 1018042 1062964 1125798 1227756 1260154 1294310 1315706 1441448 1539859
2128 1539859 1590698 1692206 1751841 1819358 1905467 1963461 2049988 2177759 2281887 2450548 2681337
2117 2681337 2900884 3145817 3420159 3657798 3882050 4152317 4515805 4995610 5623314 6431574
2107 6431574 7256211 8085285 9097294 10365035 12371428 15066566 18372072 20294006 18468261
2098 18468261 15207394 12094009 9461988 7368250 5975335 5028858 4266745 3728970 3393197
2089C393197k69914j77782k28421q6281q5159j66635j84114j80533k13671j57671
2079A643016j18840r7847r1905j61373n7582J2798n4565j35222o6044M3777N8027
2068I74240n2015o6526j21061m8209K0106j3486p6495p9815m1397l0123j5888
2057D49331m043n2518j7594k1893L237J4151j8172p650p4569p82L5007L1533L260
2044C39298m1231l5616O798J785o7796n248k6427m2380J0918N4671l1910j2422
2032A50440J0035J1611k3116n4235l038O2988j4188k5108L566J0141j2112m987
2020A11997L7667J730l2269l6519m241l4188k394J1654k4547K1471J3553p174
2008E6740k2130J2754k2562J3234k1310K4306K4814m9274k195r156O9942O945
$$ plain form
2089 3393197 3123283 2945501 2717080 2630799 2545640 2379005 2194891 2014358 1800687 1643016
2079 1643016 1524176 1426329 1334424 1173051 1115469 1128267 1073702 938480 872436 916213 974240
2068 974240 922225 855699 734638 686429 706535 693049 616554 536739 495342 465219 449331
2057 449331 445288 392770 375176 353283 356520 370671 352499 344849 270280 269498 304505 336038 339298
2044 339298 298067 262451 269249 271034 203238 197990 171563 129183 140101 194772 162862 150440
2032 150440 160475 172086 148970 94735 91697 154685 140497 115389 118955 129096 116984 111997
2020 111997 149664 151394 119125 82606 78365 44177 41783 53437 28890 50361 63914 56740
2008 56740 34610 47364 24802 38036 16726 41032 65846 16572 14377 5221 75163 82108
1996H2108k1378m6684n683o056J001k060K826j8682j3325K426l466L1412K9184
1983C1623K2846k9676j9648m254N235L4186l7465m8413L2561m0363K2412L2935
1971A979j4333R336N3749K3497j8373n5213j3182L1314J2645j6367K892K393n905
1958A4432n44j8129K1108k1019m7974M1583k3973m051L0169k8922K8883m089J3140
1945F14m7565N5723L0480p2743m594K0000O583J3410L1324n0351K501K6920J5040
1932B7342l8754j7804J3681L977l8220L2527L5808l171O11j1143j2511k9864M917
1919c2604K9790K3394j6550K4241L7850q6235K682L0632j7458O4894j3711l8251
1907H674J830M729j5667l8679L678N4721M6450m5064q666j6224l4435M5566L0096
$$ plain form
1996 82108 60730 14046 8363 2307 3308 1248 4074 -14608 -27933 -25507 -28973 2439 31623
1983 31623 54469 24793 5145 891 6126 40312 2847 -45566 -13005 -53368 -30956 1979
1971 1979 -12354 -3018 50731 74228 55855 642 -12540 18774 31419 15052 17944 20337 14432
1958 14432 13888 -4241 16867 -4152 -52126 -10543 -34516 -38567 -8398 -37320 -8437 -12526 614
1945 614 -46951 8772 39252 -33491 -38085 -18085 -11502 1908 33232 -17119 -14618 12302 27342
1932 27342 -11412 -29216 -15535 -11558 -49778 -17251 18557 15386 15997 4854 -7657 -37521 -32604
1919 -32604 -2814 20580 4030 28271 66121 -20114 -17432 13200 -4258 60636 46925 8674
1907 8674 10504 15233 -434 -39113 -35435 19286 65736 20672 12006 -4218 -38653 6913 37009
1894C7009j4448Q920M201j6745r691L7088K4820k4104M4040l9571k9105k8957
1882f543l245j7256L6184M5113n3079K371k6238J7954k2889j7355o347K0656Q155
1869b2519K9575N858l0265M7332j0914k441j6386M084Q58P824k0673N350J1904
1856I587j9590j0537M2116N3289j0870k6816J3422k1024m4628n574k2330M7789
1844D834K6713j6071m923Q658j1281M448O8858j1066J3847p814M2134o198k3485
1831H8654j7337k0383L1447l7641J1740L284m6223N8393j5515k5868k6731l0394
1819b6574P066R038m599O122m9768L9865n438j8852N733J1683R968J3163j711
1806d304r174M1715L8499m9276n3189L233l378O3247l1623j6998K8924l884P211
$$ plain form
1894 37009 22561 31481 35682 18937 9246 46334 71154 47050 91090 51519 22414 -6543
1882 -6543 -9788 -27044 9140 54253 1174 3545 -22693 -4739 -27628 -44983 -51330 -30674 -22519
1869 -22519 7056 12914 -17351 29981 19067 16626 240 4324 5182 13006 -7667 -2317 9587
1856 9587 -10003 -20540 21576 74865 63995 37179 50601 29577 -15051 -20625 -42955 4834
1844 4834 31547 15476 10553 19211 7930 12378 81236 70170 84017 76203 118337 112139 88654
1831 88654 71317 50934 82381 44740 56480 59764 13541 71934 56419 30551 3820 -26574
1819 -26574 -19508 -10470 -15069 -8947 -58715 -18850 -24288 -43140 -37407 -25724 -15756 -2593 -4304
1806 -4304 -13478 28237 66736 17460 -35729 -32496 -35874 27373 -4250 -21248 7676 3792 11003
1793A1003j1035K695J8560j6130j1479O980L0293k6684M7344r85j6546l2803o1264
1780f0051m660k8527P885L0147M489L9728k1516L990q042k769k0501J8776j8212
1767e9263J564J7145R845L9077N64r227K0184r1356J6369M2226K1180k8433J2844
1754g281k6032l7498p199P279k4315P4378m539J7548M9698l7160J5405l1238K1201
1741A0247k0134K3314J6211k9028k1688L2943k2942L5142q640k5370M286o643
1729a2302K7393N762K8619J7512k2970K8157p6214J8027K1531M643m749n2495
1717a7086k9168J3298L7548J2266k4068p246k5408L5561K7512K1581J1510o2613
1705f313k600P4613j5216j5203l3227k5102J4501M2174J4766K0138k1387q097
$$ plain form
1793 11003 -32 2663 21223 5093 -6386 594 30887 4203 51547 50562 34016 1213 -60051
1780 -60051 -64711 -93238 -85353 -55206 -50717 -10989 -32505 -28515 -36557 -39326 -59827 -41051 -59263
1767 -59263 -57699 -40554 -30709 8368 8932 -295 19889 -71467 -55098 -12872 8308 -20125 -7281
1754 -7281 -33313 -70811 -78010 -70731 -95046 -20668 -25207 -7659 42039 4879 20284 -10954 10247
1741 10247 -9887 13427 29638 610 -21078 11865 -11077 24065 15425 -9945 -5659 -12302
1729 -12302 15091 20853 49472 66984 44014 72171 -4043 13984 35515 40158 35409 -17086
1717 -17086 -46254 -32956 4592 16858 -7210 -14456 -39864 -4303 23209 44790 56300 -6313
1705 -6313 -8913 65700 50484 35281 2054 -23048 -8547 33627 48393 68531 47144 39047
1693C9047k4723j9901M5905p0313M3215K9148l4175Q262J8150m1902j5920L1664
1681H457M0222n957m7175l814L6090K0218j9866k6638p653K9145K8588j9940j8532
1668A3145j8588k1566p009K9806L873j8470L2405M0017q782J7691l6398m9690
1656b3566L16j768j8543K5177L193j3002K8372N3456k3589m1171j0519Q689J4225
1643A270J0256P815k6600J739k1638j7944M5851j1349j3823K6244n787j3140K1364
1630D258r141j18J1752N70J2585l6749N1142M790k2299n0059k4933K6711L1163
1617c28m0028L7918J5165k5172q39J756L4371l3773r776m307K0491m2128r138
1604e5788P413N615L2851m0028K5360K4610P865m741k8790J021o346O2953J575
$$ plain form
1693 39047 14324 -5577 40328 -29985 13230 42378 8203 16465 34615 -7287 -23207 8457
1681 8457 48679 42722 -4453 -8267 27823 48041 28175 1537 -6116 23029 51617 31677 13145
1668 13145 -5443 -27009 -34018 -4212 -339 -18809 13596 53613 44831 62522 26124 -23566
1656 -23566 -23250 -25018 -43561 -18384 -15191 -28193 179 53635 30046 -11125 -21644 -12955 1270
1643 1270 11526 19341 -7259 -5520 -27158 -45102 749 -10600 -24423 1821 -3966 -17106 4258
1630 4258 -4883 -5001 6751 7321 19906 -16843 34299 39089 16790 -33269 -58202 -31491 -328
1617 -328 -40356 -2438 12727 -12445 -13284 -11528 22843 -10930 -20706 -25013 -4522 -46650 -55788
1604 -55788 -48375 -42760 -9909 -49937 -24577 33 7898 3157 -25633 -24612 -30958 31995 33570
1591C3570l1326L9488j1354j9577L4452n7421K4175L6768n7447J3770j0879m176
1579i957r614J1101n532O992q402K2498n176m314K0416J8862k634N448l5348J2956
1565A7296L7935j9545J6631L3054m1299o5315J6953k3391L5322j1870K068j268
1553c429K9131L7917L0109J2537p093o0440n1434L5775k3880l2886R4714j0448
1541E0573j5190R180m5116L7876j670j6055m5639N4968K7686l725O432j0231l5410
1528A3679J3157j0369r160N9208j1010r233m8332k2433N6927K3695q834k2094
1516B5201l6847J7898m3750N1738J701K5316j0230n373k6977l2445K4415N684
1504c669M1880m770j841k0098K4654j6553o014L3848p4714J1540K7978k0665J8996
$$ plain form
1591 33570 2244 41732 30378 10801 45253 -12168 12007 48775 -8672 5098 -5781 -9957
1579 -9957 -19571 -8470 -14002 -7010 -15412 7086 1910 -2404 18012 36874 34240 39688 4340 17296
1565 17296 55231 35686 52317 85371 44072 -21243 -4290 -27681 7641 -4229 -2161 -3429
1553 -3429 25702 63619 93728 106265 99172 38732 -12702 23073 -807 -33693 61021 50573
1541 50573 35383 44563 -553 37323 35653 19598 -26041 28927 56613 52888 59320 49089 13679
1528 13679 26836 16467 7307 66515 55505 46272 -2060 -24493 32434 56129 47295 25201
1516 25201 -11646 6252 -37498 14240 15941 41257 31027 25654 -1323 -33768 -9353 -3669
1504 -3669 38211 33441 31600 11502 36156 19603 13589 47437 -27277 -15737 12241 -8424 10572
1491A0572J7609J3856o453j3844n40j9741J6597J994n1000M5165l9963J9393K2911
1478A6556J3710K645m9970l204M5927m3793N9628L9757l9566m33L3839k186p411
1465F5499q418K2126k6034k2044j8408J9101J526j0384j1016l034P164J8313n1507
1452a7116k1558P6352J199L400o3096K0767J9996k871K7435J8827m1679j72q953
1439A2531K0938j1055J3201K1735K759l4794k2285L4578K2378o695k6141m9821
1427b2671j88J4193O241k4760L3960J4562k4060l983l0106Q8L6218J5549J6135
1414C1178J440m4334k4767L6296J0435j3634m047K2271M2844J1356J3824m3752
1402C9110l8382K7128m5673n5981J2448L8911M9565J3828m1543k2195M7000l4150
$$ plain form
1491 10572 28181 42037 35584 21740 21200 1459 18056 20050 -30950 14215 -25748 -6355 16556
1478 16556 30266 32911 -17059 -20263 25664 -18129 41499 81256 41690 41257 75096 72910 65499
1465 65499 57081 79207 53173 31129 12721 31822 33348 22964 11948 8914 16078 34391 -17116
1452 -17116 -38674 37678 38877 42277 -20819 -52 19944 17073 44508 63335 21656 21484 12531
1439 12531 33469 22414 35615 57350 60109 25315 3030 37608 59986 53291 27150 -22671
1427 -22671 -22859 -8666 -2425 -27185 6775 21337 -2723 -6706 -36812 -36724 -506 15043 31178
1414 31178 32618 -11716 -36483 -187 10248 -3386 -7433 14838 57682 69038 82862 39110
1402 39110 728 27856 -17817 -73798 -61350 -22439 27126 40954 -589 -22784 24216 -9934
1390i934m364N7099l9798L9655l5878o3076M9166K2087p900n9784M1920M3223
1378C2416j0231P114K2092k5074l1104j637K6738k4966k7246O1664o2502P405
1366b5331K9085L3871j5750j407j925J9084L9418K290J2151k0701j3821l0181
1354B6783L356l3553M3367j0893P926J0166k5230j4027o299J2134N4593J2891
1342H1214j2213n2715k5628O431J9927j6204n5707J7681K5579k611J7666L8371
1330D1791J5762o3287K7615j404l5384K4179l1548J2542J6144q750O6657r369
1318E4948L450K7143l8583M919K445k4059k4307k4334P8517L5743o2768j2776
1306B0338l6336O917J9443p455N6604k9361l1914j931l43L1403L1038m835N7372
$$ plain form
1390 -9934 -14298 42801 3003 42658 6780 -56296 -7130 14957 7057 -52727 -10807 32416
1378 32416 22185 29299 51391 26317 -4787 -6424 20314 -4652 -31898 29766 -32736 -25331
1366 -25331 3754 37625 21875 20468 18543 37627 77045 79335 91486 70785 56964 26783
1354 26783 30139 -3414 39953 29060 36986 47152 21922 7895 1596 13730 68323 81214
1342 81214 69001 16286 -9342 -2911 17016 812 -54895 -37214 -11635 -14246 3420 41791
1330 41791 57553 -5734 21881 20477 -14907 9272 -22276 -9734 6410 -2340 64317 54948
1318 54948 58398 85541 46958 51877 54322 30263 5956 -18378 60139 95882 33114 20338
1306 20338 -15998 -9081 10362 2907 59511 30150 -1764 -3695 -4038 27365 58403 53568 110940
1293A10940j3500k7762n2144L8674j0900l9158J0449O367J2117p2030K6592r002
1281a9357N0907R069J3401n5889L2971o933k5514l1172j0721O3146O5952q874
1269G6986m8667j0337K1990K6530l7386J6503O878k8760J2021O76L497j4607l010
1256B2314l0619P35L3514k3918j9992P016K5484Q949J4297N850m1407K7926m4570
1243a4421q480L7183J1625J3028k992k1364k542O384K3375m8415m5217M8831J7153
1230A4148R287n1320J8307K7885m237k8367n898L1676J3172l0068k9848O74L3041
1217a548N9171l1952k2618m752J5371Q886k5227m278k0046J2274k13J7024M037
1204F129m5483L1712M6698J1238n6345r252R155m9025k0119l3438K3732L3981
$$ plain form
1293 110940 97440 69678 17534 56208 45308 6150 16599 22966 35083 -36947 -10355 -19357
1281 -19357 31550 40619 54020 -1869 31102 24169 -1345 -32517 -43238 19908 85860 76986
1269 76986 28319 17982 39972 66502 29116 45619 52497 23737 35758 36434 39931 25324 22314
1256 22314 -8305 -7570 25944 2026 -17966 -10950 14534 23483 37780 43630 2223 30149 -14421
1243 -14421 -22901 14282 25907 38935 35943 14579 12037 18421 41796 -6619 -51836 -3005 14148
1230 14148 23435 -27885 -9578 18307 14070 -14297 -20195 11481 24653 -5415 -35263 -34589 -1548
1217 -1548 57623 25671 3053 -1699 13672 22558 -2669 -6947 -26993 -14719 -14932 2092 6129
1204 6129 -39354 -7642 39056 50294 -6051 -15303 -6148 -55173 -75292 -108730 -84998 -51017
1192e1017N452j8226K9654M3081L8922J0232m1029N325M2134L5845n9709k6465
1180A4199O0245j1968r941j5278j0220j9295j0292j561k4654j2534M6338M2085
1168D7124o640l038K4993K887l8096j7623L9949j1984K056O489m396R89Q547j4980
1154C6277l2367J6149J6451k6734o697R109K0572O678j8274k1465P6345L312l9224
1141D0132J1312j5019K3683l3641L3936m8221L9042J8321o4115j7905l094P796
1129g773k192L0695J7078o964n469P59n8741K0102L1431l5727K1537j1014M5529
1116C9251k0049k5888r312M2938M5461j980j0237m6991L4002R45o390l2590j8630
1103i470j6151M5840m895O0938j3323m4520Q215J9172K1546K1999m1242l0593
$$ plain form
1192 -51017 -45565 -63791 -34137 8944 47866 58098 17069 22394 64528 100373 40664 14199
1180 14199 74444 62476 52535 37257 27037 7742 -2550 -4111 -28765 -41299 5039 47124
1168 47124 40484 37446 62439 65326 27230 9607 49556 37572 39628 46117 41721 42710 51257 36277
1154 36277 3910 20059 36510 9776 3079 12188 32760 39438 21164 -301 76044 79356 40132
1141 40132 51444 36425 60108 26467 60403 12182 51224 69545 5430 -12475 -15569 -7773
1129 -7773 -9965 20730 37808 30844 25375 26134 -32607 -12505 18926 -16801 4736 -6278 39251
1116 39251 19202 -6686 -15998 26940 72401 70421 60184 13193 47195 48140 41750 9160 -9470
1103 -9470 -25621 20219 15324 76262 62939 18419 26634 45806 67352 89351 48109 17516
1091A7516K6708k175k1859l4269K3422J6235k239O933j1517K2079L2974p177l1558
1078C5073K3290r2392J3166K1382J0037k1669K640N7770l5851L8715k3704j763
1066B6694J792m3731l2082J4700k9509P1321n94j1689K732J2166J6200j721o532
1053A9747j3980M3084N127J2842p795m7459r777J1688K4907k4026k2212K2835
1041A4981N7632j1250K8088l2063l7226L0486J2993k0543l950L7679j2527q484
1029E5816k1925l8404K6519J102J624k0975K0995j639n0806n720p228R807L3293
1016B459M1533J6885o8047l6519K0553j6327M94K4557K1700L083n0805j3329j4784
1003f8547O6238J5220k1652K277M649k367O893O6320m5519j2283J9981R241L1058
$$ plain form
1091 17516 44224 42049 20190 -14079 9343 25578 23339 30272 18755 40834 73808 66631 35073
1078 35073 58363 -34029 -20863 519 10556 -11113 -8473 49297 13446 52161 28457 26694
1066 26694 28486 -15245 -47327 -32627 -62136 9185 8591 -3098 -366 11800 28000 26279 19747
1053 19747 5767 48851 53978 66820 59025 11566 1789 13477 38384 14358 -7854 14981
1041 14981 72613 61363 89451 57388 20162 50648 63641 43098 39148 76827 64300 55816
1029 55816 33891 -4513 22006 23108 24732 3757 24752 23113 -27693 -33413 -40641 -30834 2459
1016 2459 43992 60877 -7170 -43689 -23136 -39463 -38969 -14412 7288 10371 -40434 -53763 -68547
1003 -68547 -2309 12911 -8741 -6464 -1815 -4182 2711 69031 23512 11229 31210 40451 71509
990G1509M952j7397k2533K2053j6961J3966j0860m309k6660m4875L3636P02N072
977H295k8677L4459k5850K5487J3507j5608J7832l6239l5274R55M8350k2694L944
964a1513O797L2664K8171o1220N0250l064l1356o201K5531k3737R022p368p763
951B13l8002L9393J8037l0690O999N8905O51l3974J3198k9207K774J6849r257
938A5889p976k9771K8781K7480M5408n726p2235j1954q682Q749K0550K0641p022
925B4132l950k6586r41k7066K6646L8564j5539n7332J7705J2565J9382K1277l2735
912c878K3013k5036k3454J9809K4482J3496l9382k2607j1828K5689K4851J8037
900B3192m4069k4027M9956O140K9785j2651L285j0981n6858J1255M1671P225j0123
$$ plain form
990 71509 76461 59064 36531 58584 41623 55589 44729 40420 13760 -31115 2521 3223 8295
977 8295 -20382 14077 -11773 13714 27221 11613 29445 -6794 -42068 -41113 7237 -15457 -11513
964 -11513 -4716 27948 56119 -5101 45149 42085 10729 4528 30059 6322 15344 7976 213
951 213 -37789 1604 19641 -11049 -4050 54855 55506 21532 34730 5523 8297 25146 15889
938 15889 7913 -21858 6923 34403 79811 74085 1850 -10104 -18786 -10037 10513 31154 24132
925 24132 20182 -6404 -7345 -34411 -7765 30799 15260 -42072 -24367 -11802 7580 28857 -3878
912 -3878 19135 -5901 -29355 -9546 14936 28432 -10950 -33557 -45385 -19696 5155 23192
900 23192 -20877 -44904 5052 11192 40977 28326 31611 20630 -36228 -24973 16698 23923 13800
887A3800n69M439M5434j1810m8659Q04l3508n497n661Q499l3305J5785P7799R419
873C6970K3203n6381l555j192L0030L8897m9644n3187R391N1069k2689J0792Q044
860B1748L0859k9897j3167J644k1539J6567r6J7432n066k2994L1246J9421k0036
847B6122L0894l3880k4750J354M4823k494k9338k8265M8171q057o578J6310Q188
834D2500k1158K974l4518K1312J2133j6274L5048l4586j7213K47o535j5147K9277
821a940n672k4227R418J7402J8647q33J0082m167K8196L7504o7522J4330j2938
808A8280J4501J7821m7570n585K4956m793R286j0818k4119j4650M8924N1878j8868
795E9243n9624k3629J2754O257j9186J8584o898J785o3366k8563N4970N2807n153
$$ plain form
887 13800 13231 17670 63104 51294 2635 3439 -30069 -35566 -41227 -32728 -66033 -50248 27551 36970
873 36970 60173 3792 237 -955 29075 67972 18328 -34859 -25468 25601 2912 13704 21748
860 21748 52607 22710 9543 11187 -10352 6215 6119 23551 18485 -4509 26737 46158 26122
847 26122 57016 23136 -1614 -260 44563 42069 12731 -15534 32637 24580 18002 34312 42500
834 42500 21342 24316 -10202 11110 23243 6969 42017 7431 -9782 -9535 -16070 -31217 -1940
821 -1940 -7612 -31839 -22421 -5019 13628 12795 22877 18710 46906 84410 16888 31218 18280
808 18280 32781 50602 3032 -2553 22403 17610 26896 16078 -8041 -22691 26233 78111 59243
795 59243 -381 -24010 -11256 -4999 -24185 -5601 -12499 -10714 -74080 -102643 -47673 5134 -19
782a9l8199L5262K1183L1568k8090m9619m2390K38Q4778j3605k5398J2131q45
769a3005J2387r786K1842j4621l776J9370J5057J4014k0487j3795Q976k5897K9648
756A9927j2915K7240m9773Q837J4632l7765K7708K0842K1280j7301J5407J530
744C9649j7421R42j4127k4412M420J6625J8682L7163Q556l6823J4837J3589l2612
731B9068j9953K575j1298k6283n522M0735k1319L0915j594o968j134j7904l5753
718d4435k3352k887N4080L9537m3606J1045O5045L7217m5091J6753l077m3151
706A8078j4239l1130j4714j503l0560N5566K6152p9446N0830j5796P059K5532
694d171Q093j87j6651j7592J1149O1843K2818m1997o6556K4641J8815M3244m2775
$$ plain form
782 -19 -38218 -2956 18227 49795 21705 -27914 -70304 -70066 14712 1107 -24291 -12160 -13005
769 -13005 -618 -10404 11438 -3183 -6959 12411 27468 41482 20995 7200 16176 -9721 19927
756 19927 7012 34252 -15521 -6684 7948 -29817 -2109 18733 40013 22712 38119 39649
744 39649 22228 23170 9043 -15369 -10949 5676 24358 61521 70077 33254 48091 61680 29068
731 29068 9115 11690 392 -25891 -31413 9322 -11997 18918 17324 10356 9222 -8682 -44435
718 -44435 -67787 -70674 -16594 22943 -20663 -9618 55427 92644 47553 64306 61229 18078
706 18078 3839 -27291 -42005 -43508 -74068 -18502 7650 -71796 -20966 -36762 -29703 -4171
694 -4171 3922 3735 -12916 -30508 -19359 42484 65302 23305 -43251 -18610 205 43449 674
681F74q345K0681m4770j2917N1325J3370l4276K2421K278o342j2498p52L7772
$$ plain form
681 674 -7671 13010 -31760 -44677 6648 20018 -14258 8163 10441 4099 -8399 -9151 28621
$$ [...]
##END NTUPLES=NMR SPECTRUM
##END=
