##TITLE=1H_TG-2340-D3
 CDCl3
 8 sc, 
 18.08.2022
##JCAMPDX= 6.0         $$ Bruker NMR JCAMP-DX V2.0
##DATA TYPE= NMR SPECTRUM
##DATA CLASS= NTUPLES
##ORIGIN= UXNMR, Bruker Analytische Messtechnik GmbH
##OWNER= root
$$ XWIN-NMR		Version 3.5
$$ Thu Aug 18 10:00:27 2022 Russian Standard Time (UT+4h)  she@DPX200
##.OBSERVE FREQUENCY= 200.1313499994
##.OBSERVE NUCLEUS= ^1H
##.ACQUISITION MODE= SIMULTANEOUS
##.ACQUISITION SCHEME= undefined
##.AVERAGES= 8
##.DIGITISER RES= 18
##SPECTROMETER/DATA SYSTEM= spect
##.PULSE SEQUENCE= zg30
##.SOLVENT NAME= CDCl3
##.SHIFT REFERENCE= (INTERNAL, CDCl3, 0, 15.7315)
##AUDIT TRAIL= $$ (NUMBER, WHEN, WHO, WHERE, WHAT)
$$ ##TITLE= Audit trail, XWIN-NMR		Version 3.5
$$ ##JCAMPDX= 5.01
$$ ##ORIGIN= Bruker BioSpin GmbH
$$ ##OWNER= she
$$ F:/spectra/data/she/nmr/H-F/1/pdata/1/auditp.txt
$$ ##AUDIT TRAIL=  $$ (NUMBER, WHEN, WHO, WHERE, WHAT)
(   1,<2022-08-18 09:59:17.98 +0400>,<she>,<DPX200>,
      <created by zg, POWCHK disabled, PULCHK disabled
       configuration hash MD5:
       00 E9 B6 7A A2 85 ED C7 34 08 36 98 17 FE 4E 26
       data hash MD5: 16K
       93 10 84 53 78 39 F8 C6 F9 4A E1 7B B2 DC EC FE>)
(   2,<2022-08-18 09:59:20.23 +0400>,<she>,<DPX200>,
      <Start of raw data processing
       efp BC_mod = 2 LB = 0.24 FT_mod = 6 PKNL = 1 PHC0 = -18040 PHC1 = 13.20068 SI = 16K 
       data hash MD5: 16K
       20 7E 5B 4D 80 A5 87 C8 14 7A A5 F8 37 32 14 D5>)
(   3,<2022-08-18 09:59:38.82 +0400>,<she>,<DPX200>,
      <pk PHC0 = 4.153562 PHC1 = -6.4 
       data hash MD5: 16K
       1E 78 EC 35 AF 99 8B C1 05 A0 20 68 EA CC 02 2C>)
(   4,<2022-08-18 09:59:41.79 +0400>,<she>,<DPX200>,
      <abs ABSG = 5 
       data hash MD5: 16K
       1C 61 D0 BA E6 5B D9 E1 B2 80 38 34 17 4D C1 44>)
$$ ##END=
$$ 
$$ hash MD5
$$ 49 D3 2F DD 76 9D 17 43 35 3F D8 6B 4B D6 18 55
##$RELAX= 
##$RELAX= 
##$RELAX= 
##$RELAX= 
##$RELAX= 
##$RELAX= 
$$ Bruker specific parameters
$$ --------------------------
##$DU= <F:/spectra>
##$EXPNO= 1
##$NAME= <H-F>
##$PROCNO= 1
##$TYPE= <nmr>
##$USER= <she>
##$AMP= (0..31)
100 100 100 100 100 100 100 100 100 100 100 100 100 100 100 100 100 100 
100 100 100 100 100 100 100 100 100 100 100 100 100 100 
##$AQSEQ= 0
##$AQ_mod= 1
##$AUNM= <au_zg>
##$AUTOPOS= <>
##$BF1= 200.13
##$BF2= 200.13
##$BF3= 200.13
##$BF4= 200.13
##$BF5= 200.13
##$BF6= 200.13
##$BF7= 200.13
##$BF8= 200.13
##$BYTORDA= 1
##$CFDGTYP= 0
##$CFRGTYP= 5
##$CHEMSTR= <none>
##$CNST= (0..31)
1 1 145 1 1 1 1 1 1 1 1 1 1 1 1 1 1 1 1 1 1 1 1 1 1 1 1 1 1 1 1 1 
##$CPDPRG= <>
##$CPDPRG1= <>
##$CPDPRG2= <>
##$CPDPRG3= <>
##$CPDPRG4= <mlev>
##$CPDPRG5= <mlev>
##$CPDPRG6= <mlev>
##$CPDPRG7= <mlev>
##$CPDPRG8= <mlev>
##$CPDPRGB= <>
##$CPDPRGT= <>
##$D= (0..31)
0 1.2 0 0 0 0 0 0 0 0.06 0 0.03 0 0 0 0 0.0002 0 0 0 0 0 0 0 0 0 0 0 0 
0 0 0 
##$DATE= 1660802357
##$DBL= (0..7)
120 120 120 120 120 120 120 120 
##$DBP= (0..7)
150 150 150 150 150 150 150 150 
##$DBP07= 0
##$DBPNAM0= <>
##$DBPNAM1= <>
##$DBPNAM2= <>
##$DBPNAM3= <>
##$DBPNAM4= <>
$$ [...]
##$SUBNAM2= <"">
##$SUBNAM3= <"">
##$SUBNAM4= <"">
##$SUBNAM5= <"">
##$SUBNAM6= <"">
##$SUBNAM7= <"">
##$SUBNAM8= <"">
##$SUBNAM9= <"">
##$SW= 18.0517283424941
##$SWIBOX= (0..15)
0 0 2 0 0 0 0 0 0 0 0 0 0 0 0 0 
##$SW_h= 3612.71676300578
##$TD= 16384
##$TD0= 1
##$TE= 0
##$TE2= 300
##$TE3= 300
##$TEG= 300
##$TL= (0..7)
0 120 120 120 120 120 120 120 
##$TP= (0..7)
150 150 150 150 150 150 150 150 
##$TP07= 0
##$TPNAME0= <>
##$TPNAME1= <>
##$TPNAME2= <>
##$TPNAME3= <>
##$TPNAME4= <>
##$TPNAME5= <>
##$TPNAME6= <>
##$TPNAME7= <>
##$TPOAL= (0..7)
0.5 0.5 0.5 0.5 0.5 0.5 0.5 0.5 
##$TPOFFS= (0..7)
0 0 0 0 0 0 0 0 
##$TUNHIN= 0
##$TUNHOUT= 0
##$TUNXOUT= 0
##$USERA1= <user>
##$USERA2= <user>
##$USERA3= <user>
##$USERA4= <user>
##$USERA5= <user>
##$V9= 5
##$VALIST= <valist>
##$VCLIST= <CCCCCCCCCCCCCCC>
##$VD= 0
##$VDLIST= <DDDDDDDDDDDDDDD>
##$VPLIST= <PPPPPPPPPPPPPPP>
##$VTLIST= <TTTTTTTTTTTTTTT>
##$WBST= 1024
##$WBSW= 4
##$XGAIN= (0..3)
0 0 0 0 
##$XL= 0
##$YL= 0
##$YMAX_a= 233543
##$YMIN_a= -363462
##$ZGOPTNS= <>
##$ZL1= 120
##$ZL2= 120
##$ZL3= 120
##$ZL4= 120
##$ABSF1= 15.77553
##$ABSF2= -2.27632
##$ABSG= 5
##$ABSL= 3
##$ALPHA= 0
##$AQORDER= 0
##$ASSFAC= 0
##$ASSFACI= 0
##$ASSFACX= 0
##$ASSWID= 0
##$AUNMP= <proc_1d>
##$AZFE= 0.1
##$AZFW= 0.1
##$BCFW= 0
##$BC_mod= 2
##$BYTORDP= 0
##$COROFFS= 0
##$CY= -3
##$DATMOD= 1
##$DC= 0
##$DFILT= <>
##$DTYPP= 0
##$F1P= 0
##$F2P= 0
##$FCOR= 1
##$FTSIZE= 16384
##$FT_mod= 6
##$GAMMA= 0
##$GB= 0
##$INTBC= 1
##$INTSCL= 0
##$ISEN= 128
##$LB= 0.24
##$LEV0= 0
##$LPBIN= 0
##$MAXI= 10000
##$MC2= 0
##$MEAN= 0
##$ME_mod= 0
##$MI= 1.114404
##$NCOEF= 0
##$NC_proc= -5
##$NLEV= 6
##$NOISF1= 3.799351
##$NOISF2= 2.8
##$NSP= 0
##$NTH_PI= 0
##$NZP= 0
##$OFFSET= 15.73146
##$PC= 1
##$PHC0= -18035.85
##$PHC1= 6.80068
##$PH_mod= 1
##$PKNL= yes
##$PPARMOD= 0
##$PSCAL= 0
##$PSIGN= 0
##$REVERSE= no
##$SF= 200.130008019435
##$SI= 16384
##$SIGF1= 3
##$SIGF2= 2
##$SINO= 5.538805
##$SIOLD= 16384
##$SREGLST= <1H.CDCl3>
##$SSB= 0
##$STSI= 16384
##$STSR= 0
##$SW_p= 3612.71676300578
##$SYMM= 0
##$S_DEV= 0
##$TDeff= 16384
##$TDoff= 0
##$TI= <>
##$TILT= no
##$TM1= 0
##$TM2= 0
##$TOPLEV= 0
##$USERP1= <user>
##$USERP2= <user>
##$USERP3= <user>
##$USERP4= <user>
##$USERP5= <user>
##$WDW= 1
##$XDIM= 16384
##$YMAX_p= 272379562
##$YMIN_p= -169479
$$ End of Bruker specific parameters
$$ ---------------------------------
##NTUPLES= NMR SPECTRUM
##VAR_NAME=  FREQUENCY,     SPECTRUM/REAL,   SPECTRUM/IMAG
##SYMBOL=    X,             R,               I
##VAR_TYPE=  INDEPENDENT,   DEPENDENT,       DEPENDENT
##VAR_FORM=  AFFN,          ASDF,            ASDF
##VAR_DIM=   16384,         16384,           16384
##UNITS=     HZ,            ARBITRARY UNITS, ARBITRARY UNITS
##FACTOR=    0.220516191357247, 1,           1
##FIRST=     3148.33713943066, 0,            0
##LAST=      -464.379623575123, 0,           0
##MIN=       -464.379623575123, -169479,     0
##MAX=       3148.33713943066, 272379562,    0
$$ Real data points
##PAGE= N=1
##DATA TABLE= (X++(R..R)), XYDATA
$$ [...]
7266C59225K8362L0221m4742k3923n546P10J3028K8136J6196l2883K588J1721
7254C83093m4199J3190m700j1407K737P8043J8139q430l9988M4766J7456q088
7242D40612N0119k3176j7590j3105L2227n245M4735l9825M2990L6810l452K6157
7230E71257o5090K9803O3072L4700L2891J1928o632j918L1526k058j995k3287
7218F74197N107K9918k4653J9982K5542l1142o059M242M6525k8245N4665R970
7206G80049k7558K830L9508L538R341P66P028K9854J7530J9260P7739J21O6337
7193A026343N2339L5273R5594K7648K3616J1841Q7087J3139R99O8132J9831m304
7181A457538O7633Q9240N8857M0785M5720R0233O3534K5842L5425L2804P655M191
$$ y = [359225, 387587, 417808, 373066, 349143, 343597, 344307, 357335, 385471, 401667, 368784, 371372, 383093, 338894, 352084, 347384, 335977, 338714, 416757, 434896, 426466, 386478, 431244, 448700, 440612, 490731, 467555, 449965, 436860, 469087, 463842, 508577, 468752, 511742, 548552, 545100, 571257, 506167, 535970, 599042, 633742, 666633, 678561, 671929, 670011, 701537, 699479, 697484, 674197, 679304, 709222, 684569, 704551, 730093, 698951, 692892, 697134, 743659, 715414, 770079, 780049, 752491, 755321, 794829, 798367, 807708, 808474, 815502, 845356, 862886, 882146, 959885, 960006, 1026343, 1078682, 1113955, 1209549, 1237197, 1260813, 1272654, 1359741, 1372880, 1373879, 1442011, 1461842, 1457538, 1525171, 1614411, 1673268, 1714053, 1759773, 1850006, 1913540, 1939382, 1974807, 2007611, 2015266, 2019457]
7169B019457R2648J5529k2269K8545Q1174Q8336O5825N7254L8391L8249O5262
7158B568401P0041P1071O3253O4223R1991J03634J06712R2293R4584J39401J18212
7147C583816J47213J46252J76040K07722K02676J89883J74412K58013K58413K55887
7137E600327L48215L17568L12237L54963L49488L47495L32727K77690L78655N57173
7127I176538O04626O87635Q88785J082147J300493J521996J736571J992660K491173
7118B1482624L142756M052774N336994O840272Q158569Q285568O419836K044618
7110F5764011k697038o874475q875461q506422p152269n462498m101445k955568
7102A9138835k317117j748082j291943j020907q42908p28097o62385n74768n57157
$$ y = [2019457, 2112105, 2127634, 2105365, 2133910, 2215084, 2303420, 2369245, 2426499, 2464890, 2503139, 2568401, 2638442, 2709513, 2772766, 2836989, 2928980, 3032614, 3139326, 3231619, 3326203, 3465604, 3583816, 3731029, 3877281, 4053321, 4261043, 4463719, 4653602, 4828014, 5086027, 5344440, 5600327, 5948542, 6266110, 6578347, 6933310, 7282798, 7630293, 7963020, 8240710, 8619365, 9176538, 9781164, 10468799, 11357584, 12439731, 13740224, 15262220, 16998791, 18991451, 21482624, 24625380, 28678154, 34015148, 40855420, 49013989, 57299557, 63719393, 65764011, 63066973, 56192498, 47317037, 38810615, 31658346, 26195848, 22094403, 19138835, 16821718, 15073636, 13781693, 12760786, 11917878, 11189781, 10527396, 9952628, 9395471]
7093I395471m52662l99058m24180l53736k10648j97677j47924q3834q1641j01885
7083F942226l0571n0000k4047j6863N076O0048N8886J76094K00367L06595L56047
7072G983858M93860O02049O90579R40909J080658J222852J308059J465664J724550
7063A7513038K103269K452579K485829J973605R83732l76870j694279k463031
7055B2977872k793343k773183k465816k205272j761290j312092j129906r08719
7047G628251p04717n38063m90038l57938l52243m02268l03323k46173k99217k97080
7037C637191j93718j28524j25195j47332j87101j16704p1726j15987p9269m6445
7027B425190o9918p2563o4027r3742j26195o3313n7379m1984j6672l8860k4855
$$ y = [9395471, 8942809, 8543751, 8119571, 7765835, 7555187, 7357510, 7209586, 7125752, 7044111, 6942226, 6911655, 6861655, 6837608, 6820745, 6825821, 6885869, 6944755, 7120849, 7321216, 7627811, 7983858, 8477718, 9079767, 9770346, 10711255, 11791913, 13014765, 14322824, 15788488, 17513038, 19616307, 22068886, 24554715, 26528320, 27512052, 27135182, 25440903, 22977872, 20184529, 17411346, 14945530, 12740258, 10978968, 9666876, 8536970, 7628251, 6923534, 6385471, 5895433, 5537495, 5185252, 4782984, 4479661, 4233488, 3934271, 3637191, 3443473, 3314949, 3189754, 3042422, 2855321, 2738617, 2666891, 2550904, 2471635, 2425190, 2355272, 2282709, 2218682, 2124940, 1998745, 1935432, 1878053, 1836069, 1819397, 1780537, 1755682]
7016A755682r4387r7062p098M3382K2928J859q8991l3863L3196k5750j15139k8503
7004A366254l9748o3805J3398o3759p5598j8545K394M5720K7140k043O1211M1780
6992A294399N8307O7961O7816J00674P8771j2049p5127q0080o5448j14886j05854
6981A214484o1531p6833p6493o0824k2079R038O994j6797n368O933j03897n5454
6969G58173k6636l8088k4940n3055k8480m467j4438q258n387k8634l203n1329
6957D71258p2516j3891O7629n1626r579K7869l7684K959o490j151n7557K6849
6945C46070l6728k8327M6138M9406m463m0280m3310j020N7912j0259N4643l1179
6933C58603R318j9998j3950L6087j03938j4488p944j6572O667L1951l6794p0821
$$ y = [1755682, 1661295, 1564233, 1557135, 1600517, 1623445, 1625304, 1536313, 1502450, 1535646, 1509896, 1394757, 1366254, 1326506, 1262701, 1276099, 1212340, 1136742, 1118197, 1120591, 1166311, 1193451, 1191408, 1252619, 1294399, 1352706, 1420667, 1488483, 1589157, 1667928, 1655879, 1580752, 1500672, 1435224, 1320338, 1214484, 1152953, 1076120, 999627, 938803, 916724, 925762, 932756, 915959, 910591, 917524, 813627, 758173, 731537, 693449, 668509, 615454, 586974, 582507, 568069, 559811, 554424, 525790, 522587, 471258, 398742, 384851, 452480, 400854, 391275, 419144, 381460, 384419, 377929, 376778, 319221, 346070, 309342, 281015, 327153, 376559, 372096, 331816, 288506, 287486, 345398, 335139, 389782, 358603, 367921, 347923, 333973, 370060, 266122, 251634, 243690, 227118, 233785, 265736, 228942, 158121]
6921A58121M1411K6959l8197J9671K7234J7134j3515o6110j9270l877k5179M4711
6909A69093l6480j5939M9274J2431N832j6667N8603m5383n6815k5352k8962J6344
6897H5979j0288l9365L4707M2977j667K559J1933K5714j9135k658M0424k2542
6885A48638l8781q56K5769L998L5510r197m3504K846p693J2155M4486R032k5003
6872A57400j6523K9922J2295m6488l2544o653K235J7579r891L872J1507L997k8558
6859I8150m2863o902L7665k1880k056M7017L805k3170j7061R920m8151K4234J7813
6846G6521M8777j7554o0058n510L2909M6067J96m953L5584j5041J2952K1701k3283
6833A48308L443l547m3320j4743o190j8927n183K1346K2537j7324k0263M913k1963
$$ y = [158121, 199532, 226491, 188294, 207965, 235199, 252333, 238818, 172708, 153438, 149561, 124382, 169093, 132613, 116674, 165948, 178379, 184211, 167544, 226147, 180764, 123949, 98597, 69635, 85979, 75691, 36326, 71033, 114010, 112343, 114902, 126835, 152549, 133414, 130756, 171180, 148638, 109857, 109001, 134770, 138768, 174278, 165081, 121577, 124423, 116730, 128885, 173371, 182403, 157400, 140877, 170799, 183094, 136606, 104062, 97409, 99644, 117223, 107332, 111204, 122711, 126708, 98150, 55287, 48385, 86050, 64170, 62114, 109131, 112936, 89766, 72705, 82625, 34474, 58708, 76521, 125298, 107744, 47686, 42176, 75085, 121152, 121348, 116395, 151979, 136938, 149890, 171591, 148308, 151751, 148204, 104884, 90141, 83951, 65024, 59841, 81187, 103724, 86400, 66137, 71050, 49087]
6820D9087O2796J3321o5656M557L5590j4610l6185p490K7815J6771l76L6253K3211
6807A45084k9018Q542N0547L114J2859Q888K4715k4148k5525J4527k6161o340
6795A57084O80o1976m860K6129p463j3131k6285p363J4755K2923J3437M353m1472
6782G6811j4758J7302K4042M398m0070Q9646o188j7432p535K0754k7346J3635
6770A33259M3092J7614k6945k3314K0470M5854L8702m5392n000l4073o3752R1211
6758A91726J9339L6685n3068k176L1056p1527L2278J4566J2708M2366p913l5961
6746B10079N990J950J341P24j9385j73k8214Q49N9680o409p254n8943N57J3781
6732A74573K887k222J2997l948q445J2449J0978J606n0685j5351L4969l2336m4090
$$ y = [49087, 111883, 125204, 59548, 64105, 99695, 85085, 48900, 41410, 69225, 85996, 85620, 121873, 145084, 116066, 124608, 175155, 178269, 191128, 200016, 224731, 200583, 175058, 189585, 163424, 157084, 157764, 95788, 90928, 117057, 109594, 96463, 70178, 62815, 77570, 100493, 113930, 118283, 76811, 62053, 79355, 103397, 107795, 67725, 157371, 151183, 133751, 126216, 146970, 119624, 133259, 176351, 193965, 167020, 143706, 164176, 210030, 248732, 203340, 198340, 164267, 100515, 191726, 211065, 247750, 194682, 192506, 223562, 152035, 184313, 198879, 211587, 253953, 246040, 210079, 216069, 218019, 219360, 220084, 200699, 200526, 172312, 173161, 232841, 226432, 219178, 160235, 160792, 174573, 177460, 175238, 188235, 184287, 175842, 188291, 199269, 200875, 150190, 134839, 169808, 137472, 93382]
6719I3382Q1555N6546Q0217N831L156N9883P1851O9184k0267J6024M975r6553
6707D25784o4317j5225o652J0726j15328l3831o811k2441K8657k1826l5712K6779
6695A69803m9992m0724j2051N4927n252M0582J8118j5328j8670J7237k0199J9480
6683A57931J5561j8572j486J961m8240m790M7385j4170M2007M935k6934k1386
6671A34202K5563K2723j2254m5166K6134L2052J7629J6349n0621q096K7869M3265
6659B29649Q2394j8558q7038J0011n2571L8018q903j2360L1704k4002k7242k9527
6647A31575N855l5659M997P923N2276J9345l8776j841K1590K6669l7878j9920
6635A36156L5288m959l0387l2623o872K181J9983J6743K0123J0513l9004j7583
$$ y = [93382, 174937, 231483, 311700, 317531, 320687, 380570, 452421, 521605, 501338, 517362, 522337, 425784, 361467, 346242, 339590, 350316, 234988, 201157, 194346, 171905, 200562, 178736, 143024, 169803, 119811, 79087, 67036, 121963, 116711, 157293, 175411, 160083, 141413, 158650, 138451, 157931, 173492, 154920, 153434, 155395, 107155, 102365, 149750, 135580, 177587, 182522, 155588, 134202, 159765, 182488, 170234, 125068, 151202, 183254, 200883, 217232, 166611, 158515, 186384, 229649, 312043, 293485, 206447, 216458, 163887, 201905, 193002, 180642, 212346, 188344, 161102, 131575, 137430, 101771, 106768, 114691, 166967, 186312, 147536, 145695, 167285, 193954, 156076, 136156, 171444, 166485, 136098, 103475, 96603, 98784, 118767, 135510, 155633, 166146, 127142, 109559]
6623A09559p454K1j4837M0363k2984j9876O1682k2695m6943j8621L1453J7795
6611A07463K0334m1988K2982l4083K620k693k399P6319n980k6385r1646j8855
6599E689P3716J8122l9310k0385N6389l4369J5457k9779J5176J3543M4517J2865
6587A31631J9495m0183j9912K8841L9591j6988o3104l8135O4001j6417k4564l0211
6575C4045j2646J6264l7618K2644K7553J1443J5081N113k4051K4437O739J3228
6563A02232j0012k3790J5509j8224k8768K202Q609j155k0273M2182M6720j9061
6551I6171j2449j4504J1439K8182J009j030m6705k707J0554L6529l5441l8197
6539C2851L7886o518R057J4817l6371q95M2374N5878r2867k3795J5539j6566K0549
$$ y = [109559, 102105, 102126, 87289, 127652, 104668, 84792, 146474, 123779, 76836, 58215, 89668, 107463, 127797, 85809, 108791, 74708, 77328, 74635, 72236, 148555, 142575, 116190, 24544, 5689, 79405, 97527, 58217, 37832, 94221, 59852, 75309, 45530, 60706, 74249, 118766, 131631, 151126, 110943, 91031, 119872, 159463, 142475, 79371, 41236, 105237, 88820, 64256, 34045, 21399, 37663, 45, 22689, 50242, 61685, 76766, 81879, 57828, 82265, 89004, 102232, 92220, 68430, 83939, 65715, 36947, 39149, 47758, 46603, 26330, 68512, 115232, 96171, 83722, 69218, 80657, 108839, 109848, 108818, 62113, 59406, 69960, 106489, 71048, 32851, 70737, 64219, 73276, 88093, 51722, 50827, 93201, 149079, 56212, 32417, 47956, 31390, 51939]
6526E1939l5910j3725P4464j250K9027q1956J201m491J5576N4737o646m5262K1173
6513E8877o33l6069L5570N3231l1501J6524K7509k3574l029m1589L4905L2337
6501A22558j1424l5726j6056O4977K6033M034r700k7279M8952j0431j8806k49
6489A36883j5505n464j550N9350q534q3705K4109K0375P395k0070n513Q139K4199
6476A40109j4173l0536R311L5911j5971L0651m2738r516K6980n265l3557k2508
6464F8698P6830M208J9953p8264J068J3192j6316J1099L0593R552n1619J5107
6452A04101K2697J2813q16M0993J3551j9482J4072J7730j4k4523L3743q728k9620
6439A76517M5508P86n7859J527N907k8831N0243L1249j734M4586k7109J3686K2687
$$ y = [51939, 16029, 2304, 76768, 75518, 104545, 22589, 23790, 19299, 34875, 89612, 82966, 37704, 58877, 58244, 22175, 57745, 110976, 79475, 95999, 123508, 99934, 96905, 55316, 90221, 122558, 111134, 75408, 59352, 124329, 150362, 154396, 144696, 117417, 166369, 155938, 137132, 136883, 121378, 115914, 114364, 173714, 165180, 81475, 105584, 125959, 133354, 113284, 107771, 115910, 140109, 125936, 95400, 104711, 140622, 124651, 155302, 112564, 103048, 130028, 124763, 91206, 68698, 145528, 149736, 169689, 91425, 92493, 105685, 89369, 100468, 131061, 140613, 88994, 104101, 126798, 139611, 138795, 179788, 193339, 173857, 187929, 205659, 205645, 181122, 214865, 206137, 176517, 222025, 222811, 164952, 166479, 172386, 143555, 193798, 225047, 223313, 267899, 240790, 254476, 277163]
6426B77163N944m268K0233J8912n0244n9121j688M9457q247k4037j9310L545j5433
6413A92906j8892j3726J2249K2617J9227J9639j2682k5520M4917L5970k6923R958
6401B59740j3778l4947M1601M330J4119M4058j228m6490P6487O5276k6220Q135
6389C91083L4173p9076l5888O472k7442n2364J348J5376L4721m1828n5053k1921
6377A69601N048k203J7059m089K4549M2788o1598k5759L6569J5826j4602k1714
6365A81475N278L4781K3761O639r932k8509N4926N5811n0421L2410l3028j8629
6353B54562L6490p930K6715j6391j4876K5889L325j8537K3413L4446K3558J1146
6341C81810o3834J3636O5153m218l6159j8190k5358k2191j037n1442K4471K7864
$$ y = [277163, 283107, 278839, 299072, 317984, 267740, 208619, 206931, 256388, 248141, 224104, 204794, 208339, 192906, 174014, 160288, 172537, 195154, 214381, 234020, 221338, 195818, 240735, 276705, 249782, 259740, 245962, 211015, 252616, 256946, 271065, 315123, 313895, 267405, 343892, 409168, 382948, 391083, 425256, 346180, 310292, 316764, 289322, 236958, 238306, 253682, 288403, 246575, 191522, 169601, 174649, 172446, 189505, 185416, 209965, 252753, 191155, 165396, 201965, 217791, 203189, 181475, 186753, 221534, 245295, 251934, 242002, 213493, 268419, 324230, 273809, 306219, 273191, 254562, 291052, 283122, 309837, 293446, 278570, 304459, 307784, 289247, 312660, 347106, 370664, 381810, 317976, 331612, 396765, 392547, 356388, 338198, 312840, 290649, 289612, 238170, 262641, 290505]
6329B90505k9102K4718l6262k4903L6989L1957M4975l5252Q137M3176l6778k4324
6317B93836j4083L4854N4095k6439J5746k475n6495K1971J5837K3040k276Q505
6305C66116j5780r407q212K9597k9216R255J3128M646N484l5825O437m7074j0940
6292B78209K8296L1360N157l9805M0291o27L2932K7633N8543q971k8724k5461
6280C98833k099l199M0024M6788L6304J1767k2087l0321k7721K3862p938j9721
6268D44492L0239k0426N6067j7508j0699j5818j3795J4503J9715K2250j6390k0026
6256D72604Q7688K9964K9071N7638K3596J28808M9895P0766L147r0643p9378o4469
6244G18687j5409r8110r1744J2324N736L7302n0978K5704l3314J4447K657K3622
$$ y = [290505, 261403, 286121, 249859, 224956, 261945, 293902, 338877, 303625, 311762, 354938, 318160, 293836, 279753, 314607, 368702, 342263, 358009, 355534, 299039, 321010, 336847, 359887, 357611, 366116, 350336, 340929, 332717, 362314, 333098, 342353, 355481, 360127, 365611, 329786, 336223, 289149, 278209, 306505, 337865, 343022, 303217, 343508, 342881, 375813, 403446, 461989, 453018, 424294, 398833, 396734, 393535, 433559, 480347, 516651, 528418, 506331, 476010, 448289, 472151, 464213, 444492, 474731, 454305, 510372, 492864, 482165, 466347, 452552, 467055, 486770, 509020, 492630, 472604, 560292, 590256, 619327, 676965, 700561, 829369, 879264, 950030, 953177, 862534, 783156, 718687, 703278, 605168, 513424, 525748, 531484, 568786, 517808, 543512, 510198, 524645, 527302, 550924]
6232E50924j2813o2886J6024N7143j3390L9781j073M01j3374m4366j9290R152
6220E06233J2603k0978k9374L8101j5707k2290K6160P550K2119n918l091n893
6208E09515j2010k7330k6070N0612O008K0978M7961J0515m5724j175O3973j6345
6196E80908l490K2917k6328L6462J0851K2279O199j7380J2403J3562N028J7684
6184F81095j7053j3082K0541k3228J1142P13m767J0057N2672l4014J3580L5847
6172G33503l5195R083J1198M5136Q2454j566R852q975l0835M6946N0236J240r733
6159I03344M82l1237L6259L6148k2447L9864J2028P200k0448J8486N9939K1319
6147A060937M0682p67k0264P5919M3293L8375P6348L1235K6372J7936n5298J000
$$ y = [550924, 538111, 475225, 491249, 548392, 535002, 574783, 573710, 574111, 560737, 516371, 497081, 506233, 518836, 497858, 468484, 506585, 490878, 468588, 494748, 502298, 524417, 518499, 515408, 509515, 497505, 470175, 444105, 494717, 500725, 521703, 569664, 580179, 534455, 533280, 597253, 580908, 577418, 600335, 574007, 610469, 621320, 643599, 649798, 632418, 644821, 658383, 663411, 681095, 664042, 650960, 671501, 648273, 659415, 660128, 655361, 665418, 718090, 684076, 697656, 733503, 698308, 707391, 718589, 763725, 846179, 844613, 854465, 845490, 814655, 861601, 911837, 913077, 903344, 903826, 872589, 908848, 944996, 922549, 962413, 974441, 981641, 961193, 979679, 1039618, 1060937, 1101619, 1100852, 1080588, 1156507, 1199800, 1238175, 1314523, 1345758, 1372130, 1390066, 1334768, 1335768]
6135A335768L7913q543n813J5970J4756Q097R594K8654L7681L1941L8586M6996
6123A591600R6723N0587q330N2550K284P9214K1538J8615M3317O4891O1209M7139
6111B121337Q1594n494K5304L3671M9287M9630O3096O9244J32510P1390J54280
6100B845849Q8418M3282J48197J00893J38865J91721J58058J41368J94570J58012
6090D209233K29495K54081L15241L50774M14827M22756M72833O48333P68660R18253
6080I004486J208711J526898J925550K208507K088289J224721k90425j449432
6072A7447305j731454j398825r06371l48413J74239O49347J167899J647101J760758
6063A8461586J033750l60433j688760k299384k227081j743680j316155r90345
$$ y = [1335768, 1373681, 1365138, 1359325, 1375295, 1390051, 1398148, 1407742, 1436396, 1474077, 1506018, 1544604, 1591600, 1688323, 1738910, 1730580, 1783130, 1785414, 1864628, 1886166, 1904781, 1948098, 2012989, 2074198, 2121337, 2202931, 2197437, 2222741, 2256412, 2305699, 2355329, 2418425, 2487669, 2620179, 2691569, 2845849, 2934267, 2977549, 3125746, 3226639, 3365504, 3557225, 3715283, 3856651, 4051221, 4209233, 4438728, 4692809, 5008050, 5358824, 5773651, 6196407, 6669240, 7317573, 8086233, 9004486, 10213197, 11740095, 13665645, 15874152, 17962441, 19187162, 18896737, 17447305, 15715851, 14317026, 13410655, 13062242, 13236481, 13885828, 15053727, 16700828, 18461586, 19495336, 19134903, 17446143, 15146759, 12919678, 11175998, 9859843, 8869498]
6055H869498p43445n10441m37384l50109k07142j89271r5916q4834k4191q383
6045F218382M2163j1675M8722N2855N7224J17132J23199J95060K53689L78615
6035G475366M44022M62811N97470O87531Q42527J030492J324382J708367K292839
6026A6865807K786193K940950K285905N84290j298734k304876k254878j567832
6018A8036825q54630j99856M82608J214811J892273K286172J988460L56342j627404
6009B3575601l048413l198035k752435k224088j675937j300431r93440q69590
6001G513232o24259m70082m58796l29788l04844k40811k07572k22484k01501j80347
5991D272748j58962j44250j48526j53306j39284j23188j11727q5631o4666j10866
$$ y = [8869498, 8126053, 7615612, 7178228, 6828119, 6620977, 6431706, 6335790, 6250956, 6226765, 6218382, 6260545, 6248870, 6297592, 6350447, 6407671, 6524803, 6648002, 6843062, 7096751, 7475366, 7919388, 8382199, 8979669, 9667200, 10509727, 11540219, 12864601, 14572968, 16865807, 19652000, 22592950, 24878855, 25463145, 24164411, 21859535, 19604657, 18036825, 17182195, 16982339, 17464947, 18679758, 20572031, 22858203, 24846663, 25203005, 23575601, 20527188, 17329153, 14576718, 12352630, 10676693, 9376262, 8382822, 7513232, 6888973, 6418891, 5960095, 5630307, 5325463, 5084652, 4877080, 4654596, 4453095, 4272748, 4113786, 3969536, 3821010, 3667704, 3528420, 3405232, 3293505, 3207874, 3143208, 3032342]
5981C032342l8909m8671o9986r3132j13213m2638n0767m2326j7130n9603m1723
5970B414244m1460O894m6765o182n3654p9362m510j9087l9996l7302j5639j1406
5958B065775j7919l8317l8465l1577J47k3952M6143L567k8435M2492k4386o4407
5946A890666K4928L5142K4800R611L2631k4463J0074O1714L6005j6445j9105M1565
5934B107123K1327m3541m8059P6951K8711Q123P009j4137m2851N7303K3292j3528
5922B167723L2354K2035P3167k2277K3355K8546k5622J5018K6510j2722k0175
5911B307912j9062Q3856Q5697K5350J7159K0594O0234L5931Q3007M7970O1397
5900B810045O4559Q7932O5594R2529J32421J04074J72225J66521J94171J12308
$$ y = [3032342, 2993433, 2944762, 2874776, 2781644, 2668431, 2625793, 2575026, 2532700, 2515570, 2455967, 2414244, 2372784, 2379678, 2332913, 2326731, 2273077, 2193715, 2189205, 2170118, 2130122, 2092820, 2077181, 2065775, 2047856, 2009539, 1971074, 1939497, 1939644, 1915692, 1961835, 1965402, 1936967, 1979459, 1955073, 1890666, 1915594, 1950736, 1975536, 1985147, 2017778, 1993315, 2003389, 2065103, 2101108, 2084663, 2065558, 2107123, 2128450, 2084909, 2036850, 2113801, 2142512, 2150635, 2157644, 2143507, 2100656, 2157959, 2181251, 2167723, 2200077, 2222112, 2295279, 2273002, 2296357, 2324903, 2299281, 2314299, 2340809, 2328087, 2307912, 2288850, 2372706, 2458403, 2483753, 2500912, 2521506, 2581740, 2617671, 2700678, 2748648, 2810045, 2874604, 2962536, 3028130, 3120659, 3253080, 3357154, 3529379, 3695900, 3890071, 4002379]
5890D002379K7125k735k2271J9339P4557n916M867J022M3264O0596P0244J44580
5878D417051P8721J24761N0465J00340J11374J34968J02509J46610J65067J87143
5868E619009J90802J80679K12373K07094K98167L07394L64403M43448M34190L89738
5858H647297K58453J01314l3938l4398M7007M1560R4813R0009Q1434J64511K74994
5847I733056L17203L69820L63358M44352M52202N36810N20438N89914O01999P72082
5837A4701234Q33356Q39708J018923J214561J488801J664878J928861K247590
5829B5937912K565663K805541K831131K527817K102600J690172J284623Q52725
5821D2598184L14441l22931p40840j139352j461542j675363j883719j977425k191090
$$ y = [4002379, 4029504, 4026769, 4004498, 4023837, 4098394, 4092478, 4097345, 4098367, 4141631, 4202227, 4272471, 4417051, 4495772, 4620533, 4670998, 4771338, 4882712, 5017680, 5120189, 5266799, 5431866, 5619009, 5809811, 5990490, 6202863, 6409957, 6708124, 7015518, 7379921, 7823369, 8257559, 8647297, 8905750, 9007064, 8973126, 8938728, 8985735, 9027295, 9122108, 9212117, 9293551, 9458062, 9733056, 10050259, 10420079, 10783437, 11227789, 11679991, 12216801, 12737239, 13327153, 13929152, 14701234, 15534590, 16374298, 17393221, 18607782, 20096583, 21761461, 23690322, 25937912, 28503575, 31309116, 34140247, 36668064, 38770664, 40460836, 41745459, 42598184, 42912625, 42589694, 41848854, 40709502, 39247960, 37572597, 35688878, 33711453, 31520363]
5812C1520363k176215k103217j988087j828532j542275j273123j091321r84681
5804A8532912q83114p87565p40874p39962p29848o42543n24355m31558m38234
5795A2614859l90398l18004l48836l99006l27529k84881j22167j41831n2459N7988
5785A0287736L2242N5528P9712J05554k6524j65958k35518m06800l90668l38391
5775H996913k48621k41956k86269j40093j27961j11577l574J3406K3829L2184
5765G906281J50686J41171K57854K95100L63654M49979N29882O34028Q11960R91548
5755A2532143J267462J686461K174239K516351K494152J688365j16546j736094
5747B2506533k501908k460429k113652j608115j146436q62786o22386m62695k45222
$$ y = [31520363, 29344148, 27240931, 25252844, 23424312, 21882037, 20608914, 19517593, 18532912, 17649798, 16862233, 16121359, 15381397, 14651549, 14009006, 13484651, 13053093, 12614859, 12224461, 11906457, 11557621, 11158615, 10831086, 10546205, 10424038, 10282207, 10229748, 10287736, 10319978, 10375506, 10455218, 10560772, 10534248, 10368290, 10132772, 9725972, 9335304, 8996913, 8748292, 8506336, 8220067, 8079974, 7952013, 7840436, 7836862, 7850268, 7874097, 7906281, 8056967, 8198138, 8455992, 8751092, 9114746, 9564725, 10094607, 10728635, 11540595, 12532143, 13799605, 15486066, 17660305, 20176656, 22670808, 24359173, 24242627, 22506533, 20004625, 17544196, 15430544, 13822429, 12675993, 11813207, 11190821, 10728126, 10482904]
5738A0482904j60730j3083O1460K12874L33705M24109N16576O47829Q61693J083315
5728A4450652J419356J968838K370534K730286K476804J116871q24027k340446
5720B3368868k731403k540855k070730j667853j174863q00536n46329m38274k92708
5711A1105317r8421O5908R2517K85474K99317L95911N30340P92539J008706J358623
5701A5836231J659168J925066J615167O09620p10811j619805j838381j690318
5693A5785937j285019r75614o98960n47360l13249k25926j34347k0944L3757J41109
5683A1759384K09032K52893L18689L70140N49701O30446R38078J149236J586223
5674A7763822J959357J948838J361545j4622j423960k132317k194538j904421
$$ y = [10482904, 10322174, 10309091, 10370551, 10583425, 10917130, 11341239, 11857815, 12505644, 13367337, 14450652, 15870008, 17838846, 20209380, 22939666, 25416470, 26533341, 25709314, 23368868, 20637465, 18096610, 16025880, 14358027, 13183164, 12382628, 11836299, 11398025, 11105317, 11006896, 11072804, 11165321, 11450795, 11750112, 12146023, 12676363, 13468902, 14477608, 15836231, 17495399, 19420465, 21035632, 21645252, 20934441, 19314636, 17476255, 15785937, 14500918, 13525304, 12826344, 12278984, 11965735, 11739809, 11605462, 11584518, 11618275, 11759384, 11968416, 12221309, 12539998, 12910138, 13459839, 14090285, 15028363, 16177599, 17763822, 19723179, 21672017, 23033562, 23018940, 21594980, 19462663, 17268125, 15363704]
5666A5363704j567825j169256q66674o70777n68074m50239l84055l32893k57806
5657I096105k65783k05192j95309j91786k12304j86676j99737j62171j74728p7558
5647G224861j67063j67851j58465r0743p9662q1944r0261r8488r6330r5181r1531
5636F007342q8005j04305j27316j60341j07099r9822q7719j12174r2704q0498
5626D947359o9014q0510j31750j46953j20761j24300q5800j02697j40303q9854
5616C855417j43664l2145q8389l7800j24416r8007o9392m6375p6809m5758l6651
5605C056011o6708l9253o1519j733J8681j2649l4497n2374k8344k4572l2080m3731
5593B677232r3229o269J2023j02912k2556j5225r7458q5732j9497J7541k9072
$$ y = [15363704, 13795879, 12626623, 11759949, 11089172, 10521098, 10070859, 9686804, 9353911, 9096105, 8830322, 8625130, 8429821, 8238035, 8025731, 7839055, 7639318, 7477147, 7302419, 7224861, 7057798, 6889947, 6731482, 6640739, 6561077, 6479133, 6388872, 6290384, 6194054, 6098873, 6007342, 5919337, 5815032, 5687716, 5527375, 5420276, 5320454, 5232735, 5120561, 5027857, 4947359, 4878345, 4797835, 4666085, 4519132, 4398371, 4274071, 4188271, 4085574, 3945271, 3855417, 3711753, 3679608, 3591219, 3553419, 3429003, 3330996, 3261604, 3215229, 3138420, 3092662, 3056011, 2989303, 2950050, 2888531, 2886798, 2905479, 2892830, 2858333, 2805959, 2777615, 2753043, 2720963, 2677232, 2584003, 2577734, 2589757, 2486845, 2464289, 2449064, 2351606, 2265874, 2246377, 2263918, 2234846]
5582B234846p3085j4456j6162p6l0419l1177j4090l2495n9248K1748k501j8205
5570A964680m2723j1061o1003l8289M8267m6377o0019p129K1669j1312l4556o0782
5558A661365J6364n155l7388j4770K855l7837l9221l3286M9854j9938p8125k4023
5546A440695K8282K0742k7860n3653j6713j5797O137j0320K4970l2946k7689k6974
5534A308874J5730k4632m5308j3794L5526P778n0498l8933J6305q036r266k5447
5522A168299n885J6339l4385K1416k3891J8142p2581l6832p40O5544k8537j378
5510A085511R904j6595M6972j6374o5098J4271M1893M0277n5306m17J7820j8369
5498A084489J4658O921K0810m8558q8979K5767O5513n7748O71p709n227o020l5088
$$ y = [2234846, 2161761, 2147305, 2131143, 2131067, 2100648, 2069471, 2055381, 2022886, 1963638, 1985386, 1982885, 1964680, 1921957, 1910896, 1849893, 1811604, 1859871, 1813494, 1753475, 1746346, 1768015, 1756703, 1722147, 1661365, 1677729, 1672574, 1635186, 1620416, 1623271, 1585434, 1546213, 1512927, 1562781, 1542843, 1464718, 1440695, 1468977, 1489719, 1461859, 1408206, 1391493, 1375696, 1381833, 1371513, 1396483, 1363537, 1335848, 1308874, 1324604, 1299972, 1254664, 1240870, 1276396, 1284174, 1233676, 1194743, 1211048, 1203012, 1193746, 1168299, 1162414, 1178753, 1144368, 1165784, 1141893, 1160035, 1087454, 1050622, 1049882, 1115426, 1086889, 1085511, 1095415, 1078820, 1125792, 1109418, 1044320, 1058591, 1100484, 1140761, 1085455, 1085038, 1102858, 1084489, 1099147, 1106068, 1126878, 1078320, 989341, 1015108, 1080621, 1022873, 1023544, 1015835, 1010608, 1004588, 969500]
5485I69500j1958J3526j0981k6765O6552K0626K8622k47k9166N4130K0802L8471
5473A133112n6287l1753N0326j1326k1281L1814j4440L1050m1264J7942N0814
5462A138707m4945O796m334o8832L4038Q9432M6127k3856O9929L3307k472N1028
5450A324925O3912p038p743J7322l4433K9992O8944l7086L5751J5656l0333j1244
5438A428625r016P6364L8854K2059N0370O3257L6570R1595Q0373Q6353L2694O3369
5426B061467R6402J21883J30397P6884J00477Q8513n955J8693P2735K6400M8286
5415B836182O0555K5557P1520J6946P6790M8538L5114O9041N3509n188N7940K9116
5403C375620O1426P2458M5473J07314J32433J44989O0078P5825P4566J5094P5981
$$ y = [969500, 957542, 971068, 960087, 933322, 999874, 1020500, 1049122, 1048875, 1019709, 1073839, 1094641, 1133112, 1076825, 1045072, 1095398, 1084072, 1062791, 1094605, 1080165, 1111215, 1069951, 1087893, 1138707, 1093762, 1100558, 1096224, 1027392, 1061430, 1150862, 1196989, 1173133, 1243062, 1276369, 1273897, 1324925, 1388837, 1381799, 1374056, 1391378, 1356945, 1386937, 1455881, 1418795, 1454546, 1470202, 1439869, 1428625, 1419609, 1495973, 1534827, 1556886, 1607256, 1670513, 1707083, 1798678, 1879051, 1965404, 1998098, 2061467, 2157869, 2279752, 2410149, 2487033, 2587510, 2676023, 2670068, 2688761, 2761496, 2787896, 2836182, 2896737, 2922294, 2993814, 3010760, 3087550, 3136088, 3171202, 3240243, 3293752, 3288564, 3346504, 3375620, 3437046, 3509504, 3554977, 3662291, 3794724, 3939713, 3999791, 4075616, 4150182, 4165276, 4241257]
5392D241257J15808J80156K10834K03631K06335J67436J01876J00809P8779J08859
5382E715780J07847K02588K41751L03422L54105N03065N81516O19941Q17280R25629
5372A0372924R97169R62010P78112M39013K66698K16316K08433J92606K09383
5363A4642664L19948L87612M27107N38540N32607L47967J43268m797n9088Q4177
5353A7360005K563J68864K63976K62253K37413J05940j48110m88519o67624q25948
5343A6270813q48988q91899q57787o63965n71217m93023l15926j85656j67020
5334A1275332l58716n95426p11000p36217p31346p12037o73023n71540m13514
5325E772513l15357k07964k69415k12788k03371j76665j55932j41044j26044o3347
$$ y = [4241257, 4357065, 4537221, 4748055, 4951686, 5158021, 5325457, 5427333, 5528142, 5606921, 5715780, 5823627, 6026215, 6267966, 6571388, 6925493, 7428558, 8010074, 8630015, 9447295, 10372924, 11370093, 12332103, 13110215, 13549228, 13815926, 14032242, 14240675, 14433281, 14642664, 14962612, 15350224, 15777331, 16315871, 16848478, 17196445, 17339713, 17334916, 17275828, 17360005, 17362568, 17531432, 17795408, 18057661, 18295074, 18401014, 18252904, 17764385, 17096761, 16270813, 15421825, 14529926, 13672139, 13008174, 12436957, 11943934, 11628008, 11442352, 11275332, 10916616, 10321190, 9610190, 8873973, 8142627, 7430590, 6757567, 6186027, 5772513, 5457156, 5249192, 4979777, 4766989, 4563618, 4386953, 4231021, 4089977, 3963933, 3900586]
5315C900586r2027j14508j06941j822l235j3341K0428j0240l6804j6268o7276
5304C458552j10475j15212j31505j9031j22979j27700j07182k6972r1174p7210
5294B529112m2297m9842k9208m0677J040K2938M14k3266L215j5018l8553q6684
5282B231174q2434j02239q8830p9803j32180p8377l5870m6911q7419q867n4143
5271A434101l5750j2302L7102n6974o1197l475N027o518p525l4262k1364n0134
5259A186729p1428k6429J4075M8898l0391k3960L2881J0685j0376j5865l0888
5248A083931J9455j1791j6160K0372j57J53j6816J6290N10L6146M1087k9079m4350
5235A099591m0858J4311k6880K6360K2267J3966J9844K2096j1359O649k9361m433
$$ y = [3900586, 3808559, 3694051, 3587110, 3585288, 3582053, 3568712, 3589140, 3578900, 3542096, 3525828, 3458552, 3348077, 3232865, 3101360, 3082329, 2959350, 2831650, 2724468, 2697496, 2606322, 2529112, 2486815, 2436973, 2407765, 2367088, 2368128, 2391066, 2391480, 2368214, 2371429, 2356411, 2317858, 2231174, 2148740, 2046501, 1957671, 1877868, 1745688, 1667311, 1631441, 1584530, 1497111, 1488244, 1434101, 1398351, 1386049, 1423151, 1366177, 1304980, 1301505, 1306532, 1300014, 1292489, 1258227, 1236863, 1186729, 1115301, 1088872, 1102947, 1151845, 1121454, 1097494, 1130375, 1141060, 1130684, 1114819, 1083931, 1103386, 1091595, 1075435, 1095807, 1095650, 1095803, 1078987, 1095277, 1095787, 1131933, 1173020, 1143941, 1099591, 1058733, 1073044, 1046164, 1072524, 1094791, 1108757, 1128601, 1150697, 1139338, 1145987, 1116626, 1112193]
5223A112193l837K3646N3787o867J3148M567M559M2688J059O937M4316L5484q545
5210A323135J4825O1560N287L051K5195O7700J7784J1988J6852L3004N8977Q5942
5198A725300k2433R518J4576L1713L2297J6390L8530M7404R1603M73M4050O1321
5186B090742N1225R2533Q7817M1982Q5320J09279Q4367N5609J03802J07637J05073
5175C015386O2115J30203J54482J63042J87959J43068J92708K46699K89690K59798
5165D845150L72560M67812N67263P10115P97798P46920L86545m4056j87954j72855
5155H489298l0785K39299M44691N80094Q50834J182518J354909J333304P49942
5146A5194104j64137n58866l44353j7979K54844N00854L84953Q7521K13361M74892
$$ y = [1112193, 1108356, 1132002, 1185789, 1178922, 1192070, 1196637, 1201196, 1243884, 1244943, 1251880, 1296196, 1331680, 1323135, 1337960, 1399520, 1404807, 1407858, 1433053, 1500753, 1518537, 1530525, 1547377, 1580381, 1639358, 1725300, 1702867, 1712385, 1726961, 1758674, 1790971, 1807361, 1845891, 1893295, 1984898, 1985371, 2029421, 2090742, 2141967, 2234500, 2322317, 2364299, 2449619, 2558898, 2643265, 2698874, 2802676, 2910313, 3015386, 3077501, 3207704, 3362186, 3525228, 3713187, 3856255, 4048963, 4295662, 4585352, 4845150, 5217710, 5685522, 6252785, 6962900, 7760698, 8507618, 8894163, 8850107, 8662153, 8489298, 8458513, 8697812, 9142503, 9722597, 10573431, 11755949, 13110858, 14444162, 15194104, 15029967, 14471101, 14126748, 14108769, 14363613, 14864467, 15249420, 15336941, 15550302, 16025194]
5136A6025194P23147Q07168M90204L58412K86994K21491M67563M56134p0055q84831
5126A8881421r62295p11797k06277L62059O76070O99076K43801k23460j82050
5117A8576548k1732r8310l77258n27734q28886r96869p42242m04321j96820l41587
5107A4040789m25159k71140Q9878L52879N20054L34339m72664j257503j410285
5098A1501188j258491r62814o81882m40027j53362L3671J35662K55379J54659
5089H583983k28213p46020q09307p21664n54366m69791l56613l31791k83988k00489
5079C881741j27250o7848o2699o2210p1937m1338N7039Q1104O8328K6229o0932
5068C620227m5526j02591j81737j08463j33149j06380j11501m8305m8216j16285
$$ y = [16025194, 16748341, 17555509, 18045713, 18404125, 18691119, 18912610, 19380173, 19836307, 19766252, 18881421, 17919126, 17207329, 17001052, 17363111, 18039181, 18738257, 18982058, 18758598, 18576548, 18554816, 18456506, 18079248, 17551514, 16722628, 15725759, 14983517, 14579196, 14382376, 14040789, 13615630, 13344490, 13434368, 13787247, 14307301, 14641640, 14168976, 12911473, 11501188, 10242697, 9279883, 8598001, 8157974, 8004612, 8038283, 8173945, 8429324, 8583983, 8355770, 7609750, 6800443, 6078779, 5524413, 5054622, 4698009, 4366218, 4082230, 3881741, 3754491, 3686643, 3623944, 3561734, 3489797, 3448459, 3505498, 3586602, 3654930, 3681159, 3620227, 3574701, 3472110, 3290373, 3181910, 3048761, 2942381, 2830880, 2782575, 2734359, 2618074]
5058B618074j9729L1569K0023J090N048k657J25042J40166J06396J95681J77261
5047C397964J52043J12658K4744j2395j25680j68208k56999k48813k31028j17380
5037B526906j39239j09820p8978M45J757m8280n884l7388O1633J9212q423l395
5025B178546Q3275N0682P6984L1307O9778N177j02996j25081j56349j24994j27013
5014A859316j10398j22199r0022m4567l8956l0078p2543p940K9962r5539L1422
5003A308458K2056J5037n3323K9419k5068r917k5026J6612j4738o1669l2956k9490
4991A139395m4127m5654N252l1678R082k7005k7475J2324R403k579j7028k9759
4979I50151K4699j7297p135R585L0977M361J8840k287J7553L5588l8473p2182
$$ y = [2618074, 2598345, 2629914, 2649937, 2651027, 2656075, 2653418, 2778460, 2918626, 3025022, 3220703, 3397964, 3550007, 3662665, 3687409, 3675014, 3549334, 3381126, 3124127, 2875314, 2644286, 2526906, 2387667, 2277847, 2198869, 2199314, 2201071, 2152791, 2146907, 2109519, 2171152, 2190364, 2181941, 2178546, 2261821, 2312503, 2389487, 2420794, 2490572, 2495749, 2392753, 2267672, 2111323, 1986329, 1859316, 1748918, 1626719, 1536697, 1492130, 1453174, 1423096, 1350553, 1342613, 1372575, 1277036, 1308458, 1330514, 1345551, 1292228, 1321647, 1296579, 1286662, 1261636, 1278248, 1263510, 1201841, 1168885, 1139395, 1095268, 1049614, 1054866, 1023188, 1032270, 1005265, 977790, 990114, 999517, 996938, 979910, 950151, 974850, 957553, 950418, 960003, 990980, 995341, 1014181, 1011894, 1029447, 1065035, 1026562, 954380]
4967I54380n7854l2362m7779J0331j7116o875P882k0966O75n844l6206Q938P5126
4954H32330Q0335k3848J2022m0904p8018m2350j2016N301R497n1689o938M6877
4942G30599k9486k3999p8317M7776O7148j6295K2466q74j3912n8209J8115k9115
4930F35897m5006M1574J4990J0154M861k9243k8981J6513k693p193K446r220Q000
4917F12099O1063l281j7523L4420J8348l0992o903K9803r190l858k9951n5036
4905E98999N324q200l069n599k4855l4472J5295m209n5511J131N5187N134J3738
4892E58893j3854Q79J6101k539j4474K9025N656L391L011N5905K8163J821m1410
4879F30568j5208k6658P744K8512N3901q489k9135M3200K6087J3236M0156r856
$$ y = [954380, 896526, 864164, 816385, 826716, 809600, 802725, 810607, 789641, 790316, 784472, 748266, 757204, 832330, 912665, 888817, 900839, 859935, 781917, 739567, 727551, 732852, 742349, 690660, 683722, 730599, 701113, 677114, 598797, 646573, 713721, 697426, 719892, 719018, 705106, 646897, 665012, 635897, 590891, 632465, 647455, 657609, 662470, 633227, 604246, 620759, 618066, 610873, 613319, 604099, 612099, 673162, 669881, 652358, 686778, 705126, 674134, 667231, 697034, 687844, 683986, 654035, 598999, 604323, 596123, 593054, 587455, 562600, 528128, 543423, 539214, 483703, 484834, 540021, 545155, 558893, 545039, 545918, 562019, 559480, 545006, 574031, 579687, 583078, 586089, 641994, 670157, 671978, 630568, 615360, 588702, 596446, 624958, 678859, 670370, 641235, 684435, 710522, 723758, 763914, 754058]
4867G54058m4295j4801K6808k9189n3329o278j8517N1005k8653M1764N4027j3671
4855G18929N6028o3151n615O6716n9149J1733L4038l5418K4571P660J0012M6090
4843H12444K182J140K9556J2951k2145n310K0977j6897k0255l1496L507J0150
4831G96804K5610K5599n4446K6679R6869j1291o1037O0042j0784L4778n796K813
4819I25840m655Q344k6950M1441Q3482M9823q447r137L9300M8746M3661M0960
4807A232408K46j1844R513L0415k5644L8564j4838r559O5571n1692M5321O1601
4795A370062O9504N2427P2486L9053J382N3629R2746R4782K820l565p519L0442
4783A868249K1565M3662K5404P7608N1793K3803K8994P5299M1689J103J07045
$$ y = [754058, 709763, 694962, 721770, 692581, 639252, 632974, 614457, 665462, 636809, 678573, 732600, 718929, 774957, 711806, 706191, 772907, 713758, 725491, 759529, 724111, 748682, 756342, 766354, 812444, 814626, 815766, 845322, 858273, 836128, 830818, 851795, 834898, 814643, 783147, 786654, 796804, 822414, 848013, 793567, 820246, 917115, 905824, 844787, 904829, 894045, 928823, 923027, 925840, 921185, 929529, 902579, 944020, 1027502, 1077325, 1068878, 1059741, 1099041, 1147787, 1191448, 1232408, 1232654, 1220810, 1230323, 1260738, 1235094, 1273658, 1258820, 1249261, 1314832, 1263140, 1308461, 1370062, 1439566, 1491993, 1564479, 1603532, 1604914, 1658543, 1751289, 1846071, 1848891, 1845326, 1837807, 1868249, 1889814, 1933476, 1958880, 2036488, 2088281, 2112084, 2141078, 2216377, 2258066, 2259169, 2366214]
4772B366214Q2541O1139N0407L8427O8431M6507Q8187J07764Q0278Q3101M8384
4761C121380J36664J16562Q5616J50726O7941J33022J17153Q6990J38911J53484
4751D308449J59553K33758L23887K76805L07907L80187M66545N49484O40234P23703
4741H370512Q60463J058201J420455J801885K209835K537043K303480Q82635j119873
4732B0324636k102516k110176j755437j220746o71230l00782q0253J63384M50084
4723A2696964P96348J037097J360278J794703K439883K988435L626179L912947
4715C0652834L052390J559612M54564j418326l608235m237232l927498l252901
4707A9275208k425406j683605j142080p61256m39697j60909J31397M24344P47855
$$ y = [2366214, 2448755, 2509894, 2560301, 2598728, 2667159, 2713666, 2801853, 2909617, 2989895, 3072996, 3121380, 3258044, 3374606, 3460222, 3610948, 3678889, 3811911, 3929064, 4016054, 4154965, 4308449, 4468002, 4701760, 5025647, 5302452, 5610359, 5990546, 6457091, 7006575, 7646809, 8370512, 9230975, 10289176, 11709631, 13511516, 15721351, 18258394, 20561874, 21444509, 20324636, 18222120, 16111944, 14356507, 13135761, 12464531, 12163749, 12083496, 12246880, 12696964, 13493312, 14530409, 15890687, 17685390, 20125273, 23113708, 26739887, 30652834, 33705224, 35264836, 35719400, 34301074, 30692839, 26455607, 22528109, 19275208, 16849802, 15166197, 14024117, 13262861, 12823164, 12662255, 12793652, 13217996, 13965851]
4698A3965851J191649J656969K158924K538961K017573J48302k187622l037535
4690A8453072k971298k523016j951382j483913j099076q15370p33113n36627m31201
4681E908076l68297l28643k84669k32102j92957j95006j66089j95343j92551j53076
4671C599343j54439o0162j00394p0540j26740q3819n9675n4775l4015j3333p6884
4660B764567o9026r8222m4270K3326r878r0239L5468K3219J8942J0060M487r2173
4648B476261k6802o4911k9176j3973o8777r354N4674l6034j9224j2280L8103L8536
4636B327043M494j228K3176M0570O4492N1354k8414O4617Q32L4226j5432N3929
4624B619659l672o25P3337K8684L46m903K5626L3898M0831O2627K3141M8211P5839
$$ y = [13965851, 15157500, 16814469, 18973393, 21512354, 23529927, 23678229, 21490607, 18453072, 15481774, 12958758, 11007376, 9523463, 8424387, 7609017, 6875904, 6339277, 5908076, 5539779, 5211136, 4926467, 4694365, 4501408, 4306402, 4140313, 3944970, 3752419, 3599343, 3444904, 3384742, 3284348, 3213808, 3087068, 3003249, 2943574, 2888799, 2854784, 2841451, 2764567, 2695541, 2597319, 2553049, 2576375, 2566497, 2476258, 2511726, 2534945, 2553887, 2563947, 2568434, 2476261, 2449459, 2384548, 2355372, 2341399, 2272622, 2263268, 2317942, 2281908, 2262684, 2250404, 2288507, 2327043, 2331537, 2330309, 2353485, 2394055, 2458547, 2509901, 2481487, 2546104, 2546936, 2581162, 2565730, 2619659, 2615987, 2615362, 2688699, 2717383, 2717729, 2712826, 2738452, 2772350, 2813181, 2875808, 2898949, 2947160, 3022999]
4611C022999O4124J34511Q4649Q3425K2418R0861J02415N0951J26438J44347J17648
4600D044786O6128O0037J32487J42969P0607J81439K14522J35784J71628K12182
4590E432569K22422K04429L04032L46548L48809M05564N14486N48413O40716P75001
4580I742989R50661J113550J463474J928277K388668K915361L133390K503995
4572B6140365Q30131j013158k001912k091806j573434p40633n9720Q40332J455427
4563B1785592K048987K376776J814417K72603j462947k272117k083127j480138
4555B1000046n58951L05111R97673J377612J069878j03420j439041k049829j963950
4546A8635129j465849r32347l77482K71218Q54353J215007J351403Q56020m62695
$$ y = [3022999, 3087123, 3221634, 3306283, 3389708, 3412126, 3502987, 3605402, 3656353, 3782791, 3927138, 4044786, 4110914, 4170951, 4303438, 4446407, 4517014, 4698453, 4912975, 5048759, 5220387, 5432569, 5654991, 5859420, 6163452, 6510000, 6858809, 7264373, 7778859, 8327272, 8967988, 9742989, 10693650, 11807200, 13270674, 15198951, 17587619, 20502980, 23636370, 26140365, 26970496, 25957338, 23955426, 21863620, 20290186, 19549553, 19489833, 20330165, 21785592, 23834579, 26211355, 28025772, 28298375, 26835428, 24563311, 22480184, 21000046, 20441095, 20746206, 21743879, 23121491, 24191369, 24087949, 22648908, 20599079, 18635129, 17169280, 16236933, 15859451, 16130669, 16985022, 18200029, 19551432, 20407452, 19944757]
4537A9944757j813071k318694k283022k003818j532288j232709r79437p10574
4529G071144n69092n12090l64217l16835l18987k20534k21767j56332k08449k37872
4519C944969k12842j73300j31612m4737j11403j31828n6299m0833j19451p3083
4509B849581q4989j04645k7637j13639p0465l3848j47859l4592l0962l7526o0631
4498B102788l2704k6385j0405q763r159L300j21514J2391j6658k13j7863k2093
4486A852722k3451n8366m1296M1851L9682o809n006n2385n4978l3372m5704K8793
4474A641681L3912l0455K2455K7942n8313n0962M789o0970j0635n6480k184j0683
4462A450097j1472O8741J5732K1066l833L0160K2557J1656K8230M5649Q4903Q7541
$$ y = [19944757, 18131686, 15812992, 13529970, 11526152, 9993864, 8761155, 7781718, 7071144, 6502052, 5989962, 5625745, 5308910, 4989923, 4769389, 4547622, 4391290, 4182841, 3944969, 3732127, 3558827, 3427215, 3382478, 3271075, 3139247, 3082948, 3042115, 2922664, 2849581, 2764592, 2659947, 2632310, 2518671, 2448206, 2414358, 2266499, 2231907, 2200945, 2163419, 2102788, 2070084, 2043699, 2033294, 2024531, 2015372, 2018672, 1897158, 1909549, 1892891, 1892678, 1874815, 1852722, 1829271, 1770905, 1729609, 1771460, 1811142, 1804333, 1799327, 1746942, 1691964, 1658592, 1612888, 1641681, 1675593, 1645138, 1667593, 1695535, 1637222, 1586260, 1591049, 1530079, 1519444, 1462964, 1460780, 1450097, 1438625, 1507366, 1523098, 1544164, 1540331, 1570491, 1593048, 1604704, 1632934, 1678583, 1763486, 1851027]
4450A851027J73302J30542R5026J72126J53302J36098P8848o8055j32027j21461
4440B468728j48380j54139j47386j18344j30435m7699o8753o8069o1875L08K0671
4429A544627N4031n8498o8403N005J2163L7958l7821P757M130J6061M4961m592
4417A557379j0847j9239r439K1743q598N5335l8262K798M4520M966M4535o9269
4405A575622n1928l8056q3260p417L7057l9526K2828K4943o353j5485J359K375
4393A422159m250n543j6129J4878R1871Q1756N3849P8434J9150K7361J15633N1861
4381A931030J14357J32500Q6386K2903o7286m5962k0184j3047M4255J10488M1116
4370B336556o684j11095p6634q8347j02104m448n1072k2097q384k527O570o5725
$$ y = [1851027, 2024329, 2154871, 2249897, 2422023, 2575325, 2711423, 2790271, 2722216, 2590189, 2468728, 2320348, 2166209, 2018823, 1900479, 1770044, 1722345, 1653592, 1585523, 1523648, 1523956, 1544627, 1598658, 1540160, 1471757, 1476762, 1488925, 1526883, 1489062, 1496819, 1500949, 1517010, 1561971, 1557379, 1546532, 1527293, 1517854, 1539597, 1530999, 1586334, 1548072, 1550870, 1595390, 1600356, 1644891, 1575622, 1523694, 1485638, 1402378, 1394961, 1432018, 1392492, 1415320, 1440263, 1433910, 1418425, 1419784, 1422159, 1417909, 1412366, 1396237, 1411115, 1502986, 1584742, 1638591, 1717025, 1736175, 1763536, 1879169, 1931030, 2045387, 2177887, 2264273, 2287176, 2219890, 2173928, 2153744, 2140697, 2184952, 2295440, 2336556, 2329872, 2218777, 2142143, 2053796, 1951692, 1947244, 1896172, 1874075, 1865691, 1863164, 1869734, 1804009]
4358A804009l2218n5757L0260l6562k5630l1041M8144m1073L1609J6651M7811
4347A756203K6193M0097N7657L4103R5255L0410Q8605R1672M8618o4762l032J9582
4335B220601M0231N0129O3030P7330Q8596m739j7067l5039k3246n8417p9688j3147
4323B308574m5094O559m6183J987m696l654L7051K2239K1711J8794J4552j2065
4311B319775M1081M9290j1444l0804l4421k2497j8888k2967p0230q0407k5778
4300B092710k9686j1491M0249N0598M4306O9889L9733L360P4667Q1657K0596O3489
4288B540077k0959o2907Q154k7223j10656L615J0551n5899J8542Q1486K3562N881
4276B414224P6671Q9691O9541O2173P0120M7855K6355L8684N5679L0824K8391
$$ y = [1804009, 1771791, 1716034, 1746294, 1709732, 1684102, 1653061, 1701205, 1660132, 1691741, 1708392, 1756203, 1782396, 1822493, 1880150, 1914253, 2009508, 2039918, 2128523, 2220195, 2268813, 2204051, 2201019, 2220601, 2260832, 2310961, 2373991, 2451321, 2539917, 2535178, 2518111, 2483072, 2459826, 2401409, 2321721, 2308574, 2263480, 2270039, 2223856, 2225843, 2221147, 2217493, 2254544, 2276783, 2298494, 2317288, 2331840, 2319775, 2360856, 2410146, 2398702, 2367898, 2333477, 2310980, 2292092, 2269125, 2198895, 2118488, 2092710, 2063024, 2051533, 2091782, 2142380, 2186686, 2256575, 2296308, 2299668, 2374335, 2455992, 2476588, 2540077, 2519118, 2456211, 2464365, 2437142, 2326486, 2330101, 2340652, 2284753, 2303295, 2384781, 2408343, 2414224, 2490895, 2580586, 2650127, 2712300, 2782420, 2830275, 2856630, 2895314, 2950993, 2981817, 3010208]
4265C010208K6558l442l2090L3720n5195m1874L8620J9661M3300P6315K8123J20426
4253C264330K6420L1394Q0370J71874J21610J7233J16588K3968R5485J27967M9585
4242D126824j1268J58248J81147J44112K20070K17322K10403K42144J95430K20458
4232E904890K34896K19613J85764J99997R8545J26523J40040J52867J16456J87630
4222G567221K16899J46300J90050J50235J69325J67423K28412K19927J28168J76565
4212I360525J63914K28982J91519K11763K75575K86339J91804K71404K39993L47446
4202A1769264L60951L41080L10232L99222M21350M64012N81151N43566N52282
4193A5743110O45965N54591O59624P72871Q81507Q49819R34814Q91619J034177
$$ y = [3010208, 3036766, 3033324, 3001234, 3034954, 2979759, 2937885, 2976505, 2996166, 3039466, 3115781, 3143904, 3264330, 3290750, 3322144, 3402514, 3574388, 3695998, 3713231, 3829819, 3853787, 3949272, 4077239, 4126824, 4115556, 4273804, 4454951, 4599063, 4819133, 5036455, 5246858, 5489002, 5684432, 5904890, 6139786, 6359399, 6545163, 6745160, 6843705, 6970228, 7110268, 7263135, 7379591, 7567221, 7784120, 7930420, 8120470, 8270705, 8440030, 8607453, 8835865, 9055792, 9183960, 9360525, 9524439, 9753421, 9944940, 10156703, 10432278, 10718617, 10910421, 11181825, 11421818, 11769264, 12130215, 12471295, 12781527, 13180749, 13602099, 14066111, 14647262, 15190828, 15743110, 16389075, 16943666, 17603290, 18376161, 19257668, 20107487, 21042301, 21933920, 22968097]
4184B2968097J105059J180182J208033J343492J283125J300908J428306J533489
4176C3350691J635428J903438K243080K631838L013486L407562L976024M789768
4168E6951315N668783O686941P954309R413762J1474948J4516583J9014683K4767888
4160A56449212L1313337L5550297L2385574J6681142j769255j7342341k4442604
4153B28825362k6635906k8133859k7446825k3781301j9145369j5020519j1417498
4146G7244085q804112o726829n514764m500019l966096l506812l193121k932565
4138C8099767k701012k480696k210786j932270j776353j438897j179806r02540
4130B3477407q78496p23923o75702o17125p20689p36336r23449r00280r19232
$$ y = [22968097, 24073156, 25253338, 26461371, 27804863, 29087988, 30388896, 31817202, 33350691, 34986119, 36889557, 39132637, 41764475, 44777961, 48185523, 52161547, 56951315, 62620098, 69307039, 77261348, 86675110, 98150058, 112666641, 131681324, 156449212, 187762549, 223312846, 255698420, 272379562, 270610307, 253267966, 228825362, 202189456, 174055597, 146608772, 122827471, 103682102, 88661583, 77244085, 68439973, 61713144, 56198380, 51698361, 47732265, 44225453, 41032332, 38099767, 35398755, 32918059, 30707273, 28775003, 26998650, 25559753, 24379947, 23477407, 22598911, 21874988, 21199286, 20582161, 19861472, 19125136, 18201687, 17301407, 16382175]
4121A6382175q24687p69436p35186p20048o50233n94821n03536m63108m02122
4112A0718998l51099l43525l61262k92450k00068k40089l08160k43872k07661
4103H170812k01271j95852j34756j72569k61573k53380j93927k07470j42343j53498
4093F254173j25598j41596j46462j92923j34388j84100j16061j67475j56145j69687
4083D719738j46071j63977j64373r6407j7312l2850j00288l4448p406j0584j9604
4072C926418R899M1891j7988j26121r3395m4335k6709l3872l7873l0044J4230
4061C582101L788n8838n1738J6468K496l2125O0475L8264M2828l5757p4446j50042
4049C343474j33806j24835r7836n5137Q200j7730N720M1389M5050J16545R9731
$$ y = [16382175, 15557488, 14788052, 14052866, 13332818, 12682585, 12087764, 11584228, 11121120, 10718998, 10367899, 10024374, 9663112, 9370662, 9170594, 8930505, 8622345, 8378473, 8170812, 7969541, 7773689, 7638933, 7466364, 7204791, 6951411, 6757484, 6550014, 6407671, 6254173, 6128575, 5986979, 5840517, 5647594, 5513206, 5329106, 5213045, 5045570, 4889425, 4719738, 4573667, 4409690, 4245317, 4148910, 4131598, 4098748, 3998460, 3964012, 3956606, 3946022, 3926418, 3936317, 3978208, 3960220, 3834099, 3740704, 3696369, 3669660, 3635788, 3597915, 3567871, 3582101, 3585889, 3527051, 3475313, 3491781, 3494277, 3462152, 3522627, 3560891, 3603719, 3567962, 3493516, 3343474, 3209668, 3084833, 2986997, 2931860, 2940060, 2922330, 2928050, 2969439, 3014489, 3131034, 3230765]
4038C230765J15P0097J61659J09996J43062Q9176J06862O5175P0462k0277m5326
4027C981766o227M3765J8252J7017M5926J1193N2660J86299J28859J29679K02850
4016D812039K67919L04470K11665J45260J29166N7006J05128K01370K14589K64549
4006F713161K56323K79206L19544L02651L19035L17252L16156K54166J25273O6984
3996I269751N8692R6100k2582l0868p1242j12606j20389j18690j53893k13175
3986H581098j87546k43057j77938k71673k00020k46065l09351l30758k18361l21107
3976F075222k94373k28551k86146k82134k32365k09483k54555j98387j67208k33485
3966C688535j51618j76242j46641j34783j56145o4129q6993j81388r8601o7365
$$ y = [3230765, 3230880, 3300977, 3462636, 3572632, 3715694, 3804870, 3911732, 3976907, 4047369, 4027092, 3981766, 3975539, 4019304, 4037556, 4054573, 4100499, 4111692, 4164352, 4350651, 4479510, 4609189, 4812039, 5079958, 5384428, 5596093, 5741353, 5870519, 5927525, 6032653, 6234023, 6448612, 6713161, 6969484, 7248690, 7568234, 7870885, 8189920, 8507172, 8823328, 9077494, 9202767, 9269751, 9328443, 9424543, 9401961, 9371093, 9299851, 9187245, 9066856, 8948166, 8794273, 8581098, 8393552, 8150495, 7972557, 7700884, 7500864, 7254799, 6945448, 6614690, 6396329, 6075222, 5780849, 5552298, 5266152, 4984018, 4751653, 4542170, 4287615, 4089228, 3922020, 3688535, 3536917, 3360675, 3214034, 3079251, 2923106, 2858977, 2771984, 2590596, 2491995, 2424630]
3956B424630q7106m7939r0461j09458m2915r9160m7919n8920p9586k4632p3987
3945A662547n5465J2552k2525j6022J011o1762l384K8030N0889M3668k5593l0657
3933A583289k3258m6019r5505p7484l1600j8565K5084o2669o0583m7845r523j3413
3921A121909p5860n7969K5397l1027p203j3450j9220l0648o547o55l5709m1601
3909H27417n282K9260k5698k6175k9943K1907L0015p863j1081M639Q196k555l7166
3896G75671J4400M5179Q157k9732l2712L8592n695J2039j8312L451l0091l276
3884G77671L5363n9584K1376O4824O796L8346M6626J6193J2478P3992N2909R1497
3872A178487P8176J57297J49887J63265K09483J90752k4028p9526q1275j23905
$$ y = [2424630, 2337524, 2289585, 2199124, 2089666, 2046751, 1947591, 1899672, 1840752, 1761166, 1736534, 1662547, 1607082, 1619634, 1597109, 1581087, 1582098, 1520336, 1516952, 1544982, 1595871, 1639539, 1613946, 1583289, 1560031, 1514012, 1418507, 1341023, 1309423, 1290858, 1315942, 1253273, 1192690, 1144845, 1135322, 1121909, 1046049, 988080, 1013477, 982450, 975247, 961797, 942577, 911929, 905382, 904727, 869018, 827417, 822135, 851395, 825697, 799522, 769579, 791486, 821501, 813638, 802557, 807196, 815392, 812837, 775671, 790071, 835250, 843407, 813675, 780963, 819555, 813860, 825899, 807587, 811038, 780947, 777671, 813034, 753450, 774826, 839650, 846446, 884792, 931418, 947611, 960089, 1034081, 1086990, 1178487, 1256663, 1413960, 1563847, 1727112, 1936595, 2127347, 2103319, 2023793, 1942518, 1818613]
3862A818613j17214j32576n1821j1078m647K9465r3583j24444j06426j02549j02133
3851A001607m7120m7095n2736l7718j04565m0317n1635l1240K5446m9652k7792
3840E37183l9004n7325j2553l7396L3769k8794M506J312j9356m7405m697J3383
3828C43623k4696J1562m540j2873k2942r774n318J8555O068Q953j1140m7859K8445
3815B78064Q603l2251m5747j0660J1261M9455m9206j3797J11824j8007m1372l7663
3803B10504m1689K9869K3772L464K443J751L5971Q430l7886l7741L3485l049j7133
3790B12191L9105o22J988K645J9730j6485k6644K2157N0121J5080o610n1627J2105
3777B73134N2834n4919l0342k0326L3599J6811m3627Q434N8133j606l9636N22
$$ y = [1818613, 1701399, 1568823, 1517002, 1505924, 1501277, 1530742, 1437159, 1312715, 1206289, 1103740, 1001607, 954487, 907392, 854656, 816938, 712373, 672056, 620421, 589181, 614627, 564975, 537183, 498179, 440854, 428301, 390905, 424674, 395880, 400386, 401698, 382342, 334937, 330240, 343623, 318927, 330489, 325949, 313076, 290134, 280360, 275042, 293597, 299665, 308618, 297478, 249619, 278064, 286667, 254416, 208669, 198009, 209270, 258725, 209519, 195722, 307546, 289539, 248167, 210504, 168815, 198684, 222456, 225920, 228363, 230114, 266085, 274515, 236629, 198888, 232373, 229324, 212191, 251296, 250674, 252662, 255307, 275037, 258552, 231908, 254065, 304186, 319266, 312656, 261029, 273134, 325968, 271049, 240707, 220381, 253980, 270791, 227164, 235598, 293731, 292125, 252489, 253011]
3765B53011n7525M9624j2870j0243n3965J2457M3220Q772k0854J9472K7123o1210
3753A97012l3610K9114j9672M0353J1490q143K3485m7079K1461j0717o605n005
3741A92084n5144k187K8100K8859N2743Q427l4289j290L046J8267O7068j3115
3729B92569m2795l4287l073L2271n8462k3520K010J2189J2828K1437j6150o652
3717A88365Q751L15M286K580j2069l7359M5919p3832O079L0252L7056m475J1243
3704B07111Q636Q037Q211M6529j6541J2347k4192l8420n502p933N634j4359j3839
3691A75719P556N9374N205p826J9219q200L0709L9549P840m29m9444m5483J0365
3678B44154M1041L353p976J4721M5942l8479l4656J5050L9135k249J9146L343
$$ y = [253011, 195486, 245110, 232240, 221997, 168032, 180489, 223709, 232481, 211627, 231099, 258222, 197012, 163402, 192516, 172844, 213197, 224687, 216544, 240029, 192950, 214411, 203694, 197089, 192084, 136940, 134753, 162853, 191712, 244455, 252882, 218593, 217303, 220349, 238616, 305684, 292569, 249774, 215487, 212414, 244685, 186223, 162703, 164713, 176902, 189730, 211167, 195017, 188365, 197116, 197431, 201717, 204297, 192228, 154869, 200788, 126956, 133035, 163287, 200343, 195868, 207111, 215747, 223784, 231995, 278524, 261983, 274330, 250138, 211718, 206216, 198283, 203917, 189558, 175719, 183275, 242649, 247854, 240028, 259247, 251047, 281756, 321305, 329145, 328716, 279272, 233789, 244154, 285195, 288548, 280572, 295293, 341235, 302756, 268100, 283150, 322285, 320036, 339182, 342525]
3666C42525m0497k5954J1953R162K9649K9791K633l3020J4373j3435p7706k425
3654B47049J1847P625k1961J0714P1058p267l8320j9480K9896L5809j7262L7269
3642C46977Q66M357M9891j8136J3154n43k7749N2984k6626q288k8977k0200Q8893
3629D26603k0233j5204P644m1700M737L9720k3082o505J5346m8560j2371J467
3617C27862K7577k1305k1506J0121J6483j8293l612l5083R452K7322l1486J6263
3605C03795k5801R22J5811K4832m8711M4768O7212n9369p782n50O5100l1176q066
3592C40985L037o3533l508M2470Q981j8876j2954k2816J2529l6486j4M2009M2467
3579C34291K9540k6420o0979M120P670L9603p324P290M345o5707N8903L6005l6879
$$ y = [342525, 302028, 276074, 288027, 297189, 326838, 356629, 359262, 326242, 340615, 327180, 249474, 247049, 258896, 266521, 244560, 255274, 326332, 319065, 280745, 261265, 291161, 326970, 309708, 346977, 347843, 352200, 402091, 383955, 397109, 396566, 368817, 421801, 395175, 386887, 357910, 337710, 426603, 406370, 391166, 398810, 357110, 361847, 401567, 378485, 371980, 387326, 338766, 326395, 327862, 355439, 334134, 312628, 322749, 339232, 320939, 317327, 282244, 291696, 319018, 287532, 303795, 277994, 278916, 294727, 319559, 270848, 315616, 382828, 323459, 315677, 315127, 380227, 349051, 340985, 344022, 280489, 276981, 319451, 328432, 309556, 296602, 273786, 286315, 249829, 249815, 291824, 334291, 363831, 337411, 276432, 280552, 288222, 327825, 320501, 327791, 332136, 266429, 325332, 361337, 324458]
3566C24458k1725L3686m616k7859J6942J6715K5391o697L4912l2827P501J7774
3554C83655m3160l1089J9258J0357j7350L3633K408M985j0158k2156N5321k8918
3542C56786j2267P432L1868k9976J4863P5945l1885l4290O608j7496k8706J6734
3530C55616n20L5682l9602J4692k6926M0779j9755o5387Q770K8700J4936j349
3518C45636M3236K5829M3669j0811j9793l736K2832K5814j1354l9412l0617K4746
3506D16039k5741L5139M7043m5471l1836O2315O587J1071k8914j2559O7019K6004
3494E26696n3668k4945m9262P963j939L8423M5313k910N4559m8707Q154J0451
3482E10128j0110l8178M1507K6795J2170K3285L221O4263j8020L0521O8621m1388
$$ y = [324458, 302733, 336419, 331803, 303944, 320886, 337601, 362992, 356295, 391207, 358380, 365881, 383655, 340495, 309406, 328664, 339021, 321671, 355304, 357712, 362697, 352539, 330383, 385704, 356786, 344519, 351951, 383819, 353843, 368706, 444651, 412766, 378476, 385084, 367588, 338882, 355616, 355096, 390778, 351176, 365868, 338942, 379721, 359966, 294579, 303349, 332049, 346985, 345636, 388872, 414701, 458370, 447559, 427766, 424030, 446862, 472676, 461322, 421910, 391293, 416039, 390298, 425437, 472480, 427009, 395173, 457488, 464075, 475146, 446232, 433673, 500692, 526696, 473028, 448083, 398821, 406784, 404845, 443268, 488581, 485671, 540230, 491523, 499677, 510128, 500018, 461840, 503347, 530142, 542312, 565597, 568818, 633081, 615061, 645582, 714203, 672815]
3470F72815p374l9125K2289J634k835k1020K5769Q495J5346n1766R75Q8852M2065
3457G56120l0927k7215J4538k245K0092J1075M513J4254J4073M0097m921l2991
3445G76463J0115N8921k052L7095n688M5246J07195P1751J1181O4532R2542J26486
3433A393787J34948J42579J81246K21848L27821K97545J27076j78632k95954l02787
3423B049477k24242j58578o8963j13330o8348N691o1708j0110L3266r692r30M488
3411A377021J03221j9990J2987R6331L5686J52557J17544R3557J17676J71340
3401B257930K84531L31921M40077N10813O37322N09303J17859m11920o08766o50172
3391C418898m42473l50197l01212j46026j03283j32377l5387j0606j17416j09886
$$ y = [672815, 665441, 626316, 648605, 650239, 647404, 626384, 652153, 660648, 675994, 624228, 625203, 714055, 756120, 725193, 697978, 712516, 710271, 730363, 741438, 745951, 760205, 774278, 814375, 809454, 776463, 786578, 845499, 843447, 880542, 874854, 920100, 1027295, 1099046, 1110227, 1174759, 1267301, 1393787, 1528735, 1671314, 1852560, 2074408, 2402229, 2699774, 2826850, 2648218, 2352264, 2049477, 1825235, 1666657, 1597694, 1484364, 1416016, 1421707, 1359999, 1349889, 1383155, 1373463, 1372533, 1377021, 1480242, 1460252, 1473239, 1569570, 1605256, 1757813, 1875357, 1968914, 2086590, 2257930, 2542461, 2874382, 3314459, 3825272, 4462594, 4971897, 5089756, 4677836, 4069070, 3418898, 2976425, 2626228, 2325016, 2178990, 2075707, 1943330, 1907943, 1897337, 1779921, 1670035]
3381A670035j1803j0478p096o6309k6483n800K8107N0457L5400P764Q9686J00172
3369A853652N7791J21753K22171K62559K06516K17271J13691r0561l10349l01909
3359B352585k49740j51022q8488o3016l8111L2174l1451q3950n1112j22930n6697
3348A448242j003q2992r9942p2737J6542N710k3868K5142L442j2542L657m112
3336A205539L1960J3658M2339M4801K0311k588M8348k0686O106m8531K0484L4847
3324A396588J7701P7677P4425R624j950J6919m7723o900J9585m6303M1451j3384
3312A537710L9874j7086l8555K9204l841N0230n94K6670J7990N1773J4754Q986
3300A717115Q7461L8904J9812L4249k7227m668K0814k2528J9193L6187m2010J4079
$$ y = [1670035, 1658232, 1647754, 1640658, 1574349, 1547866, 1542066, 1570173, 1620630, 1656030, 1663794, 1753480, 1853652, 1911443, 2033196, 2255367, 2517926, 2724442, 2941713, 3055404, 2964843, 2654494, 2352585, 2102845, 1951823, 1863335, 1800319, 1762208, 1794382, 1762931, 1678981, 1627869, 1504939, 1448242, 1447239, 1364247, 1264305, 1191568, 1208110, 1213820, 1189952, 1215094, 1218536, 1205994, 1209651, 1205539, 1237499, 1251157, 1293496, 1338297, 1358608, 1356020, 1404368, 1383682, 1389788, 1341257, 1361741, 1396588, 1414289, 1491966, 1566391, 1576015, 1574065, 1590984, 1543261, 1536361, 1555946, 1509643, 1551094, 1537710, 1577584, 1560498, 1521943, 1551147, 1547306, 1597536, 1596942, 1623612, 1641602, 1693375, 1708129, 1717115, 1804576, 1843480, 1863292, 1897541, 1870314, 1865646, 1886460, 1863932, 1883125, 1919312, 1877302, 1891381]
3288A891381R2064k9056K5152M9019M3643K6525M2862Q9551Q2898N2086L8039
3277B404164N4092K6554N5212L3642P4075M8072P2057P0972L0518P5337O8718
3266C013413N1866J20316P5344N1815J28611J19083J45043J07739J51823J55150
3256D120203J58515J84718J98739K26567K24866K03272K05519J66396J09582k7693
3246E770684j3653j32635l18233k90149l48882k65475k58691k75197k31489k30165
3236C406115k08543q1376j90827j26872j16787n4709o2484j29175q1792p7464
3226B276086n9801l3695o8773o6098J3743j1827l6133n2000p5021j6635l2695
3215A837151n1485j2595K3594m9458l8474l0714K0924k0202j02078k0665n2242
$$ y = [1891381, 1983445, 1954389, 1979541, 2028560, 2072203, 2098728, 2141590, 2231141, 2314039, 2366125, 2404164, 2458256, 2484810, 2540022, 2573664, 2647739, 2695811, 2767868, 2838840, 2869358, 2944695, 3013413, 3065279, 3185595, 3260939, 3312754, 3441365, 3560448, 3705491, 3813230, 3965053, 4120203, 4278718, 4463436, 4662175, 4888742, 5113608, 5316880, 5522399, 5688795, 5798377, 5770684, 5757031, 5624396, 5306163, 5016014, 4667132, 4401657, 4142966, 3867769, 3636280, 3406115, 3197572, 3116196, 2925369, 2798497, 2681710, 2627001, 2564517, 2435342, 2353550, 2276086, 2216285, 2182590, 2113817, 2047719, 2061462, 2049635, 2013502, 1961502, 1886481, 1869846, 1837151, 1785666, 1773071, 1796665, 1747207, 1708733, 1678019, 1698943, 1678741, 1576663, 1555998, 1503756]
3204A503756p1267k0084n9763J5648k9353M754o2944p7237r129m1012m598L220
3192A151991n0723n4543K6799L9343o6m5781L987m0889K3562k1949q860J6181
3180A039052k4628q246k3878K1805K8665m9471O0147l8025m3469O160R087m562
3168I72637n9309k46l1057m3374j8205l7144l839J997K0326j9495k5059r341o6269
3155F81622J9349O3098l2663j3913N236K8419j7872r587n4921l6980Q815M9937
3143F90540J9223j7623Q364m1505k4178o738L792k9539K3055K1327j3596n4739
3131E78383k3653K40j5255J7877O1635J3532n3702K2363J2483j95l699m2020m4816
3118E23173r228O0360J4432m7377M285j5538J0787L8512j4083K453o153j0507
$$ y = [1503756, 1432489, 1412405, 1352642, 1368290, 1338937, 1343691, 1280747, 1203510, 1194381, 1153369, 1148771, 1151991, 1101268, 1046725, 1073524, 1112867, 1112801, 1067020, 1071007, 1030118, 1053680, 1031731, 1022871, 1039052, 1014424, 1006178, 982300, 1004105, 1032770, 983299, 1043446, 1005421, 961952, 968112, 977199, 972637, 913328, 913082, 882025, 838651, 820446, 783302, 779463, 781460, 801786, 782291, 757232, 747891, 681622, 700971, 764069, 731406, 717493, 722729, 751148, 733276, 723689, 668768, 631788, 640603, 690540, 709763, 692140, 700504, 658999, 634821, 628083, 631875, 602336, 625391, 646718, 633122, 578383, 554730, 554970, 539715, 557592, 619227, 632759, 579057, 601420, 613903, 613708, 610009, 567989, 523173, 513945, 574305, 588737, 541360, 545645, 530107, 540894, 579406, 565323, 567776, 561623, 551116]
3106E51116L479n22j8093k6126l2614k3463n431K6367M5073j8333l3263k2516
3094D45674J319l749J6824M482J0934M268j4600n5590M800N7447j4420M2082J8364
3081E17835l7210j6217j1722P746r060p335K3796J8339Q05n1429j4921O57J1537
3068D32821K118L4246l5767P685j0491q84j0459K5949K52N1585n2670o909q586
3055D28890j3605J7964J7422k1076k7068K9929k5764j0083L288M1782Q976k2756
3043D27899l1509K2353K7417J9722n0826R425K8115j9420q23k2435n5206M2283
3031C96995M5845k502j150K615O051J3757r147J5887l336j1308n382Q515j0423
3018D46417J1179N7542l3021l5685j872j4694O2323k3329k0906J9991L5444M4802
$$ y = [551116, 554595, 554073, 535980, 509854, 477240, 453777, 448346, 474713, 519786, 501453, 468190, 445674, 446993, 443244, 460068, 464550, 475484, 479752, 465152, 409562, 414362, 471809, 457389, 499471, 517835, 480625, 464408, 452686, 460432, 451372, 444037, 467833, 486172, 486977, 435548, 420627, 421284, 432821, 434939, 469185, 433418, 441103, 430612, 429728, 419269, 445218, 445470, 497055, 444385, 437476, 428890, 415285, 433249, 450671, 429595, 402527, 432456, 406692, 396609, 399897, 441679, 450655, 427899, 396390, 418743, 446160, 465882, 415056, 424481, 452596, 433176, 432353, 409918, 354712, 396995, 442840, 440338, 439188, 441803, 447854, 461611, 452464, 468351, 465015, 453707, 448325, 456840, 446417, 457596, 515138, 482117, 446432, 444560, 429866, 492189, 468860, 447954, 467945, 503389, 548191]
3006E48191l0345k8811j4356j2580Q285k4163L4578L233J560P486L9350p194k6109
2993D99125M3322N678l3838j1135K6095M6311j793Q385k9198l5578O3274N6405
2981F37053l8327j2848K2755r131l5202J9591O6200L0459l1037m277J0267l4597
2969F20906l5639J0268o894J7329K8813K3125M0656K9242J7144k2252j8650p428
2957F96620l03M6144P813L7646K2416K3905k794K3826L1512q2387M3567M3439
2945H91404N7876k7582M8307Q0138q25K5552Q561L3390K5483L3517j6598J7927
2933A177150M3827l431L1881l0849j0056p664N5825P529K6876J0650P8139M388
2921A384265k7936J5035N184N6802O5895n328L6540J0756P1135N1639J02669J14859
$$ y = [548191, 517846, 489035, 474679, 462099, 470384, 446221, 480799, 484032, 485592, 493078, 532428, 525234, 499125, 542447, 548125, 514287, 503152, 529247, 575558, 573765, 582150, 552952, 517374, 580648, 637053, 598726, 585878, 608633, 599502, 564300, 583891, 650091, 680550, 649513, 645236, 655503, 620906, 585267, 595535, 588641, 605970, 634783, 657908, 698564, 727806, 744950, 722698, 704048, 696620, 696317, 742461, 750274, 787920, 810336, 834241, 831447, 855273, 886785, 804398, 847965, 891404, 949280, 921698, 970005, 1050143, 1049318, 1074870, 1083431, 1116821, 1142304, 1175821, 1159223, 1177150, 1220977, 1217546, 1249427, 1218578, 1208522, 1200858, 1256683, 1264212, 1291088, 1301738, 1379877, 1384265, 1356329, 1371364, 1376548, 1433350, 1499245, 1493917, 1530457, 1541213, 1612348, 1663987, 1766656, 1881515]
2909A881515L7677L9188O2764L1314L1300P393m9457m0592j06587m4681n8875
2898A790959p6588k5276k1560l2546n5541r70J9064K5285K2406M2285P379J9649
2886A714546K962L808J2415j9850J948M1186L0827J1597j8819j8150j4878n7765
2874A689827m9194l3340k0775q3106J5950m1867k5584n8717r3565k5791P838o7987
2862A213689r505j5081M736l0413J0564K6894o6149K833J4236n5556k4227o1398
2850A010623j0990l5808p2364l9099m575j7810j2242j2696l3439o9190k4343J8819
2838F96886j9550r0139o191N9532j7486l4777J4384o586l6710p1939N7180N4455
2826E99059j1932n0038m2670L884j1621J6381n4631M5746r24k9690k5522j4346
$$ y = [1881515, 1919192, 1958380, 2021144, 2052458, 2083758, 2091151, 2041694, 2001102, 1894515, 1849834, 1790959, 1714371, 1689095, 1667535, 1634989, 1579448, 1578478, 1597542, 1622827, 1645233, 1687518, 1694897, 1714546, 1717508, 1721316, 1733731, 1713881, 1715829, 1757015, 1787842, 1799439, 1780620, 1762470, 1747592, 1689827, 1640633, 1607293, 1586518, 1503412, 1519362, 1477495, 1451911, 1393194, 1299629, 1273838, 1281676, 1213689, 1204184, 1189103, 1193839, 1163426, 1173990, 1200884, 1134735, 1137568, 1151804, 1096248, 1072021, 1010623, 999633, 963825, 891461, 852362, 847787, 829977, 817735, 805039, 771600, 702410, 678067, 696886, 677336, 587197, 581006, 640538, 623052, 588275, 602659, 596073, 559363, 487424, 544604, 599059, 587127, 537089, 494419, 498303, 486682, 503063, 448432, 494178, 493254, 463564, 438042, 423696]
2814D23696k2766n1861M1265M3753K02M99n3889n7066K8810K5957n1759N931j9564
2801C13208m0420q534N5310j4424n8359m872L0572l181J3430j3051q615K8026
2789B89090n0456J0709k1975l5476J603j1287J4796j2261j8086j9274J9642L5826
2777B02851J304j5727o0647K5790O5594j8895l1642r166J0556o047N1943r837
2765B06077n8154k035j2971N001m5543L69J9982R687j9963k5333M878k9211k3117
2752B9667K6292L9838P380k9328J3248k5730k2010m251k2673M6780K1044N4683
2740A34940k6505n5300L1732n504l7351n267k1404J5576N553J4033L6235j4314
2728G2424n1819j1169j4752j985L6419K5285j2992K1697m6479K8559l6251K9991
$$ y = [423696, 400930, 349069, 390334, 434087, 434289, 434788, 380899, 323833, 352643, 378600, 326841, 332772, 313208, 272788, 264254, 319564, 305140, 246781, 241909, 272481, 269300, 282730, 269679, 261064, 289090, 238634, 249343, 227368, 191892, 193495, 182208, 197004, 184743, 166657, 147383, 167025, 202851, 204155, 188428, 127781, 153571, 219165, 200270, 168628, 159462, 170018, 163971, 215914, 206077, 147923, 145888, 132917, 137918, 92375, 92744, 112726, 122413, 102450, 77117, 81995, 52784, 29667, 55959, 95797, 103177, 73849, 87097, 61367, 39357, 35106, 12433, 59213, 80257, 134940, 108435, 53135, 84867, 79363, 42012, 36745, 15341, 30917, 36470, 50503, 86738, 72424, 20605, 9436, -5316, -7301, 29118, 54403, 41411, 63108, 16629, 45188, 8937, 38928]
2716C8928M8889m5338J5178o3714M6318M4150l6380l6091K8745L671J704p8523
2704c2463j7959M6975L2233p225k8653k2487r543L2465j0266n331L3663k4280
2692a2871K8147K7526j7359j5504n6902O0176j7654k696N4012k2774L129k249
2680B4981l5270l5950k2143K3539p241j1423l3638K1224P0095L2577R509k8227
2668H033l3164M9633J4864j3613l7363j7606j1075L8548J735J9854q086l8511
2656b6751J3242k2561J7331N0k7021o174M7192n170m2867K3472Q749k6438j4763
2643f1709J7557J1732n8416k2914L8911N9694k5457M8860l2784J0807P7136k2199
2631D1218l8552P739j8790K0128m0205J6802n8931j7332M5846k3292o799Q258
$$ y = [38928, 87817, 42479, 57657, -6057, 40261, 84411, 48031, 11940, 40685, 44356, 46060, -32463, -50422, -3447, 28786, 21561, -7092, -29579, -39122, -6657, -16923, -22254, 11409, -12871, 15276, 42802, 25443, 9939, -46963, 13213, -4441, -7137, 46875, 24101, 27230, 24981, -10289, -46239, -68382, -44843, -52084, -63507, -97145, -75921, -5826, 26751, 36260, 8033, -25131, 24502, 39366, 25753, -11610, -29216, -40291, -1743, -8, 19846, 11760, -26751, -13509, -36070, -18739, -18689, -45710, -51884, -4692, -9862, -52729, -29257, -20508, -46946, -61709, -44152, -32420, -90836, -113750, -74839, -15145, -40602, 8258, -24526, -13719, 63417, 41218, 2666, 10405, -8385, 11743, -28462, -11660, -70591, -87923, -42077, -65369, -72168, -63910]
2619f3910m356L8057n1999l9129J1522L6164P3145r411J7655q678j9564q335m6985
2606g5824L53K5936m111P1006m785l5618l7367K8049P220k858Q395L2491N6779
2593F9666k4118k9745k2404J2944j2594n1069p15j2009k2748M7466k568k3695
2581g1589J8647m271n7994K0456L7617k8027m7503J951P2426m6407N2832L3283
2569a8579K1599k1758j6349m8686K0389Q475k7967O1108L905l1310L2849l4664
2557e0988n3784j0853K2498L1631J7786J3632j9594K5289k1389k5341L190L0108
2545c7815N754m0823j1405K5605k2482k210J9583J8653k1756q427M3640j2994
2533d4677M3035k4571l3645l956J1283J8105k5631M1186K532K2641l9663O59o959
$$ y = [-63910, -68266, -30209, -82208, -121337, -109815, -73651, -506, -9917, 7738, -940, -20504, -28839, -75824, -75471, -49535, -53646, 17360, 12575, -23043, -60410, -32361, -25141, -27999, -19604, 12887, 69666, 45548, 15803, -6601, 6343, -6251, -57320, -58035, -70044, -92792, -45326, -47894, -71589, -52942, -57213, -115207, -94751, -57134, -85161, -132664, -130713, -58287, -104694, -51862, -18579, 3020, -18738, -35087, -83773, -63384, -54909, -82876, -21768, -17863, -49173, -16324, -50988, -104772, -115625, -93127, -61496, -43710, -30078, -49672, -24383, -45772, -71113, -67923, -37815, -32061, -72884, -84289, -58684, -81166, -83376, -63793, -45140, -66896, -75323, -31683, -44677, -1642, -26213, -59858, -63814, -52531, -34426, -60057, -18871, -16339, 6302, -33361, -32702, -39661]
2520c9661O146j2757N0592k7121n1396J3880k2599J0655J6490M6585q234k5286
2508d2706L5086K6028l329k7226n5691j513l143M4119J9430n4809l4727K2575
2496g5906L372K5362j4350j5620L7682K3908k773K5187l2545l534O44r718K9124
2483i167k0165k6793l4307M0682M7714o8272l9123R599K2067J2256k9290l2182
2471a26981P3501O5830o8707k9386L9464k0403L2358J9355l7236J4917n7233n496
2459a00017K5480K9458j4091l8046M150J3875O946J9792K1362o0686J8458M9641
2447b3678P118J5066m6490J7918L5476j3678l2401L6506J3772l1025n9260n566
2435h6242R0820L580k4924K8916j9646n1718L9207L1423q1732J9356M9469J9430
$$ y = [-39661, -33515, -46272, 4320, -22801, -74197, -60317, -82916, -72261, -55771, -9186, -17420, -42706, -7620, 18408, 15079, -12147, -67838, -69351, -72494, -28375, -8945, -63754, -98481, -75906, -72534, -47172, -61522, -77142, -39460, -15552, -18325, 6862, -25683, -29217, -28573, -38291, -9167, -29332, -56125, -90432, -49750, -2036, -70308, -109431, -99832, -77765, -65509, -94799, -126981, -53480, 12350, -56357, -85743, -46279, -66682, -34324, -14969, -52205, -37288, -94521, -100017, -74537, -45079, -59170, -97216, -93066, -79191, -72245, -52453, -31091, -91777, -73319, -23678, -16560, -1494, -47984, -30066, 5410, -8268, -40669, -4163, 9609, -21416, -80676, -86242, 4578, 8158, -16766, 12150, -7496, -59214, -20007, 11416, -70316, -50960, -1491, 17939]
2423A7939j3205l1638K4973m5570l6187P918J8547J8150K4505m5081L2079o596
2411c4166m4677L2288L3996j2594M453N7823k4632o7795J1342j003r276K5052
2399b9189l1716J9093K9061m095L1181J6498l5014l0114R594j8487k6757N4491
2387a5454j6509J0367J2818n0016L2994N358m449K8473O204J577n0137K6845P1240
2374E9311K9662r440n110L9646k0026q9215M25j3228n6786L873J0184j1629k0243
2361h2576L8294P0616m1659n3696j5203K8189M1524k726K1624j8745J3745r773
2349a0386m178j9369J4799N7346r5269j9994O1000j7425L411j3580N721J3711
2337b4213J7613j3140j9407J2313r009L2434j4063l7227M0296k9189K1435R219
$$ y = [17939, 4734, -26904, -1931, -47501, -83688, -75770, -57223, -39073, -14568, -59649, -27570, -34166, -78843, -46555, -12559, -25153, -20700, 37123, 12491, -55304, -43962, -44965, -54241, -29189, -60905, -41812, -12751, -16846, 14335, 30833, -4181, -34295, -24701, -43188, -69945, -15454, -31963, -21596, -8778, -58794, -25800, -20442, -24891, 3582, 9786, 11363, -38774, -11929, 59311, 88973, 79533, 74423, 114069, 94043, 4828, 5253, -7975, -64761, -60888, -50704, -62333, -82576, -44282, 26334, -15325, -69021, -84224, -56035, -14511, -17237, 4387, -14358, -613, -10386, -14564, -33933, -19134, 38212, -57057, -77051, -16051, -33476, -30065, -43645, -37924, -24213, -6600, -19740, -39147, -26834, -35843, -3409, -17472, -54699, -14403, -43592, -22157, -12938]
2325a2938j7134M314L2772n348J8322j4994L006J329L379k5988n3467O7803M3801
2312D4857J6726k4692n2319R401N5090q142O377J5369l1752J2463m5614n2188
2300e4424O3436L2501N2633O400l5084m9014K610j1765L9228k101l7265J6046
2288B3201j0358l8138l1032K1864K5855j737K3925K7311O486j9976N384l291j1692
2275A7802j5577O614O68j0004K1083k8994O2491N851n0015J8580j7536J4415K3648
2262D9026k6038K266M405J7398k2173k6750J9415l764l602k0848M6389J5552j6277
2249C4999k8467J2370K2680K1887K0024k5599J6593N0231p3180o401K2543J1725
2237G9405K6821j1262J6112n6008j8200r709j0998O044N3309J974K4666j7219
$$ y = [-12938, -30072, -25758, 7014, 1666, 19988, 4994, 8000, 9329, 12708, -13280, -66747, 1056, 44857, 61583, 36891, -15428, -6027, 49063, 40921, 47298, 62667, 30915, 43378, -2236, -54424, 9012, 41513, 94146, 100546, 65462, 16448, 19058, 7293, 46521, 44420, 7155, 23201, 12843, -25295, -56327, -34463, -8608, -10345, 13580, 40891, 47377, 27401, 32785, 29494, 17802, 2225, 8839, 9507, -497, 20586, -8408, 54083, 59934, 9919, 28499, 10963, 25378, 49026, 22988, 25254, 29659, 47057, 24884, -1866, 17549, 13785, 10183, -10665, 35724, 51276, 34999, 6532, 18902, 41582, 63469, 83493, 57894, 74487, 124718, 51538, 45137, 67680, 79405, 106226, 94964, 111076, 55068, 36868, 27159, 16161, 22205, 75514, 77488, 102154, 84935]
2225H4935l4452J6571N7357l4749O093K0151j0436K4443L4984j0695j8312m430
2213A31460q4522M2119K9894k7325N328K6254k4361K2538j6832N9913J6994n9970
2201A21490L3502L0036K9913k7875J477O590m857J4769N034L648j3654J2368j3417
2188A99024L1727L9346J4300R687K564M6385k4145J5249k4447J5840P0215N459
2176D01204m9211q730K101K9346n413N1468M1540p508J3588k6791N1604M1919
2164E35117l7575J9131l0124J0511N0519k2539K7058L8917K5347K1555l2076J0049
2152F15890Q064K5444K9362L4078L837J6058O9623M7066j6066L6793M8998P7012
2140I96159J297L9697J14606R5696L4761O7626J19491J01837O7329O3718P3271
$$ y = [84935, 50483, 67054, 124411, 89662, 95755, 115906, 105470, 129913, 164897, 154202, 135890, 131460, 46938, 89057, 118951, 91626, 96954, 123208, 98847, 121385, 104553, 164466, 181460, 121490, 154992, 185028, 214941, 187066, 188543, 195133, 190276, 205045, 210079, 213727, 200073, 212441, 199024, 230751, 270097, 284397, 294084, 296648, 343033, 318888, 334137, 309690, 325530, 395745, 401204, 351993, 343263, 345364, 374710, 369297, 420765, 462305, 454797, 468385, 441594, 493198, 535117, 497542, 516673, 486549, 497060, 547579, 525040, 552098, 591015, 616362, 637917, 605841, 615890, 623954, 649398, 678760, 712838, 716675, 732733, 802356, 849422, 833356, 870149, 919147, 996159, 997456, 1037153, 1151759, 1247455, 1282216, 1349842, 1469333, 1571170, 1638499, 1702217, 1775488]
2129A775488Q8478J52768M6433J39074J69622J36864K21334J79540K58900J45200
2119C313701J84854L40884L37555M67670N54832O69106Q28984J083042J472762
2110I253390K152610K671497L499647L369657J118845l179506m253415l217436
2102A1415289k436535j583683j154840r47438q14301n51550l64877k65992k27591
2093C068482j02249j18370j30165k40720k09529k21788j27512j81035j84608j47844
2083A404662q1420p9883r5080l9643M0472N140j09746n4238n185k8582l0111j03003
2071H23383q3565O869N416j18591M04N242j5762o0678J177k1845l1699k9320k3775
2058D57256j056k4531J8564R372j13179p263L4957l3717l5882J7194j5352j5444
$$ y = [1775488, 1863966, 2016734, 2063167, 2202241, 2371863, 2508727, 2730061, 2909601, 3168501, 3313701, 3498555, 3839439, 4176994, 4644664, 5199496, 5868602, 6697586, 7780628, 9253390, 11406000, 14077497, 17577144, 20946801, 22065646, 18886140, 14632725, 11415289, 8978754, 7395071, 6240231, 5292793, 4478492, 3926942, 3562065, 3296073, 3068482, 2966233, 2847863, 2717698, 2476978, 2267449, 2045661, 1918149, 1737114, 1552506, 1404662, 1323242, 1243359, 1148279, 1108636, 1149108, 1154248, 1044502, 990264, 985079, 956497, 926386, 823383, 739818, 746687, 752103, 633512, 633916, 639158, 623396, 562718, 563895, 542050, 510351, 481031, 457256, 456200, 431669, 450233, 459605, 346426, 339163, 374120, 340403, 304521, 321715, 306363, 290919]
2046B90919K3320l2120m6447K0057l9853L2804q49o381J4295j03203J7492K1355
2034A91389j827Q516M8668l1739m8175K7757o271j1064K968k5924M3192L1683
2022B29173l1018j5587j7551m21j2040j6745J0545m4400l1260P1653l2714k4814
2010H4821m0325N547J960K1815j2891k5485L4942K3212j6855k0901K80J7603j1556
1997F2167o1038n403K8856J349n94J9328k8989J2091R608K8460r9438M1228M7752
1984E5377k1833J2159j8369l2325k163j0284l6162j7277L8578K6093r950L3371
1972A7215K7143j5545N0422m8619o0665N4784K908Q779n6182k8683N7237J2529
1960B1323l3880J5760k7925k8602P3220J7004q208r765J0364l1549k4840R112
$$ y = [290919, 314239, 282119, 235672, 255729, 215876, 248680, 247831, 241450, 255745, 152542, 170034, 191389, 189562, 198078, 246746, 215007, 166832, 194589, 188318, 177254, 180222, 154298, 197490, 229173, 198155, 182568, 165017, 164596, 152556, 135811, 146356, 101956, 70696, 142349, 109635, 84821, 44496, 50043, 52003, 73818, 60927, 35442, 70384, 93596, 76741, 55840, 56120, 73723, 62167, 1129, -4274, 24582, 25931, 25337, 44665, 15676, 27767, 37375, 65835, -33603, 7625, 55377, 33544, 45703, 27334, -4991, -7154, -17438, -53600, -70877, -32299, -6206, -16156, 17215, 44358, 28813, 79235, 30616, -30049, 24735, 27643, 36422, -19760, -48443, 8794, 21323, -12557, 3203, -24722, -53324, 19896, 36900, 28692, 18927, 29291, -2258, -27098, -17986]
1948a7986K1866k6000J4122l0242L221K5493Q019N4114j5399o3216J5236k8347
1936c9119k2116J1273L6739K7817l1736j742J5297M6647m6931R644J8519j508
1924B2784o970J7448p286J9921k6897Q480k0473k7517l4689L2703j1871j7091
1912e1458j6080J5593j8945K4652L2319n8204l1570p996L8738M1703j8917M446
1900d5719K5060k2876K5052l2849K5380j0970n1487q211j2152J3447L5429J9691
1888d0205n5232r679p383k0532O3308O2637J8314l6300r903p053k0156k912M9752
1875a5344L6700K863j3715j0790j4025l497J632j6019j9136J0229k2311r118n739
1862g8270l4275L7972P5988k1080J5467q847J7845l3464m0543M0878r78j5731
$$ y = [-17986, 3880, -22120, -7998, -38240, -35019, -9526, -1507, 52607, 37208, -26008, -10772, -39119, -61235, -49962, -13223, 14594, -17142, -18884, -3587, 43060, -3871, 5773, 24292, 22784, 15814, 33262, 25976, 45897, 19000, 27480, 7007, -20510, -55199, -22496, -34367, -51458, -67538, -51945, -70890, -46238, -13919, -72123, -103693, -111689, -72951, -31248, -50165, -45719, -20659, -43535, -18483, -51332, -25952, -36922, -88409, -96620, -108772, -95325, -59896, -40205, -95437, -105116, -112499, -133031, -69723, -7086, 11228, -25072, -34975, -42028, -62184, -65096, -15344, 21356, 24219, 10504, -286, -14311, -17808, -16176, -32195, -51331, -41102, -63413, -72531, -78270, -112545, -74573, 1415, -19665, -4198, -13045, 4800, -28664, -69207, -28329, -29307, -45038]
1850d5038J6956k4988M8881o15J3926j2129k7924m995J9942M4221K9689Q629p8427
1837a1872J844Q6355J4132q7186k5017K2394K4130j5439o6636Q817K9107j2417
1825c1788m675j7881P085l472K3727P0345N632k4428K1112J7819m7988n6465k9063
1812g0040l4416M0572Q1199j826m1251k7534p613Q2177l3224o79J6678m2399r982
1799d8338m381J9334K0547o804N529m6038O0593l0675l4938N9586k0759K0584
1787e760r378j8950j6134k4941J1016N3563m2371k1413L3468J6859L3408m2412
1775c3045o005n660p750m0146K4610N5784N544J5630j0537j9775K9747L604l1299
1762a9298m0200K8637j6748P954M3596K5104l1779J0777K1232j1692J0262o0723
$$ y = [-45038, -28082, -53070, -4189, -4804, 9122, -3007, -30931, -35926, -15984, 28237, 57926, 66555, -11872, -10028, 76327, 90459, 3273, -21744, 650, 24780, 9341, -57295, -48478, -19371, -31788, -36463, -54344, -47259, -50731, -27004, 43341, 48973, 24545, 45657, 63476, 15488, -40977, -70040, -104456, -63884, 17315, 15489, -25762, -53296, -60909, 21268, -11956, -12635, 4043, -38356, -48338, -52719, -33385, -12838, -19642, -14113, -60151, 442, -30233, -65171, -5585, -26344, -5760, -15138, -34088, -50222, -75163, -64147, -10584, -52955, -74368, -40900, -24041, 9367, -33045, -39050, -44710, -52460, -92606, -67996, -12212, -6668, 8962, -1575, -21350, 8397, 12001, -19298, -59498, -30861, -47609, -39655, 3941, 29045, -2734, 8043, 29275, 17583, 27845, -32878]
1750c2878L1662J1587m2223J3765r427n829Q243q614j7930N306N3935l3006N0205
1737B4796K3006k474k1553l0633J1259j6425Q826O737j7293R725J4528m1121l605
1724c4227J041M360J6166J5300k9148n7687N8381J6361p193j9817j9034K7545
1712b7952J9570k5389K9468n826o6294K4178l9569J0599L2236k9730L9727K3529
1700a5453k5585r450M6451J9811l8610n027J0802O565J5436p893k2195N564m158
1687b3742J2355k0216J999l573k0892j7888l01N168J6985R30l8091j1188N1369
1674d7085L7804L6034O971j2211k6234q5160J5021M391L3637O323N1782J2j7888
1661C397k5352N982P354l6636K4574M3279r039o1689J2091k148l2466N3337L4046
$$ y = [-32878, -1216, 10371, -31852, -18087, -27514, -33343, -25100, -33714, -51644, -46338, 7597, -25409, 24796, 47802, 45328, 23775, -6858, 4401, -12024, -3198, 3539, -13754, -4029, 10499, -30622, -34227, -33186, -28826, -12660, 2640, -26508, -84195, -25814, -9453, -16646, -36463, -55497, -27952, -8382, -33771, -4303, -10129, -76423, -52245, -91814, -81215, -48979, -78709, -38982, -15453, -41038, -50488, -4037, 15774, -22836, -27863, -17061, -10496, 4940, -2953, -25148, -19584, -23742, -11387, -31603, -29604, -33177, -54069, -71957, -72258, -67090, -50105, -49175, -87266, -98454, -47085, -9281, 26753, 33724, 21513, -4721, -89881, -74860, -70469, -36832, -30509, 21273, 21285, 3397, -21955, -15973, -8619, -45255, -20681, 22598, 13559, -48130, -36039, -38187, -70653, -17316, 16730]
1648A6730m0933R095k458n902O7270k4669P033k0644n007K215q3287j8317M8894
1635d9980O6125j078n2893j0753J4650K3540n850l236k4761R135K7813N1751o4326
1622a9863J0290L40l8116M9711k0166m2614k6263L4412k7590K9489L9589k242
1610a3023j4141j7135K0143j7200j4819l3899J9886M4283Q238Q220j2365L1624
1598I812M552k8850N4k31P849J7604Q715J1813l2628j9366n4390M4822L667k0109
1584d6686j8798J3727R180K0198j087O475K5852J7077j6558M5554r9753j7942
1572f2761M8564J4436q427k9702L9794j8709k2101k8743L4716L2193n9093M637
1560e5196j8185N8749L2964J5443Q027k6881m988l4115J04970J2497p7534l8984
$$ y = [16730, -24203, -15108, -17566, -23468, 43802, 19133, 26166, 5522, 515, 2730, -80557, -98874, -49980, 16145, 15067, -37826, -48579, -33929, -10389, -16239, -19475, -44236, -35101, -7288, 44463, -19863, -9573, -9233, -47349, 2362, -17804, -60418, -86681, -52269, -79859, -50370, -10781, -13023, -27164, -44299, -24156, -41356, -56175, -90074, -70188, -25905, -17667, -9447, -21812, 9812, 14364, -14486, -14432, -14663, -6814, 10790, 19505, 31318, -1310, -20676, -75066, -30244, -26577, -46686, -65484, -51757, -42577, -22379, -23466, -16991, 8861, 25938, 9380, 54934, -44819, -62761, -14197, 239, -8188, -37890, 1904, -16805, -38906, -67649, -32933, -740, -59833, -55196, -73381, -14632, 18332, 33775, 41802, 14921, 9933, -24182, 80788, 93285, 15751, -23233]
1548b3233m006J5907r480J343n768j8037O9533j8752J8891j859n3168K8316M010
1535C697l3570L3901j3998J6714j2758Q061l2974l2261M5626N445o124J3616M4746
1522D0121o1244q554L2769k8507o7486J1440L2951J1028j05M1138L0767l5839
1510a521K6655j4474m7682J1110K9278n852l161j1815K5074k4057j9582K1164
1498a4863R468J893j432N4946j546k6959j742j9040K9583Q137Q115J2675n744
1485E3491k6210j4537L067l2056j5998n7580L6876J9071k5046L0386J6370M202
1473g964K944O057o34n8751m690j2194L3792M1169j4146q022k6373N1963J0551
1460A3702k8873o8376l2733K2669L7785M8714l8080j3422J2427J2471k337k9990
$$ y = [-23233, -27239, -11332, -20812, -19469, -25237, -43274, 26259, 7507, 26398, 24539, -28629, -313, 3697, -29873, 4028, -9970, 6744, -6014, 2047, -30927, -63188, -17562, -12117, -18241, -4625, 40121, -21123, -29677, 3092, -25415, -92901, -81461, -48510, -37482, -37587, 3551, 34318, -1521, 25134, 10660, -37022, -25912, 3366, -2486, -5647, -17462, 7612, -16445, -36027, -14863, -5395, -3502, -4934, 50012, 48466, 21507, 19765, 725, 30308, 38445, 46560, 59235, 53491, 27281, 12744, 15811, -16245, -32243, -89823, -52947, -33876, -58922, -28536, -12166, -7964, -5020, 1037, 403, -58348, -63038, -75232, -41440, -271, -14417, -22439, -48812, 3151, 13702, -15171, -83547, -116280, -93611, -55826, -7112, -45192, -58614, -46187, -33716, -36053, -66043]
1448f6043K8409K5921K9133J257k3895p904K3113J508O1824n1482K776o789j7400
1435D28k774J970M868l0115M4372j3187j1411L0199K0226j7610l6590O714l9750
1422d2660L9558l697n870J2468o7129K9621J439k0410K2073l7890K8707M9559
1410E769l2129K717K9950p0124L763K4487K5482J1589l9377L4715j5122l1558
1398d9838L1271K0907k6072j4242L7614K8974j9579j4916j2246k7439k1877M9124
1386a8319L054m0692J1330K1703l7472Q31L9593m906j9771L2471o33m3575r688
1373f6074K0175k0486Q521J4215L9160k7968k0127l4049J092M8834k8295m224
1361f9226J5588J4716R325n4932O0989L5399M2474n0838l0007m601K431J5299
$$ y = [-66043, -37634, -11713, 17420, 18677, -5218, -13122, 9991, 11499, 73323, 21841, 24617, 17828, 428, -2346, -376, 4492, -25623, 18749, 5562, -5849, 24350, 44576, 26966, -9624, -2910, -42660, -3102, -6799, -12669, -201, -67330, -37709, -36270, -56680, -34607, -72497, -43790, 5769, -26360, -23643, 6307, -63817, -60054, -35567, -10085, 1504, -37873, -3158, -18280, -49838, -18567, 2340, -23732, -37974, -360, 28614, 9035, -5881, -18127, -45566, -67443, -18319, -15265, -55957, -44627, -22924, -60396, -59565, -19972, -24878, -44649, -12178, -12811, -56386, -66074, -45899, -66385, -57864, -43649, -4489, -32457, -52584, -86633, -85541, -36707, -65002, -69226, -53638, -38922, -29597, -84529, -23540, 11859, 54333, 3495, -26512, -31113, -28682, -13383]
1349a3383p825J0377r894J7503m1164J9014N663m6228K5440l721K1270m339p645
1336c4932j9841K4122J6920J3775j6296n0155K6412K4552K3360k9188l561r434
1324c4266l3575N1916l572j7371m587O028N4526J0369l5967l1886k3048K2917
1312c8516K8194j6985K8426k0752j070o394K557K5903r300J2428k7518K5898p361
1299d490j7863P818m6057M2422N0058p887j5979K9135m6111J2471m1363J3804
1287b4042K1819K3747K7000l5909n4329M7079j1435n434J5934o1737J0202L1113
1275a5992P173L717J4957R241j4847J0980J4043p49o7844K9530K8028M421m2576
1262a9918j7192J4675K0994K6436j121K4037J2361n7970k0271m10M5493l4667
$$ y = [-13383, -21208, -10831, -20725, -3222, -44386, -25372, -19709, -65937, -40497, -44218, -22948, -27287, -34932, -54773, -30651, -13731, 44, -16252, -66407, -39995, -15443, 7917, -21271, -24832, -34266, -67841, -15925, -19497, -36868, -41455, -35427, 19099, 29468, -6499, -38385, -61433, -38516, -10322, -27307, 1119, -19633, -20703, -27097, -24540, 1363, -7937, 4491, -23027, 2871, -4490, -22353, -14535, -60592, -18170, 31888, 24001, 8022, 37157, -8954, 3517, -37846, -24042, -2223, 21524, 48524, 12615, -41714, 5365, -6070, -11504, 4430, -57307, -47105, -15992, -8819, -5102, 9855, 19096, 4249, 15229, 29272, 28523, -39321, -9791, 18237, 22658, -19918, -37110, -22435, -1441, 24995, 23874, 47911, 60272, 2302, -17969, -18379, 27114, -7553]
1250g553m9514L4550L8079j1032j2871j1085l069P0387j9179L1644n3622r6696
1238h9961N823P8003j4537j1096L016K6894o708K4697j9370k7979O755l1760O6411
1225A0188j5930n9142N1266L9927L8580p2957L9562n607L413n379n8245o7227
1213a01551L3613L863j9016P4854K8751j0889j0070L0293p606k7423k1760N0874
1201B3933j2286j3630l5111J081j828k1695L262R279M5851k663J8036R396n13
1188B3112J154n6100l780M377L2031J6921J2215l0963k9849J4538K5900k7465
1176a7909M7060R920m4963K5710j27J9921K82k2534k7699K0258m9817J9928M150
1163a5820j8772K2408k1509J9048K536k2619L1047J9791j3493k3108N0515L3432
$$ y = [-7553, -57067, -22517, 15562, 4530, -8341, -19426, -22495, 47892, 28713, 60357, 6735, -89961, -84138, -6135, -20672, -31768, -28752, -1858, -8566, 16131, -3239, -31218, -24463, -56223, 10188, -5742, -64884, -13618, 26309, 64889, -8068, 31494, 25887, 29300, 23921, -34324, -101551, -67938, -64075, -83091, -8237, 20514, 9625, -445, 29848, 22242, -5181, -26941, 23933, 11647, -1983, -37094, -36013, -37841, -59536, -56274, -46995, -1144, -3807, 14229, 23625, 23112, 24266, -31834, -35614, -31237, 794, 17715, 29930, -1033, -30882, -16344, 9556, -17909, 29151, 39071, -5892, 19818, 19691, 39612, 39894, 17360, -10339, 9919, -39898, -19970, -15820, -34592, -12184, -33693, -14645, -12109, -34728, -3681, 16110, 2617, -20491, 30024, 63456]
1151F3456k7894k0672M7898n4878l2776K4895l8465O813K463J1802j1702K5560
1139c500k876j8103m470L2841J8269k0636l1620K6435j0105m102N1161l2921J2236
1126A2609J5585k0721J6618l7099L896M1769k54l2211K8045m235r284J8514K990
1113C6222K668j4198j4018O471k8410L3100n4725k8284L6864N0210m646j4485
1101F769K6322k0573R950k7991q779K9004L7643k1402O067k4671j9822J621j0933
1088a6795l2681K7332J9765k8060o0159l8204O8783M6650j9732O309J7240J4191
1076D639J0352J1604m1859K9247Q953k3448l984k1369K5503J6987J1106o0851
1064c3120K2715L5619M1216J4200n4635m9263J2429L4610l471k536m1314K8759
$$ y = [63456, 35562, 14890, 62788, 7910, -24866, 29, -38436, -31623, -29160, -17358, -29060, -3500, -6376, -24479, -28949, 3892, 22161, 1525, -30095, -3660, -13765, -17867, 33294, 373, 12609, 28194, 7473, 24091, -13008, -9112, 32657, 32403, 192, 28237, 24002, 14718, 33232, 36222, 38890, 24692, 10674, 17145, -11265, 21835, -32890, -61174, -24310, 25900, 21254, 6769, 33091, 12518, 22468, -5523, -14302, 14702, 52345, 30943, 37010, 12339, -7483, -5862, -16795, -49476, -22144, -2379, -30439, -90598, -128802, -60019, -13369, -33101, -26792, -9552, 4639, 14991, 26595, -15264, 13983, 22936, -512, -4496, -25865, -362, 16625, 27731, -33120, -10405, 25214, 66430, 80630, 25995, -23268, -10839, 23771, 20300, 17764, -23550, 5209]
1052E209k3849M5083J0267j2131k9847l9194M5519O4134k1433j6064k8038k1330
1040b1674L0309n5581M1420o792j3301k395m9755N4491N9277k5694q236l8417
1028c6348j9546N4438r856K5999m4077K6271Q73L673J5317K4656J3437j8803L4521
1015G0555m8385l534q827m788L9559K0167j0660j0019k2195j764R327o2n0732
1002b1358J2356J1432j6934K199m207L089Q683K695K1459l6849k0782L2342N0667
989D4792k8596o8746M2761j023k5306Q6416n2484j8781J3002m8112K4869L1900
977F92R660k1700q996k7891K6539k7895J8022J9172n80L9343m4252Q060j7000
964b6826Q309L8862J964m1435L965p056L1657l3600N498j9352k4470M4599O4956
$$ y = [5209, -18640, 26443, 36710, 24579, -5268, -44462, 1057, 65191, 43758, 27694, -344, -21674, 8635, -46946, -5526, -12318, -25619, -28014, -77769, -23278, 35999, 10305, 2069, -36348, -55894, -1456, -11312, 14687, -29390, -3119, -2246, 1427, 16744, 41400, 54837, 36034, 70555, 22170, 18636, 9809, 5021, 44580, 64747, 54087, 44068, 21873, 20109, 29436, 29374, -21358, -9002, 2430, -14504, -12305, -16512, -13423, -4740, -2045, 19414, -17435, -38217, -5875, 44792, 16196, -52550, -9789, -10812, -36118, 50298, -2186, -20967, -7965, -56077, -31208, 692, 10352, -11348, -20344, -48235, -21696, -49591, -31569, -12397, -12977, 26366, -17886, -9826, -26826, -18517, 20345, 22309, -19126, -15161, -22217, 9440, -24160, -18662, -38014, -62484, -17885, 47071]
951D7071r919K034o257l5979L707p834l6483L6939J5178j3416j4950j8146K809
938c5246K7660L1746k6156M658K7936K8815l0875n0115M32N0569k1301N370l1606
925a8113N0325m9043L2579L2018j3403m820J9103o587k4850J000J4075j818p969
912B2497Q594j1012m8585M545k5964J0788L8041j3421L0161l8622Q015N8985j193
899D2829K9501k3673l9766J8696L340m0361K4007K1194l4480k8068j6586m965
887d8332o081R12P537K6915k1619O2976m610l0324k6987L0901K1058J7616o156
874B3806L458L4495n986k2203k8539M3550J5794J8795j2031m0927l9763K8387
862A8836J4122j8506K0048P274k5022j072j83k9798L5484L6525l9620k1489N44
$$ y = [47071, 37152, 39186, 32929, -3050, 657, -7177, -43660, -6721, 8457, -4959, -19909, -38055, -35246, -7586, 24160, -1996, 2662, 30598, 59413, 28538, -21577, -21145, 29424, 8123, 13493, -18113, 32212, -16831, 15748, 47766, 34363, 29543, 48646, 42059, 17209, 18209, 32284, 30466, 22497, 31091, 20079, -28506, -23961, -49925, -39137, -1096, -14517, 15644, -22978, -14963, 44022, 42829, 72330, 48657, 8891, 27587, 30927, -9434, 14573, 35767, 1287, -26781, -43367, -48332, -54413, -53501, -45964, -19049, -40668, 22308, 17698, -12626, -39613, -8712, 12346, 29962, 23806, 27264, 61759, 55773, 33570, 5031, 48581, 64375, 83170, 71139, 30212, -9551, 18836, 32958, 14452, 34500, 41774, 16752, 15680, 15497, -14301, 21183, 57708, 18088, -3401, -2857]
849b857j5921j202L4970M313l7688p454j6232M3055K6968k7647J9390j9706K2772
836B2761J2940J1468J5444m2055m0470j1858N5227k803N059L757o4216K7520J7005
823I779J856o6074k057N7463K0513m2095q866K9664j6917Q443K7906n217L5877
810E0275K332m7048N473L2082M7569Q456o8048l1796J5598k4292K3917l8897N0276
797B5897m3608k7808K9022L9390M2230j1478m131j3593n0696J4405J1355K831
785A3816N201J2587L009K1692l5924k1682j2669K0531o384M2964k416J3402K3992
772G8119m3370j8505k8097K2923K7997Q505l1353k7125j9921N6403m806l807r899
759G064L935L4556l05m3356j168M8076J0193J6911J0977l7456p5904m3781P7474
$$ y = [-2857, -18778, -19980, 14990, 19303, -18385, -25839, -42071, 984, 27952, 305, 19695, -11, 22761, 35701, 47169, 62613, 20558, -19912, -31770, 23457, 20654, 25713, 29470, -34746, -7226, 9779, 11635, -54439, -56496, 967, 21480, -20615, -29481, 183, -16734, -8291, 19615, 14398, 50275, 52607, 5559, 11032, 43114, 90683, 99139, 31091, -705, 14893, -9399, 14518, -24379, 25897, -17711, -45519, -16497, 22893, 65123, 53645, 49514, 35921, -14775, -370, 10985, 13816, 19017, 31604, 34613, 56305, 20381, -1301, -13970, 6561, 177, 43141, 40725, 54127, 78119, 34749, 16244, -11853, 11070, 39067, 47572, 16219, -10906, -30827, 25576, 20770, 16963, 7064, 10999, 45555, 45250, 1894, 726, 48802, 58995, 75906, 86883, 49427, -26477, -70258, 7216]
746G216K932j0498J8664L222j3537k3379K8960j3253L4686J9854k3365K5508k8003
$$ y = [7216, 10148, -350, 18314, 21536, 7999, -15380, 13580, 327, 35013, 54867, 31502, 57010, 29007]
$$ [...]
##END NTUPLES=NMR SPECTRUM
##END=
