##TITLE=1H_TG-2340-C
 CDCl3
 8 sc, 
 14.12.2021
##JCAMPDX= 6.0         $$ Bruker NMR JCAMP-DX V2.0
##DATA TYPE= NMR SPECTRUM
##DATA CLASS= NTUPLES
##ORIGIN= UXNMR, Bruker Analytische Messtechnik GmbH
##OWNER= root
$$ XWIN-NMR		Version 3.5
$$ Tue Dec 14 13:07:03 2021 Russian Standard Time (UT+4h)  she@DPX200
##.OBSERVE FREQUENCY= 200.131346
##.OBSERVE NUCLEUS= ^1H
##.ACQUISITION MODE= SIMULTANEOUS
##.ACQUISITION SCHEME= undefined
##.AVERAGES= 8
##.DIGITISER RES= 18
##SPECTROMETER/DATA SYSTEM= spect
##.PULSE SEQUENCE= zg30
##.SOLVENT NAME= CDCl3
##.SHIFT REFERENCE= (INTERNAL, CDCl3, 0, 15.7193)
##AUDIT TRAIL= $$ (NUMBER, WHEN, WHO, WHERE, WHAT)
$$ ##TITLE= Audit trail, XWIN-NMR		Version 3.5
$$ ##JCAMPDX= 5.01
$$ ##ORIGIN= Bruker BioSpin GmbH
$$ ##OWNER= she
$$ F:/spectra/data/she/nmr/H-F/1/pdata/1/auditp.txt
$$ ##AUDIT TRAIL=  $$ (NUMBER, WHEN, WHO, WHERE, WHAT)
(   1,<2021-12-14 13:05:41.06 +0400>,<she>,<DPX200>,
      <created by zg, POWCHK disabled, PULCHK disabled
       configuration hash MD5:
       00 E9 B6 7A A2 85 ED C7 34 08 36 98 17 FE 4E 26
       data hash MD5: 16K
       0F 06 5C 60 60 02 E0 41 64 21 F6 73 B7 9A 97 0E>)
(   2,<2021-12-14 13:05:44.65 +0400>,<she>,<DPX200>,
      <Start of raw data processing
       efp BC_mod = 2 LB = 0.24 FT_mod = 6 PKNL = 1 PHC0 = -15869.73 PHC1 = 9.000799 SI = 16K 
       data hash MD5: 16K
       23 57 A3 4E B1 B6 4E 40 CD 20 D2 EE 40 7E 7C 98>)
(   3,<2021-12-14 13:06:03.93 +0400>,<she>,<DPX200>,
      <pk PHC0 = -0.7830656 PHC1 = 0.6 
       data hash MD5: 16K
       48 AF BC 06 9C A2 82 21 F3 E1 A2 FE 7F 71 A8 C9>)
(   4,<2021-12-14 13:06:07.32 +0400>,<she>,<DPX200>,
      <abs ABSG = 5 
       data hash MD5: 16K
       41 9B 15 57 22 C3 5D 00 D9 60 87 4E 8A A7 87 47>)
$$ ##END=
$$ 
$$ hash MD5
$$ E0 8B 7F DC 02 9F 00 AB 0A 58 69 78 B9 E7 6B 0C
##$RELAX= 
##$RELAX= 
##$RELAX= 
##$RELAX= 
##$RELAX= 
##$RELAX= 
$$ Bruker specific parameters
$$ --------------------------
##$DU= <F:/spectra>
##$EXPNO= 1
##$NAME= <H-F>
##$PROCNO= 1
##$TYPE= <nmr>
##$USER= <she>
##$AMP= (0..31)
100 100 100 100 100 100 100 100 100 100 100 100 100 100 100 100 100 100 
100 100 100 100 100 100 100 100 100 100 100 100 100 100 
##$AQSEQ= 0
##$AQ_mod= 1
##$AUNM= <au_zg>
##$AUTOPOS= <>
##$BF1= 200.13
##$BF2= 200.13
##$BF3= 200.13
##$BF4= 200.13
##$BF5= 200.13
##$BF6= 200.13
##$BF7= 200.13
##$BF8= 200.13
##$BYTORDA= 1
##$CFDGTYP= 0
##$CFRGTYP= 5
##$CHEMSTR= <none>
##$CNST= (0..31)
1 1 145 1 1 1 1 1 1 1 1 1 1 1 1 1 1 1 1 1 1 1 1 1 1 1 1 1 1 1 1 1 
##$CPDPRG= <>
##$CPDPRG1= <>
##$CPDPRG2= <>
##$CPDPRG3= <>
##$CPDPRG4= <mlev>
##$CPDPRG5= <mlev>
##$CPDPRG6= <mlev>
##$CPDPRG7= <mlev>
##$CPDPRG8= <mlev>
##$CPDPRGB= <>
##$CPDPRGT= <>
##$D= (0..31)
0 1.2 0 0 0 0 0 0 0 0.06 0 0.03 0 0 0 0 0.0002 0 0 0 0 0 0 0 0 0 0 0 0 
0 0 0 
##$DATE= 1639472740
##$DBL= (0..7)
120 120 120 120 120 120 120 120 
##$DBP= (0..7)
150 150 150 150 150 150 150 150 
##$DBP07= 0
##$DBPNAM0= <>
##$DBPNAM1= <>
##$DBPNAM2= <>
##$DBPNAM3= <>
##$DBPNAM4= <>
$$ [...]
##$SUBNAM2= <"">
##$SUBNAM3= <"">
##$SUBNAM4= <"">
##$SUBNAM5= <"">
##$SUBNAM6= <"">
##$SUBNAM7= <"">
##$SUBNAM8= <"">
##$SUBNAM9= <"">
##$SW= 18.0517287032376
##$SWIBOX= (0..15)
0 0 2 0 0 0 0 0 0 0 0 0 0 0 0 0 
##$SW_h= 3612.71676300578
##$TD= 16384
##$TD0= 1
##$TE= 0
##$TE2= 300
##$TE3= 300
##$TEG= 300
##$TL= (0..7)
0 120 120 120 120 120 120 120 
##$TP= (0..7)
150 150 150 150 150 150 150 150 
##$TP07= 0
##$TPNAME0= <>
##$TPNAME1= <>
##$TPNAME2= <>
##$TPNAME3= <>
##$TPNAME4= <>
##$TPNAME5= <>
##$TPNAME6= <>
##$TPNAME7= <>
##$TPOAL= (0..7)
0.5 0.5 0.5 0.5 0.5 0.5 0.5 0.5 
##$TPOFFS= (0..7)
0 0 0 0 0 0 0 0 
##$TUNHIN= 0
##$TUNHOUT= 0
##$TUNXOUT= 0
##$USERA1= <user>
##$USERA2= <user>
##$USERA3= <user>
##$USERA4= <user>
##$USERA5= <user>
##$V9= 5
##$VALIST= <valist>
##$VCLIST= <CCCCCCCCCCCCCCC>
##$VD= 0
##$VDLIST= <DDDDDDDDDDDDDDD>
##$VPLIST= <PPPPPPPPPPPPPPP>
##$VTLIST= <TTTTTTTTTTTTTTT>
##$WBST= 1024
##$WBSW= 4
##$XGAIN= (0..3)
0 0 0 0 
##$XL= 0
##$YL= 0
##$YMAX_a= 274619
##$YMIN_a= -425630
##$ZGOPTNS= <>
##$ZL1= 120
##$ZL2= 120
##$ZL3= 120
##$ZL4= 120
##$ABSF1= 15.72045
##$ABSF2= -2.331399
##$ABSG= 5
##$ABSL= 3
##$ALPHA= 0
##$AQORDER= 0
##$ASSFAC= 0
##$ASSFACI= 0
##$ASSFACX= 0
##$ASSWID= 0
##$AUNMP= <proc_1d>
##$AZFE= 0.1
##$AZFW= 0.1
##$BCFW= 0
##$BC_mod= 2
##$BYTORDP= 0
##$COROFFS= 0
##$CY= -3
##$DATMOD= 1
##$DC= 0
##$DFILT= <>
##$DTYPP= 0
##$F1P= 0
##$F2P= 0
##$FCOR= 1
##$FTSIZE= 16384
##$FT_mod= 6
##$GAMMA= 0
##$GB= 0
##$INTBC= 1
##$INTSCL= 0
##$ISEN= 128
##$LB= 0.24
##$LEV0= 0
##$LPBIN= 0
##$MAXI= 10000
##$MC2= 0
##$MEAN= 0
##$ME_mod= 0
##$MI= 1.114404
##$NCOEF= 0
##$NC_proc= -5
##$NLEV= 6
##$NOISF1= 3.799351
##$NOISF2= 2.8
##$NSP= 0
##$NTH_PI= 0
##$NZP= 0
##$OFFSET= 15.71934
##$PC= 1
##$PHC0= -15870.51
##$PHC1= 9.6008
##$PH_mod= 1
##$PKNL= yes
##$PPARMOD= 0
##$PSCAL= 0
##$PSIGN= 0
##$REVERSE= no
##$SF= 200.130006446457
##$SI= 16384
##$SIGF1= 3
##$SIGF2= 2
##$SINO= 5.538805
##$SIOLD= 16384
##$SREGLST= <1H.CDCl3>
##$SSB= 0
##$STSI= 16384
##$STSR= 0
##$SW_p= 3612.71676300578
##$SYMM= 0
##$S_DEV= 0
##$TDeff= 16384
##$TDoff= 0
##$TI= <>
##$TILT= no
##$TM1= 0
##$TM2= 0
##$TOPLEV= 0
##$USERP1= <user>
##$USERP2= <user>
##$USERP3= <user>
##$USERP4= <user>
##$USERP5= <user>
##$WDW= 1
##$XDIM= 16384
##$YMAX_p= 331716080
##$YMIN_p= -693595
$$ End of Bruker specific parameters
$$ ---------------------------------
##NTUPLES= NMR SPECTRUM
##VAR_NAME=  FREQUENCY,     SPECTRUM/REAL,   SPECTRUM/IMAG
##SYMBOL=    X,             R,               I
##VAR_TYPE=  INDEPENDENT,   DEPENDENT,       DEPENDENT
##VAR_FORM=  AFFN,          ASDF,            ASDF
##VAR_DIM=   16384,         16384,           16384
##UNITS=     HZ,            ARBITRARY UNITS, ARBITRARY UNITS
##FACTOR=    0.220516191357247, 1,           1
##FIRST=     3145.91168045659, 0,            0
##LAST=      -466.805082549185, 0,           0
##MIN=       -466.805082549185, -693595,     0
##MAX=       3145.91168045659, 331716080,    0
$$ Real data points
##PAGE= N=1
##DATA TABLE= (X++(R..R)), XYDATA
$$ [...]
7262D78181m8101j41M7867l0752q159M2509M8434j6042j8559M6920Q402p5296
7250D75263M2105J7235k5813K5596K8492P3650N4921J0998o5215l0149P771M2528
7238F57382O5431O360j7994L2087K6153j9992N4222n0576l7985L2295J8038R018
7226G74439J8179J7677J7539j3421o835M142J1837O816L4459r61N0968L9629P6848
7213A031316J3605Q4399O8618L8940J3263q321M2101L1603J21131K9085O096L6640
7201A508476M2991L4638N5764O6099Q4681R7282J3277M1521R2686M9728N8754
7190B145897J05768N7527J9854M1134P7885N5955K9965P0707p054M9871N1508
7179B699017Q2943R8310O6738Q0628j6703M1800J18567K3276J01239J02415R0212
$$ y = [478181, 430080, 429939, 477806, 447054, 438895, 481404, 529838, 513796, 495237, 542157, 550559, 475263, 517368, 534603, 508790, 534386, 562878, 636528, 691449, 702447, 637232, 607083, 614854, 657382, 722813, 729173, 711179, 743266, 769419, 749427, 803649, 753073, 715088, 747383, 765421, 774439, 792618, 810295, 827834, 814413, 807578, 811720, 823557, 830373, 864832, 863871, 914839, 954468, 1031316, 1044921, 1129320, 1197938, 1236878, 1250141, 1241820, 1283921, 1315524, 1436655, 1465740, 1471836, 1508476, 1551467, 1586105, 1641869, 1707968, 1792649, 1889931, 1903208, 1944729, 2037415, 2087143, 2145897, 2251665, 2309192, 2329046, 2370180, 2448065, 2504020, 2533985, 2604692, 2597638, 2647509, 2699017, 2781960, 2880270, 2947008, 3027636, 3010933, 3052733, 3171300, 3194576, 3295815, 3398230, 3488442]
7168C488442K0012Q6456R5652J41131J08418J37536J33086J05535P5505K08599
7158D600372J78961J95970J75105K34642K14917K48428K76657K75904L18466K78145
7148F997567M08603L82494L60106N07789N00272N79379O21915P25858Q01883Q93061
7138A2778927J015382J142913J205053J449061J750720K035919K407550K827060
7130B6612585L214730L771394M310940M895651N639158O541445P371672Q298154
7122G0655729Q564142Q255784N689098J161554m132897r355448j1740355j2051570
7114E7046037j0275358q026149n997108m533912l401697k743870k204480j888417
7106A7975046j571691j379277j201351j090822r58491q59669p69764o71009m81931
$$ y = [3488442, 3508454, 3594910, 3690562, 3831693, 3940111, 4077647, 4210733, 4316268, 4391773, 4600372, 4779333, 4975303, 5150408, 5385050, 5599967, 5848395, 6125052, 6400956, 6719422, 6997567, 7406170, 7788664, 8148770, 8656559, 9156831, 9736210, 10358125, 11083983, 11885866, 12778927, 13794309, 14937222, 16142275, 17591336, 19342056, 21377975, 23785525, 26612585, 29827315, 33598709, 37909649, 42805300, 48444458, 54985903, 62357575, 70655729, 79219871, 87475655, 93164753, 94326307, 90193410, 80837962, 69097607, 57046037, 46770679, 38744530, 32747422, 28213510, 24811813, 22067943, 19863463, 17975046, 16403355, 15024078, 13822727, 12731905, 11773414, 10913745, 10143981, 9472972, 8991041]
7097H991041m51565l98488l27103l29719l70742k82918k84913k12789k31284k93043
7087E808477k30396k37636j97019j81841j45163j35009j66644r7171j55958j63224
7077D098416j21963j60756j51777j82698q1126j02076j54279j29109j20307n4935
7067B839390q6980j21577l096k3308r9786m7214k8326j18185n9948o3648j2452
7056B174870k4573p4832q2126o2017q8952k7157p466q5057k4201j8808j6923p4007
7044A588751k5742o222p1701m892l8238J3230j6072o2841M143k7360j04753l2302
7032A216001q1753k875o9795L35J7819m8170M4415j9926n5400J8573k1248l4921
7020I63055n5446m9585J4677n286N376o5082q6388K0850k8395j6735m2906j4008
$$ y = [8991041, 8539476, 8140988, 7813885, 7484166, 7113424, 6830506, 6545593, 6332804, 6101520, 5808477, 5578081, 5340445, 5143426, 4961585, 4816422, 4681413, 4514769, 4417598, 4261640, 4098416, 3976453, 3815697, 3663920, 3481222, 3400096, 3298020, 3143741, 3014632, 2894325, 2839390, 2752410, 2630833, 2627737, 2604429, 2504643, 2457429, 2429103, 2310918, 2250970, 2187322, 2174870, 2150297, 2075465, 1993339, 1931322, 1842370, 1815213, 1807747, 1722690, 1698489, 1679681, 1662758, 1588751, 1563009, 1556787, 1485086, 1480194, 1441956, 1455186, 1439114, 1376273, 1380416, 1353056, 1248303, 1216001, 1134248, 1131373, 1061578, 1061913, 1079732, 1031562, 1075977, 1056051, 1000651, 1019224, 997976, 963055, 907609, 858024, 872701, 867415, 872791, 807709, 721321, 742171, 713776, 697041, 654135, 640127]
7008F40127r154j0377o3397l3959K2417k7186o815K534J4821n6n1045K617m873
6995D75654k7067L0263o38L7J7267j4804K4254m211o2399j1373J1851j5831J4397
6982D37400k707p3582J6573M1974m3671q0576O9754J286m0050n1051M1717N212
6970C22279l7266K4943M6317L3248o4735j7176p28m287K7816j7005j5185J4281
6958C12502k8340m533O215K5747m5705l8201K5724J1530m346m4880l0902N0419
6946B35230N7894p563j6836j9063l4638K4410j5166j2140K8357m0380l4089J8010
6934A84026j9457m921M7457l4889L3012J7861q306l994o455m1810j199J0183L6717
6921B08225M296J1102o4970J3563L2572l6428q547m4748K0941L5046J7597K346
$$ y = [640127, 630973, 620596, 557199, 523240, 545657, 518471, 511656, 514190, 529011, 528955, 477910, 480527, 475654, 448587, 478850, 478212, 478249, 495516, 480712, 504966, 500755, 438356, 426983, 438834, 423003, 437400, 434693, 361111, 377684, 419658, 375987, 295411, 365165, 366451, 326401, 275350, 317067, 322279, 285013, 309956, 356273, 389521, 324786, 307610, 306882, 302595, 330411, 313406, 298221, 312502, 284162, 279629, 285844, 311591, 265886, 227685, 253409, 264939, 260593, 215713, 184811, 235230, 293124, 285561, 268725, 249662, 215024, 239434, 224268, 212128, 240485, 200105, 166016, 184026, 164569, 159648, 207105, 172216, 205228, 223089, 214783, 210789, 204334, 162524, 161325, 171508, 208225, 212521, 223623, 158653, 172216, 204788, 168360, 159813, 115065, 136006, 171052, 188649, 190995]
6909A90995m0784j9743K787N0993j2322n317J028l6673q539O610k6575k665J8129
6896A17924l4939N2488k616l8133l3900Q3960L079n6004r062j2217m746K555M3515
6883A11904L0164p4920P9756m4412m1753N9192j4707k5524M0195q006K993J5183
6871A30065m2288K6935O881l0808o423O134l0598k4109N5045J1898M3357n1554
6859I4535j764l585j4752k9364j1578P1695R9l1844q8889Q4461K632k7539N7287
6846A01394j6397k4412J8939l9456K0612O26l1758K1375M778J5412J1237J4901
6834I7251k5549l919N705n0631N0474k2461m494l0968J2756L2610J791j6338j1713
6821C4514j9028L8407l3715n871K5747L0898j438m2590J6851k3041j6776K6286
$$ y = [190995, 150211, 130468, 133255, 184248, 171926, 166609, 167637, 130964, 122425, 129035, 102460, 99795, 117924, 82985, 135473, 132857, 94724, 60824, 144784, 147863, 91859, 82797, 70580, 65834, 68389, 111904, 142068, 67148, 146904, 102492, 60739, 119931, 105224, 79700, 119895, 111889, 114882, 130065, 87777, 114712, 121593, 90785, 84362, 90496, 59898, 35789, 90834, 102732, 146089, 94535, 92771, 89186, 74434, 45070, 33492, 105187, 105286, 73442, -15447, 69014, 71646, 44107, 101394, 84997, 60585, 79524, 40068, 60680, 61306, 29548, 50923, 55701, 71113, 82350, 97251, 71702, 67783, 73488, 22857, 73331, 50870, 46376, 15408, 28164, 60774, 62565, 46227, 34514, 15486, 53893, 20178, 14307, 40054, 70952, 69514, 26924, 43775, 20734, 3958, 30244]
6809C0244l094k2291Q665K6689M0715m7083N310J297J4513l3387M262M0027k7982
6796C7885N5794l0265l1707M5746l9968K7871J0303k8417K4824k4370N511k3706
6784B9501O566j8037j3922j1979m911M4910P303J2794k966m001R933j5244K5279
6771F5226K7256J3614J8174k7871m1486k3247j1192J9463L3045j3022J1276m0402
6759C0834J0736k855m7205q114K8774p640Q5668J420k1410J2166p057k3147k2754
6746B9416k0434K5383N4412j5084k6282K3638J8040k0422j3960K031M3712L8318
6734A38768r439k9509J6333N995M5200K0642M1972M4563J0542n362o471R0645
6722C63879J15199j6890J2814k470J8621R533l2631j14949o0515l4066l3573m5517
$$ y = [30244, 27150, 4859, 13524, 40213, 80928, 33845, 39155, 40452, 54965, 21578, 25840, 65867, 37885, 93679, 63414, 31707, 77453, 37485, 65356, 75659, 47242, 72066, 47696, 53207, 29501, 36067, 18030, 4108, -7871, -12782, 32128, 39431, 52225, 49259, 45258, 55191, 39947, 65226, 92482, 106096, 124270, 96399, 54913, 31666, 20474, 39937, 72982, 59960, 71236, 30834, 41570, 38715, -8490, -16604, 12170, 4530, 90198, 91618, 70208, 82374, 75317, 52170, 29416, 8982, 34365, 88777, 73693, 47411, 71049, 89089, 68667, 54707, 56738, 100450, 138768, 129329, 99820, 116153, 122148, 167348, 187990, 229962, 274525, 285067, 279705, 273234, 363879, 479078, 462188, 475002, 472532, 491153, 500686, 468055, 353106, 292591, 258525, 224952, 179435]
6710A79435o5901M0244r775r654k3060k4095k972o170k7202K4088q756j6581K4877
6697G4478r058l2338L646l9075J7048L4979O07j8453J5476r013J4502j9453Q784
6684D2130m5247j4372J9522N241M0165L756N213m3010J0455j3980k8671K1113
6672B315L2991K3838k3414l989m6509N960q485J0015J7354k1506J9914O373J1227
6659B6084m6692K3991J0311K4133j6354L4678k099m1383J2425R130K4460L6607
6647I5291k2085o0713n920n387J9502N1302p663m5576l529o2446K361Q669J8895
6634a7299m005l3171O7047l333m561j9881N6198k8931J7612k4918K3568n4270
6622b5944q424L8591M6472P175k4689q482l0206j6254J8585M4718l1335k4996
$$ y = [179435, 113534, 153778, 144003, 134349, 111289, 87194, 84222, 78052, 50850, 74938, 66182, 49601, 74478, 65420, 33082, 36728, -2347, 14701, 49680, 50287, 31834, 47310, 38297, 52799, 33346, 42130, -3117, -17489, 2033, 7274, 47439, 51195, 56408, 13398, 23853, 9873, -18798, 2315, 35306, 59144, 35730, 31741, -14768, -8808, -17293, -7278, 10076, -11430, 8484, 14857, 26084, -20608, 3383, 13694, 37827, 21473, 56151, 54052, 12669, 25094, 34224, 58684, 95291, 73206, 12493, 6573, 1186, 20688, 71990, 64327, 18751, 15222, -47224, -44863, -36194, -17299, -21304, -54475, 12572, 9239, 4678, -15203, 40995, 12064, 29676, 4758, 28326, -25944, -34368, 4223, 50695, 57870, 33181, 24699, -5507, -21761, -3176, 41542, 10207, -14789]
6610a4789L7912K652q931J2741l4758M9367k7583J5593k8877j2030r154L2680
6598A4823J9244k3151j4570K8757K2619j2125n5927L9711j2421j3568K4226l519
6586A4099k0365r362O4547R214l9199K9187m5870p310L6414J725J0297j0974j2690
6573A9713K7003O330n6919P592J736r290L4321J3595J8100l9366O7851l894n5810
6560C0962L0626J0062J9347k9446K8939j9897q945l1153M575L9969m0518K847
6548C7368O180L2598M6113l1459J9279K7397L8491K5710j5787k6687Q6354L7834
6536B83391P7559L9195N4599J5454m5147m0564q0086p9585n0845m4677Q465l8814
6524I8945k0919L721K4704L7552j7066n6657k0465P295P0423j7694q8576N3863
$$ y = [-14789, 23123, 25775, 16844, 29585, -5173, 44194, 16611, 32204, 3327, -8703, -17857, 14823, 34067, 10916, -3654, 25103, 47722, 35597, -20330, 19381, 6960, -6608, 17618, 14099, -6266, -15628, 48919, 58133, 18934, 48121, 2251, -5059, 31355, 33080, 43377, 32403, 19713, 46716, 53046, -3873, 3719, 5455, -3835, 30486, 44081, 62181, 22815, 90666, 86772, 30962, 61588, 71650, 90997, 61551, 90490, 70593, 61648, 30495, 35070, 75039, 34521, 37368, 43548, 76146, 122259, 90800, 110079, 137476, 175967, 201677, 185890, 159203, 245557, 283391, 360950, 400145, 454744, 470198, 425051, 384487, 304401, 224816, 173971, 129294, 137759, 98945, 78026, 81747, 106451, 144003, 126937, 70280, 49815, 57110, 127533, 109839, 21263, 75126]
6512G5126k8283m282J419k2411Q21j3288O101K8892k8323k3322j0583k011M7035
6499B6891o851m3955O995N588J5775L5816Q288k2074N743j2916J076l627J3008
6486B9757L0661l9378q6822K8659K694R907N6145P067j9149K2249J0276j6651
6474C5415j0214n189Q719l900l2389M5034o3420M9401k7694l9919P6636K0583
6462E3063j4960J0798l6612l4677L8363j5127K5286J1348k166P98j2351o826p965
6449H972O882k1469l5211K3592O1677J4660j2009L7066m6858j8005L5105O077
6437F0479L1726k2054l2356n442q757l622K2231L9755l1728l5178N3900N5763
6425A24717j7339j1630L057L844m508M8922m0714k7064k8742L0321J6620N9546
$$ y = [75126, 46843, 42561, 43980, 21569, 22390, 9102, 15203, 44095, 15772, -7550, -18133, -20144, 26891, 20040, -23915, -16920, -11332, 4443, 40259, 48547, 26473, 32216, 19300, 20376, 16749, 29757, 60418, 21040, -65782, -37123, -34429, -24522, 31623, 38690, 19541, 41790, 52066, 35415, 25201, 20012, 28731, 24831, -7558, 37476, -25944, 23457, -4237, -44156, 32480, 53063, 38103, 48901, 12289, -22388, 15975, 848, 26134, 37482, 35316, 36114, 23763, 16937, 8972, 15854, -5615, -40826, -17234, 44443, 59103, 47094, 84160, 37302, 19297, 54402, 60479, 92205, 70151, 37795, 32353, 23596, 19974, 42205, 81960, 50232, 15054, 68954, 124717, 107378, 95748, 98805, 102649, 98141, 147063, 106349, 79285, 50543, 80864, 97484, 157030]
6413A57030M2091m3760J2903P850J825K4384m1586j9618l1557K8644J7336P543
6401A63085j9709l9570R467K0359O8089J190j6341K2970k7421j6290R049k2769
6389A52109J9440l2898j6223k549q741j6368l1449K128l3262N5913Q479l8696
6377E7883K2848O911l0082J5574q147N761K5395n822K4586j1216M7696l1681j559
6364A18147N2597N1713k7179K781q83j7190K7681j108M9820l304m9208J0532N6889
6351B71288j2125J2655R515j6220j1498K2420k0698j135K8955l9239j3367m3389
6339A87162j7696J1897k4219J9779J3903L4246J0873p3725k247P805K5026L1937
6327B24741n109o6933n896J8920M3925K9441L5378q1312n42O0511L301J0947K6366
$$ y = [157030, 199121, 155361, 168264, 176114, 177939, 202323, 160737, 141119, 109562, 138206, 155542, 163085, 143376, 103806, 113273, 133632, 201721, 202911, 186570, 209540, 182119, 165829, 174878, 152109, 171549, 138651, 122428, 119879, 111138, 94770, 63321, 65449, 32187, 88100, 96579, 57883, 80731, 87642, 57560, 73134, 64987, 70748, 96143, 90321, 114907, 103691, 151387, 119706, 118147, 170744, 222457, 195278, 198059, 197176, 179986, 207667, 206559, 256379, 253075, 203867, 214399, 271288, 259163, 271818, 281333, 265113, 253615, 276035, 255337, 254202, 283157, 243918, 230551, 187162, 169466, 181363, 157144, 176923, 190826, 225072, 235945, 162220, 159973, 167778, 192804, 224741, 219632, 152699, 146803, 165723, 209648, 239089, 274467, 193155, 192613, 253124, 256425, 267372, 293738]
6314B93738J7177K5359k0067m0363m978M8063l2061l0098l7791q125o672j4567
6302A89615P249r780r637j4763K6866m659K2157J961J7191m7218l9042k685J4335
6289A51590L3430o694L124K0766j6015J9495k8443M0090L0957k8565J805j1774
6277B09766o74K5548j3314K9090J3468J3477m5413J3404l0056m126J1427J6387
6265B38984j1850o719L0008j8550K8087J1549p410J2337Q268k2335j9165Q744
6253B51948j3983J478O7274q599l8850J0262J9569K5316l2701p993l825L0796
6241C00692J3278R47J0998K0765R197l6294N3247k3633k9034J2894k4364k7535
6229B81158N4012J1605K0860N6367k6982n50l0523P133K4290J7199L7315l0458
$$ y = [293738, 310915, 336274, 316207, 275844, 270866, 318929, 286868, 256770, 218979, 210854, 204182, 189615, 196864, 187084, 177447, 162684, 189550, 184891, 207048, 209009, 226200, 178982, 139940, 137255, 151590, 185020, 178326, 181450, 202216, 186201, 205696, 177253, 217343, 248300, 219735, 221540, 209766, 209092, 234640, 221326, 250416, 263884, 277361, 231948, 245352, 215296, 211170, 222597, 238984, 227134, 220415, 250423, 231873, 259960, 271509, 264099, 276436, 284704, 262369, 243204, 251948, 237965, 239443, 306717, 298118, 259268, 269530, 289099, 314415, 281714, 273721, 269896, 300692, 313970, 314917, 325915, 346680, 355877, 319583, 372830, 349197, 320163, 333057, 308693, 281158, 335170, 346775, 367635, 424002, 397020, 396470, 365947, 373080, 397370, 414569, 451884, 421426]
6217D21426j3995j2978j3668N7236L229L1169k6325o1536L5670O203K0256K274
6205D48961J4690L9832K062j7010K1449l950K8648k6252n1127K1140Q6887J6371
6193E81701J7565N122J6114j3061l9737l5666K0808M7403J3699p329K9088K0125
6181F55832O3341K9313m8137k6249K5700j617J3567R10O3978j4774J7811M7706
6169H27381o1957L0837M5872j1473N5308J9044L537P2207Q0922J1562m7625J8362
6157A043977O7956o089j7340N5856J2152O7707N5138L4654j5447M992L5675Q0028
6145A419259L432K7620L6288M5167L2948L3879O3570O1496K1157M0353N7910P1020
6133A914099K7138k1955k1456L9490k3201K9526R0205P6337N3954J7234N6146
$$ y = [421426, 407431, 394453, 380785, 438021, 441250, 472419, 446094, 384558, 420228, 426431, 446687, 448961, 463651, 503483, 505545, 488535, 509984, 506034, 534682, 508430, 457303, 478443, 565330, 581701, 599266, 604388, 620502, 607441, 567704, 532038, 552846, 600249, 613948, 606619, 635707, 655832, 719173, 748486, 700349, 674100, 699800, 698183, 711750, 712660, 776638, 761864, 779675, 827381, 765424, 796261, 842133, 830660, 885968, 905012, 908549, 980756, 1061678, 1073240, 1025615, 1043977, 1111933, 1105844, 1088504, 1144360, 1156512, 1224219, 1279357, 1314011, 1298564, 1303556, 1339231, 1419259, 1422691, 1450311, 1486599, 1531766, 1564714, 1598593, 1662163, 1723659, 1744816, 1785169, 1843079, 1914099, 1941237, 1919282, 1897826, 1937316, 1914115, 1943641, 2033846, 2110183, 2164137, 2181371, 2237517]
6122B237517J05627Q1409L0675Q4721P4072Q4089R0336Q7448O2884O3412P8026
6111C080216J31589J43526J14970J47539J69240K28406J31367J71310K45037K39789
6101D802989K22029K79576L52887L27511L44514L95669M59833N28219O43171Q11164
6091I167562R03346J025708J090964J262590J460004J681293J894239K035876
6083B0521582K102469K132288K131168J493585K41246j120847j782970j652994
6075B4065527r85588m07424K21942Q19708J034637J047519J174929P45948m35901
6066B7281297j933539k876173l034735k608686j962980j454339j140603q36954
6058A1433288o45633m97277l78482k94995j69666j56645o8869l9000O5041J12657
$$ y = [2237517, 2343144, 2424553, 2455228, 2539949, 2614021, 2698110, 2788446, 2875894, 2938778, 3002190, 3080216, 3211805, 3355331, 3470301, 3617840, 3787080, 4015486, 4146853, 4318163, 4563200, 4802989, 5025018, 5304594, 5657481, 5984992, 6329506, 6725175, 7185008, 7713227, 8356398, 9167562, 10070908, 11096616, 12187580, 13450170, 14910174, 16591467, 18485706, 20521582, 22624051, 24756339, 26887507, 28381092, 28622338, 27501491, 25718521, 24065527, 23079939, 22672515, 22894457, 23714165, 24748802, 25796321, 26971250, 27717198, 27281297, 25347758, 22471585, 19436850, 16828164, 14865184, 13410845, 12270242, 11433288, 10787655, 10290378, 9911896, 9616901, 9447235, 9290590, 9221721, 9182721, 9247762, 9360419]
6048I360419J39900J87771L14772L27690M26346N37110O42611Q09309J027187
6039A3773115J110776J263513J522705J753443K003466K243946K541363K728449
6031B8940776K681249K760202K455322J172317q13653k213911k494366j891938
6023C0595998j056611j67012O04683J079847J295711J397533J273815J51576j807006
6014C3368534l603961m206947l934993l238756k519820j900098j516528j152718
6006A1294713r70816q92554o97320n81367m69286m21745m56772l62857l15577
5997F126419k91625k35633j69383k16398k34466j40057j52742j42038j69973j41684
5987D232420j75012j10688p2685j34693j31559o0013m2733j16938q3607j09518
$$ y = [9360419, 9500319, 9688090, 10002862, 10330552, 10756898, 11294008, 11936619, 12745928, 13773115, 14883891, 16147404, 17670109, 19423552, 21427018, 23670964, 26212327, 28940776, 31622025, 34382227, 36837549, 38009866, 37196213, 34982302, 32487936, 30595998, 29539387, 29372375, 29977058, 31056905, 32352616, 33750149, 35023964, 35175540, 33368534, 29764573, 25557626, 21622633, 18383877, 15864057, 13963959, 12447431, 11294713, 10323897, 9431343, 8734023, 8152656, 7683370, 7261625, 6804853, 6441996, 6126419, 5834794, 5599161, 5429778, 5213380, 4978914, 4838857, 4686115, 4544077, 4374104, 4232420, 4057408, 3946720, 3874035, 3739342, 3607783, 3547770, 3505037, 3388099, 3304492, 3194974]
5977C194974r1629r2540q8248p7183m9134p3964q7222l0234j9972r9040J943m6617
5965B441134l8592l1595j6125q3050q7083K3615r224L0908l559l4427K912O829
5953B201743L763j0621J703j6127k9042o7837Q985n2176k3411l2765m5210j8133
5941A920872m6754O202L1663j0355k5045J6291l4547k6379K0556Q1505k3518K8206
5929A938697M3702j9515o6147P3983j9250l5414J9400J1124L3336P0598P102j9114
5917B038502L5644k7218J6991Q711Q3343Q1098j8395L6273P8761Q6322P2670J25824
5905B618526R3679J66086K23536J61283J38664P4770k8643k4751l4219K0030J37875
5894C546836J46513N8985O7665M8203q4265K6508J4866l8379j12371j94997j44890
$$ y = [3194974, 3103345, 3010805, 2922557, 2845374, 2796240, 2722276, 2635054, 2604820, 2584848, 2485808, 2487751, 2441134, 2402542, 2370947, 2354822, 2271772, 2184689, 2208304, 2199080, 2229988, 2226429, 2192002, 2194914, 2201743, 2205506, 2194885, 2196588, 2180461, 2151419, 2083582, 2092567, 2040391, 2016980, 1984215, 1939005, 1920872, 1874118, 1880320, 1911983, 1901628, 1876583, 1892874, 1858327, 1831948, 1852504, 1934009, 1910491, 1938697, 1982399, 1962884, 1896737, 1970720, 1951470, 1916056, 1935456, 1946580, 1979916, 2050514, 2057616, 2038502, 2074146, 2046928, 2063919, 2072630, 2155973, 2237071, 2218676, 2254949, 2333710, 2420032, 2492702, 2618526, 2712205, 2878291, 3101827, 3263110, 3401774, 3476544, 3447901, 3423150, 3388931, 3408961, 3546836, 3693349, 3752334, 3819999, 3868202, 3783937, 3810445, 3825311, 3786932, 3674561, 3479564, 3334674]
5883C334674m3681m4224l9608M6717K1615q8098j70328j47039j90857j31885q3362
5872B463924j12121o1784l2034l3872J8723q440L413M2425L7340L7854L5293O1514
5860B452235N3179O6638J36741Q1633J31794K01443J88153K46516L08348J97923
5850D064603J56955Q655n8188q5546L3238J53235J97591K12733J54493N9323l4404
5839D862688m2429j226j1835l7574j85249k43490j35127j24435m2909J0707R2901
5828D142022j9417j50705k96949l47678k41281j91391r4042l0027j25579p3740
5818B571213m8699J7450r1822n9161L6203M1894m8845J5809N5567J2914K6753
5807B529276M0931j7595Q0354P1907L8953N0176N1536N3891J4305M4482M6840
$$ y = [3334674, 3290993, 3246769, 3207161, 3253878, 3275493, 3187395, 3017067, 2870028, 2679171, 2547286, 2463924, 2351803, 2290019, 2257985, 2224113, 2242836, 2234396, 2237809, 2280234, 2317574, 2355428, 2390721, 2452235, 2505414, 2572052, 2708793, 2790426, 2922220, 3123663, 3311816, 3558332, 3866680, 4064603, 4221558, 4230213, 4172025, 4086479, 4119717, 4272952, 4470543, 4683276, 4837769, 4897092, 4862688, 4820259, 4819033, 4807198, 4769624, 4584375, 4340885, 4205758, 4081323, 4038414, 4049121, 4142022, 4122605, 3971900, 3674951, 3327273, 3085992, 2894601, 2800559, 2770532, 2644953, 2571213, 2522514, 2539964, 2448142, 2388981, 2425184, 2467078, 2418233, 2434042, 2489609, 2502523, 2529276, 2570207, 2552612, 2632966, 2704873, 2743826, 2794002, 2845538, 2899429, 2913734, 2958216, 3005056]
5796C005056N7022M8669N8833K4389N3423Q5930M0349L7821J11023J58225P2592
5785C753332J21935R9697J32438J36170J34442K10206J94116J42924J63343K78143
5775E366746K54669K90807K91292L47298M55880M81729M36087N53675O68307P65346
5765I911836R02444J111281J292694J470493J668336J873627K049322K010238
5757B2290271J620308J383345J634538K052734J040685q38322k147920k726132
5749B4309507k712029k458880j894222j403520r29720o01914l56562j87176P1858
5740A3837342L09684M88604P09142R03251J089672J396171J616195J785088K017589
5731B4152738J923005J408883J271635J770136J830255L62492j626552k725040
$$ y = [3005056, 3062078, 3110747, 3169580, 3193969, 3247392, 3333322, 3373671, 3411492, 3522515, 3680740, 3753332, 3875267, 3974964, 4107402, 4243572, 4378014, 4588220, 4782336, 4925260, 5088603, 5366746, 5621415, 5912222, 6203514, 6550812, 7006692, 7488421, 7924508, 8478183, 9146490, 9911836, 10814280, 11925561, 13218255, 14688748, 16357084, 18230711, 20280033, 22290271, 23910579, 25293924, 26928462, 28981196, 30021881, 29183559, 27035639, 24309507, 21597478, 19138598, 17244376, 15840856, 14911136, 14309222, 13952660, 13765484, 13837342, 14147026, 14635630, 15344772, 16248023, 17337695, 18733866, 20350061, 22135149, 24152738, 26075743, 27484626, 28756261, 30526397, 32356652, 32719144, 31092592, 28367552]
5723B8367552l122093l041694k609243j968009j470074j004410p32764m62209
5715A3957056k57586J3108J97152L05432O29661P91658R35757J139515J218133
5706A8929886J117755Q30040Q36731J240027J090078o3096j355774j947097k150072
5697A8528478j996157j688031j330239r69271o82029m58723k31389j20176l04
5688A1052159K34289L80597M91454O60893Q37138J024530J172971J336957J440056
5679A8631044J144521Q32146R57651J335138Q51050o71878j920609k390205k531844
5670A6237014k340477j980275j549341j198241q75332p28440o45814n71557m14295
5661E933242l77365l41039l03668k92999k43299j66307j59761j87364j41071j09645
$$ y = [28367552, 25245459, 22203765, 19594522, 17626513, 16156439, 15152029, 14419265, 13957056, 13699470, 13712578, 13909730, 14215162, 14844823, 15636481, 16572238, 17711753, 18929886, 20047641, 20877681, 21714412, 22954439, 24044517, 23981421, 22625647, 20678550, 18528478, 16532321, 14844290, 13514051, 12544780, 11862751, 11404028, 11172639, 11052463, 11052159, 11286448, 11667045, 12158499, 12819392, 13656530, 14681060, 15854031, 17190988, 18631044, 19775565, 20607711, 21565362, 22900500, 23751550, 23079672, 21159063, 18768858, 16237014, 13896537, 11916262, 10366921, 9168680, 8293348, 7564908, 6919094, 6347537, 5933242, 5555877, 5214838, 4911170, 4618171, 4374872, 4208565, 4048804, 3861440, 3720369, 3610724]
5651C610724o3310p1439j37715j74171o4696l4076r4400j12983p2251m5865p3275
5640B666543o2357q1978r7589k6508p1091o0353N10o1000o8900j6259l2700J9368
5628B107686j0973n1385n91L5703l0820k0838k1239m1272j7105L7282M9597N2004
5616B088049k0554N5682K3722R4130O1516Q5672J24742J06600J98749K28031J76512
5605C222851J88484K62557J78979J46406O7735j9071j79000k08700k96225l16162
5595C047854l06835j50912j20582j54592o7066o0676o4463n0883O025M8504M9389
5584B175763K4768O0195J27719R4311J07853K08824J80791K49027L19567J86987
5574C735805K03601J65284K9299r2721j16227j76390l04783l38483k79820k08951
$$ y = [3610724, 3547414, 3475975, 3338260, 3164089, 3099393, 3065317, 2970917, 2857934, 2785683, 2739818, 2666543, 2604186, 2522208, 2424619, 2398111, 2327020, 2266667, 2267177, 2206177, 2137277, 2121018, 2088318, 2107686, 2096713, 2045328, 2044737, 2080440, 2049620, 2028782, 2007543, 1966271, 1949166, 1986448, 2036045, 2088049, 2067495, 2123177, 2146899, 2241029, 2302545, 2388217, 2512959, 2619559, 2818308, 3046339, 3222851, 3411335, 3673892, 3852871, 3999277, 4067012, 4047941, 3868941, 3660241, 3364016, 3047854, 2741019, 2590107, 2469525, 2314933, 2247867, 2187191, 2122728, 2071845, 2077870, 2126374, 2175763, 2200531, 2260726, 2388445, 2482756, 2590609, 2799433, 2980224, 3229251, 3548818, 3735805, 3939406, 4104690, 4133989, 4041268, 3925041, 3748651, 3443868, 3105385, 2825565, 2616614]
5564B616614j87348j05451o0867k0563K6585M3260N0503J35601P0614J51501J54814
5553B875263J49143J50618P0689j950j76342j54891j77654k02521k63380j89918
5543B079057j48545j1321r5378q0266k4924o5586J7417k5733K6231N6450Q0453
5532A807855J2339N3544O2369J35984R9408J12031J99065J83709J75635J37562
5522B979501M0146m2135r4408j22378k53903k24509k46846k58051j31555j11291
5512A534571j40987r7644p2439l9441k015m9415o5200k4870k6507n9971n9233
5501H96849j5545j5258r262k4183l0425j8432j0755P094n2343k5605R964j6550
5489F95549l6252m0626L4081M4480n1515p632K1318l8387k8123N0226n7452l4228
$$ y = [2616614, 2429266, 2323815, 2262948, 2242385, 2268970, 2312230, 2362733, 2498334, 2568948, 2720449, 2875263, 3024406, 3175024, 3245713, 3243763, 3067421, 2912530, 2734876, 2532355, 2268975, 2079057, 1930512, 1919191, 1823813, 1743547, 1718623, 1653037, 1670454, 1644721, 1670952, 1727402, 1807855, 1820194, 1873738, 1936107, 2072091, 2171499, 2283530, 2482595, 2666304, 2841939, 2979501, 3019647, 2977512, 2883104, 2760726, 2506823, 2282314, 2035468, 1777417, 1645862, 1534571, 1393584, 1295940, 1223501, 1184060, 1182045, 1132630, 1067430, 1042560, 1016053, 956082, 896849, 881304, 866046, 856784, 832601, 802176, 783744, 772989, 780083, 727740, 702135, 712099, 695549, 659297, 618671, 652752, 697232, 645717, 638085, 659403, 621016, 592893, 643119, 585667, 551439]
5477E51439L5847L8371L0789k5136j2265m0225k2129p549N8479o867K745j886
5465F01613J8900K7206n7347m4592M1773N4628K113o0545N149J7976m1714r648
5453E55512K8158k964O750M3976k1148M9164k376j0272o2346j9873o627K2766
5441E80720o554K3230j6099k096P166K9191j1275j5900L6269j9993P665m7997
5429E64327J2138M4235K1036M1796l7516M9815j370k1597o475j6856N266N169
5417F59968k3338n08l2349l800P363L396J0289J3711J6752l5091L6928m1160J8888
5404F31049R855L260l6286j9738M894M7888O442k7341M3973J5349O2390O20l4878
5391G07477k9172J165n2116J0429N2528O648M08k0982K6381k2052k0340L2885
$$ y = [551439, 587286, 625657, 656446, 631310, 619045, 578820, 556691, 549142, 607621, 600754, 603499, 601613, 620513, 647719, 590372, 545780, 587553, 642181, 644294, 583749, 588898, 606874, 565160, 555512, 583670, 580706, 587456, 631432, 610284, 659448, 657072, 646800, 584454, 564581, 557954, 580720, 574166, 597396, 581297, 579201, 586367, 615558, 604283, 588383, 624652, 604659, 612324, 564327, 576465, 620700, 641736, 683532, 646016, 695831, 694461, 672864, 666389, 649533, 654799, 659968, 636630, 636122, 603773, 599973, 607336, 610732, 621021, 634732, 651484, 616393, 653321, 612161, 631049, 640904, 644164, 607878, 588140, 593034, 640922, 647364, 620023, 663996, 679345, 741735, 742355, 707477, 678305, 679470, 627354, 637783, 690311, 696959, 697367, 676385, 702766, 680714, 660374, 693259]
5379F93259K2435K977k6480j0750p2K0983K550N2647N0533M098Q339O893R6364
5366I23776J5321J8645J4235J6503K2624m2032K6419Q4727K9734K6485l6364l2790
5354A067283J1239k7639n1279l6851k5196P251k1631m602J6468L2435j2556m4085
5342I10837N9707N148O793M1949L537j0309n0263q1258j9317P7392j7442n2795
5330H73979j2470k6063n470j9l8102K0176P911j0137r16m0486K7629k2797Q168
5317G81403K4843N604L0517q68k6099n6603K7979k840M7066o2241n9166J773L736
5304G15104m47J1867L1851L1451r669k752K0408j2852p132n130J1112o361O035
5291G83485K6023q432P7325r510r1545K0851K8344L0314M3896m4394m9892P6766
$$ y = [693259, 715694, 718671, 692191, 681441, 681369, 702352, 704902, 757549, 808082, 812180, 820519, 827412, 923776, 939097, 957742, 971977, 988480, 1011104, 969072, 995491, 1080218, 1109952, 1136437, 1100073, 1067283, 1078522, 1050883, 999604, 962753, 937557, 944808, 923177, 918575, 935043, 967478, 954922, 910837, 970544, 975692, 982485, 1024434, 1027971, 1017662, 967399, 886141, 866824, 944216, 926774, 873979, 861509, 835446, 829976, 829957, 791855, 812031, 819942, 809805, 808889, 768403, 796032, 773235, 781403, 806246, 811850, 842367, 841499, 815400, 758797, 786776, 783936, 831002, 768761, 709595, 711368, 715104, 714657, 726524, 758375, 789826, 780157, 777405, 797813, 784961, 777829, 772699, 783811, 777450, 783485, 809508, 801076, 878401, 868891, 777346, 798197, 826541, 856855, 900751, 856357, 806465, 883231]
5279H83231M6533l3603n0261L8370M0176J4709o0330n3717M8378N4756l7399m3084
5267H47759K4451L4712K555J2870o309M77j5676P6339n3121K8031M7493k6951
5255I72630J5442l562M5298j8010k8019J30l2903N9354N3568k7540j9158J0217
5243A027447Q2810K2885K710K9625L3713N5254L5356K2582k877N4546J9842K6085
5231A409978M1212N3415L9251k3404M1484K9612J2241k1291L0645P956O5275l8679
5219A647695k0647O9904P6775O7618P5378r496L5765J10361J9595N6426K3583
5208B152957L2606N4335P1303J9697O2354K9789M2450N4561O1997J6787J14130
5197B712966J51625O3843N7816J25744O8842P5572R5670M8485Q9306Q0352J18808
$$ y = [883231, 929764, 896161, 845900, 884270, 924446, 939155, 878825, 825108, 873486, 928242, 890843, 847759, 872210, 906922, 909477, 922347, 916038, 916515, 900839, 977178, 924057, 952088, 999581, 972630, 988072, 984510, 1029808, 1011798, 983779, 983909, 951006, 1010360, 1063928, 1036388, 1017230, 1027447, 1110257, 1133142, 1135852, 1165477, 1199190, 1254444, 1289800, 1312382, 1309505, 1364051, 1383893, 1409978, 1451190, 1504605, 1543856, 1520452, 1561936, 1591548, 1603789, 1582498, 1613143, 1621099, 1686374, 1647695, 1627048, 1696952, 1773727, 1841345, 1916723, 1907227, 1942992, 2053353, 2072948, 2129374, 2152957, 2185563, 2239898, 2311201, 2330898, 2393252, 2423041, 2465491, 2520052, 2582049, 2598836, 2712966, 2864591, 2928434, 2986250, 3111994, 3180836, 3256408, 3352078, 3400563, 3489869, 3570221, 3689029]
5186C689029J56154J40282J93502J45000J81865J76888K35894K09467K30614K53920
5176E612615K90287L51371L86546L99691M72297O21815O20619O26515P57442P78288
5166A0917486P02930Q95473R89885P42365L59553J44585J67936L78700N08777
5157A5807690Q25484J084487J173769J148869J342756J595477J151235K92196
5149B4421963l1846k57579j36812K88238P99754Q09976N05773M26838N76490Q52677
5139B8255472Q83722O74116P98170L36347j17931Q1854M52276J46767n98886p18145
5129C0193762o71636m79216j43464M48100R03725L29352l58456m09647m39558
5120B9372962o33112o04595m78440r81940j169720j025051p09183k77391k47726
$$ y = [3689029, 3845183, 3985465, 4178967, 4323967, 4505832, 4682720, 4918614, 5128081, 5358695, 5612615, 5902902, 6254273, 6640819, 7040510, 7512807, 8134622, 8755241, 9381756, 10139198, 10917486, 11620416, 12515889, 13505774, 14248139, 14607692, 14752277, 14920213, 15298913, 15807690, 16633174, 17717661, 18891430, 20040299, 21383055, 22978532, 24129767, 24421963, 24390117, 24132538, 23995726, 24283964, 25083718, 25893694, 26399467, 26826305, 27402795, 28255472, 29139194, 29813310, 30611480, 30947827, 30829896, 30911750, 31364026, 31510793, 30911907, 30193762, 29522126, 29042910, 28899446, 29347546, 30251271, 30580623, 30222167, 29812520, 29372962, 28739850, 28135255, 27656815, 26674875, 25505155, 24480104, 23770921, 23493530, 23245804]
5111B3245804m25146k98205l83355l38597M9697K23322n94387j323400j551122
5102A8604611j613118j276414r55076o40082l00706k57768k69249j46455n2608
5093A3093135m46381q60503r60044j085911q72287p51009n97809m75061m37137
5084F606993l27105k55178k66023j98854j81047j73732j03397q8713j73582j48233
5074D691129j40821j05374q4366j10318p2089m8703o4103r8428o5300j21123m7844
5063C732660k5843o4156k5612j00508j01898k5150j07673j08672l0858n3817j8673
5052C069800o1568o1551r040k8580K1639l2301K3938J5569M3140Q486m4712N2654
5040B997474L7975P0477O646M5225O2573J8934M1286J6805O888J2459j2340j52
$$ y = [23245804, 22820658, 22522453, 22139098, 21800501, 21850198, 22073520, 21479133, 20155733, 18604611, 16991493, 15715079, 14760003, 14119921, 13819215, 13561447, 13292198, 13145743, 13093135, 12646754, 11786251, 10826207, 9740296, 8868009, 8117000, 7519191, 7044130, 6606993, 6279888, 6024710, 5758687, 5559833, 5378786, 5205054, 5101657, 5012944, 4839362, 4691129, 4550308, 4444934, 4360568, 4250250, 4178161, 4129458, 4065355, 3966927, 3901627, 3780504, 3732660, 3706817, 3642661, 3617049, 3516541, 3414643, 3389493, 3281820, 3173148, 3142290, 3088473, 3069800, 3008232, 2946681, 2937641, 2909061, 2930700, 2898399, 2922337, 2937906, 2981046, 2989532, 2944820, 2997474, 3035449, 3105926, 3112572, 3157797, 3220370, 3239304, 3280590, 3297395, 3304283, 3316742, 3304402, 3304250]
5028C304250K1953N0893K851N9524O0873n5313n879R925l0189j8172K2713j9198
5016C404231K9392J28644J13165O9280R8627J57957Q6074K5818L6316L6245K0887
5005D206636l0523Q593j5889k0430N2836K3767O6028O6266O6224O8356J17593
4994D609457P0575L0560M6564N891k9237p8056n1219n7003Q885j4868K1143P5194
4982D637886P3760J07785R2270J04023N7843r246o4745n3322l5010r0893j8947
4971D801404o8817k5370O8923J2097J5166N8432O1369O7991M4866K3531J34966
4960E194558J0954n0213q474o1823o1073j11629n3048N2564R532J6267L4915m4593
4948D927937o28k9580k1883o0416n3975m3758j3068j367o189L066m4796n5538
$$ y = [3304250, 3326203, 3377096, 3379947, 3439471, 3500344, 3445031, 3439152, 3449077, 3418888, 3400716, 3423429, 3404231, 3433623, 3562267, 3675432, 3744712, 3843339, 4001296, 4087370, 4113188, 4149504, 4185749, 4206636, 4176113, 4184706, 4168817, 4148387, 4201223, 4224990, 4291018, 4357284, 4423508, 4491864, 4609457, 4680032, 4710592, 4757156, 4763047, 4733810, 4655754, 4604535, 4547532, 4556417, 4541549, 4562692, 4637886, 4711646, 4819431, 4911701, 5015724, 5073567, 5064321, 4999576, 4946254, 4911244, 4820351, 4801404, 4732587, 4707217, 4776140, 4788237, 4803403, 4861835, 4923204, 4991195, 5036061, 5059592, 5194558, 5205512, 5155299, 5146825, 5085002, 5023929, 4912300, 4859252, 4911816, 4921348, 4937615, 4972530, 4927937, 4927309, 4897729, 4875846, 4815430, 4761455, 4717697, 4704629, 4703262, 4697073, 4700139, 4655343, 4599805]
4936D599805j6940k2301j5526k9451p0643j08083j14574k3886L17K4143n2076
4925D170785J1340K4026l2576l8797o1952o4843q0294q1886p6737j35536j19335
4914C514195j36955j60813j11556j43155j61722l7727n6245r1251j05572o0595
4904B448604n7393j1442k801p2978j07599n1383n6570l1080k4339r8317k6059
4893A908643m0098o2439j04525o0505j1569q143L496j9226K1809M6608Q06J2901
4881A687758O509M2922k0899j3665n4234k4400r0319m5621L806K3446O2131k3558
4869A553876m8281K5382K2065L2767O0027j0926j7108l6587o5249p7594n2968
4858A385404l3568K9422R755n5382j5203m6807j4363L8655J5582M4076j5205k9423
$$ y = [4599805, 4582865, 4560564, 4545038, 4515587, 4444944, 4336861, 4222287, 4198401, 4198718, 4222861, 4170785, 4182125, 4206151, 4173575, 4134778, 4072826, 4007983, 3927689, 3845803, 3769066, 3633530, 3514195, 3377240, 3216427, 3104871, 2961716, 2799994, 2762267, 2706022, 2614771, 2509199, 2448604, 2391211, 2379769, 2376968, 2303990, 2196391, 2145008, 2088438, 2057358, 2033019, 1934702, 1908643, 1868545, 1806106, 1701581, 1641076, 1629507, 1621364, 1624860, 1605634, 1627443, 1674051, 1674857, 1687758, 1694267, 1737189, 1716290, 1702625, 1648391, 1623991, 1533672, 1488051, 1491857, 1515303, 1577434, 1553876, 1505595, 1530977, 1553042, 1585809, 1645836, 1634910, 1617802, 1581215, 1515966, 1438372, 1385404, 1351836, 1381258, 1391013, 1335631, 1320428, 1273621, 1259258, 1297913, 1313495, 1357571, 1342366, 1312943]
4846A312943J9067j2875L3737K8180M576N3428O22M370j0428n8430q631L3501
4834A400060L4810O3229k8481L1369k251J6143M6264Q5866K8357N8338j7096L1453
4822A748061M5044J799K0018N7037O3116R4313N2369M0191J26788R0782O9739
4811B409257K2768N8387J06991Q0079j2419k4480l3171p608K3791J342n1579q465
4799B564893J4761M1830R7093N6982J35694N6500K1241J13104N1493R3102M5114
4788C291807N2392M7322K0587N8364Q776M5997N7669J3228M3378K4203R4123Q5553
4776C843399N7953Q1905R3175J25886Q4256J04355J48649R8327M7943J04528J28027
4765D918403O9451J31380J43421J76794J59529J86615K21283K51171K47728K46691
$$ y = [1312943, 1332010, 1319135, 1352872, 1381052, 1385628, 1439056, 1439678, 1444048, 1433620, 1375190, 1366559, 1400060, 1434870, 1498099, 1469618, 1500987, 1498736, 1514879, 1561143, 1647009, 1675366, 1733704, 1716608, 1748061, 1793105, 1794904, 1814922, 1871959, 1935075, 2029388, 2081757, 2121948, 2248736, 2339518, 2409257, 2432025, 2490412, 2597403, 2677482, 2665063, 2640583, 2607412, 2599804, 2623595, 2624937, 2573358, 2564893, 2579654, 2621484, 2718577, 2775559, 2911253, 2967753, 2988994, 3102098, 3153591, 3246693, 3291807, 3344199, 3391521, 3412108, 3470472, 3479248, 3525245, 3582914, 3596142, 3639520, 3663723, 3757846, 3843399, 3901352, 3983257, 4076432, 4202318, 4286574, 4390929, 4539578, 4637905, 4685848, 4790376, 4918403, 4987854, 5119234, 5262655, 5439449, 5598978, 5785593, 6006876, 6258047, 6505775, 6752466]
4755F752466K76303L79567M00616M28008N08198N48889O59853Q36520Q81722R69662
4745A2641804J118681J381469J568835J680757J894350K108263J743410J453771
4737B5591340J899618K312960J016654j057735j830789k084336j839941j155514
4729B2852257n99894N2498N81128J041223J531292J879726K291789K787676L136213
4720C5553908K993606L070674L614372L387685J653640M02649J78744j730999
4712D9124279m125169m745544m722328m113842l057263k130606j334526p61584
4704B4133417k23563K33906O13986R75583J308161J553935J109472P53647J327418
4695C1785962J807801n8255k476583l241376l611803l325635k669123k132058
$$ y = [6752466, 7028769, 7408336, 7808952, 8236960, 8745158, 9294047, 9953900, 10790420, 11672142, 12641804, 13760485, 15141954, 16710789, 18391546, 20285896, 22394159, 24137569, 25591340, 27490958, 29803918, 30820572, 29762837, 27932048, 25847712, 24007771, 22852257, 22252363, 22304861, 22885989, 23927212, 25458504, 27338230, 29630019, 32417695, 35553908, 38547514, 41618188, 45232560, 48620245, 50273885, 50676534, 50855278, 49124279, 44999110, 40253566, 35531238, 31417396, 28360133, 26229527, 24895001, 24133417, 23909854, 24143760, 24757746, 25733329, 27041490, 28595425, 29704897, 30458544, 31785962, 33593763, 33535508, 31058925, 27817549, 24205746, 20880111, 18210988, 16078930]
4687A6078930j622013j252786r20590p90985p38815n18078m70388l84906l45859
4678I034510l07597k66183k41144j54831j03782q3075m3890m2620o1868k5278
4668G704242l3134o76J8746m0419j3331J21360Q0174J68070K55791K25190J87461
4657H673474J64604J0266j41643k39225k02081j01523r1152n1998K2131J19151
4647H162004J00361J47533K25222K49507L41678L82198L56808L73082M12091L44883
4637A1095367K42445J62583J16722J14726L7297j07299j44671j37989o2020m5733
4627A1271428k02284k88863k51233q8240L9451P9059K58065L51651M28635M73023
4617A2070692M25076K84438K80477J84256J68065K81107L86887N91472M72755
$$ y = [16078930, 14456917, 13204131, 12283541, 11492556, 10753741, 10235663, 9765275, 9380369, 9034510, 8726913, 8460730, 8219586, 8064755, 7960973, 7877898, 7834008, 7791388, 7729520, 7704242, 7671108, 7670432, 7689178, 7648759, 7635428, 7756788, 7836962, 8005032, 8260823, 8486013, 8673474, 8838078, 8848344, 8706701, 8467476, 8265395, 8163872, 8072720, 8020722, 8042853, 8162004, 8262365, 8409898, 8635120, 8884627, 9226305, 9608503, 9965311, 10338393, 10750484, 11095367, 11337812, 11500395, 11617117, 11731843, 11769140, 11661841, 11517170, 11379181, 11317161, 11271428, 11069144, 10780281, 10529048, 10440808, 10480259, 10559318, 10817383, 11169034, 11597669, 12070692, 12495768, 12780206, 13060683, 13244939, 13413004, 13694111, 14080998, 14672470, 15145225]
4608A5145225K80277K78062J96019Q0197J7034o9126p3845M7809N9471j7939M9127
4597A5992311N987J9128J59144K88441M19181O31868Q27351R76134J205625J443286
4587B1968456J555317J494649J580252J839461K202042K509219K825116K922230
4579C8896742K678542K403996K438729K149482O52375j193476k339009k406385
4571D3280996j962073j042244o3123O77954J061844J217655J676089J779923N51208
4562D7178229j039388j911812j980426j520431p77159j93363K40790P68563J009231
4553D1774234J39564j340047k216064k460934k157574j592683q26364l38062j26923
4544C0855147k5076K92069L52608p06362k088109k796892l041375k815425k355525
$$ y = [15145225, 15425502, 15703564, 15899583, 15979780, 15996814, 15927688, 15853843, 15901652, 15961123, 15943184, 15992311, 15998298, 16017426, 16176570, 16465011, 16884192, 17516060, 18343411, 19319545, 20525170, 21968456, 23523773, 25018422, 26598674, 28438135, 30640177, 33149396, 35974512, 38896742, 41575284, 43979280, 46418009, 48567491, 49219866, 48026390, 45687381, 43280996, 41318923, 40276679, 40213556, 40891510, 41953354, 43171009, 44847098, 46627021, 47178229, 46138841, 44227029, 42246603, 40726172, 39949013, 39755650, 39996440, 40765003, 41774234, 41913798, 40573751, 38357687, 35896753, 33739179, 32146496, 31320132, 30982070, 30855147, 30830071, 31122140, 31474748, 30768386, 28680277, 25883385, 22842010, 20026585, 17671060]
4535A7671060j868825j425995j152587r79517p10755o85004n95853n07523m67368
4526I277633l57665l30612l30434k95555k31404k51036j46967j63256j28102p8629
4516F963973j41626j10741p4915j08119j20637j39280j05886j14780q3273j36548
4506E828168j03739j48959j45539j39946r3615j29614j59789m7247n1780m2998
4496D764942J0824m0441l0925l6115P2012J8575n6730J7132k1123L7003K6301
4485D761455j840M5362m6932n1110n794m5759o7125o2457p6697M405k1402k0023
4473D412083L6470L9495K3751l3285M637K0106J6498J28566K20243J03036J96957
4462E168557K37142K95570L09398K51609K11405N8476l0578k373P0538J21663
$$ y = [17671060, 15802235, 14376240, 13223653, 12244136, 11533381, 10848377, 10252524, 9745001, 9277633, 8919968, 8589356, 8258922, 7963367, 7731963, 7480927, 7333960, 7170704, 7042602, 6963973, 6822347, 6711606, 6636691, 6528572, 6407935, 6268655, 6162769, 6047989, 5964716, 5828168, 5724429, 5575470, 5429931, 5289985, 5196370, 5066756, 4906967, 4859720, 4807940, 4764942, 4775766, 4735325, 4704400, 4668285, 4740297, 4758872, 4702142, 4719274, 4698151, 4735154, 4761455, 4759615, 4804977, 4758045, 4706935, 4701141, 4655382, 4588257, 4525800, 4449103, 4453508, 4432106, 4412083, 4448553, 4488048, 4511799, 4478514, 4483151, 4503257, 4519755, 4648321, 4868564, 4971600, 5168557, 5405699, 5701269, 6010667, 6262276, 6473681, 6532157, 6501579, 6499206, 6569744, 6691407]
4452F691407K16174K37170K15694Q2951J3872j13873l05131k80725j60982n9941
4442F536616Q8565J69479L03069L63783K77073K52534J31576q017l1757j533j6842
4431H064546K45739L84390M40271M33463L52331J00463k02073m34289n04552l89098
4421H491191k67327j0015J39449J87068L12508L13502J95037j6883l30429n81675
4411H432426o37774n53728l23722j63834j19201r648l7696j3133j88484k98791
4401F086415l42770l10693j99301j01236o111N5098O8037N5385L2828r5959k36631
4390E005062l76963l48990l91990l00156k27657k00544j23269j55551r0181j15235
4380B674526l9203p175q9086n1340j8587n3750l2499k2537K151N610k7221k0088
$$ y = [6691407, 6907581, 7144751, 7360445, 7443396, 7457268, 7343395, 7038264, 6757539, 6596557, 6536616, 6625181, 6794660, 7097729, 7461512, 7738585, 7991119, 8122695, 8114678, 8082921, 8081388, 8064546, 8310285, 8694675, 9134946, 9568409, 9920740, 10021203, 9819130, 9384841, 8880289, 8491191, 8223864, 8213849, 8353298, 8540366, 8852874, 9166376, 9361413, 9344530, 9014101, 8432426, 7794652, 7240924, 6917202, 6753368, 6634167, 6624519, 6586823, 6573690, 6385206, 6086415, 5743645, 5432952, 5233651, 5132415, 5126304, 5181402, 5249439, 5304824, 5337652, 5241693, 5005062, 4628099, 4279109, 3887119, 3586963, 3359306, 3158762, 3035493, 2879942, 2789761, 2674526, 2635323, 2628148, 2539062, 2487722, 2469135, 2415385, 2382886, 2360349, 2362500, 2368110, 2340889, 2320801]
4368B320801o493N708j773K3052q1147l5599J5115j8727n0830L4058L8908K9586
4356B272659K3129j4821k6941K1697j5749l7979j4629K9965P758J3410p40L6724
4344B294483M3117N4272L3305Q6692N9904J02807K522J1530j5513O161L012L3609
4332B715901L1006K624J1032L0192l215N4580J0515l9286Q7385O6008K9261k0022
4320B975981Q6450M8075L4068P3529M7357l246l7295K724j5795l8746p9259o7361
4308C026482J6407J6297l184j2787j6735j0272j2268j6618K0961o360O7720M4639
4296C114282P8679P6450L3486M4115R9157M7292P1536j9703J2513k7718o9771
4285C460318l0208j7731L919l842N2938O3949m3811K3945Q087O8655Q3458O2815
$$ y = [2320801, 2314308, 2320016, 2318243, 2341295, 2260148, 2224549, 2239664, 2220937, 2170107, 2204165, 2243073, 2272659, 2295788, 2280967, 2254026, 2275723, 2259974, 2221995, 2207366, 2237331, 2245089, 2258499, 2257759, 2294483, 2337600, 2391872, 2425177, 2511869, 2571773, 2674580, 2677102, 2688632, 2673119, 2679280, 2682292, 2715901, 2746907, 2749531, 2760563, 2790755, 2787540, 2842120, 2852635, 2813349, 2900734, 2966742, 2996003, 2975981, 3062431, 3110506, 3144574, 3218103, 3265460, 3262214, 3224919, 3227643, 3211848, 3173102, 3093843, 3026482, 3042889, 3059186, 3056002, 3043215, 3026480, 3016208, 3003940, 2987322, 3008283, 3001923, 3069643, 3114282, 3192961, 3269411, 3302897, 3347012, 3446169, 3493461, 3564997, 3545294, 3557807, 3530089, 3460318, 3430110, 3412379, 3416298, 3412456, 3465394, 3529343, 3485532, 3509477, 3517564, 3586219, 3669677, 3732492]
4273C732492L0067P7493J38330M3095L2680J03341P7299J33801J08723J25524
4263D602845J35272J89184J45848J15576J04839K01262J82234K02393J45959J54151
4253F179563K17159K51565J64671K26797J17123J61770J98559J92850K02347K61723
4243H174127J97023K45239J32688J56805J75866J38261R0098J69443P4461J41968
4233I695979J53488J53923K30035K44638J91805K09946K25760K25052K80015K42313
4223A1852954K59368K96842K47390K78625K91044L26666M04608M11229M76024
4214A4844750L88074L65226M57729M46559N26493O73780P35062Q22200P76940
4205B0036813Q60078Q66291J019104J040545J122200J211583J394311J461464
$$ y = [3732492, 3762559, 3840052, 3978382, 4021477, 4054157, 4157498, 4234797, 4368598, 4477321, 4602845, 4738117, 4927301, 5073149, 5188725, 5293564, 5494826, 5677060, 5879453, 6025412, 6179563, 6396722, 6648287, 6812958, 7039755, 7156878, 7318648, 7517207, 7710057, 7912404, 8174127, 8371150, 8616389, 8749077, 8905882, 9081748, 9220009, 9310107, 9479550, 9554011, 9695979, 9849467, 10003390, 10233425, 10478063, 10669868, 10879814, 11105574, 11330626, 11610641, 11852954, 12112322, 12409164, 12656554, 12935179, 13226223, 13552889, 13957497, 14368726, 14844750, 15232824, 15598050, 16055779, 16502338, 17028831, 17702611, 18437673, 19259873, 20036813, 20896891, 21763182, 22782286, 23822831, 24945031, 26156614, 27550925, 29012389]
4197B9012389J606777J749925J968848K129118K499158K771919L079603L311699
4189D8129436L687887M011680M665178N349490O520834P721048R232915J0429911
4181I9748379J2146801J3846131J6164938J7939962K0470136K3507329K8427823
4174B32251499L2019210L4290973K5458172P696226j6149546l5529479m2682093
4167B37354962m1406535l3474176k6202010j9363563j4888985j1399941r415797
4160H1203955p827009o864455n793284n136994m353259l951721l444796l230666
4152D0601771k729387k444080k030563j804642j441519j361157j173335j157617
4144B6459471j058634j121152j024227j031739q73050q57890p18193q15851o37229
$$ y = [29012389, 30619166, 32369091, 34337939, 36467057, 38966215, 41738134, 44817737, 48129436, 51817323, 55829003, 60494181, 65843671, 72364505, 80085553, 89318468, 99748379, 111895180, 125741311, 141906249, 159846211, 180316347, 203823676, 232251499, 264270709, 298561682, 324019854, 331716080, 315566534, 280037055, 237354962, 195948427, 162474251, 136272241, 116908678, 102019693, 90619752, 81203955, 73376946, 66512491, 60719207, 55582213, 51228954, 47277233, 43832437, 40601771, 37872384, 35428304, 33397741, 31593099, 30151580, 28790423, 27617088, 26459471, 25400837, 24279685, 23255458, 22223719, 21350669, 20492779, 19774586, 18958735, 18321506]
4135A8321506o36103n65494n45254m73139n26237n99052o02310n15951n06878
4126A3351088m91887l42243k79791l67096l57906l83104l31361l39479k62947
4117A0195274k88755k30964k66340j47845j95673k32075j89533k02096k08609
4108H233384k21240j98573k20612j44764k43811j95620j61039j12638j35820r9513
4098F499754p1479o0283j61249j74917r2054o6109j13672p6443j1065p3608j35560
4087E463315r1097j10730j63823j86174j16264j10507p9018p6778p0597l0845
4077D427482k0277j02329p8101o6101r996m7943q7337o3682p6427p1143l9881
4066C764265q4329l4969j569N775k9466m6061j8949m0469K4547K742m7429m5738
$$ y = [18321506, 17685403, 17119909, 16574655, 16101516, 15575279, 14976227, 14373917, 13857966, 13351088, 12859201, 12516958, 12237167, 11870071, 11512165, 11129061, 10797700, 10458221, 10195274, 9906519, 9675555, 9409215, 9261370, 9065697, 8833622, 8644089, 8441993, 8233384, 8012144, 7813571, 7592959, 7448195, 7204384, 7008764, 6847725, 6735087, 6599267, 6499754, 6428275, 6367992, 6206743, 6031826, 5939772, 5873663, 5759991, 5683548, 5672483, 5598875, 5463315, 5372218, 5261488, 5097665, 4911491, 4795227, 4684720, 4605702, 4528924, 4458327, 4427482, 4407205, 4304876, 4226775, 4160674, 4150678, 4102735, 4015398, 3951716, 3875289, 3804146, 3764265, 3679936, 3644967, 3643398, 3649173, 3619707, 3573646, 3554697, 3514228, 3538775, 3541517, 3494088, 3448350]
4054C448350o6521L7308r45k3354J2019K3517j4354K3130k3814N1035O5366Q7457
4042C619194L4549P0246j6148p370O9623J0290l1078M3807j316J4687o36K6955
4030C832803r257m3834q8214l0489o6407n9041k1681n0148p2500l7649m3535J0753
4018C320801m2297l4737k592R955l7169m6538p5380r8640J6105m1182p5662p8078
4006B814586m9063l3494j28p7943q3752l8223m3859o9218m0274k998p9632m7103
3994B248899p7093r5931j8315m6159r8587o6411l775l0126l4609l4011p5655l4731
3982A633496M266j8918k1488n6131k3444K9159n3817p886j9077q3050o3288k9770
3970A290052J2671j4260M145l0589j8967k229k2416J9233K80k682l4109n8536
$$ y = [3448350, 3381829, 3419137, 3418192, 3394838, 3406857, 3430374, 3416020, 3439150, 3415336, 3466371, 3531737, 3619194, 3653743, 3723989, 3707841, 3700471, 3770094, 3780384, 3749306, 3793113, 3791797, 3806484, 3805848, 3832803, 3823546, 3779712, 3691498, 3661009, 3594602, 3535561, 3513880, 3463732, 3391232, 3353583, 3310048, 3320801, 3278504, 3243767, 3241175, 3251130, 3213961, 3167423, 3092043, 2993403, 3009508, 2968326, 2892664, 2814586, 2765523, 2732029, 2731901, 2653958, 2570206, 2531983, 2488124, 2418906, 2378632, 2375634, 2296002, 2248899, 2171806, 2075875, 2057560, 2011401, 1912814, 1846403, 1842628, 1812502, 1777893, 1743882, 1668227, 1633496, 1637762, 1618844, 1597356, 1541225, 1517781, 1546940, 1493123, 1485237, 1466160, 1383110, 1319822, 1290052, 1302723, 1288463, 1292608, 1262019, 1243052, 1240823, 1218407, 1237640, 1237920, 1235238, 1201129, 1142593]
3958A142593r709M9167K7237m6782n1727m1438J003j6671k775m6929N297R738
3946A019004M2309l6950o1731j0749m7402m6930J6176j8132J9921j3831J2166
3935H73851j6263k2523l7011j2530K4686m168j2586j362r240K452N209r80k280
3922G87255n6859Q11M9289J3083m0389k0351J3398J0543K0335j8353o379k4646
3910G27737K3696k3673r361J0819o874L2852J0240O737k9510N2831L8156O001
3898H39651K8996j0257M8492J4543M8004M8898M7656O2803M6033P4208M6424J37925
3886A433376J91907J17342J69006K07380J64526J02820M704j36543k43832j93546
3876A817140k32027j93258j30031j03538l7688q7073o0644j4484j6355q610l9001
$$ y = [1142593, 1132884, 1182051, 1209288, 1162506, 1110779, 1069341, 1070344, 1053673, 1050898, 1003969, 1009266, 1019004, 1061313, 1024363, 962632, 951883, 904481, 857551, 873727, 855595, 875516, 861685, 873851, 857588, 835065, 798054, 785524, 810210, 806042, 793456, 792094, 782854, 785306, 790515, 789535, 787255, 730396, 731207, 780496, 793579, 753190, 732839, 746237, 756780, 777115, 758762, 752383, 727737, 751433, 727760, 718399, 729218, 722344, 755196, 765436, 772173, 742663, 795494, 833650, 839651, 868647, 858390, 906882, 921425, 969429, 1018327, 1065983, 1128786, 1174819, 1249027, 1295451, 1433376, 1625283, 1742625, 1911631, 2119011, 2283537, 2386357, 2391061, 2254518, 2010686, 1817140, 1585113, 1391855, 1261824, 1158286, 1120598, 1033525, 972881, 958397, 942042, 933432, 894431]
3865H94431p5048l9290k3470k7861k5070J0127k3436N998k5662m3490K380K366
3853F31975m2747o85j7355l4106L2979j0412K4514k7499j0651j7738l5104n7987
3841D35184L9426R5654l7558J5556N454k3639l146M491K2382k5635j1958j5472
3829E00739p394M067K9781j7457J0429j5407J2900m4606j4709j1664J1262K3926
3817D81867q1628K6511L3480M7791o7188k0653m850m584Q209K1821Q452M4414
3805D93642j7305o841J6L4888P4033o8565M3781k3530k160j7094M9623r886J2205
3792E62807j715M3735O6817L2841o5654K4445k1261o0992L7307J4032m4490n3910
3780E33962j5305K2857k4475J717L0541L2157o631j5162k0113j0663l249K5478
$$ y = [894431, 819383, 780093, 756623, 728762, 703692, 713819, 690383, 696381, 670719, 627229, 629609, 631975, 589228, 588543, 571188, 537082, 570061, 559649, 584163, 556664, 546013, 528275, 493171, 435184, 474610, 570264, 532706, 548262, 553716, 530077, 526931, 531422, 553804, 528169, 516211, 500739, 493345, 497412, 527193, 509736, 520165, 504758, 517658, 473052, 458343, 446679, 457941, 481867, 400239, 426750, 460230, 508021, 440833, 420180, 415330, 410746, 418955, 440776, 449228, 493642, 476337, 469496, 469512, 504400, 578433, 509868, 553649, 530119, 527959, 510865, 560488, 550602, 562807, 561092, 604827, 671644, 704485, 638831, 663276, 642015, 581023, 618330, 632362, 587872, 533962, 518657, 541514, 517039, 518756, 549297, 581454, 574823, 559661, 539548, 528885, 525636, 551114]
3768E51114K8993n2431M7133l0074L4742l1515j508K1222L2312j5125L0978r06
3756F14935J3054J4185j6360m5414m7820o0479k2778M4707ol02j8853k152L1681
3743E04398K5304m8329j7291K007M7748k0155N219k1985J8768J2366L5943o199
3731E37794j2438P1729L3368k4977j6742l843R262K201j1184P542p139p7700l3846
3718D74027J7846j6074j6374K2020L3150L0168K1929k8452m2561n1871L3407K7160
3706E04375J8471p000l4230j4146J7544L9825R021j6721M9886N9992K5373j1839
3694F40551k523l3944k6215J3074L953l1438J6771l1798l586n7754N8921M3071
3682E89083k7547o693J858L3035k2638k2368K5851j3195m152K8300K5656J898
$$ y = [551114, 580107, 527676, 574809, 544735, 579477, 547962, 546454, 567676, 599988, 584863, 615841, 614935, 627989, 642174, 625814, 580400, 532580, 472101, 449323, 494030, 494024, 493722, 474869, 472717, 504398, 529702, 481373, 464082, 466089, 513837, 493682, 498901, 476916, 495684, 508050, 543993, 537794, 525356, 597085, 630453, 605476, 588734, 584891, 594153, 596354, 585170, 592712, 585573, 507873, 474027, 491873, 475799, 459425, 481445, 514595, 544763, 566692, 538240, 495679, 443808, 477215, 504375, 522846, 515846, 481616, 467470, 485014, 524839, 533860, 517139, 567025, 627017, 652390, 640551, 638028, 604084, 577869, 590943, 594896, 563458, 580229, 548431, 544845, 487091, 546012, 589083, 561536, 554843, 556701, 589736, 567098, 544730, 570581, 557386, 553234, 581534, 607190, 609088]
3670F09088p1680k0955Q134m541k9960l0406O6454N2579P492J2749k2473j9983
3658E56498k3402j6463q070r878j5332j2354J2084K4242L3990j761Q320o1907
3646D85967J4819m031J5424q170r369k8168J5626K3809K523N6346k1646M1064
3634E84194l5198j0671j2326k3285L05K3461J9266k3470J7325L2482j7339M0941
3622E95685l0269n1158L4747r361j5454j008o6572M4670K8266K428J6506L6053
3610E84533j3859K293l207m5776N9389p807k1142k5226K3520M6464k0469l653
3598E75060J4231L8757j343k8753j1112l132K6584k9190j87M1038j4596M1158
3586F48515o5144L174J7985M471j224n343N715q023K4393o6490n790M6546K1519
$$ y = [609088, 537408, 516453, 524587, 520046, 490086, 459680, 526134, 578713, 586205, 598954, 576481, 556498, 533096, 516633, 508563, 498685, 483353, 470999, 483083, 507325, 541315, 539554, 547874, 485967, 500786, 496755, 512179, 504009, 494640, 466472, 482098, 505907, 508430, 564776, 543130, 584194, 548996, 538325, 525999, 502714, 503019, 526480, 545746, 522276, 539601, 572083, 554744, 595685, 565416, 514258, 549005, 539644, 524190, 523182, 456610, 501280, 529546, 531974, 548480, 584533, 570674, 572967, 569760, 523984, 583373, 575566, 554424, 529198, 552718, 599182, 578713, 575060, 589291, 628048, 626705, 597952, 586840, 583708, 610292, 581102, 580915, 621953, 607357, 648515, 583371, 586545, 604530, 609001, 607777, 602434, 608149, 600126, 624519, 558029, 552239, 598785, 620304]
3573F20304j2426j1704K2072o697o69o380n137K4107L8162n3727R112L2203l5358
3560F13862k6935O2680M4070j8459l0110q194M807M1158j2534k6597m3625j3810
3548E86313K7289j0226N8798L4140l8732k8468k83P867N6210r986j3514k3788
3536F45620L1819l96l4651L7053n1884l0857K4874N2855Q0553m1653J6167J7495
3524G46995k933n9271K4084j0243J9056K5469J8925O50l1540l5332J9279P9291
3512G94430O184j7674l3630L5610O008j5619K1331k207J3001n022q2295r140k467
3499G08510j4837J752O8849m621o3155o296L9925K000O760N604n419J6426M8526
3486H04024k1600q053J2816k270l1173j5047K8294J5160j7333j5898j6137M6900
$$ y = [620304, 607878, 596174, 618246, 611549, 610880, 604500, 599363, 623470, 661632, 607905, 617017, 649220, 613862, 586927, 649607, 693677, 675218, 645108, 636914, 641721, 682879, 670345, 643748, 600123, 586313, 613602, 603376, 662174, 696314, 657582, 629114, 628831, 636698, 692908, 682922, 669408, 645620, 677439, 677043, 642392, 679445, 627561, 596704, 621578, 674433, 754986, 713333, 729500, 746995, 744062, 684791, 708875, 698632, 717688, 743157, 762082, 762732, 731192, 695860, 715139, 794430, 800614, 782940, 749310, 784920, 790928, 775309, 796640, 794433, 807434, 802412, 720117, 710977, 708510, 693673, 695425, 764274, 759653, 696498, 690202, 730127, 732127, 738887, 744491, 739072, 755498, 804024, 782424, 774371, 787187, 784917, 753744, 738697, 766991, 782151, 764818, 748920, 732783, 779683]
3474G79683j7014j2416M3990K2307j087J8094k0494m1038L7362k3568M5648J1094
3462H42561m7381j9267N446k1918Q975L977J4340l1635K6252M3629K8288L1768
3450H85035l3045k2736K2259j1509k4290J7473N4671q000J8249L2814K9438M168
3438I64527M4825L5181K3578j1776L3180j8827o7786j4688k2513N5360j6826M525
3426A008760k691n100J4203k9556K5633P2210K1467j550M0823N4758K5820R2895
3414A317672N3380l4807O0210J05954N4288J01506J02513K8921j4766l4142l2601
3403A708128j3349m761p1398m6912r4589o9006j0364J2064o0186n2891m5987M778
3391A255527K1815K5751L981j8427L2935j5368J1099K9811M5650L2255O4984K4804
$$ y = [779683, 762669, 750253, 794243, 816550, 815463, 833557, 813063, 772025, 809387, 785819, 831467, 842561, 795180, 775913, 781359, 759441, 768416, 772393, 786733, 755098, 781350, 824979, 853267, 885035, 851990, 829254, 851513, 840004, 815714, 833187, 887858, 879858, 898107, 930921, 960359, 964527, 1009352, 1044533, 1068111, 1056335, 1089515, 1070688, 1002902, 988214, 965701, 1021061, 1004235, 1008760, 1006069, 1000969, 1015172, 985616, 1011249, 1083459, 1104926, 1103376, 1144199, 1198957, 1224777, 1317672, 1371052, 1336245, 1396455, 1502409, 1556697, 1658203, 1760716, 1789637, 1774871, 1740729, 1708128, 1694779, 1690018, 1618620, 1571708, 1477119, 1408113, 1397749, 1409813, 1349627, 1296736, 1250749, 1255527, 1277342, 1303093, 1307074, 1288647, 1321582, 1306214, 1317313, 1347124, 1392774, 1425029, 1490013, 1514817]
3379A514817L3490N3124j6223j9246j3695j6620J8678j0781N1335J01k691J1046
3367A603335j7610k1748r181N5338R947l8690m4930N099O4748j376o860O5230
3355A663302n9730r116O3579L3882O1628P918K3317K8989P0925j8732P6172P3716
3343B015850J9768n234k5439o512O1854N5038Q4182O9722J1970L1867J00554M0274
3331B453894k7447k8992j0950J1492K1846Q827j127Q1937P0066o684K7884k7597
3319B573149N0352O1576J1314L7611P3579J02564N5336J37165K5000M3588J30495
3308C301729J98767P3394L7916J19883J18956P1858Q0214N2277K5465k0606p9020
3297C980833l3813M247K8232M7226J34114J18972K2802M2627R9716O5187Q7774
$$ y = [1514817, 1548307, 1601431, 1585208, 1565962, 1552267, 1535647, 1554325, 1543544, 1594879, 1594980, 1592289, 1603335, 1585725, 1563977, 1554796, 1610134, 1620081, 1581391, 1536461, 1541560, 1606308, 1604932, 1598072, 1663302, 1603572, 1594456, 1658035, 1691917, 1753545, 1761463, 1784780, 1813769, 1884694, 1865962, 1942134, 2015850, 2035618, 2030384, 2004945, 1998433, 2060287, 2115325, 2199507, 2269229, 2281199, 2313066, 2413620, 2453894, 2426447, 2397455, 2386505, 2397997, 2419843, 2428670, 2427543, 2509480, 2579546, 2572862, 2600746, 2573149, 2623501, 2685077, 2696391, 2734002, 2807581, 2910145, 2965481, 3102646, 3127646, 3171234, 3301729, 3500496, 3573890, 3611806, 3731689, 3850645, 3922503, 4002717, 4054994, 4080459, 4059853, 3980833, 3947020, 3951267, 3979499, 4026725, 4160839, 4279811, 4302613, 4345240, 4444956, 4510143, 4597917]
3286D597917J83979P9732O9043J06568J68420J91640J41853J16005K07704K56986
3276F119847K76469K98574L06422L23505L52664L21475L16104K90242K40786J89422
3266I035510J52153J86757J82705O7405K5809M5744J1476p2151j65002j87230
3256I283176l01857m02859l16062k62348l84980l26581l15572l25139l24530l08577
3246F014671k24356l04474k43871j12597j16428j63228j76935q0873n0506j41534
3236D399869j26276j55860j47701r3845k8958j12141j33575k9621r0317j04857
3226C376718p1372L6570m1042l1443m5035k278p1069o5554r9519j00691o9683
3215B815602p7931o8447m7626j6286q1442n8279k3978k1197o6661l8229j9002
$$ y = [4597917, 4781896, 4861628, 4930671, 5037239, 5205659, 5397299, 5539152, 5655157, 5862861, 6119847, 6396316, 6694890, 7001312, 7324817, 7677481, 7998956, 8315060, 8605302, 8846088, 9035510, 9187663, 9374420, 9557125, 9624530, 9650339, 9696083, 9707559, 9635408, 9470406, 9283176, 8981319, 8578460, 8262398, 8000050, 7615070, 7288489, 6972917, 6647778, 6323248, 6014671, 5790315, 5485841, 5241970, 5129373, 5012945, 4849717, 4672782, 4591909, 4541403, 4399869, 4273593, 4117733, 3970032, 3876187, 3847229, 3735088, 3601513, 3571892, 3481575, 3376718, 3305346, 3341916, 3300874, 3269431, 3224396, 3222118, 3151049, 3085495, 2985976, 2885285, 2815602, 2737671, 2669224, 2621598, 2605312, 2523870, 2465591, 2441613, 2420416, 2353755, 2315526, 2296524]
3204B296524r37k8684p903k9399O167l9767o256J6052j0158k4836M58O3039l3166
3191B201134k4048j8872j2340k7286n5359m8818l8861p0031n8574j8043n103j8944
3179A804855m3773j4728m3525k9045l053m474O749O368m9895L2863o4697k9096
3167A568549K7322l4983n7945k6277M5385J6187K113j0810l0361m2377L218m3419
3155A416602J8217J0663n8039n6600n8855l212O0941N1763o9097n6803k4234o9513
3143A161833j2389N1246j1580o2006j9962M0036K2810P425P039r912O940n1107
3131A130373m048K9432r408k4871l5893k8184P833J9333j3965k8796n3520M5582
3119A033868K7164p161l184q0551n28L2182K4840m1955J453M8714k4838q5799
$$ y = [2296524, 2295587, 2266903, 2259000, 2229601, 2235768, 2196001, 2189745, 2205797, 2195639, 2170803, 2171261, 2234300, 2201134, 2177086, 2158214, 2145874, 2118588, 2063229, 2014411, 1975550, 1905519, 1846945, 1828902, 1823799, 1804855, 1761082, 1746354, 1702829, 1673784, 1670731, 1666257, 1673006, 1679374, 1629479, 1662342, 1597645, 1568549, 1595871, 1560888, 1502943, 1476666, 1522051, 1538238, 1540351, 1529541, 1499180, 1456803, 1460021, 1416602, 1434819, 1445482, 1387443, 1330843, 1271988, 1268776, 1329717, 1381480, 1312383, 1255580, 1231346, 1161833, 1149444, 1200690, 1189110, 1127104, 1107142, 1147178, 1169988, 1177413, 1184452, 1174540, 1181480, 1130373, 1126325, 1155757, 1146349, 1121478, 1085585, 1057401, 1065234, 1084567, 1070602, 1041806, 988286, 1033868, 1061032, 1053871, 1050687, 970136, 969608, 1001790, 1026630, 984675, 986128, 1034842, 1010004, 924205]
3107I24205K8191L1744l9416M6791j5595J8363n7412p9523K2228J4840l5052L6394
3095H95758J3127M5882j0860r3989N702J0616J4172k3210J2844j7901K4641m2858
3083H33924M6531J063n500j6467n165j4934P111Q908K806L7840m8199k347K735
3070H48306Q797k9995j3678N805k093q454J3033p482J15k0818N368J1145P154
3057H17203J8779N097m1810l2268M0824K5744M801M125m5941O841N2365J1303
3045H67063j3618l6537l4734J3279K2874J75r213k2238M4097O148L101K7404j781
3032H66020m0076N0586K9226n1260K4580M2411k1035L7062o267M9893M4407M714
3020A030261j594m0730k0748j7858M5625n65K4666l7478N6954M7220K3491J4419
$$ y = [924205, 952396, 984140, 944724, 991515, 975920, 994283, 936871, 857348, 879576, 894416, 859364, 895758, 908885, 954767, 943907, 849918, 855620, 866236, 880408, 857198, 870042, 852141, 876782, 833924, 880455, 881518, 876018, 859551, 854386, 839452, 846563, 855471, 858277, 896117, 847918, 845571, 848306, 857103, 827108, 813430, 819235, 817142, 808688, 821721, 814239, 814354, 793536, 798904, 810049, 817203, 835982, 841079, 799269, 767001, 807825, 833569, 838370, 842495, 796554, 803395, 855760, 867063, 853445, 816908, 782174, 795453, 818327, 818502, 809289, 787051, 831148, 837296, 840397, 867801, 866020, 825944, 876530, 905756, 854496, 879076, 921487, 900452, 937514, 931247, 981140, 1025547, 1030261, 1028667, 987937, 967189, 949331, 994956, 994391, 1019057, 981579, 1038533, 1085753, 1109244, 1123663]
3008A123663L674j0135K7591m0544k2404P2531Q370m5049L5772K0323K1740N0662
2996A246194N91K3422J5149n533L3341M0542K3935k4900o763N2468J1346l0865
2984A378927j068N7530K58k684O2850N3441L909L8406P268q682J7543o1244m3564
2971A502890L2997O9746L7625J9597M4206M3678M0686j1439P8212J5358P0280
2960A943836K0987P224Q9221M4586R2944J01069J0436O2063Q2407P0029J16916
2949B641718O1010P1442N4190Q0865N2763O6087K5355N036J7929O4169J2459l0511
2937C122512K479K4126K8339N3744N5695O1537J34590j0896Q571J22645J55151
2926C758493O3163N4553J34623J49100J59312J69592K27708J55724J77180J63669
$$ y = [1123663, 1127337, 1117202, 1144793, 1104249, 1081845, 1154376, 1162746, 1117697, 1153469, 1173792, 1195532, 1246194, 1246785, 1270207, 1285356, 1279823, 1313164, 1353706, 1377641, 1352741, 1345978, 1398446, 1409792, 1378927, 1377859, 1435389, 1435647, 1432963, 1495813, 1549254, 1553163, 1591569, 1598837, 1590155, 1607698, 1546454, 1502890, 1535887, 1605633, 1643258, 1662855, 1707061, 1750739, 1791425, 1779986, 1858198, 1873556, 1943836, 1964823, 1972047, 2061268, 2105854, 2198798, 2299867, 2310303, 2372366, 2454773, 2524802, 2641718, 2702728, 2774170, 2828360, 2909225, 2961988, 3028075, 3053430, 3058466, 3076395, 3140564, 3153023, 3122512, 3124991, 3149117, 3177456, 3231200, 3286895, 3348432, 3483022, 3472126, 3480697, 3603342, 3758493, 3821656, 3876209, 4010832, 4159932, 4319244, 4488836, 4716544, 4872268, 5049448, 5213117]
2916E213117O8610r0236j70352k02449k26862k03481j60843j22174j59997j24809
2906C820524o2386j7400J0588p964k3612L921L8440M9498L6671k8746l5076L511
2894C787969J371L2055N1841O385M3476K9957o3012l5176j18230r2571m6001r9211
2882C498853j20518j11738r9238j42671j06511q1469r3139m5021o0151p776o1908
2871B568713k2614o4317l9696K882r4975q8123k5855q1867r6995l5011o9454m7096
2859A905592o5669o9731n8255m6405n9799J0983o497p6857M533q9185q1647l4193
2847A332870K0556r848J85k0698n3123l8510j7502K1345r986n0195p8689l9009
2835A057396Q896l0524k3810J2355j6067k5956j1082n3308P705M0133n6611l1666
$$ y = [5213117, 5281727, 5191491, 5021139, 4818690, 4591828, 4388347, 4227504, 4105330, 3945333, 3820524, 3758138, 3740738, 3751326, 3743362, 3719750, 3723671, 3762111, 3811609, 3848280, 3819534, 3784458, 3787969, 3789340, 3821395, 3873236, 3879621, 3923097, 3953054, 3890042, 3854866, 3736636, 3644065, 3598064, 3498853, 3378335, 3266597, 3167359, 3024688, 2918177, 2836708, 2743569, 2698548, 2638397, 2630621, 2568713, 2546099, 2481782, 2442086, 2444968, 2349993, 2261870, 2236015, 2154148, 2057153, 2022142, 1952688, 1905592, 1839923, 1770192, 1711937, 1665532, 1605733, 1616716, 1610219, 1533362, 1537895, 1448710, 1367063, 1332870, 1353426, 1343578, 1343763, 1323065, 1269942, 1231432, 1213930, 1235275, 1225289, 1175094, 1096405, 1057396, 1066292, 1035768, 1011958, 1024313, 1008246, 982290, 971208, 917900, 925605, 965738, 909127, 877461]
2823H77461k2120j479K9112q773n7945K16k1173l470j2337l2301o5943K3394J8699
2810G23341l8671l5299p766k3091K2896N938l641j5901K6853J8941l1226l4077
2798F08297o8799j6809K3027J8612j5208l6823k0127L9156K430j1229J204o8509
2786D55222L801J2024n733q731m8033j1536J5780J4336n612l672m166n5975K6384
2773C84089j0309o124L2775K3521q7377O082M1822n0345p807K9407j6202m6528
2761B93004m6887N9781K7126m5633M1347K2294o1000p4203j4418K7386P5978O730
2749C11505j8078l6434K1073k5495l1237K3293J6300L479K5531l5541J388k7354
2737B28430l5205j3103J3885j6753l8339l544L7183J7046p850K5044N9251o9227
$$ y = [877461, 855341, 853862, 882974, 874201, 816256, 816472, 795299, 791829, 779492, 747191, 681248, 704642, 723341, 684670, 649371, 641605, 618514, 641410, 647348, 643707, 627806, 654659, 673600, 642374, 608297, 539498, 522689, 545716, 564328, 549120, 512297, 492170, 531326, 533756, 522527, 523731, 455222, 459023, 471047, 465314, 456583, 408550, 397014, 412794, 427130, 421518, 417846, 413680, 357705, 384089, 373780, 367656, 400431, 423952, 336575, 342657, 384479, 334134, 326327, 355734, 339532, 293004, 246117, 305898, 333024, 287391, 328738, 351032, 290032, 215829, 201411, 228797, 304775, 311505, 293427, 256993, 278066, 252571, 221334, 244627, 260927, 264406, 289937, 254396, 255784, 228430, 193225, 180122, 194007, 177254, 138915, 135371, 172554, 189600, 181750, 206794, 266045, 196818]
2725A96818k724N343o943O559m2198j8301J3445J7884q456J791L442j1308j2689
2712A42663r228r724K1127N5229j2303J5587Q680q4111K8930P866p8413M4833
2700A31136p791n134j6342O215K2460o330j1995J0384M0433L738n3410o835K9520
2687A36049K1150j8288q007j1781n108J251l2946J9367k568J4221j1239k0231
2675H1870k2007J8336J8817M5069K6667k7717o1051L7675l281J677k583m372L3485
2662A42585m634k5364K6989K052j9761l3233J4842m783J8082J53m8124p4652K9066
2649B3218M4424L827K2652P8504N42n9843k4755K3420P0202l9035m9429J28N9592
2636A53447j8198l1609L0926j6012L9304M0983k6097m7003K797n087L5166j1819
$$ y = [196818, 194094, 199437, 192494, 199053, 156855, 138554, 151999, 169883, 161427, 163218, 166660, 155352, 142663, 133435, 123711, 144838, 200067, 187764, 203351, 212031, 127920, 156850, 164716, 86303, 131136, 123345, 118211, 101869, 108084, 130544, 124214, 112219, 122603, 163036, 166774, 113364, 106529, 136049, 157199, 138911, 130904, 119123, 114015, 115266, 82320, 101687, 99119, 113340, 102101, 81870, 59863, 78199, 97016, 142085, 168752, 141035, 79984, 117659, 114378, 116055, 113472, 109100, 142585, 137951, 112587, 139576, 141628, 121867, 88634, 103476, 98693, 116775, 116928, 68804, -5848, 23218, 67642, 71469, 94121, 172625, 173167, 113324, 88569, 111989, 182191, 143156, 93727, 93855, 153447, 135249, 103640, 134566, 118554, 157858, 198841, 172744, 125741, 128538, 123451, 158617, 146798]
2624A46798n371k2153N327J2843k0774J4433l6849k296O1321r54L6947j7349l7919
2611A34004l0581K1739j6982O24N5748n0743n556J0941j3365n7583R1837k9485
2599A10598l4926O3061L9322m3369j5278M367L8281l4372j8575j634J4050l7954
2587H3571j4352M109j3404n52N936m617o615K1677J9307K9240P870k6043L555
2574A09682J3232j0384m897J7880J7645j0700p670M412o2234k6178l2507L8219
2562D6500J3238N621J124R860M0163m8304j6782J4756j4781l1927K7685K5387
2550G2540l7737J263j6385L949J6472k4232n663N001J5183k2032k693J4593M7459
2537F7718n1409j3433N3895O397L799m432l4268L3872j8689P722k7576q3479K7973
$$ y = [146798, 141427, 119274, 124601, 137444, 116670, 131103, 94254, 91958, 153279, 152325, 189272, 171923, 134004, 103423, 125162, 108180, 108804, 164552, 113809, 108253, 119194, 105829, 48246, 140083, 110598, 75672, 138733, 178055, 134686, 119408, 123775, 162056, 127684, 109109, 107475, 121525, 83571, 69219, 73328, 59924, 59372, 65308, 60691, 54076, 75753, 95060, 124300, 132170, 106127, 109682, 122914, 112530, 107633, 125513, 143158, 132458, 124788, 129200, 66966, 40788, 8281, 46500, 59738, 65359, 66483, 76343, 116506, 68202, 51420, 66176, 51395, 19468, 47153, 72540, 34803, 36066, 19681, 23630, 40102, 15870, 10207, 15208, 30391, 8359, 5666, 20259, 67718, 16309, 2876, 56771, 63168, 66967, 62535, 28267, 62139, 43450, 51172, 23596, -59883, -31910]
2524c1910N3088j7398J0284k0932N5491j9048L733M4484p8151r823J6082q206
2512b306J2433j6339K7029j0854j2656k4747J5835J2577k1369J0570M918K1622
2500A6713K5099O307o2247M1603n0901R698L8458N786o1800m8273Q2112O873m6461
2487c7033J1708L3963l569l3344K1528l3290k0999N3438J9774J7843j6502M15
2475A3932K1652K2269L8550p6909k7297l3892j1701N6043j2299j2556k1964N339
2463c8833K8182J3857k5946J7653O7142M7559p7120k3943Q119q141k9308K0771
2451hJ1882k9289L869o97k2349j9151M8436R297J3306p296l08L2563o6199j3724
2437c9668M5806J9632l7358j8279J62j1356J6773K0682j8062J544j5943m688J2812
$$ y = [-31910, 21178, 3780, 14064, -6868, 48623, 29575, 33308, 77792, -359, -10182, 5900, -2306, 10127, -6212, 20817, 9963, -2693, -27440, -11605, 972, -20397, -9827, -4909, 16713, 41812, 48119, -14128, 27475, -23426, -13728, 24730, 30516, -31284, -79557, 2555, 9428, -37033, -25325, 8638, 5069, -28275, -6747, -40037, -61036, -7598, 12176, 30019, 13517, 13932, 35584, 57853, 96403, 19494, -7803, -41695, -53396, 2647, -9652, -22208, -44172, -38833, -10651, 3206, -22740, -5087, 62055, 109614, 32494, 8551, 16670, 8529, -20779, -8, 11874, -17415, -13546, -14243, -36592, -55743, -7307, 1990, 15296, 8000, 7692, 40255, -25944, -39668, 6138, 25770, -11588, -29867, -29705, -41061, -24288, -3606, -21668, -20124, -36067, -40755, -27943]
2424b7943O5335o790J882j1276k5272M1753m6953Q638M878m826k27j7790L1613
2411A3022o533k182M313l0148l1607O2339M2095j0665j4367l9309j7492j469J9460
2398a2543K5677k0351K5758K7450J1144j5818l5717L7693j0598J4498J0751J7412
2386G5356L0553K6082k7116J1005K5583l1938q9572j3481r858j9823P843L1627
2374A6261J0755j0755K5736n45o447q7379K6493O9209r25l1766L2232L5761j4380
2361F4250J5494n6918N2941q454j4224m4323K8122n5654J2595P97L311L0959K2086
2348E0982k782n0111N2877J1100J649J181l0428n152j0815K4574j7814j6546K0094
2335B8809o6492J5330M3379J3153L7828o511p0625J7237K9691J662j366k297j4127
$$ y = [-27943, 37392, 30602, 32484, 21208, -4064, 37689, -9264, -626, 4252, -574, -801, -18591, 13022, 6489, 4307, 8620, -21528, -53135, 9204, 51299, 40634, 26267, -13042, -30534, -32003, -12543, 13134, -7217, 18541, 45991, 57135, 41317, 5600, 43293, 32695, 47193, 57944, 75356, 105909, 131991, 104875, 115880, 141463, 109525, 19953, 6472, -3386, -23209, -15366, 16261, 27016, 16261, 41997, 41452, 35005, -52374, -25881, 43328, 42403, 10637, 42869, 78630, 64250, 79744, 22826, 75767, 67313, 53089, 8766, 36888, -18766, -6171, -5374, -2063, 28896, 50982, 48200, -1911, 50966, 62066, 63715, 64896, 34468, 29316, 18501, 43075, 25261, 8715, 28809, -37683, -22353, 21026, 34179, 72007, 65496, -5129, 12108, 41799, 43461, 42095, 39798, 25671]
2322B5671l60J5322q061j6347N8181q82l1863j5088n518l8642J1374P35N4935
2309D9457p956j9628j7120j918M855j34N3982j2908q524j1409L5252k4382J2906
2296E2473M237P479m0937m8574K1800J9503R021J3466L0340j9K9868m7949J9859
2283G0567P742l8040Q4605P362l0669k5511l1682M7572J9841M7491l2958p1270
2271E5050O539K0147m776j5037L3752J9991m8762m239K4851J2036l4190L2089
2259I7451K8440k0215o4957J9838K9681L7157n2737o2816M4760J1472J7400n1506
2247C3968N628M6919k0777J3788M4176J4480k3243O8836m4904m9446J6599K1008
2235A27032Q76N885q136l2192j6589j0314M1076k84p865L9848K2105k5753J2949
$$ y = [25671, 25311, 40633, 32572, 16225, 74406, 73524, 41661, 26573, 21055, -17587, -6213, -5478, 49457, 41501, 21873, 4753, 2835, 7690, 7556, 61538, 48630, 40106, 28697, 63949, 39567, 52473, 56710, 64189, 23252, -25322, -3522, 15981, 25002, 38468, 68808, 68789, 98657, 50708, 70567, 78309, 40269, 124874, 132236, 101567, 76056, 44374, 91946, 111787, 159278, 126320, 55050, 61589, 81736, 76960, 61923, 95675, 115666, 66904, 62665, 87516, 99552, 65362, 97451, 125891, 105676, 40719, 60557, 90238, 127395, 74658, 11842, 56602, 68074, 85474, 33968, 39596, 86515, 65738, 79526, 123702, 138182, 114939, 183775, 138871, 89425, 106024, 127032, 127908, 133793, 125657, 93465, 76876, 66562, 107638, 107354, 99489, 139337, 161442, 135689, 148638]
2222A48638k1182J5678k3598Q713R2782j221k2711l9540k0680O1181K2610M4756
2210B65426k9617R329j1207l010K328J7471R795J4163k971N8305R4236k110R270
2197D31408L2730l3932l6053J1128L6369J5479N0216j7078m3968N7158O5955j8441
2185E50971J3470L0536J058l1481k5055j2542L4162O5926K914J3267J6096Q825
2173F68147o008n530L4165L0974O1726M7446L365l1896J4217L6372L0603q247
2161H75334L4096N1822K8374K95K7397N1861N6451N5482M7779N8372Q7298Q5443
2149A460004N8621N5184O4204J30285J26764Q9735J08287J07685J90310J83599
2139B574678J86241K43969K23843K33531K81928L36925L09701L76256L97768M93224
$$ y = [148638, 127456, 143134, 119536, 128249, 221031, 219810, 197099, 157559, 136879, 198060, 220670, 265426, 235809, 245138, 233931, 230921, 233249, 250720, 260515, 274678, 271707, 330012, 424248, 422138, 431408, 464138, 430206, 394153, 405281, 441650, 457129, 507345, 490267, 446299, 503457, 569412, 550971, 564441, 594977, 596035, 564554, 539499, 526957, 561119, 627045, 629959, 643226, 659322, 668147, 662139, 656609, 690774, 721748, 783474, 830920, 834285, 802389, 816606, 852978, 883581, 875334, 909430, 961252, 989626, 989921, 1017318, 1069179, 1125630, 1181112, 1228891, 1287263, 1374561, 1460004, 1518625, 1573809, 1638013, 1768298, 1895062, 1984797, 2093084, 2200769, 2391079, 2574678, 2760919, 3004888, 3228731, 3462262, 3744190, 4081115, 4390816, 4767072, 5164840, 5658064]
2129E658064N65593O99635P49566R07925J178748J371020J410242J628392J944397
2120A6113582K731271L320812L784291R83697k827578m398267m155503l112908
2112A2439397k276129j591397j231933q83440o67150n16425m64410l17800k73118
2103D217595j52033k57838l01396l61212l18122k41824j55496j73802n1900r0021
2093B113951p8348j59993p4169n2812r6763r7421m1997l3257m3377l3914o8872
2082A333028p2161l9594k9630m9531o9356n0631l9485O564o6095q3737q734R756
2070H40394k5611l195m0850j7249l0927p1281n091l3144n036K5021l6376l7668
2058E58987J0848k3904P839O2051k9684r4547j3936J8271l3570n1070l5347j5695
$$ y = [5658064, 6223657, 6923292, 7672858, 8580783, 9759531, 11130551, 12540793, 14169185, 16113582, 18844853, 22165665, 25949956, 26933653, 24106075, 19707808, 15552305, 12439397, 10163268, 8571871, 7339938, 6456498, 5789348, 5272923, 4808513, 4490713, 4217595, 4065562, 3807724, 3506328, 3145116, 2826994, 2585170, 2429674, 2255872, 2203972, 2113951, 2035603, 1875610, 1801441, 1748629, 1651866, 1554445, 1512448, 1479191, 1435814, 1401900, 1333028, 1260867, 1221273, 1191643, 1142112, 1072756, 1022125, 982640, 989204, 923109, 839372, 830638, 840394, 814783, 811588, 770738, 753489, 722562, 651281, 646190, 613046, 608010, 633031, 596655, 558987, 569835, 545931, 553770, 615821, 586137, 491590, 477654, 495925, 462355, 411285, 375938, 360243]
2046C60243J2160Q198k355K9754L2443l0208p620J0187l1611k8302n3581j7307
2034B82001N2279L8461m9749p068L8839r9586K0216O229n5006K5386j2993J5721
2022B54730J5856n3477K9084L747J290l049M007J9245J4999l9827o6823l2251
2010A47531P7159l128l0111m0501L8199r862l2402j0209j2172l2500n413M4258
1998A30849L999j9039j5222k5644k9125M8729P1587l3157r360L6236m7038n8034
1986E4781O273J9540J0545p961j7628n509N0692J0656l0526K739J2529l9425j2403
1973E4303M952O993k1193n1142M5600M627J2561R524k3886J6246J9079O007o475
1960G7196K8590K285j3526j6060J50r405o1034M2084L1175L9110q807k3722m7386
$$ y = [360243, 372403, 380601, 378246, 408000, 440443, 410235, 402615, 412802, 381191, 352889, 299308, 282001, 334280, 372741, 322992, 315924, 354763, 255177, 275393, 281622, 226616, 252002, 239009, 254730, 270586, 217109, 246193, 249940, 251230, 248181, 252188, 271433, 286432, 246605, 179782, 147531, 224690, 221562, 191451, 150950, 189149, 179287, 146885, 136676, 124504, 92004, 86591, 130849, 134848, 115809, 100587, 74943, 45818, 94547, 166134, 132977, 123617, 159853, 112815, 54781, 61054, 80594, 91139, 83178, 65550, 60041, 110733, 121389, 90863, 93602, 106131, 66706, 54303, 59255, 66248, 45055, -6087, 39513, 44140, 56701, 66225, 42339, 58585, 77664, 83671, 77196, 105786, 108071, 94545, 78485, 78635, 69230, 8196, 50280, 81455, 120565, 111758, 88036, 40650]
1947D0650J1077j3893J4271Q306n5437k4348L3581J5548j6229K3584J8365j4427
1935D1048l1547L510K0097m4071j2975L8808P212n409J2122j292N0062m0972J2631
1922D9224J0464M0587p6635k4888M3402K9353m850O088l4481k7062j7624J934
1910d488J6080j2224j7508m24L4367j1745O7947n2712m3450J0093J3942J3780
1898A3658L6927K7536j3917o9437k0298M6107J0093m8230K9780K1440K4965K075
1886F0699l8259j1459n529k5825J2926K8991L0718L3552n5827J566l5710J3130
1874H973M481J213r427J4M5398j280k6862J4786L184J7594p350j1021K8806m6422
1860B2087J3706L3481J2986j3371J6156m248M2026l7261j0498j0629K8176M4157
$$ y = [40650, 51727, 37834, 52105, 60411, 4974, -19374, 14207, 29755, 13526, 37110, 55475, 41048, 9501, 13011, 33108, -10963, -23938, 14870, 22082, 16673, 28795, 27503, 77565, 36593, 49224, 59688, 100275, 23640, -1248, 42154, 71507, 66657, 72745, 38264, 11202, -6422, -4488, 11592, -632, -18140, -18564, 15803, 4058, 72005, 19293, -24157, -14064, -122, 13658, 50585, 78121, 64204, -5233, -25531, 20576, 30669, -17561, 12219, 33659, 58624, 60699, 22440, 10981, 5452, -20373, -7447, 21544, 52262, 85814, 29987, 31553, -4157, 8973, 13454, 14667, 5240, 5254, 50652, 49372, 22510, 37296, 40480, 58074, 50724, 39703, 68509, 22087, 35793, 69274, 82260, 68889, 85045, 80797, 122823, 85562, 75064, 64435, 92611, 136768]
1848A36768j2816k0816k1089K2599L6109o7109m9177j9996K5781N098m9585n819
1836b0052K2351j0571M6222p825m8399k3573K1159J8880q749K6654J2813N0118
1824G9028q257n3624L067n2871j739J7518J3744J2150L0523m6363l7976N9858
1812A5058J5499k963J080O479l5213j9697O504j2040J0349M6800n093J7799j8864
1799B5698M233l9307l1340K0665j6888K2604J3785n238m1072K6700L5166j4913
1787I3N054J9815J6041k2814L5334J1411n9959l5558Q8564k5907J562L0102l2511
1774C1227K0584l23r677M721j4237Q375j7761j9447K8501l3958l0578L9853J0174
1761A7454p1567l4287J7709M6487k9474R031M3786m4528j6723M8313N1013J6421
$$ y = [136768, 123952, 103136, 82047, 104646, 140755, 73646, 24469, 4473, 30254, 35352, -14233, -20052, 2299, -8272, 37950, 30125, -18274, -41847, -20688, -1808, -10557, 16097, 28910, 79028, 70771, 17147, 20214, -32657, -34396, -16878, -3134, 9016, 39539, -6824, -44800, 15058, 30557, 27594, 28674, 35153, -60, -19757, -13253, -25293, -14944, 31856, 26763, 44562, 25698, 29931, -9376, -40716, -20051, -36939, -14335, -550, -5788, -46860, -20160, 15006, 93, 5147, 24962, 41003, 18189, 53523, 64934, 4975, -30583, 57981, 32074, 33636, 63738, 31227, 51811, 51488, 41811, 46532, 32295, 40670, 22909, 3462, 31963, -1995, -32573, 7280, 17454, -54113, -88400, -70691, -24204, -53678, -44647, -861, -45389, -62112, -13799, 37214, 53635]
1749E3635p8724k976L1733n4919K9400L0984N6106n4855k2065N0888l7102m9730
1737d7625L3748j169J295j0462k525j9429L5170M341k7699q891J8638P977L77
1724a6254n65M5867j5839n2486L0938k944j452j1281J4838j1540K4243J1521l7226
1711b2180M1450l7999l7091J0193L4873L5758j2632o1066k0091N0627j2217K590
1699b7785m528L8956k8179l3539N2348j6081Q355m506l4181M1882n0645k7292
1687h5195K4629P7211o2098r859M0724K8130j5828k4045J7285P839K1220K4300
1675D4313o8427K6569l2527j1484l961p727N1387j8054L0128k6350j164J0556
1663f741k7420O489K0705j9951k68l369K7435N8972j6435l0402J2684j5970j7811
$$ y = [53635, -25089, -28065, 3668, -51251, -21851, 9133, 65239, 10384, -11681, 39207, 2105, -47625, -13877, -15046, -13751, -24213, -26738, -46167, -10997, -6656, -34355, -43246, -24608, -16631, -16254, -16819, 29048, 13209, -39277, -8339, -11283, -12735, -24016, -9178, -20718, 3525, 15046, -22180, 19270, -18729, -55820, -45627, -10754, 25004, 12372, -48694, -68785, -18158, -30375, -27785, -32313, 6643, -21536, -55075, -2727, -18808, -10453, -14959, -49140, -7258, -57903, -85195, -60566, 16645, -45453, -55312, -14588, 13542, -2286, -26331, -9046, -1207, 20013, 44313, -24114, 2455, -30072, -41556, -45517, -53244, -1857, -19911, 10217, -16133, -17297, -6741, -34161, -27672, -6967, -26918, -27186, -30555, -3120, 55852, 39417, 9015, 21699, 5729, -12082]
1650a2082r227K1904L205n7873j0740K3497K5724j0360m6868N0341l4231R789
1638d6921k3972K7578K6758J4517O645J1376l4328K5210k613l65J0005p339L4684
1625D1235p781m2560j5203J6815m910l4003k9894M567K1502M2804Q506L4680j4127
1612B1631M321J843K6826j7832j192M628o6250l9788J5049j8909N5084j050J5281
1599c58j6411L7047k3517n8018K5787K559M066l4115J0955O9972l3394j0883J4360
1586a1950n0730K6168M3050l8379j7659R60L054L1546m4100K4902m227P269L7030
1573F934J9745J6524l3028l6671J227l0713j1217J4638J9309K8069j6898o147
1561b8228j0715J1044m2092N8961K9399l1088J7136o1821K3971n983O1731m0983
$$ y = [-12082, -21309, 595, 3800, -54073, -64813, -41316, -15592, -25952, -72820, -22479, -56710, -46921, -70893, -43315, -16557, -2040, 4605, 15981, -18347, 6863, 4250, 3885, 13890, 6551, 41235, 33454, -9106, -24309, -7494, -12404, -46407, -76301, -71734, -50232, -7428, 1078, 35758, 21631, 25952, 27795, 54621, 36789, 35597, 40225, -26025, -65813, -50764, -69673, -14589, -15639, -358, -16769, 20278, -3239, -61257, -35470, -32911, -28845, -62960, -52005, 17967, -15427, -26310, -11950, -62680, -36512, 6538, -31841, -49500, -48540, -45486, -13940, -58040, -33138, -37365, -30096, 6934, 26679, 43203, 10175, -26496, -25269, -55982, -67199, -52561, -33252, -5183, -22081, -28228, -38943, -27899, -69991, -11030, 18369, -12719, 4417, -57404, -33433, -39416, 22315, -18668]
1549a8668k4385L8314q612J7881M9232n8768m017l1667K0045L2920j7911j5188
1537b0824m6274J4701o033P9282j2579J2900j8649o709l9381o010K3456J9262
1525f858k8184j1372K4231Q94K8000R894n7456O039J6752j6438J8196k6293l7878
1512h0473K3200M293K6238r48j9859L6069K3808N968k220j2571M0785m2339l2608
1499c0657L2958m9716m0050O706N7941M3873k2531l5661j821j0053J1729K6738
1487a0544J6778J9085l3978o1553J2078K4550R050J8528J886n3543L1961k9839
1475e5541K6503J7902l746l27l500K6781j2846p07m4785Q00j5114j359N5806J1977
1461A844R599k8543K211k2656L7856k287j1964j992L789J292l654J0698l214q988
$$ y = [-18668, -43053, -4739, -13351, 4530, 53762, -5006, -9023, -40690, -20645, 12275, -5636, -20824, -67098, -52397, -58430, 20852, 8273, 21173, 2524, -4185, -43566, -49576, -26120, -6858, -35042, -46414, -22183, -21289, 6711, 16605, -40851, -34812, -18060, -34498, -16302, -42595, -80473, -57273, -52980, -26742, -27690, -47549, -11480, 12328, 18296, 16076, 3505, 44290, 1951, -30657, 2301, -47415, -87465, -80759, -22818, 21055, -1476, -37137, -38958, -49011, -37282, -10544, 6234, 25319, -8659, -70212, -58134, -33584, -24534, -6006, -4120, -57663, -25702, -55541, -29038, -11136, -14882, -15209, -18709, 8072, -4774, -5481, -50266, -49466, -64580, -65939, -10133, 1844, 11443, -17100, -14889, -37545, 311, -1976, -13940, -15932, -12143, -10851, -14505, -3807, -7021, -16009]
1447a6009l3072K34l1307J9837M4457L0878m6714n6252K1945M7007K1436n1304
1435d8864L7156O177o118l1996k9180J5917J4579n9726J0465L7147M4214j7534
1423b7763k0427J4269K2119k4433o4310L8814Q774M23l2922J9968N6191p917n6981
1410g4195j0926L2796M3794K5766J7177l5014K3707k2591J1362n813k4261r497
1398b7695J8432K003r969J8287M39j6160K0604N93j6068J0500R470o358k3367
1385a9289l9717K4609k5801p753N8791j6348K2174j4377p5864J2637L62L5156
1373d5420L8261j6511R361J0048K4351R930l9309l670n017L2780K4072l9019K9757
1360B9614J0813o5312K901K6546R034o5551p739L6021l6850K9544L3248n961J8176
$$ y = [-16009, -49081, -48847, -80154, -60317, -15860, 15018, -31696, -87948, -66003, -18996, 2440, -48864, -11708, -5531, -11649, -43645, -72825, -56908, -42329, -102055, -91590, -54443, -10229, -27763, -48190, -33921, -11802, -36235, -100545, -61731, -52957, -52534, -85456, -65488, -9297, -17214, -74195, -85121, -52325, -8531, 17235, 34412, -602, 23105, 514, 11876, 6063, -18198, -27695, -9263, -7260, -17229, 1058, 1497, -14663, 5941, 6534, -9534, 966, 10436, 4078, -19289, -59006, -34397, -60198, -67951, -9160, -25508, -3334, -17711, -93575, -80938, -80576, -45420, -7159, -23670, -14309, -4261, 20090, 30020, -9289, -12959, -17976, 14804, 38876, -143, 29614, 40427, -24885, -21984, 4562, 13596, -51955, -59694, -23673, -60523, -30979, 2269, -3692, 14484]
1347A4484k17L4218m5141M151L428k746l6131K3787m4598k2822P2892R185j5404
1334d914l1362O877M557m853l7839J9466j4572J2085k0971K9199J5626q614J4136
1321b1179L8549k9968O677J0042j5181k2753K1261J4825K0022m1878k4406O0602
1309A6613P170l773q33o594j8233l896N0428j5858l81n7957k825K6257J6161L051
1295I330K1371L3282l3392j8626J9662j8223m2102P782j7787k64J4300M6534K5586
1282D7453j0938o3675q396Q595k2383k2279N550J3546j4450L3508l2545J435M3380
1269b1199l1134k0001J1626L69J4385M659o744L3180J3913K748Q103l2263o81
1256b3039M1821q134K9650j1643J8002m743r405J7554m3827p5361J9577K8620
$$ y = [14484, 14267, 48485, 3344, 7495, 10923, 8177, -27954, -4167, -48765, -71587, 1305, 10490, -4914, -36276, -29399, -24842, -29695, -67534, -48068, -62640, -50555, -71526, -42327, -26701, -35315, -21179, 17370, -12598, -5921, 4121, -11060, -33813, -12552, 2273, 22295, -19583, -43989, 16613, 23783, 20010, 19177, 12583, -5650, -9546, 40882, 25024, 24643, -33314, -36139, -9882, 6279, 9330, 30701, 63983, 30591, 11965, 31627, 13404, -28698, -20916, -38703, -38967, -24667, 21867, 47453, 36515, -27160, -35556, -26961, -49344, -71623, -66073, -52527, -66977, -33469, -66014, -64579, -21199, -52333, -72334, -60708, -60339, -45954, -41295, -48039, -14859, -946, 1802, 9905, -22358, -23039, 18782, 10648, 40298, 28655, 46657, 41914, 32509, 50063, 6236, -69125, -49548, -20928]
1244b0928k921J0876J264n468m7117K1202R957M7931l1341o9224J4899M4510o2379
1231h8739J59N2298J7452l6340l252N223J1557n770j5454L4330M548K7975k2151
1218a8164M0520K0596m7563k3739k49j6485K6578L1023j5660N438O9K3799q568
1205A7595l6693J2540L0539l4852M4447n043j3644Q580K1652l562l6836l783j1674
1192a0734K7707K182N5k2842L2434K7738n3674m1623L9934o66J0359K6000J3271
1179E0141m1871O3942l3994o5260J1887p131k1173M1190j4225N095J54k8192j3925
1166e3362N7508k4340p583l039M448J5419L0870J4744M151m8992k3924M3745k3845
1153a4200K878K3183o5476J8823J3292o013n663L3517J5405n0560M0445L0367
$$ y = [-20928, -23849, -12973, -11709, -17177, -64294, -43092, -33135, 14796, -16545, -85769, -70870, -26360, -88739, -88580, -36282, -18830, -55170, -58422, -53199, -41642, -47412, -62866, -28536, -23988, 3987, -18164, 22356, 42952, -4611, -28350, -28599, -45084, -18506, 12517, -3143, 2295, 2364, 26163, 17595, -19098, -6558, 23981, -10871, 33576, 28533, 14889, 23469, 45121, 41559, 4723, 940, -10734, 16973, 19155, 19210, -3632, 28802, 56540, 2866, -38757, 1177, 511, 10870, 36870, 50141, 8270, 72212, 38218, -27042, -15155, -22286, -43459, -2269, -16494, -11399, -11245, -39437, -53362, 4146, -20194, -27777, -30816, -26368, -10949, 19921, 34665, 38816, -10176, -34100, 9645, -14200, -11322, 11861, -53615, -34792, -21500, -27513, -33176, 341, 15746, -34814, 5631, 35998]
1141C5998J689m0478L6994l1192j3912j7019j974J5662Nj1692j1747K3003O853
1128g810l452n982k3591P905K0746J4688m4144j5126l9162O0564N4512J4953m4593
1115a0492j2918R848l0589J7693O9176l3652m3232n762o834L0060O3715m5588
1103A425q145j4524k9379L1878N3068K6615m5042k0633r377K962K9826L7058l9483
1090A6249l2211J7933J0526l547l487J3426j3644j3559Q021L008k162j3770J1423
1077a794L5532j0824m2417J0728m241p4323K3020K6521J2474P0596k6553j2894
1065E825J0988o5562q691K4696J6278O515L4537k9094r196P272k6652K953M6567
1052A6436k0238n1502N677K1816J7722k4676J0527L5786p571l7872M2340J7668
$$ y = [35998, 37687, -2791, 34203, 3011, -10901, -27920, -29894, -14232, -14227, -25919, -37666, -14663, -7810, -11262, -17244, -40835, -32930, -12184, 2504, -41640, -56766, -95928, -35364, 19148, 34101, -10492, -23410, -13562, -44151, -26458, 42718, 9066, -34166, -39928, -46762, -16702, 47013, 1425, -6720, -21244, -50623, -18745, 34323, 60938, 15896, -4737, -14114, -11152, 18674, 55732, 16249, -15962, 1971, 12497, 8950, 5463, 18889, 5245, -8314, -293, 2715, 553, -13217, -1794, 33738, 22914, -19503, -8775, -13016, -87339, -64319, -37798, -25324, 45272, 18719, 5825, 16813, -48749, -57440, -32744, -16466, -9951, 24586, -4508, -13704, -6432, -33084, -30131, 16436, -3802, -55304, -49627, -27811, -10089, -34765, -24238, 11548, 3977, -33895, 8445, 26113]
1040B6113j4903o3243L8797K9788l4117L0067L318j198r382k2046J0457p400J817
1027a1932n751M3661L21J3709n429n9155j2717K0617p723j4330p817k1153J6665
1014e1034J051K8984M2237Q938Q031J6998m5127o2406L0851j3708k5695K0872
1002d0008N4653O95o572k5291K8899N841j9662k4694j5113L1416N5540l0100l0859
989a5255J2280L3886k614m3552J1473o317O1235j1519m4819J5587l1262K1606
977G29j471k1561K4259l2991L5591J1680M1257l1630k1612J5726m4603M743K9572
964I689p380J6747l4661l1374N1273K4929l2273r719N6517k2336q170Q779o382
951A5639M096j7046k4980l14l2533L4703P461J8045J12J0411L49l1060Q68j0522
$$ y = [26113, 11210, -52033, -13236, 16552, -17565, 12502, 15820, 14622, 5240, -16806, -6349, -13749, -11932, -17683, 25978, 26299, 40008, 34579, -24576, -37293, -16676, -24399, -38729, -46546, -67699, -51034, -49983, -20999, 21238, 30176, 38207, 55205, 10078, -52328, -21477, -35185, -60880, -40008, 14645, 15340, 8768, -16523, 12376, 18217, -1445, -26139, -41252, -9836, 45704, 15604, -15255, -2975, 30911, 28297, -15255, -3782, -10099, 51136, 39617, -5202, 10385, -20877, 729, -742, -22303, 1956, -31035, 4556, 16236, 57493, 25863, 4251, 19977, -24626, -19883, 9689, 2309, 19056, -15605, -46979, 4294, 29223, -3050, -12769, 43748, 21412, 13242, 22021, 15639, 19735, 2689, -22291, -22605, -55138, -20435, -12974, 5071, 5183, 15594, 15943, -15117, -14249, -24771]
937b4771K1085M1220q906r999L9388n1079J0625L953j7482k3920L9293M013j8681
924D739L1514q730n614l017l4255K7947K8213m2326k7258K2511m3545K7075M9475
911B6729m2669j5010j2788J3705J2635k509K7674M304k4068m8218L6815L6175
899A2775K4304J2141r843K2742l2219o099m0119N01O0758l9941N785J1027l7951
886a6139L4190m7205M2249j8079k0891K5366p0837P450L0638j7182M588M8560
874B708J8838l0438k9791K7233q995L1017j175l2299j501j6341K2650J3252L6993
861C2151k8970j8968N877k1798J4794J8219q809m974K9396j5819M4402l9098n9399
848e2996p118o788K687N3756n552M058K3790l7453j979n8566P274N4962N1108
$$ y = [-24771, -3686, 37534, 28628, 18629, 58017, 6938, 17563, 21516, 4034, -19886, 19407, 23420, 4739, 36253, 27523, 21909, 18892, -15363, 12584, 40797, -1529, -28787, -6276, -49821, -22746, 26729, -15940, -30950, -43738, -30033, -17398, -19907, 7767, 12071, -11997, -60215, -23400, 12775, 37079, 49220, 39377, 62119, 29900, 23801, -16318, -15817, 44941, 5000, 10785, 21812, -16139, 18051, -29154, 13095, -4984, -25875, -509, -71346, -63896, -33258, -50440, -45852, 2708, 21546, -8892, -38683, -11450, -20445, 10572, 9397, -22902, -24403, -40744, -18094, -4842, 32151, 3181, -15787, -9910, -31708, -16914, 1305, -7504, -12478, 16918, 1099, 45501, 6403, -52996, -60114, -66902, -64215, -10459, -16011, -11953, 11837, -25616, -27595, -86161, -78887, -23925, 27183]
835B7183l0222J7939N285k9168L836J3662J557R49j0251p151k5327M0089J7613
822B5994j9080m198o4829N4767K6361k1411l3699J6690M4270J797q684M1696n3122
809F552l9966L8392j211J4041J2863k9578L5938l0869n9010j912M9770N9193j7794
796C6409l7918Q482J9577j6991k8696J6237k3555J3151K3251m3483n588M0289
784A165K0378l0338J2316J0716J1335K5840P99j6446N70l7544k8969N8415K618
771C0855n8129m196l5582P1912J1837j2408l7862K4236j2245q368j8419j2201
759f0570M4461L2805O327m3646m3075q512J1920K4713L0434J3723k6801K5600
747G379Q35M19j5939j5251L6271j7358O156j6941j6272r608N3147j3140l1740
$$ y = [27183, -3039, 14900, 20185, -8983, -5147, 8515, 10072, 11021, 770, -6381, -31708, 8381, 25994, 6914, 2716, -62113, -7346, 19015, -2396, -36095, -19405, 24865, 26662, 17978, 59674, 6552, -33414, 4978, 3767, 17808, 30671, 1093, 37031, 6162, -52848, -54760, -4990, 54203, 36409, -1509, 6973, 26550, 9559, -19137, -2900, -26455, -13304, 9947, -33536, -39124, 1165, 21543, -8795, 3521, 14237, 25572, 51412, 52211, 35765, 36335, -1209, -30178, 28237, 30855, -27274, -31470, -67052, 4860, 16697, 4289, -33573, -9337, -21582, -29950, -48369, -60570, -16109, 16696, 23023, -20623, -63698, -72210, -60290, -35577, -5143, 8580, -18221, 7379, 8214, 8633, -7306, -22557, 13714, -3644, 2512, -14429, -30701, -40309, 12838, -302, -32042]
734c2042J4856j249K0264m196K7539k8774K801L8381j7717k857l0334J2013L5976
721C4661K4115n8852j646Q80K8507J3868k3398l0530K7283k582l2659Q767j9669
$$ y = [-32042, -17186, -18435, 1829, -2367, 25172, -3602, -801, 37580, 19863, 17006, -13328, -1315, 34661, 58776, -76, -1722, -842, 27665, 41533, 18135, -12395, 14888, 12306, -20353, -11586, -31255]
$$ [...]
##END NTUPLES=NMR SPECTRUM
##END=
