##TITLE=1H_TG-2340-B
 CDCl3
 8 sc, 
 6.07.2022
##JCAMPDX= 6.0         $$ Bruker NMR JCAMP-DX V2.0
##DATA TYPE= NMR SPECTRUM
##DATA CLASS= NTUPLES
##ORIGIN= UXNMR, Bruker Analytische Messtechnik GmbH
##OWNER= root
$$ XWIN-NMR		Version 3.5
$$ Wed Jul  6 14:03:52 2022 Russian Standard Time (UT+4h)  she@DPX200
##.OBSERVE FREQUENCY= 200.1313499994
##.OBSERVE NUCLEUS= ^1H
##.ACQUISITION MODE= SIMULTANEOUS
##.ACQUISITION SCHEME= undefined
##.AVERAGES= 8
##.DIGITISER RES= 18
##SPECTROMETER/DATA SYSTEM= spect
##.PULSE SEQUENCE= zg30
##.SOLVENT NAME= CDCl3
##.SHIFT REFERENCE= (INTERNAL, CDCl3, 0, 15.7337)
##AUDIT TRAIL= $$ (NUMBER, WHEN, WHO, WHERE, WHAT)
$$ ##TITLE= Audit trail, XWIN-NMR		Version 3.5
$$ ##JCAMPDX= 5.01
$$ ##ORIGIN= Bruker BioSpin GmbH
$$ ##OWNER= she
$$ F:/spectra/data/she/nmr/H-F/1/pdata/1/auditp.txt
$$ ##AUDIT TRAIL=  $$ (NUMBER, WHEN, WHO, WHERE, WHAT)
(   1,<2022-07-06 14:02:45.79 +0400>,<she>,<DPX200>,
      <created by zg, POWCHK disabled, PULCHK disabled
       configuration hash MD5:
       00 E9 B6 7A A2 85 ED C7 34 08 36 98 17 FE 4E 26
       data hash MD5: 16K
       9B DC C3 53 08 8F 3B 59 99 5C 5B 84 F2 1F 79 D6>)
(   2,<2022-07-06 14:02:48.71 +0400>,<she>,<DPX200>,
      <Start of raw data processing
       efp BC_mod = 2 LB = 0.24 FT_mod = 6 PKNL = 1 PHC0 = -18057.38 PHC1 = 9.40069 SI = 16K 
       data hash MD5: 16K
       3C 26 48 D1 4D 31 9C 0E BD F4 00 01 48 EE 2C 9E>)
(   3,<2022-07-06 14:03:05.15 +0400>,<she>,<DPX200>,
      <pk PHC0 = -0.5480228 PHC1 = 1.2 
       data hash MD5: 16K
       72 36 E8 56 01 2F 15 7B C8 C2 9A B7 57 62 EA F3>)
(   4,<2022-07-06 14:03:08.57 +0400>,<she>,<DPX200>,
      <abs ABSG = 5 
       data hash MD5: 16K
       B7 7B 57 BB 72 EF 55 86 94 E6 57 68 E4 63 B5 3F>)
$$ ##END=
$$ 
$$ hash MD5
$$ CC D6 59 8F 8F C6 ED 3E 3D 5C A1 27 02 01 E6 C3
##$RELAX= 
##$RELAX= 
##$RELAX= 
##$RELAX= 
##$RELAX= 
##$RELAX= 
$$ Bruker specific parameters
$$ --------------------------
##$DU= <F:/spectra>
##$EXPNO= 1
##$NAME= <H-F>
##$PROCNO= 1
##$TYPE= <nmr>
##$USER= <she>
##$AMP= (0..31)
100 100 100 100 100 100 100 100 100 100 100 100 100 100 100 100 100 100 
100 100 100 100 100 100 100 100 100 100 100 100 100 100 
##$AQSEQ= 0
##$AQ_mod= 1
##$AUNM= <au_zg>
##$AUTOPOS= <>
##$BF1= 200.13
##$BF2= 200.13
##$BF3= 200.13
##$BF4= 200.13
##$BF5= 200.13
##$BF6= 200.13
##$BF7= 200.13
##$BF8= 200.13
##$BYTORDA= 1
##$CFDGTYP= 0
##$CFRGTYP= 5
##$CHEMSTR= <none>
##$CNST= (0..31)
1 1 145 1 1 1 1 1 1 1 1 1 1 1 1 1 1 1 1 1 1 1 1 1 1 1 1 1 1 1 1 1 
##$CPDPRG= <>
##$CPDPRG1= <>
##$CPDPRG2= <>
##$CPDPRG3= <>
##$CPDPRG4= <mlev>
##$CPDPRG5= <mlev>
##$CPDPRG6= <mlev>
##$CPDPRG7= <mlev>
##$CPDPRG8= <mlev>
##$CPDPRGB= <>
##$CPDPRGT= <>
##$D= (0..31)
0 1.2 0 0 0 0 0 0 0 0.06 0 0.03 0 0 0 0 0.0002 0 0 0 0 0 0 0 0 0 0 0 0 
0 0 0 
##$DATE= 1657101765
##$DBL= (0..7)
120 120 120 120 120 120 120 120 
##$DBP= (0..7)
150 150 150 150 150 150 150 150 
##$DBP07= 0
##$DBPNAM0= <>
##$DBPNAM1= <>
##$DBPNAM2= <>
##$DBPNAM3= <>
##$DBPNAM4= <>
$$ [...]
##$SUBNAM2= <"">
##$SUBNAM3= <"">
##$SUBNAM4= <"">
##$SUBNAM5= <"">
##$SUBNAM6= <"">
##$SUBNAM7= <"">
##$SUBNAM8= <"">
##$SUBNAM9= <"">
##$SW= 18.0517283424941
##$SWIBOX= (0..15)
0 0 2 0 0 0 0 0 0 0 0 0 0 0 0 0 
##$SW_h= 3612.71676300578
##$TD= 16384
##$TD0= 1
##$TE= 0
##$TE2= 300
##$TE3= 300
##$TEG= 300
##$TL= (0..7)
0 120 120 120 120 120 120 120 
##$TP= (0..7)
150 150 150 150 150 150 150 150 
##$TP07= 0
##$TPNAME0= <>
##$TPNAME1= <>
##$TPNAME2= <>
##$TPNAME3= <>
##$TPNAME4= <>
##$TPNAME5= <>
##$TPNAME6= <>
##$TPNAME7= <>
##$TPOAL= (0..7)
0.5 0.5 0.5 0.5 0.5 0.5 0.5 0.5 
##$TPOFFS= (0..7)
0 0 0 0 0 0 0 0 
##$TUNHIN= 0
##$TUNHOUT= 0
##$TUNXOUT= 0
##$USERA1= <user>
##$USERA2= <user>
##$USERA3= <user>
##$USERA4= <user>
##$USERA5= <user>
##$V9= 5
##$VALIST= <valist>
##$VCLIST= <CCCCCCCCCCCCCCC>
##$VD= 0
##$VDLIST= <DDDDDDDDDDDDDDD>
##$VPLIST= <PPPPPPPPPPPPPPP>
##$VTLIST= <TTTTTTTTTTTTTTT>
##$WBST= 1024
##$WBSW= 4
##$XGAIN= (0..3)
0 0 0 0 
##$XL= 0
##$YL= 0
##$YMAX_a= 377946
##$YMIN_a= -649738
##$ZGOPTNS= <>
##$ZL1= 120
##$ZL2= 120
##$ZL3= 120
##$ZL4= 120
##$ABSF1= 15.76562
##$ABSF2= -2.286229
##$ABSG= 5
##$ABSL= 3
##$ALPHA= 0
##$AQORDER= 0
##$ASSFAC= 0
##$ASSFACI= 0
##$ASSFACX= 0
##$ASSWID= 0
##$AUNMP= <proc_1d>
##$AZFE= 0.1
##$AZFW= 0.1
##$BCFW= 0
##$BC_mod= 2
##$BYTORDP= 0
##$COROFFS= 0
##$CY= -3
##$DATMOD= 1
##$DC= 0
##$DFILT= <>
##$DTYPP= 0
##$F1P= 0
##$F2P= 0
##$FCOR= 1
##$FTSIZE= 16384
##$FT_mod= 6
##$GAMMA= 0
##$GB= 0
##$INTBC= 1
##$INTSCL= 0
##$ISEN= 128
##$LB= 0.24
##$LEV0= 0
##$LPBIN= 0
##$MAXI= 10000
##$MC2= 0
##$MEAN= 0
##$ME_mod= 0
##$MI= 1.114404
##$NCOEF= 0
##$NC_proc= -5
##$NLEV= 6
##$NOISF1= 3.799351
##$NOISF2= 2.8
##$NSP= 0
##$NTH_PI= 0
##$NZP= 0
##$OFFSET= 15.73367
##$PC= 1
##$PHC0= -18057.93
##$PHC1= 10.60069
##$PH_mod= 1
##$PKNL= yes
##$PPARMOD= 0
##$PSCAL= 0
##$PSIGN= 0
##$REVERSE= no
##$SF= 200.130007578867
##$SI= 16384
##$SIGF1= 3
##$SIGF2= 2
##$SINO= 5.538805
##$SIOLD= 16384
##$SREGLST= <1H.CDCl3>
##$SSB= 0
##$STSI= 16384
##$STSR= 0
##$SW_p= 3612.71676300578
##$SYMM= 0
##$S_DEV= 0
##$TDeff= 16384
##$TDoff= 0
##$TI= <>
##$TILT= no
##$TM1= 0
##$TM2= 0
##$TOPLEV= 0
##$USERP1= <user>
##$USERP2= <user>
##$USERP3= <user>
##$USERP4= <user>
##$USERP5= <user>
##$WDW= 1
##$XDIM= 16384
##$YMAX_p= 449159589
##$YMIN_p= -189393
$$ End of Bruker specific parameters
$$ ---------------------------------
##NTUPLES= NMR SPECTRUM
##VAR_NAME=  FREQUENCY,     SPECTRUM/REAL,   SPECTRUM/IMAG
##SYMBOL=    X,             R,               I
##VAR_TYPE=  INDEPENDENT,   DEPENDENT,       DEPENDENT
##VAR_FORM=  AFFN,          ASDF,            ASDF
##VAR_DIM=   16384,         16384,           16384
##UNITS=     HZ,            ARBITRARY UNITS, ARBITRARY UNITS
##FACTOR=    0.220516191357247, 1,           1
##FIRST=     3148.77954330994, 0,            0
##LAST=      -463.937219695842, 0,           0
##MIN=       -463.937219695842, -189393,     0
##MAX=       3148.77954330994, 449159589,    0
$$ Real data points
##PAGE= N=1
##DATA TABLE= (X++(R..R)), XYDATA
$$ [...]
9408 749094 738866 744969 702341 685030 704716 706665 641585 635915 639716 596920 594491 610248 675919
9395 675919 656951 652422 641845 593167 610603 684645 650056 614894 582237 576035 591199 612855
9383 612855 644754 606178 624651 667642 705364 688440 668854 630786 662915 655873 635513 684545
9371 684545 740158 733190 744226 790041 812585 797310 824485 780058 793810 789971 799775 812279
9359 812279 816043 854523 851760 845327 879249 888281 878101 902439 935120 919796 930373 936815 949847
9346 949847 955938 946991 947138 945990 956013 958702 982362 964084 969487 948901 993641 980419 981108
9333 981108 1012901 1017717 1034205 1070094 1095184 1121631 1116104 1150084 1155666 1158173 1182543 1193748
9321 1193748 1240141 1278850 1307616 1304680 1359662 1315214 1378221 1432633 1407966 1424751 1459451 1550159
9309 1550159 1572766 1545066 1589907 1616629 1690269 1730208 1717718 1744199 1743785 1781772 1813360 1816495
9297 1816495 1775204 1704296 1654447 1681717 1695270 1749995 1756905 1728325 1731997 1745656 1733959 1727628
9285 1727628 1728822 1752187 1777382 1762602 1781697 1809874 1837202 1866704 1916117 1930385 1943654 2026750
9273 2026750 2064671 2072721 2082800 2163521 2255079 2310992 2305842 2354556 2385164 2433425 2469130 2432826
9261 2432826 2411103 2373138 2340120 2301128 2256443 2209447 2252080 2231579 2202346 2215711 2334443
9250 2334443 2353455 2302937 2339217 2359261 2348291 2328132 2314747 2374568 2366033 2385948 2421785 2410863
9238 2410863 2423138 2426995 2439502 2485167 2533908 2541542 2547164 2566754 2606934 2621524 2642574 2623705
9226 2623705 2609432 2635239 2669750 2667337 2712361 2733409 2790678 2862605 2907924 2977704 3006474 3061734
9214 3061734 3122727 3141451 3143499 3193816 3257562 3321970 3341877 3365180 3406286 3383221 3398115 3460502
9202 3460502 3474871 3479675 3502745 3514077 3555662 3594478 3623148 3694725 3743248 3795547 3847556 3920087
9190 3920087 3978927 4056489 4084151 4219797 4360917 4437645 4514897 4658821 4787073 4904473
9180 4904473 5043878 5192040 5327032 5437178 5565515 5647710 5723985 5818130 5912750 5943831
9170 5943831 6015266 6106901 6145165 6189682 6205674 6219789 6306963 6403629 6460739 6530465 6610976
9159 6610976 6723888 6837736 6914372 7079210 7145260 7308744 7449351 7590589 7739021 7972275
9149 7972275 8181044 8377217 8618011 8839722 9073461 9243054 9429327 9638036 9886792 10105652
9139 10105652 10338398 10585301 10889841 11121178 11377937 11660343 11908634 12226666 12454083
9130 12454083 12676726 12976339 13314849 13657778 14006058 14428730 14904220 15355415 15821665
9121 15821665 16313517 16841787 17431772 18028807 18628183 19295848 19985601 20676772 21438919
9112 21438919 22344467 23314513 24311348 25298081 26435491 27723994 29243015 31040656 33320659
9103 33320659 36286006 39925023 44106773 48294983 52483796 57493608 63753855 70801551
9095 70801551 76723800 79641661 80587403 82251171 85551188 90942881 96126593 97441972
9087 97441972 94395529 87466846 78296634 69765217 63125699 58573791 56086495 54769528
9079 54769528 53381283 51243834 48795170 46414607 44380700 42979097 42204238 41925526
9071 41925526 42134192 42751950 43959308 45867619 48797991 52818477 57917331 63451289
9063 63451289 68782702 74200814 79536596 83601898 86882038 91132059 97387785 104968319
9055 104968319 110657012 113175782 114582125 114615104 112731962 108300934 99222211 86917011
9047 86917011 74735343 63897254 55096749 48721994 44166999 40910210 38676034 37142910
9039 37142910 35750435 33762130 31209214 28556656 25934153 23647925 21883264 20414969
9031 20414969 19201738 18175272 17264596 16389304 15593127 14960042 14398555 13878729 13410023
9022 13410023 13050767 12698828 12374709 12157721 11985461 11880378 11823448 11866320 11918392 11953677
9012 11953677 12059227 12136193 12136433 12135235 12202403 12377152 12647308 12772880 12705237 12606612 12410775
9001 12410775 12154133 11712775 11045134 10288317 9499228 8790914 8204635 7839929 7543545
8992 7543545 7299326 7104473 6933197 6757549 6517339 6379971 6190270 5987288 5831067 5655217
8982 5655217 5519912 5396749 5290615 5209148 5095235 5043539 5036349 4957193 4900653 4836948 4812229
8971 4812229 4752878 4738066 4720159 4726250 4703310 4623681 4588503 4548623 4496056 4525932 4548567 4535726
8959 4535726 4542903 4599031 4558466 4587366 4587603 4548375 4546987 4507195 4493535 4522812 4541904 4523258
8947 4523258 4511770 4540657 4563441 4601149 4639235 4691280 4720741 4788912 4893384 4960048 5031078
8936 5031078 5072441 5105178 5114519 5165035 5209790 5294661 5347604 5420123 5448842 5461284 5573459
8925 5573459 5629584 5658010 5750509 5860903 5897719 5984234 6064298 6093544 6112230 6194387 6224801
8914 6224801 6274659 6360321 6482425 6540840 6671813 6802727 6874218 6984474 7123899 7289557
8904 7289557 7390697 7517634 7623353 7761821 7922550 8120828 8284107 8447565 8592624 8706897
8894 8706897 8852991 9049437 9250526 9431492 9662648 9882497 10079552 10336208 10520511 10779066
8884 10779066 11083313 11278663 11517131 11809186 12094600 12370658 12661247 12937733 13267252
8875 13267252 13591601 13978750 14347026 14694761 15154187 15599091 16021163 16492196 16971583
8866 16971583 17467998 18011283 18659633 19367925 20233215 21179561 22309559 23763117 25486151
8857 25486151 27472194 29744809 32234749 34731150 37246119 40293937 44124095 48610867
8849 48610867 53412058 57550712 60919562 63828109 65424011 64145883 60517614 56229791
8841 56229791 52422423 49264585 46974453 45821716 45508692 45083721 43892483 42404878
8833 42404878 41019064 39770761 38730768 38228544 38287936 38893412 40081849 41867245 44115801
8824 44115801 46725148 49483199 52114817 55111016 59047846 64138751 70327343 77464465
8816 77464465 85649323 94863633 103058929 109609554 113932781 114539642 110799188 104485322
8808 104485322 97681299 91542552 86517381 82238873 77391572 71218936 65183593 59999514
8800 59999514 55145210 50617361 46879684 43926142 41699755 39910810 38601791 37747231
8792 37747231 37332953 37363075 37739647 38508435 39740567 41426230 43666160 46218301 49051063
8783 49051063 51814355 53853706 55400167 57621975 60900855 64795972 68403792 71825186
8775 71825186 73353363 71773716 67676537 61727810 54570997 47737258 42202285 37515011
8767 37515011 34139427 31832494 30215023 28747581 27113224 25486158 24016203 22656180
8759 22656180 21436343 20412670 19611956 18929728 18448462 18077141 17774678 17529499 17338257
8750 17338257 17046941 16643999 16245457 15775792 15255479 14757732 14350203 14010597 13661553
8741 13661553 13436375 13291267 13154713 13023406 12912592 12880385 12841173 12860546 12882871 12901838
8731 12901838 13009236 13150587 13327762 13455413 13617805 13831125 14014397 14251774 14534492
8722 14534492 14795636 15060917 15306385 15530268 15801104 16160661 16553454 16999243 17501767
8713 17501767 18064161 18822850 19682348 20689865 21845358 23239896 24927642 27080337 29899505
8704 29899505 33458079 38177592 44237362 52371513 61340993 64003104 60186780 53633627
8696 53633627 47968142 45107502 44403832 45112954 45914076 46488434 47465102 49189231 51104775
8687 51104775 52621274 52152640 49936492 47597427 45846217 43974054 41781441 39111751
8679 39111751 36116963 33506320 31368597 29308465 27633972 26531106 25845215 25388350
8671 25388350 25108076 25013755 25261439 25754895 26460808 27518306 28975205 30625632 32402617
8662 32402617 33750772 34641126 35863088 38070228 41098447 44973096 49667359 53945401
8654 53945401 56617267 57284414 55877556 52096997 46941521 41995478 37797005 34323352
8646 34323352 31723007 30132004 29007537 27687592 26010803 24393761 23033109 21627164
8638 21627164 20283212 19199457 18244464 17492421 16832205 16380770 16087992 16069441 16225498
8629 16225498 16686490 17430174 18365377 19312418 19970453 20340173 20905210 21575478 22274401
8620 22274401 22535229 21825932 20615296 19556428 18708654 17673354 16408677 14954203 13537765
8611 13537765 12339251 11248018 10242186 9440871 8836030 8366442 7920928 7541681 7164590
8602 7164590 6870450 6536734 6188480 5891990 5590717 5318701 5085600 4866497 4644041 4491707
8592 4491707 4368073 4182726 4033227 3953743 3797628 3647172 3522496 3406588 3341128 3233355
8582 3233355 3144499 3088567 3010989 2972706 2937980 2879171 2808624 2694550 2623145 2618481 2554959
8571 2554959 2548562 2539059 2512424 2392567 2349114 2531705 2534213 2476433 2405025 2413194 2354986 2378429
8559 2378429 2399826 2394071 2385648 2419488 2409887 2401648 2388892 2370860 2350134 2352214 2343449 2286250 2231164
8546 2231164 2197997 2174042 2099744 2089028 2112512 2069634 2025216 2001749 1994997 1967842 1881704 1852536
8534 1852536 1837457 1795114 1743083 1734729 1714421 1681774 1624280 1628804 1655709 1673803 1678525 1603520
8522 1603520 1640889 1678983 1646213 1617427 1573465 1490845 1461437 1429531 1393319 1343229 1311149
8511 1311149 1286664 1240181 1158444 1170784 1184902 1108462 1109842 1089369 1033514 1026070 1055520 1056153
8499 1056153 1031014 1083578 1093344 1062528 1056359 1068536 1057847 1048213 1102660 1130586 1131087 1121291 1125214
8486 1125214 1151380 1163240 1170474 1177031 1151819 1132607 1136218 1131930 1076277 1091364 1109069 1138186
8474 1138186 1084076 1048863 995449 956085 958260 917857 870867 879266 879918 855890 832051 824082
8462 824082 852393 834697 822947 814345 803872 798606 762865 797289 837082 872307 948376 997763
8450 997763 957628 979765 1007654 1059689 1124737 1166450 1149773 1132092 1150054 1115466 1076015 1031875
8438 1031875 1001047 930450 904395 929726 910659 847039 820959 777516 724426 682161 677384 692522
8426 692522 673361 618998 612586 600398 638462 655395 664687 653338 672512 683332 706368 685280
8414 685280 687947 706461 672627 714269 693856 693786 734978 707685 651399 680418 682106 680947 649847
8401 649847 580869 596929 574829 568039 586316 509489 515101 513118 518544 480207 449905 448089 436767
8388 436767 417691 406927 383393 376185 421343 426179 385254 414653 409564 430476 427742 441915
8376 441915 426057 394766 372945 372529 368860 372050 375504 317995 327092 351908 347261 373124 397665
8363 397665 320119 275510 307438 304901 297935 327680 307355 356173 347177 320881 333540 299570
8351 299570 268534 279812 281417 260845 266798 276112 250255 248589 254508 270072 282530 269498 231775
8338 231775 258834 243531 252379 295366 299142 300407 303555 309658 289480 301714 334508 296532 294667
8325 294667 310039 313318 369022 396949 331520 290331 272964 268892 295976 303126 300279 301287 336067
8312 336067 302537 271225 284954 288600 264639 240078 297652 286446 267092 293176 285937 265978
8300 265978 275338 304214 298208 338258 347763 347666 430864 438215 415913 424830 420334 414201 402981 414414
8286 414414 410291 385946 372401 366790 334205 301771 311644 274565 251700 242232 212744 226501
8274 226501 235585 230622 231449 203103 218528 198707 198727 231740 264602 286114 228417 196917 218583
8261 218583 194071 277100 279175 268634 280311 293201 263614 225808 180348 134927 194234 183844
8249 183844 205505 200393 147330 157888 188958 159994 152229 104408 127103 94774 102100 128177
8237 128177 169602 161108 157069 102346 99919 114731 103689 132763 146171 191605 191222 213291 250312
8224 250312 236914 282236 309670 311695 310383 260517 189359 168087 129253 140287 155279 82781
8212 82781 86811 51353 4033 7294 81549 117130 30727 32992 38792 62257 109236 53419 31665
8199 31665 88364 65376 83511 49566 110439 94336 222576 490623 103967 36717 56852
8188 56852 60726 68781 49459 -1062 -7963 -11698 -25515 38707 46508 15057 24059 25279 1114
8175 1114 -1762 -21433 -29605 -32531 -700 -4377 -2780 15515 46623 34030 -4252 -290 41575
8162 41575 15954 18441 -7556 8448 -17504 -11023 6012 -23797 -39394 20567 -9120 -62302
8150 -62302 -56324 2490 45726 6127 -58481 -23899 -38113 -48019 -62446 -32081 -25796 -34472 -13347
8137 -13347 7658 -8190 -43640 -15297 -8975 -49687 -75283 -92676 -32007 5134 3369 741
8125 741 -6954 -20566 -18370 -46509 -77742 -43909 -61889 -69171 -45158 1256 -54509 -49648 -29326
8112 -29326 -24496 -18482 -48333 -81487 -56325 -39934 -2711 -46256 -63210 -38743 -56894 -40306
8100 -40306 -76444 -110188 -38633 -3794 -19633 -57777 -51141 -20938 -18759 -45330 -46389 -33180
8088 -33180 -39790 -56345 -77465 -66249 -69776 -65324 -7474 -16295 -32476 6772 -34104 -91624 -98089
8075 -98089 -71328 -68995 -35375 14388 -11551 -29952 -49589 -40960 -48492 -87272 -54394 -660
8063 -660 -59296 -45675 -84271 -96832 -47512 -10581 -20750 -28254 -73209 -95915 -72756 -98492
8051 -98492 -53686 -62608 -59700 -35050 -22596 -40443 -49893 -47170 -61068 -119922 -100159 -114000 -99911
8038 -99911 -47160 -89412 -89730 -48362 -82842 -65323 -54892 -76852 -96986 -52399 -43094 -57269
8026 -57269 -33775 -41435 -54568 -33145 -72271 -96816 -30376 -41260 -94500 -94909 -62924 -43978
8014 -43978 -60228 -87692 -72711 -87284 -51463 -45191 -40700 -76524 -38161 -4883 -43204 -91935
8002 -91935 -80418 -89909 -91616 -49786 -36055 -15580 -40603 -71989 -71016 -69910 -33209 -77148 -111714
7989 -111714 -62571 -65442 -68048 -85716 -112823 -78525 -82773 -112625 -72947 -77589 -117738 -117418 -83393
7976 -83393 -62619 -47471 -49880 -56171 -74778 -81588 -110179 -66296 -42369 -65470 -78031 -88712
7964 -88712 -77452 -78998 -85241 -30935 -28138 -35980 -71590 -92292 -91243 -109816 -134581 -121753 -94103
7951 -94103 -126262 -134776 -100988 -62720 -44899 -96738 -94456 -97683 -89819 -82370 -63160 -80997 -89005
7938 -89005 -58509 -72326 -89411 -100342 -78170 -63212 -92139 -91509 -62432 -64100 -91866 -87828 -81313
7925 -81313 -85118 -74317 -56179 -45286 -51022 -82716 -125374 -107956 -72128 -85197 -58377 -18112
7913 -18112 -66042 -54115 -49590 838 -7580 -52379 -56128 -55077 -56109 -41789 -56350 -114183 -109471
7900 -109471 -71681 -97727 -47804 23549 16023 2458 -7656 -41454 -70008 -76154 -49985 -24310
7888 -24310 -18712 -35266 -16852 -39011 -18511 -29516 -50560 -60310 -75089 -44783 -66973 -42209
7876 -42209 -39285 -60670 -50452 -70064 -70458 -65923 -55545 -40921 -69679 -47056 -17043 -34740 -36496
7863 -36496 -11200 18182 34093 -26170 -14297 -44647 -24079 -21907 -90711 -50208 -13185 -42647
7851 -42647 -36564 -45752 -45046 -26589 -25134 -36818 -26718 -25030 -47663 -64870 -44161 -88331 -97749
7838 -97749 -91308 -47796 -21061 -76692 -66854 -69447 -29101 5629 -20439 -39446 -53419 -78194
7826 -78194 -69628 -42871 -63691 -33931 -27546 -49268 -21583 -58970 -44579 -189393 -154805 -135588
7814 -135588 -83085 -93022 -112735 -40914 -53204 -86158 -75064 -63027 -69331 -77522 -75680 -66238 -85458
7801 -85458 -42130 -48647 -72878 -112931 -98781 -58380 -68176 -50528 -25474 -5463 -48305 -54159
7789 -54159 -75844 -96186 -34286 -88264 -92756 -50836 -90265 -75109 -43197 -90163 -76291 -91329
7777 -91329 -104453 -87031 -37239 -46559 -17367 -14031 -17159 -10953 -30455 -17344 -31012 -94685 -53429
7764 -53429 -20333 -10547 -38156 -30701 -24750 -83235 -71751 -97225 -98398 -81158 -39010 -8765 -12001
7751 -12001 -65824 -66316 -40841 -49182 -668 -37949 -30777 -6019 -13809 -31057 -82696 -72945 -61107
7738 -61107 -92292 -88561 -57111 -80156 -97112 -53288 -43503 -87744 -62008 -74407 -59046 -73390
7726 -73390 -79905 -16900 -8237 -32358 -43468 -61838 -77370 -50242 -57899 -44899 3037 -9183
7714 -9183 -42851 -35453 -27778 -25905 -6565 -24559 -76574 -54761 -41897 -37494 -26783 -23003 -53230
7701 -53230 -52983 -51762 -80474 -93344 -121552 -109576 -92296 -99868 -66862 -44406 -53683 -6767 -60027
7688 -60027 -70691 -22321 -4033 -6090 -23141 -21564 -79598 -95784 -84795 -64748 -39160 -31161
7676 -31161 -56763 -66938 -56686 -54516 -78339 -52707 -21585 -18452 -32478 -51004 -47130 -51843 -43994
7663 -43994 -49825 -65127 -46448 -53610 -7505 -42228 -96634 -56764 -27515 -15063 -28640 4910
7651 4910 -638 -3435 -17123 11741 26905 10148 -25881 -40756 -40242 -25564 -45025 -59029 -69632
7638 -69632 -58631 -43557 -14743 -21581 -1041 17733 -33050 -38920 -56932 -32745 -51871 -59357
7626 -59357 -52639 -38418 -38823 -16339 -39474 -68450 -44229 -22541 -54735 -94014 -77751 -26509
7614 -26509 -24164 -49784 -34048 -34922 -6687 -12940 -59045 -28758 -31760 -23543 39055 13261 4431
7601 4431 1136 -15346 -53011 -61883 -59165 -21565 -24127 -53511 -44406 -48416 -32612 -48333 -16372
7588 -16372 -31856 -17947 -52453 -66798 -40703 -68737 -40825 -47343 -31988 -56907 -14303 -5144
7576 -5144 -17008 3749 8744 14942 21704 -4938 -4022 -3834 12411 -3989 -5057 47225 35465 27585
7562 27585 49303 -5204 25579 35759 23995 29248 41856 63076 10194 -5016 -16359 43918
7550 43918 101384 74930 76972 27379 35131 10693 27326 39817 72306 122855 79678 13109
7538 13109 -21437 10016 43088 66276 74972 24175 6645 48098 59186 115050 90401 68233
7526 68233 23151 36276 30610 65482 50240 50439 49436 82927 51984 54118 68708 54636 86051
7513 86051 133078 146133 152378 134330 124353 110452 109186 139921 221875 225515 180364 183119 210903
7500 210903 239241 276244 314924 375957 480778 550365 612971 704283 704534 698330 693888 620189
7488 620189 575078 512211 475913 476116 370023 276367 272011 188186 197394 194959 166616 138880
7476 138880 118996 112933 111448 99026 92561 102522 141534 127731 117969 128601 88502 122375 71342
7463 71342 71210 109744 85703 128892 147861 138947 114084 121921 90227 99223 44090 57365 105664
7450 105664 142923 154345 141299 140275 142341 152258 153805 125133 90045 150118 176890 163548
7438 163548 160700 136402 150341 151584 139901 128310 113711 107423 152713 143086 114503 158795
7426 158795 132815 116044 122485 155552 118077 111246 128200 189132 205006 179961 179086 204153
7414 204153 207348 199795 145202 146549 139942 151185 177028 159443 198851 200518 176603 157929 205251
7401 205251 231571 251680 228236 248865 237189 196933 186119 233073 233296 207811 183395 248732
7389 248732 269346 256237 241455 221732 192087 188796 193220 167045 168580 114395 115290 113482 127774
7376 127774 174461 241183 282476 231610 245510 209944 200004 214779 261262 275634 289221 268794
7364 268794 276018 339703 362538 340101 355136 325661 291220 289346 293138 304194 292863 316715
7352 316715 359973 372301 318000 349098 352434 334991 281208 268956 306204 295643 262589 287953
7340 287953 309831 330717 304437 329296 373684 359623 337290 355714 367036 381940 399861 411001
7328 411001 429018 430126 418522 459947 418226 401602 408604 452027 472609 476061 483327 532726
7316 532726 506323 498852 472277 456330 464915 455709 479768 485381 466414 456634 436736 426140 435956
7303 435956 438987 461620 458228 433644 503845 533738 550520 553612 524931 513987 556920 581326
7291 581326 588159 606077 591980 592464 610314 606377 621294 646344 611531 596197 564894 608731
7279 608731 591002 573756 601230 642682 602120 536495 522826 549095 542164 528174 536500 546815
7267 546815 562953 565288 539087 538577 559080 571922 554329 580207 597102 645845 645746 639495 674910
7254 674910 634981 614644 668463 688971 711748 706366 685459 702915 696619 738959 751865 779543
7242 779543 831924 835932 820090 806977 851383 830113 898015 899771 947531 960936 940212 921546
7230 921546 922729 969012 964019 946868 945963 991434 1026117 1034887 1033776 1081796 1096163 1097970 1142112
7217 1142112 1137212 1177655 1192955 1196335 1212952 1259125 1323355 1370489 1383091 1428098 1447916 1500502
7205 1500502 1536492 1557852 1608705 1596894 1608163 1624619 1702649 1736155 1761850 1843519 1880998
7194 1880998 1839298 1888027 1976016 2095970 2129437 2193803 2275257 2393732 2481824 2560888 2624421
7183 2624421 2707397 2746482 2791596 2855049 2937412 3002606 3052527 3149102 3219425 3288400 3359358
7172 3359358 3396533 3441967 3526179 3577505 3622494 3718772 3767070 3834624 3919674 3985023 4080833
7161 4080833 4130342 4222561 4281157 4357600 4399671 4435063 4505134 4604491 4704963 4750369 4797204
7150 4797204 4940182 5126424 5255237 5434041 5593191 5730912 5908667 6090851 6260967 6469022
7140 6469022 6646772 6940464 7162842 7379251 7621585 7847159 8129479 8407774 8711565 9010314
7130 9010314 9313716 9687338 10038194 10430729 10819251 11259574 11637203 12067397 12518381 12926598
7120 12926598 13339462 13805411 14333350 14866602 15432115 16061641 16801896 17625632 18582400
7111 18582400 19617381 20950178 22483505 24233725 26222177 28505782 31232244 34481088
7103 34481088 38518803 43834243 50948237 60368703 72346713 86666617 102164200 117038739
7095 117038739 127504507 131332780 127436137 117299220 103630263 88629815 74370464
7088 74370464 61487869 50844872 42654598 36561843 31904913 28362228 25465726 23059466
7080 23059466 20950693 19066636 17479564 16103569 14842900 13732128 12726169 11869954
7072 11869954 11173465 10548527 10014779 9597365 9114084 8692734 8361759 8038332 7766272
7063 7766272 7543664 7376586 7244531 7132794 7047912 7005392 7051143 7156049 7212971 7378318
7053 7378318 7461885 7380159 7147775 6810896 6391891 5984113 5603412 5283060 5008022 4779204
7043 4779204 4592317 4449808 4347875 4225483 4152673 4127900 4090188 4014507 4025477 4066396 4108512
7032 4108512 4158248 4256752 4458200 4724025 4943806 5237480 5616031 6044213 6576800 7035858
7022 7035858 7382225 7585264 7504534 7314103 7015356 6605137 6092868 5576331 5007951 4488235
7012 4488235 4020508 3601259 3269214 2976179 2746955 2536355 2381053 2158664 2040466 1965512
7002 1965512 1910805 1805040 1694859 1645213 1599060 1573683 1542484 1498113 1455082 1437603 1422999
6991 1422999 1402167 1337514 1320617 1288078 1238515 1199036 1097627 1034602 1035705 1024267 969369
6980 969369 917191 889032 910919 881720 894850 881579 868446 882034 845782 778873 783527 801305
6968 801305 793391 769188 747647 822264 806146 775961 763924 774014 716773 656861 613521 606224
6956 606224 630025 604598 582364 609999 588294 523664 494940 536060 548667 506931 547132 565883
6944 565883 526776 517537 489729 464191 424294 466714 512458 480182 470644 473072 432614 437688
6932 437688 435505 379154 389412 411108 389884 397750 454527 456721 412675 363685 359942 393076
6920 393076 344502 334154 347621 347840 322568 352345 299719 246162 239191 240760 288798 247552
6908 247552 226190 214493 181390 189454 234442 198890 141963 98685 111792 108122 150440 141785
6896 141785 123409 116684 109120 152160 204886 169982 158004 172584 154766 155343 170541 185142
6884 185142 194457 177548 140276 114038 164528 149102 111853 130260 135675 163988 141581 150482
6872 150482 156993 156876 219102 207117 184976 202819 217306 248250 217899 188692 176257 210204
6860 210204 200112 126713 136973 154529 136119 123361 118368 127729 145197 165888 154059 124651
6848 124651 174327 208255 165796 169969 170924 159985 119792 101460 77140 85683 54755 33771
6836 33771 53899 62166 88073 82066 81124 71409 113151 134762 98864 90879 132723 131568 139544
6823 139544 92794 32397 51662 59613 112165 116832 134494 154909 154463 117108 142696 178487
6811 178487 127468 116399 84264 83288 122944 134996 125334 108615 91317 132083 125771 85777
6799 85777 97656 134719 75196 60491 28381 45505 74475 106146 108093 95084 97686 89280
6787 89280 60299 30540 48122 81272 93380 71863 65805 47669 66915 63222 102504 132228
6775 132228 160695 184046 175311 147539 135767 121581 85224 85970 77749 59893 68191 115822 131067
6762 131067 125187 133831 112171 165786 169003 153299 121606 135818 149088 168169 154218 151920
6750 151920 124945 98410 107720 95590 89567 123650 106737 66466 64836 83245 119659 101118
6738 101118 98973 101458 125319 116845 92198 104625 143045 121558 107904 127702 136250 154460
6726 154460 148283 138505 193426 177271 191480 155309 134623 137188 175077 241160 180273 115419
6714 115419 147790 161223 146215 179084 205616 221363 203668 270031 269965 267561 287013 352570
6702 352570 334800 360353 442952 498027 564753 631589 649917 678686 694925 711538 741986 716500
6690 716500 692756 633416 534447 518286 433732 336907 317240 288324 303249 291419 283257 236715
6678 236715 228087 222796 289060 258611 245496 303546 258216 233813 263700 213547 208555 253139
6666 253139 270920 271965 223280 213490 250549 262339 245500 253053 232491 184721 172830 174464
6654 174464 191141 165643 133088 150931 131052 99837 109983 95575 57753 45070 71204 47931
6642 47931 62474 49387 35326 62522 100124 92574 97575 98418 127739 125978 101676 85460 79517
6629 79517 104300 109931 89103 82794 118216 77199 50718 125704 115432 116739 129114 128693 122575
6616 122575 94523 108837 135565 105415 112341 122073 143615 190446 199346 206485 210451 200402 183970
6603 183970 195580 178873 222376 207959 258590 249117 258785 282065 309836 271265 255918 267785
6591 267785 273037 279220 251889 254535 212501 201546 235866 217113 209770 223796 167866 137761
6579 137761 109229 107638 116458 131697 91779 13235 52570 57253 116517 110483 74472 97917
6567 97917 73470 51374 73265 50931 66054 78393 82868 130652 126510 84287 82062 66770
6555 66770 118033 143317 99288 109640 97043 80007 117133 116771 126517 128151 125534 110980 101927
6542 101927 101830 90151 73971 69616 115097 35445 68131 58692 57502 58856 83993 87635 57393
6529 57393 45776 47729 57304 32690 65480 81700 34479 40749 25635 11331 -2327 31321
6517 31321 37018 -11884 -548 29573 18934 3435 20154 17667 -7742 21946 28832 -6560
6505 -6560 3270 4334 9180 2307 -22690 13574 39512 53677 70538 6663 -16306 2544 22234
6492 22234 1438 45650 29999 -5443 24209 -10900 8282 31980 36246 51645 48204 66827
6480 66827 65811 24792 19239 43923 69202 80236 55015 45573 76221 80791 98806 113224 66379
6467 66379 51235 46803 29210 34406 65571 94239 110748 81093 89132 106694 72780 62203
6455 62203 43141 77019 126828 142940 94051 33455 77921 79708 72409 86381 68899 80392
6443 80392 72398 103376 118288 150452 130243 45543 67580 120305 131101 135401 163358 139908
6431 139908 91866 58435 100251 121567 111261 91980 85739 42378 34165 91468 111761 108212
6419 108212 88274 96383 113313 117188 77279 85226 148497 123926 162250 122521 113512 147156
6407 147156 136602 132110 124149 134073 123570 156242 147414 111597 122162 138033 198166 179344
6395 179344 172084 175848 176701 168072 174006 201772 179245 208007 197004 175011 175541 212010 198083
6382 198083 183582 200694 239849 260025 301894 318873 365719 353836 332278 310571 310440 280712
6370 280712 263665 330346 361919 384214 377402 363175 398500 452265 409359 372307 366903 363015
6358 363015 306966 291594 279289 278895 255321 242829 304713 233582 219666 266502 268556 249023
6346 249023 280235 284608 298256 302031 285742 271452 251819 221156 230402 298965 324231 324427 323992
6333 323992 379787 393176 375772 429577 459307 458748 456224 505643 526581 539583 490301 469436
6321 469436 469387 460622 489085 519699 482207 414408 493182 555057 547262 538006 538692 518989 466555
6308 466555 485417 467524 436177 440213 433526 397244 411257 426789 417285 416455 423329 449854 465582
6295 465582 484447 451771 483814 454376 465742 464988 483095 505850 537602 498766 525656 510974
6283 510974 478392 493748 501885 493492 479132 497556 468723 432298 501216 550160 528801 517017
6271 517017 519333 533025 544094 512396 545631 574568 571989 620709 603524 535218 546745 586409
6259 586409 581693 583979 652056 665425 648634 665703 687938 728123 726214 708722 737520 742046
6247 742046 728009 724027 690034 720253 724190 728916 770168 810480 794730 836426 842402 878478
6235 878478 825028 836318 895845 904468 913499 895046 897195 933547 991606 1049947 1108291 1116262
6223 1116262 1180719 1233692 1209117 1131646 1135063 1171880 1133522 1083877 1123243 1162478 1144946 1120525
6211 1120525 1080244 1051413 1039064 1052333 1060595 1079320 1077491 1067263 1063482 1115849 1184232 1157989
6199 1157989 1162915 1178545 1165887 1187555 1208706 1235893 1262299 1253218 1305855 1342313 1327626 1339628
6187 1339628 1386917 1475160 1464331 1467704 1439071 1417444 1402419 1415160 1434534 1475863 1450444 1441937
6175 1441937 1489850 1520693 1523058 1519195 1573889 1599633 1646294 1652516 1667882 1681446 1681108 1699233
6163 1699233 1687601 1670738 1696543 1756776 1799978 1823870 1816158 1866787 1877822 1851464 1905255 1915464
6151 1915464 1906892 1940726 2003791 2029871 2039222 2087370 2130449 2130985 2174224 2221391 2278281 2311512
6139 2311512 2329844 2384595 2426813 2448228 2446070 2460128 2506673 2531031 2590686 2641575 2675936 2683385
6127 2683385 2702687 2716017 2749149 2767775 2815020 2889755 2929880 2967039 2974059 3051348 3081719 3116352
6115 3116352 3124338 3179810 3200947 3234485 3231936 3236559 3294414 3316924 3406978 3446777 3500181 3573600
6103 3573600 3596987 3674081 3774053 3787360 3847221 3971263 4046298 4132604 4208190 4279918 4395899
6092 4395899 4504403 4647809 4770751 4861315 4986771 5097771 5156469 5282324 5411036 5608891
6082 5608891 5744670 5871254 6065519 6234488 6414600 6618375 6790383 6955201 7152060 7372811
6072 7372811 7588608 7843935 8059889 8330504 8577161 8862812 9207374 9492891 9812854 10208437
6062 10208437 10649328 11197398 11789768 12430004 13244929 14189265 15343800 16832816 18759568
6053 18759568 21196181 24092045 27367660 31055475 34768266 37544626 38573246 37674456
6045 37674456 35785978 34043710 32704061 31602971 30926399 31294668 32612298 34671028
6037 34671028 37221700 39179684 39480208 37804495 34871612 31717384 28730864 25749924
6029 25749924 22782240 20239520 18357341 17008345 16024003 15228525 14641276 14131936 13738724
6020 13738724 13498373 13316997 13208953 13093536 13076514 13157202 13299519 13493152 13795001 14165364
6010 14165364 14658135 15260434 15934354 16760469 17810009 19049694 20652536 22736954 25529213
6001 25529213 29001351 32997537 37469108 42359443 46741612 49271309 49183079 47128627
5993 47128627 44445724 42207594 40356572 38988853 38513345 39460522 41549238 44460657
5985 44460657 47410772 48864272 47765687 44248140 39761242 35430488 31247377 26865617
5977 26865617 22830491 19515861 17022008 15107525 13654135 12446609 11384219 10450392
5969 10450392 9680582 8977602 8423834 7902640 7436790 7035597 6675132 6375456 6115328
5960 6115328 5866840 5609234 5403257 5182099 5031852 4883237 4667724 4514533 4360868 4280737
5950 4280737 4176020 4069635 4005428 3891858 3720215 3602050 3525629 3440240 3342008 3249855
5940 3249855 3131609 3075609 3036573 2954061 2925272 2857550 2803015 2714255 2674195 2640655 2635816
5929 2635816 2550056 2502493 2477660 2414172 2379481 2329986 2343149 2317100 2284742 2229041 2253845
5918 2253845 2189285 2154326 2125231 2087102 2081132 2041501 2016622 2047278 2008924 1983228 1994143 1989548
5906 1989548 2014186 2006893 2003862 2000693 2021962 1992937 1982128 2018712 1996623 1981359 1981593 1933467
5894 1933467 1927869 1920982 1896836 1877705 1926311 1947460 1965671 1949119 1941413 1934921 1948751 1986818
5882 1986818 1939806 1977984 2000031 1980316 2023150 2072714 2120202 2201868 2260600 2328423 2427948
5871 2427948 2521355 2511893 2534797 2568314 2532096 2519395 2493835 2477953 2410680 2414404 2375655 2374085
5859 2374085 2355201 2331428 2331558 2346593 2374097 2363753 2375900 2381958 2430326 2510312 2633515 2696252
5847 2696252 2678906 2755876 2861126 3006550 3173685 3338423 3553494 3802332 4078338 4292052
5837 4292052 4345517 4243209 4095814 3941866 3834943 3618291 3466863 3387904 3333102 3351035
5827 3351035 3391598 3367902 3328256 3363633 3431865 3457625 3494825 3572686 3667261 3812607 3871291
5816 3871291 3986742 4097987 4259431 4436663 4577526 4767080 4994942 5261199 5574069 5808770
5806 5808770 6048806 6190045 6156761 6066443 5988945 5934048 5864968 5757699 5726519 5790193 5865252
5795 5865252 6016512 6188561 6401721 6636260 6962555 7322398 7759115 8140408 8545890 9047246
5785 9047246 9585718 10108316 10623082 11031418 11362003 11602819 11800821 11988140 12124816 12350513
5775 12350513 12507181 12484188 12327720 12028397 11693100 11399519 11074171 10707815 10321724 10011993
5765 10011993 9713904 9545752 9362451 9219942 9121407 9003790 8942455 8845831 8729452 8708285
5755 8708285 8628199 8530035 8557319 8519234 8569749 8633327 8725822 8844114 9008633 9202230 9417466
5744 9417466 9651270 9968530 10321203 10657678 11042850 11467916 11860698 12203845 12628744 13077000
5734 13077000 13547453 14118364 14856981 15674365 16671358 17946165 19677515 21730553 24010302
5725 24010302 26623065 29668176 33228977 36949495 39612656 40639170 40313652 38717658
5717 38717658 36305933 33946360 31839388 29347482 26293539 23499796 21477950 20160792
5709 20160792 19344359 18805913 18631008 18656680 18935346 19511988 20360256 21612000 23323072
5700 23323072 25371924 27596122 30206547 33359913 37118771 40692092 42749307 43130557
5692 43130557 42210323 39958953 37110100 34590980 32089099 29019324 25624237 22767247
5684 22767247 20702097 19342962 18498579 17933703 17648563 17619803 17841991 18420225 19279839
5675 19279839 20462078 21879818 23485635 25579618 28081870 30302386 31470182 31536199
5667 31536199 30767022 29050958 27053781 25381932 23670640 21463308 19097471 17151943
5659 17151943 15806686 14932044 14392123 13996858 13780300 13772104 13936379 14344518 14983762 15937019
5649 15937019 17173080 18643664 20315472 22331845 24850828 27595605 29701804 30522712
5641 30522712 30163529 28850565 26697503 24425908 22486075 20303079 17575556 14877868
5633 14877868 12724339 11090628 9890214 8965833 8195317 7467788 6834898 6316610 5890254
5624 5890254 5548165 5180804 4887514 4631881 4389261 4194936 4023739 3834260 3643116 3468751
5614 3468751 3402869 3289469 3171553 3044469 2921702 2851159 2776541 2728082 2670116 2632433 2605326
5603 2605326 2484102 2409090 2362184 2284308 2224141 2153554 2089438 2030982 1994750 1981784 1923668
5592 1923668 1882133 1869754 1838110 1776447 1760275 1726880 1708749 1688182 1667656 1636730 1596524
5581 1596524 1606118 1637946 1583711 1593216 1649803 1569157 1541487 1530198 1508135 1441691 1382015 1409161
5569 1409161 1320237 1351064 1363219 1312479 1282401 1288047 1311764 1295097 1293877 1269897 1302099 1296817
5557 1296817 1313941 1319319 1359839 1426463 1416608 1398910 1405731 1381781 1307478 1241135 1282658 1258317
5545 1258317 1197284 1177340 1157023 1097984 1096556 1154515 1139760 1085677 1118481 1107405 1125108 1174391
5533 1174391 1176970 1165983 1237626 1311658 1302181 1273131 1288014 1253158 1224414 1156519 1188713 1143576
5521 1143576 1107454 1128757 1079943 1040645 1026361 1019187 1052752 1039069 1013506 1058367 1059456 1050084
5509 1050084 1065551 1096492 1074414 1100451 1101496 1108001 1136232 1087129 1089183 1058161 983347 1049096
5497 1049096 1023290 948996 908916 908261 920393 927817 916327 900337 831785 799711 820379 852839
5485 852839 845079 836656 839248 855979 862004 879627 844283 789697 817981 747857 710128 743618
5473 743618 809307 795065 778020 775542 751160 737004 681958 699704 684890 675651 708678 696431
5461 696431 678245 684177 683392 668941 689254 666218 638743 722191 682973 631547 648969 638751
5449 638751 646333 623777 609298 592053 571974 579926 582453 621143 629165 658206 629748 636556 660398
5436 660398 633761 636996 631132 641595 614661 662084 635424 606315 644013 638399 646199 631675
5424 631675 636351 667401 686752 677713 719952 726620 763837 766684 723232 672117 675110 720815 754523
5411 754523 789897 835597 820853 744795 726548 743652 727105 721076 772341 805493 834222 869263
5399 869263 849475 895141 943477 955239 982012 988786 991743 1029127 1039326 1054122 1079378 1119849
5387 1119849 1110422 1145364 1197045 1228700 1242730 1184651 1206535 1204149 1222550 1230309 1296113 1318172
5375 1318172 1317836 1288753 1316677 1392648 1412173 1363628 1413598 1458623 1482738 1506982 1516528 1553004
5363 1553004 1575787 1580841 1602530 1666924 1755525 1764266 1768015 1817929 1804027 1805781 1826967 1840185
5351 1840185 1860602 1887197 1930816 1977342 2011884 2035698 2129285 2234641 2335133 2427967 2466310
5340 2466310 2607818 2712798 2721860 2829547 2914384 2977120 2999989 3035812 3084800 3151859 3259366
5329 3259366 3403483 3580766 3743696 3860380 3981387 4118293 4201323 4302228 4454747 4643748
5319 4643748 4796032 4926374 5050874 5178635 5289938 5395063 5441932 5505155 5569801 5546720
5309 5546720 5446789 5418317 5337665 5250157 5194484 5067454 4957950 4853851 4708880 4540629
5299 4540629 4445416 4307563 4195168 4065606 3933767 3794682 3661777 3601241 3564963 3494416
5289 3494416 3445261 3263649 3089388 2955495 2786877 2654960 2520965 2420652 2235342 2086727
5279 2086727 1973394 1876895 1786195 1736995 1731661 1694764 1654805 1621945 1569206 1533690 1502403
5268 1502403 1496903 1465352 1494535 1504350 1465084 1478439 1522992 1524630 1491337 1496236 1496832 1458331 1435831
5255 1435831 1438347 1390265 1374190 1425975 1474639 1467391 1407785 1418567 1413701 1389796 1376741 1329273
5243 1329273 1328801 1345589 1326897 1364361 1403807 1432511 1404279 1414812 1355297 1363364 1391622 1398525
5231 1398525 1408287 1414412 1405265 1413928 1459155 1430479 1389301 1415441 1397159 1415178 1436435 1434019
5219 1434019 1394562 1442058 1489577 1521334 1605724 1653472 1668914 1678200 1670135 1686353 1721644 1746881
5207 1746881 1793899 1814016 1902596 1912949 1947700 1988208 2009446 2049745 2132150 2162932 2224250
5196 2224250 2243462 2320158 2338531 2358470 2400022 2440423 2498541 2584734 2640458 2680132 2715748
5185 2715748 2766801 2818249 2885832 2954006 3007893 3066193 3145995 3158332 3185161 3257573 3357044
5174 3357044 3454004 3517355 3600255 3685721 3798940 3913417 3990813 4062756 4098420 4177116 4280777
5163 4280777 4412438 4575569 4692262 4814285 4927248 5035778 5155975 5317034 5453687 5597512
5153 5597512 5757615 5945313 6072450 6286584 6510113 6680369 6885015 7086515 7304637 7576355
5143 7576355 7868813 8193878 8512928 8896856 9277455 9743878 10280828 10862634 11610694 12519196
5133 12519196 13460878 14607758 15864411 17211942 18223795 18829706 19175878 19221638 19429929
5124 19429929 19987494 20727013 21578135 22714629 24259595 26164586 28325184 30079353 31063944
5115 31063944 31436929 31325906 31445378 32039835 32744295 33002129 33195973 33542884 34140837
5106 34140837 35251690 36658263 37782004 38710044 39146344 39725341 40551298 41289968 41438031
5097 41438031 41057404 40149967 38862488 38109012 38216346 38655923 39011756 39130054 39161236
5088 39161236 38965036 38767745 38737097 38599176 37866601 36311421 34798475 33466054 32278931
5079 32278931 31392093 30777147 29996572 29191223 28591361 28608335 29060632 29441580 28833225 27600211
5069 27600211 25800126 23802023 22221921 20944811 19490452 18100249 17155201 16708235
5061 16708235 16566133 16589221 16279410 15569264 14582833 13402331 12311337 11374237 10354820
5052 10354820 9329166 8482709 7778171 7257968 6857674 6490927 6126536 5836691 5573570
5043 5573570 5356800 5159247 4953812 4782922 4648479 4477261 4317260 4221402 4108716 4032918
5033 4032918 3930787 3897082 3877336 3860615 3809356 3770787 3732316 3682727 3697420 3579936 3484175
5022 3484175 3366455 3278819 3209850 3176676 2987850 2886328 2835290 2727701 2658666 2665767 2667207
5011 2667207 2673721 2701905 2718910 2790575 2829238 2833555 2903158 2991754 3110546 3148707 3160720 3177988
4999 3177988 3094566 3025305 2941483 2844553 2728296 2616483 2459657 2283508 2226319 2147141 2150598
4988 2150598 2112611 2015553 1929015 1896468 1915914 1863528 1913037 1993449 2022836 2098747 2093749 2081171
4976 2081171 2070256 2092514 2061799 2020054 1971422 1931722 1877458 1833560 1774424 1712548 1658554
4965 1658554 1629267 1567101 1513095 1452306 1445956 1435045 1438212 1399568 1388268 1393375 1430568 1425582
4953 1425582 1400386 1402674 1407909 1418479 1409457 1423538 1366666 1329925 1338637 1375464 1365296 1369164
4941 1369164 1334085 1359942 1394695 1438194 1444158 1469723 1432149 1424139 1406711 1387499 1428395 1415474
4929 1415474 1399326 1408937 1434804 1411508 1397192 1441087 1473568 1419998 1385178 1370746 1352642 1338662
4917 1338662 1332804 1309716 1261533 1224590 1230352 1180013 1194114 1186711 1139258 1172148 1225124 1243995
4905 1243995 1228481 1218940 1165428 1177484 1139370 1090738 1138111 1158787 1173072 1203638 1162573 1129511
4893 1129511 1109292 1087697 1025361 1032861 1018418 1073015 1009983 992566 1006832 1012326 979879 960695
4881 960695 1030813 1074116 1070756 1070473 1033513 994670 1000280 1023300 1059053 1045052 1006363 1020530
4869 1020530 1035453 1075673 1075062 1107973 1089043 1065846 1102878 1125925 1162622 1172454 1165259 1174488
4857 1174488 1204056 1190222 1230200 1260090 1208456 1202827 1181747 1158607 1159069 1184192 1226662 1214674
4845 1214674 1234802 1212768 1230280 1265829 1268546 1229138 1265512 1296573 1303352 1265647 1263296 1253944
4833 1253944 1302649 1316055 1271646 1270920 1302534 1361382 1362197 1371062 1385675 1367045 1393136 1399708 1420378
4820 1420378 1440424 1432929 1463841 1498886 1479954 1462403 1450427 1470932 1519214 1515409 1513410 1578767
4808 1578767 1613303 1611176 1642557 1704669 1751355 1751655 1750530 1779783 1847696 1872156 1872057 1909420 1932075
4795 1932075 1940894 1963899 2029453 2061083 2092236 2155593 2185946 2215836 2262409 2325958 2386704 2417913
4783 2417913 2415905 2445801 2484618 2540819 2652991 2713983 2780507 2862177 2948958 3011943 3009590 3065769
4771 3065769 3134065 3216218 3294876 3318276 3407756 3434572 3505071 3583144 3662453 3733558 3818167
4760 3818167 3926961 3996418 4082001 4154413 4202667 4288685 4410093 4515374 4587037 4627659 4747366
4749 4747366 4870049 4944671 5029361 5090891 5179163 5364022 5462604 5609577 5747614 5875817
4739 5875817 5983186 6126549 6290417 6426137 6573345 6770602 6925724 7084540 7319788 7505317
4729 7505317 7684453 7808792 7983546 8196739 8450248 8737335 8943210 9187995 9548111 9844162
4719 9844162 10179464 10585816 11054010 11494797 12019932 12655408 13313006 14103836 14979922 15909771
4709 15909771 17086253 18557756 20406245 22684338 25192903 27936108 31227677 35013706
4701 35013706 38543107 40352446 40659356 39590586 37399263 35522565 34276717 32684287
4693 32684287 30575467 29102485 28592720 28873877 29846500 31665364 34134830 37224742 41179851
4684 41179851 46189205 51890040 57551116 62234191 66263751 68706830 68122333 65730431
4676 65730431 61993973 56431561 50649386 45976936 41519569 36850218 33095138 30736568
4668 30736568 29378381 28890367 29283640 30411628 31875798 33876471 36592888 39938206
4660 39938206 42994937 43909444 43048216 40461395 36705959 33322532 30551802 27196195
4652 27196195 23195179 19779245 17318413 15533329 14131595 13069837 12153729 11377116
4644 11377116 10686261 10098306 9610533 9126292 8723239 8363570 8031205 7756461 7469946
4635 7469946 7224671 7012895 6852574 6647984 6534598 6400356 6295339 6185074 6096478 6037293
4625 6037293 5990281 5927736 5876847 5848017 5720266 5665021 5622080 5601929 5594371 5564346 5540641
4614 5540641 5524259 5475494 5446775 5443486 5429900 5457556 5462192 5477440 5438679 5525817 5599046 5607919
4602 5607919 5695164 5712909 5711024 5775788 5842276 5903206 5940849 5951388 6029699 6075049 6115180 6163863
4590 6163863 6242494 6352057 6432326 6519890 6607585 6729802 6890105 7046081 7231345 7417332
4580 7417332 7546518 7732803 7879578 8033291 8160828 8343296 8556618 8706151 8909611 9129166
4570 9129166 9301118 9574139 9799416 10095464 10405025 10698355 10957343 11291876 11682843 12094120
4560 12094120 12549608 13000995 13442691 13982945 14613358 15317936 16104402 17025232 18082574
4551 18082574 19343029 20838250 22637994 24985152 27822557 31129566 34895429 39190460
4543 39190460 43976919 48531831 51573312 52598291 51884569 50204309 48757953 48012824
4535 48012824 47529663 47072953 47362138 48988125 51697516 54492179 56059311 55927558 54299622
4526 54299622 52123062 50404431 49368108 48396487 47601301 47646227 48374391 48622309 47778687
4517 47778687 45861263 43338577 41159631 39638080 38338104 37068568 36440859 36859945
4509 36859945 38018553 39266122 39566766 38419337 36025571 32892417 29838194 27066068
4501 27066068 24182771 21054860 18315831 16161340 14534762 13269854 12302002 11444094
4493 11444094 10681156 10025091 9442473 8972742 8548022 8191562 7779808 7445881 7136283
4484 7136283 6820936 6579404 6394745 6156392 5990077 5864065 5675154 5528735 5418448 5296339
4474 5296339 5126803 4994627 4912414 4774315 4700053 4609427 4499681 4435671 4401316 4295044
4464 4295044 4291791 4278745 4156831 4136420 4105388 4062635 4032034 3951554 3923162 3864101 3852398
4453 3852398 3880167 3891935 3872010 3860124 3884392 3928508 3986631 4050186 4162480 4279944 4534465
4442 4534465 4820206 5142638 5464719 5646625 5672112 5426298 5099787 4752755 4377111 4053088
4432 4053088 3839655 3634745 3566818 3450071 3347288 3283726 3234230 3159928 3119421 3065945 3034782
4421 3034782 3053133 3102672 3001998 2958261 2898260 2863913 2876881 2836395 2822619 2808989 2801176
4410 2801176 2768837 2753894 2741474 2739966 2747304 2721855 2713406 2734768 2681104 2702084 2678899 2641423
4398 2641423 2621879 2649681 2570382 2620568 2624355 2607732 2551691 2578608 2645678 2671964 2646056 2686416
4386 2686416 2697585 2679723 2705975 2695460 2695226 2722998 2771241 2832923 2821130 2848207 2841472 2879267
4374 2879267 2831174 2799880 2789255 2752350 2737806 2680838 2685787 2707618 2714815 2691413 2659762 2625958
4362 2625958 2623351 2656237 2713560 2728804 2763328 2820343 2818785 2814987 2846859 2893961 2897897 2953417
4350 2953417 2941122 2910419 2947729 2975431 3018000 3029242 3016332 2997753 2976875 2999822 2988433
4339 2988433 2944941 2922206 2956895 2989839 2950770 2960082 2991486 2974533 2950033 2942413 2970251 2972096
4327 2972096 2945342 2940139 2948023 2928470 2880351 2936945 2901184 2894160 2920123 2920953 2959308 2958992 3038464
4314 3038464 3122787 3119214 3169676 3166518 3202106 3274264 3283176 3308112 3363283 3401427 3378144 3419526
4302 3419526 3476886 3522262 3525021 3617320 3709968 3794202 3896619 3981219 4045837 4097777 4103353 4160439
4290 4160439 4157977 4136541 4218675 4259984 4242979 4239680 4293180 4387879 4450743 4495843 4647110 4788541
4278 4788541 4955215 5128752 5263761 5385444 5489152 5550949 5527498 5532239 5563073 5599940 5679695
4267 5679695 5724541 5776807 5895869 6004893 6094204 6232726 6356465 6465337 6543168 6643902
4257 6643902 6746953 6855279 6974404 7059241 7203963 7328208 7469077 7697380 7915371 8213531
4247 8213531 8474104 8698244 9002590 9296524 9548464 9787919 9960888 10269024 10461049 10715268
4237 10715268 10926444 11182253 11377199 11669963 11903465 12057184 12200001 12401109 12633802
4228 12633802 12924942 13164933 13546387 13906041 14271895 14710350 15145357 15453463 15721453
4219 15721453 15841457 15932903 15929086 15957140 16063725 16157679 16242528 16366865 16594069 16779022
4209 16779022 17019867 17266444 17575722 17995485 18406192 18940097 19480870 20042849 20614813
4200 20614813 21230108 21831984 22520153 23307115 24086111 24857378 25605051 26351212 27067297
4191 27067297 27800166 28614217 29511384 30509428 31475065 32506099 33696794 34985020 36317965
4182 36317965 37637533 39043711 40450124 41918787 43426978 45042491 46633548 48312002
4174 48312002 50103405 52053471 54079670 56522818 59238404 62454810 66014841 70123534
4166 70123534 74657116 79941412 85961248 93066152 101350540 111383021 123552221 139092877
4158 139092877 159354489 186758047 223311747 271252663 327072721 386111817 431937678
4151 431937678 449159589 433880285 394048829 343453139 292174137 244322787 202600517
4144 202600517 171135341 147086552 128287937 112863566 100326839 89920439 81466526
4137 81466526 74206381 68041158 62425806 57522670 53041793 49132857 45651202 42691702
4129 42691702 40099466 38026463 36266445 34735364 33255861 31828238 30405528 29166242
4121 29166242 28054164 27059064 26115828 25264249 24486447 23736234 22960358 22226447 21367053
4112 21367053 20514143 19714320 18960519 18258447 17620668 17006646 16522520 16101448 15747380
4103 15747380 15386488 15051830 14659811 14378869 14082875 13792088 13513583 13242551 12876967
4094 12876967 12491740 12107766 11715601 11348659 10992554 10606144 10263978 9876879 9538088
4085 9538088 9218970 8898073 8569175 8266832 7998434 7762161 7584931 7380841 7244602 7087026
4075 7087026 6896354 6714281 6509861 6288790 6078746 5893912 5756094 5604417 5491460 5400180
4065 5400180 5234323 5091628 5021440 4882026 4792596 4731310 4637265 4519175 4500756 4465396 4450174
4054 4450174 4423747 4388309 4305616 4275301 4179287 4071681 3956675 3870234 3806772 3690302 3612187
4043 3612187 3579111 3481077 3465829 3418365 3399898 3393033 3393799 3445577 3486387 3461091 3471369 3438983
4031 3438983 3414718 3347485 3277413 3210618 3196446 3146153 3145227 3106358 3077853 3028535 2964551 2997913
4019 2997913 2999686 2977086 2928224 2872120 2855899 2875401 2837986 2788318 2773369 2781956 2782077 2797006
4007 2797006 2782679 2778308 2813931 2868626 2908536 2959296 3033392 3115610 3109181 3021012 2970035 2838172
3995 2838172 2765784 2663073 2616942 2566604 2499659 2497906 2483112 2491217 2524180 2568547 2594942 2601496
3983 2601496 2592472 2583136 2554962 2498303 2411683 2327169 2196982 2187993 2127400 1992921 1950417 1970439
3971 1970439 1907342 1878479 1877359 1879394 1858708 1844546 1887501 1880653 1828422 1777396 1771003 1744348
3959 1744348 1716061 1668265 1643037 1614148 1590839 1639882 1658463 1607640 1543602 1502505 1571619
3948 1571619 1590131 1605681 1644494 1682345 1645120 1651681 1710605 1723852 1754541 1790186 1809515 1802692
3936 1802692 1813922 1838610 1842438 1869109 1864063 1888711 2017613 2099855 2109280 2052233 2000850 1902796
3924 1902796 1798049 1730748 1707016 1667165 1643708 1620300 1592266 1553082 1513166 1489392 1474133
3913 1474133 1487378 1519341 1543068 1538591 1551985 1497753 1489620 1501190 1526081 1532837 1484154 1506342
3901 1506342 1488446 1454221 1465698 1426066 1414154 1424960 1386893 1398391 1400683 1433881 1456831 1460099
3889 1460099 1454280 1489724 1522148 1536424 1550036 1561636 1552763 1620876 1638733 1608262 1613973 1664303
3877 1664303 1716301 1749461 1780935 1809546 1831485 1850981 1919552 1989583 2038843 2084602 2206078
3866 2206078 2366318 2575403 2897090 3264496 3524936 3667436 3680667 3463741 3173473 2907235
3856 2907235 2642844 2384319 2228197 2041169 1903590 1796453 1738196 1747466 1714797 1716205 1703062
3845 1703062 1630434 1546124 1498871 1435971 1395270 1371500 1355417 1348601 1340929 1326834 1309583 1299434
3833 1299434 1273324 1298790 1295404 1278322 1287585 1286901 1273408 1251674 1261992 1231032 1203986 1210702
3821 1210702 1242740 1270777 1282179 1256907 1247997 1252629 1273655 1277582 1232727 1257888 1256532 1265158
3809 1265158 1226105 1165814 1174961 1181172 1170637 1172168 1158496 1163334 1147186 1164382 1152995 1177914
3797 1177914 1212841 1184345 1221321 1218933 1177479 1192607 1217830 1213523 1234486 1210768 1257955 1271915
3785 1271915 1294608 1287935 1298067 1284776 1267942 1275921 1285661 1323985 1328935 1376081 1459300 1440672
3773 1440672 1397324 1413976 1373829 1376462 1401161 1367823 1348856 1341001 1339605 1352154 1383318 1377234
3761 1377234 1387412 1432928 1472778 1438357 1402087 1400491 1423480 1405334 1450576 1465834 1435836 1414184
3749 1414184 1376075 1377691 1440708 1452414 1465488 1541793 1477879 1492617 1532630 1502160 1509732 1489813
3737 1489813 1487457 1483144 1545535 1523929 1516052 1475066 1466177 1480343 1493974 1508195 1513975 1498440
3725 1498440 1500563 1513850 1506424 1541291 1538639 1520963 1530371 1582944 1546324 1572291 1557996 1539406
3713 1539406 1540534 1527256 1533532 1567373 1572721 1593654 1595588 1584964 1584574 1592322 1594173 1604556 1634781
3700 1634781 1632765 1641230 1649925 1643064 1659791 1662776 1648700 1701339 1719959 1698309 1704978 1724491 1773237
3687 1773237 1815393 1850256 1832580 1839409 1880296 1864611 1844917 1848265 1879910 1919694 1891987 1876939
3675 1876939 1862930 1881283 1893890 1930611 1909818 1876520 1908727 1910531 1917276 1944250 1978398 2020322
3663 2020322 2026891 2051286 2107724 2057238 2031480 2052708 1995566 1996721 2043355 2021015 2014889 2010466
3651 2010466 1996965 2038444 2048055 2030995 2037648 2034140 2017343 2021493 2011331 2006319 2030096 2046149
3639 2046149 2059899 2119950 2155961 2089677 2084445 2096564 2119591 2137369 2124831 2162290 2175920 2167425
3627 2167425 2128444 2131875 2168973 2147983 2149437 2205726 2215515 2219239 2217338 2210901 2201833 2210203 2211984
3614 2211984 2188558 2224878 2241642 2238333 2209748 2205581 2189091 2213958 2257464 2222117 2264191 2264401
3602 2264401 2236683 2223376 2202933 2219726 2181213 2195980 2246995 2215476 2195771 2225784 2197011
3591 2197011 2186785 2198747 2190755 2193270 2192564 2214245 2224811 2236394 2226040 2216417 2273248 2225496
3579 2225496 2225988 2273685 2267493 2264670 2271126 2226219 2198242 2207539 2241984 2257226 2266812 2245045 2244454
3566 2244454 2257196 2228441 2234163 2254542 2274916 2288586 2300524 2305163 2338179 2340304 2358223 2388239
3554 2388239 2409793 2418414 2416853 2425476 2486035 2519336 2549663 2509349 2557956 2573821 2551652 2510022
3542 2510022 2533623 2543633 2561135 2583804 2544408 2587828 2608294 2621624 2630736 2623262 2571023 2588589
3530 2588589 2593033 2604336 2636001 2620754 2657739 2678662 2704628 2657993 2620937 2666647 2687054 2682132
3518 2682132 2684212 2697661 2756314 2769199 2730233 2829936 2861491 2863298 2863043 2909153 2903839 2914933
3506 2914933 2951004 2922779 2950256 2947522 2922058 2902472 2898873 2892963 2867076 2889688 2933393 2913966
3494 2913966 2891831 2895385 2872940 2914504 2964683 2975586 2921875 2909655 2966303 2994100 3002998 3016397
3482 3016397 2990941 3014285 3017991 3023094 3035762 3037717 3034936 3070526 3089343 3057237 3057152 3061900 3092670
3469 3092670 3152561 3119597 3126784 3081150 3073410 3108299 3139613 3110838 3159245 3215047 3179656 3165494
3457 3165494 3173697 3236305 3292625 3233596 3178289 3200685 3262112 3248897 3267267 3305171 3316424 3349189
3445 3349189 3332967 3374044 3372299 3372784 3402701 3405111 3415616 3448524 3468015 3485796 3526375 3559659
3433 3559659 3508917 3582064 3594003 3642559 3646353 3673627 3725948 3771960 3772780 3829655 3874226 3918423
3421 3918423 3975570 4053121 4124505 4156445 4247108 4402151 4494080 4664255 4871406 5135592 5429442
3410 5429442 5688681 5945904 6055531 5941208 5751434 5629982 5498529 5366965 5222030 5133223
3400 5133223 5125935 5139527 5215294 5313208 5415527 5562759 5683990 5792903 5808890 5785074 5757293
3389 5757293 5686970 5690539 5704816 5721153 5792923 5943509 6160155 6466264 6828765 7323179 7863220
3378 7863220 8364693 8768171 8873439 8650887 8210651 7862236 7535070 7111123 6722843 6449079
3368 6449079 6258271 6162603 6104867 6072203 6040943 6020691 5969562 5966091 6010275 6040224 6074162
3357 6074162 6146298 6185979 6256482 6337919 6444310 6549038 6698599 6920892 7131958 7379490
3347 7379490 7631731 7920538 8197326 8219884 8178377 8036370 7922143 7853294 7716403 7609239
3337 7609239 7524101 7508846 7504178 7508872 7573561 7642681 7737421 7844110 7968225 8109876 8262041
3326 8262041 8494403 8682682 8841148 8955268 9009119 8934414 8848810 8765641 8722715 8696693 8703154
3315 8703154 8743527 8815313 8866529 8894016 9028773 9125758 9229836 9380633 9432058 9548510 9654825
3304 9654825 9796562 9913860 10050284 10232968 10399991 10591002 10788456 10997652 11175715 11347624
3294 11347624 11480979 11670685 11848243 12038406 12276972 12486305 12610874 12776135 12942006
3285 12942006 13142202 13378300 13594777 13833509 14148878 14443113 14744324 15025225 15375547
3276 15375547 15777267 16169742 16591130 17036298 17467104 17947059 18557167 19213865 19846937
3267 19846937 20490948 21033323 21567062 22095553 22764879 23622931 24539978 25645754 26873834
3258 26873834 28154259 29579080 31117193 32789044 34517004 36252787 38035942 39643839
3250 39643839 41038004 42143277 42719287 42435445 41236704 39228963 36668412 33973643
3242 33973643 31453388 29160733 27176216 25410947 23942114 22686278 21571649 20558447
3234 20558447 19604207 18787556 18035872 17338368 16680904 16087526 15590716 15109249 14614098
3225 14614098 14155279 13767266 13489349 13144726 12804430 12488349 12164629 11874208 11669181
3216 11669181 11384272 11155237 10898154 10606597 10385001 10123080 9966199 9757900 9505688
3207 9505688 9333837 9142115 8971751 8807970 8670021 8494814 8345005 8227908 8049316 7913327
3197 7913327 7809434 7730330 7580545 7477863 7378715 7322915 7200872 7082699 7015987 6969373
3187 6969373 6873549 6767620 6688250 6641522 6583057 6534388 6424576 6377500 6256291 6153344 6126141
3176 6126141 6058207 5983941 5973607 5887937 5799485 5757638 5707727 5666171 5619606 5604528 5531840
3165 5531840 5460243 5413089 5399808 5324141 5369234 5329155 5244265 5191663 5193548 5161641 5092406 5073545
3153 5073545 5042561 5024226 5023227 5022308 4960692 4904834 4874642 4861788 4821946 4777086 4743318 4719767
3141 4719767 4674265 4625711 4616073 4602621 4547827 4474788 4444317 4437403 4429132 4410691 4406081 4370399
3129 4370399 4341597 4308197 4314561 4315983 4239620 4252663 4266868 4231413 4177639 4189369 4189673 4187308
3117 4187308 4153200 4111233 4076987 4017139 3936903 3868210 3919208 3934783 3908357 3857353 3828233
3106 3828233 3779421 3787804 3800494 3769901 3746964 3744673 3730518 3720474 3720127 3718886 3699500 3676437
3094 3676437 3692770 3685225 3641797 3657490 3634980 3591968 3552518 3584431 3628133 3645596 3558285 3498136
3082 3498136 3500804 3497825 3476309 3436710 3448322 3463360 3429147 3376223 3383491 3371031 3355350 3349927
3070 3349927 3347434 3334150 3359494 3315191 3283619 3240469 3289004 3278560 3216628 3214029 3211228 3209375
3058 3209375 3198100 3206369 3221804 3215457 3153161 3143337 3144048 3141386 3156751 3153630 3154702 3165951 3120629
3045 3120629 3120247 3105222 3059473 3037205 3077384 3096723 3076936 3058978 3070269 3054452 3052320 3047872
3033 3047872 3045762 3045005 3081705 3061127 3063924 3111492 3158241 3167638 3156055 3176713 3137077 3152282
3021 3152282 3112703 3174989 3205909 3172247 3246856 3318226 3308529 3316227 3368525 3374700 3368314 3392664
3009 3392664 3434590 3484123 3507575 3559588 3593310 3612864 3633775 3716644 3764716 3777991 3809526
2998 3809526 3832647 3878083 3923243 3982645 4014360 4051230 4106861 4143242 4139953 4131484 4194036 4289014
2986 4289014 4302631 4377353 4403693 4479058 4544873 4553333 4610062 4657132 4716682 4745904 4752004 4874910
2974 4874910 4920985 4945614 5044292 5110061 5145067 5163207 5236454 5290556 5331184 5354291 5408035
2963 5408035 5416539 5433431 5490521 5545196 5563088 5629686 5675080 5773618 5872961 5955876 6039148 6131042
2951 6131042 6219097 6294277 6444675 6540364 6695258 6850723 6971456 7100706 7252157 7371626
2941 7371626 7543502 7777044 7984998 8231097 8442685 8661340 8875354 9087459 9297175 9527105
2931 9527105 9673614 9777603 9824483 9838218 9943106 10075905 10119358 10196247 10231262 10298785 10413791
2920 10413791 10528259 10652298 10812396 10982045 11238468 11447080 11701607 12038925 12375321
2911 12375321 12730397 13151425 13627812 14122345 14678269 15208316 15753598 16245467 16526702
2902 16526702 16509906 16269589 15745591 15120693 14470873 13917111 13496095 13171038 12925884 12756341
2892 12756341 12666006 12630510 12602252 12623602 12648859 12643690 12685671 12690231 12691523 12752993 12815854 12876133
2880 12876133 12961626 13015692 13049533 13051577 12945125 12816936 12662279 12484352 12234697 11952374
2870 11952374 11646917 11325707 10981771 10609399 10294859 10108622 9894173 9706285 9547301
2861 9547301 9388791 9219844 9057963 8897730 8703453 8460254 8244206 8028552 7846763 7621150
2851 7621150 7335088 7095445 6850881 6626435 6454234 6247946 6067851 5912582 5700431 5503483
2841 5503483 5346388 5269091 5158133 5055717 4922460 4786471 4698488 4612995 4541362 4468834
2831 4468834 4406943 4339446 4235937 4143170 4089204 3982035 3960747 3862260 3763054 3722201 3646372
2820 3646372 3552325 3477014 3399265 3348976 3347360 3252922 3139220 3083488 3046361 2977312 2925574
2809 2925574 2870420 2867539 2820948 2784550 2690573 2631414 2592465 2529449 2527727 2496119 2456416 2461066
2797 2461066 2397801 2361393 2308170 2246829 2222246 2202300 2202665 2180351 2155439 2116035 2064739 2012802
2785 2012802 1973890 1953092 1952894 1881824 1839741 1811455 1822876 1759228 1711444 1663067 1631726 1619823
2773 1619823 1612877 1614541 1534687 1509882 1530964 1498098 1464871 1462737 1421409 1411654 1390212 1390340 1347500
2760 1347500 1339455 1343972 1363237 1315803 1301947 1287507 1238117 1215580 1215811 1210475 1209377 1166137 1142006
2747 1142006 1145444 1075717 1063214 1060821 1068855 1032589 993213 976484 990584 990948 970620 961570 959377
2734 959377 946601 883545 842651 829364 847040 826383 788654 808549 783557 739429 779837 775030
2722 775030 748798 767263 755307 708641 734738 796920 777902 713738 690907 674616 717703 677540
2710 677540 626126 620728 634742 665034 621496 609943 618041 593434 578584 596479 604567 555536
2698 555536 526478 524541 499299 535401 585012 545456 535657 564825 594446 613989 562242 541817
2686 541817 511466 493955 520607 535096 505865 485352 496282 496684 458630 485553 486017 475384
2674 475384 439336 442251 404530 406537 404633 398265 413806 394545 428932 429225 437286 448723 455014
2661 455014 464926 438720 406769 386710 349649 371853 420245 402026 442279 453915 423761 390789
2649 390789 366808 349641 351255 371340 404934 389778 334543 346093 348917 357939 368383 376327
2637 376327 390299 390567 364191 344936 326585 373330 362401 372354 406656 394869 383001 348751
2625 348751 328323 334583 319022 369425 407056 382478 359838 355296 375900 318589 317672 352085
2613 352085 354942 321139 297342 258280 263822 334419 335302 339027 305890 303308 268538 266876 303197
2600 303197 298659 346078 365966 322431 310017 323552 395788 371919 349021 321678 290381 310320
2588 310320 281585 277055 251465 257540 246722 277810 260401 269929 253241 262651 273711 192988
2576 192988 215552 222722 199922 209731 207342 210769 216941 255896 211303 193802 178471 177532 213762
2563 213762 202797 221001 180922 201880 203259 185091 183553 161691 153649 162852 130710 115925
2551 115925 139403 163283 192168 137321 138853 118095 82816 94033 118257 158458 132909 111096
2539 111096 111616 113257 140480 148154 176985 169895 193587 173098 182069 138360 92073 107458 123079
2526 123079 135561 146249 133044 92880 136393 141056 147594 131369 120198 150422 186406 146889
2514 146889 121244 109816 107400 123397 106711 42353 32086 95408 72091 84061 95334 50641
2502 50641 92328 124270 103275 106545 99401 77908 80237 75078 71940 50001 84416 79573 94739
2489 94739 61839 55345 56972 70693 69068 61187 68157 96364 86530 91856 74953 86457 80724
2476 80724 66732 81359 62273 31851 5219 50837 76202 99101 88998 60099 74741 84581
2464 84581 47853 29760 59183 59513 45327 21246 32145 36013 26161 57558 61551 59507 66068
2451 66068 42441 45753 58873 41468 58476 50099 41737 21804 27919 30083 51381 65139 83044
2438 83044 54203 26373 59641 100930 35843 27235 51617 98888 99264 95503 100493 93845 35143
2425 35143 19037 28971 25339 33683 48047 39973 13298 -15996 -2697 43191 44725 20001 19683
2412 19683 52290 73457 57124 29509 -22475 27210 68285 50947 79676 52685 21289 69731
2400 69731 94290 38930 23388 87046 97742 64930 81976 23507 84491 75276 26746 8894
2388 8894 -1012 10781 22139 -2850 -1314 12130 18158 20163 49360 101960 25497 23064 83640
2375 83640 76498 74860 84401 86031 97558 128849 136269 121417 96357 92171 102344 79971 73998
2362 73998 65997 73624 54110 47110 25300 7947 28116 29420 25407 -1107 17522 40227 20011
2349 20011 4318 74834 94181 98114 33255 -3891 10616 53163 68881 59716 37749 44099
2337 44099 49330 36385 15238 53042 61886 23362 38080 -4017 -1389 20274 42285 67452
2325 67452 105684 57295 24770 48802 52832 68801 34036 43849 99320 40661 44584 65803
2313 65803 93413 82353 58058 49376 43106 15687 88049 96210 65802 100590 142483 92902
2301 92902 67284 76291 65878 72480 60447 44807 79077 76403 67125 74252 85240 87368 19070
2288 19070 24822 33723 42687 44799 43096 -15230 22461 64512 35623 48350 85084 79668 36124
2275 36124 62550 104448 131718 118260 44096 69382 66498 68617 90072 70881 43833 34241
2263 34241 57992 77815 21418 15190 12952 74189 139641 73888 45096 88730 49243 102064
2251 102064 75276 68376 90451 83116 81145 60168 53413 84367 111771 86906 81132 65883 60105
2238 60105 83370 89169 108443 123372 111846 108969 89210 116580 144541 97095 63685 84776
2226 84776 81443 113986 112868 100482 116015 133123 108132 83625 159241 202154 158621 167445
2214 167445 173446 182739 197159 174911 184170 200091 193626 220269 243306 277686 258571 246723
2202 246723 240929 261461 234222 304098 321702 307652 293951 321289 341585 335356 308012 335905
2190 335905 315808 336256 367908 383722 373426 387346 407875 384930 393512 369977 398383 417201
2178 417201 397477 426858 414281 422851 436008 448016 434679 423203 427656 493204 516592 487666
2166 487666 501691 521498 573619 528082 509091 522061 600480 605502 635703 658960 655647 666618
2154 666618 686118 730213 796209 816156 827770 837518 930725 918827 904654 951044 1010561 1041786
2142 1041786 1070070 1088170 1127950 1162554 1193691 1252737 1326819 1386456 1398884 1429394 1545435
2131 1545435 1629865 1667251 1734014 1808568 1903011 1967621 2106496 2207937 2336407 2529865 2812951
2120 2812951 3009458 3153729 3349270 3512420 3753883 4066673 4482615 4992470 5687565 6694430
2110 6694430 8054169 9771771 12146012 15227595 18838218 20645638 19242152 16366585
2102 16366585 13210439 10158223 7981861 6603130 5579379 4792040 4145551 3673688 3362934
2093 3362934 3090223 2879730 2786919 2623595 2419600 2211204 2010296 1783312 1608516 1490365
2083 1490365 1405804 1328217 1257715 1213685 1128672 1033752 1021870 997708 974526 941034 892273
2072 892273 870698 833403 752788 728623 732679 676939 644565 650736 585333 586500 527192 519294
2060 519294 497471 488087 447887 429496 424581 398694 386368 372794 386897 386310 371974 376361 383661
2047 383661 346929 335368 383128 377383 314488 283908 270251 237081 253898 261392 245584 234905
2035 234905 176463 179151 191329 209240 203157 157712 153700 191744 164035 157808 196766 209138
2023 209138 188364 168002 174260 190314 160209 140401 145380 143732 127809 74011 75921 43444
2011 43444 74182 75457 87029 131155 173179 153866 112479 151827 136344 133572 148117 147961 117703
1998 117703 72735 50760 73622 61862 87169 78289 80063 67696 80800 95182 70788 107406
1986 107406 121823 86368 102684 115354 101988 114844 100023 69616 76205 71076 28692 16535
1974 16535 54685 75388 99338 91245 73161 70149 80635 73829 55120 40846 39527 36310 35618
1961 35618 7870 -9720 23571 29683 34343 22885 12822 52784 61208 45154 45000 11210 -491
1948 -491 25914 77720 82698 67184 109 15563 79441 50376 56247 72138 50793 78986 72362
1935 72362 44320 83271 57881 57877 28825 13176 -25718 -8993 24183 -53203 -24728 -21033 -44446
1922 -44446 -58327 6211 27409 -4875 18089 62726 118604 86260 30984 6727 39013 68624
1910 68624 60275 35657 21789 25686 20194 21319 12279 7536 16523 -2358 -19067 393 44569
1897 44569 1757 1524 30130 34269 29820 30886 -3002 7734 6058 -36065 -20943 -5310 -10945
1884 -10945 1039 25386 -1038 34289 14827 -38153 12350 -1942 -11801 -20893 -22767 -25580 -60867
1871 -60867 -29887 785 -33670 -3587 5655 48544 67944 39410 54187 45319 1291 14988
1859 14988 20652 -38650 -44840 -41341 16580 35778 41761 28904 7067 -2676 -17943 -2538 20639
1846 20639 17830 18397 5370 1069 -821 65506 69204 75451 68566 106310 74918 71749 69249 89574
1832 89574 97501 62064 14561 5040 -4764 -4840 10300 -18334 17303 28201 -18511 -16973 -4015
1819 -4015 -16998 -22179 -26653 -43337 -36359 -57983 -11949 25794 7076 -1209 -32587 -9173 58259
1806 58259 22241 -15213 24095 -29216 -21723 -21036 -45109 -16710 -74 -31056 -36596 -5447 -7168
1793 -7168 -18258 -4591 -489 13395 20780 36906 6786 -44990 -40137 -31977 -16798 34702 52465
1780 52465 15765 14714 -44651 -71239 -14681 -9449 -42784 -40947 30459 -16768 3031 12977 17036
1767 17036 -16175 -9919 6214 -12564 -49739 -35654 -1618 -15063 21925 42408 17394 -23203
1755 -23203 5437 1669 -35325 546 11420 10453 19439 -40115 -27586 2693 -14473 -1523 17642
1742 17642 -9729 -49618 -22733 -12657 -4264 -43449 -6534 -25619 -5287 34562 35970 24932
1730 24932 -20577 -25688 25370 10687 -9116 -19511 -23656 -14367 -52580 -44440 -25028 -33929 -32257
1717 -32257 35073 33242 8998 -9095 -5781 14768 -7050 -9260 -15239 -19466 -26826 -32416 -10768
1704 -10768 -9867 -20234 -22938 -16429 -43448 -57880 -69849 -58727 -74898 -23126 -47982 -31365 23391
1691 23391 -15460 -20255 -12446 -2048 21879 -6042 -40084 -17632 -30638 -49756 945 -23421
1679 -23421 -26664 -41393 -54193 7834 -5129 -16254 -12230 -24444 -14542 -19688 -61281 -15653 -12022
1666 -12022 -46280 -36401 -12456 -24108 4963 -25685 -25354 -25214 -30038 -8451 -29043 -52655 -37049
1653 -37049 -13778 -28219 -48232 -32481 -1242 -143 7867 -8384 -21627 -55486 -64368 -30896
1641 -30896 -17013 -12370 -4697 -29983 -1981 11739 -6769 -42773 -9045 49746 13568 -65399
1629 -65399 -12884 -28545 -47485 -30815 -27186 -1585 21126 -28966 595 -42121 -35835 -37114
1617 -37114 -21710 -57215 -79409 -10467 3859 -18542 -59590 -67686 -65114 -41162 -63365 -47143
1605 -47143 6331 27055 73205 42437 -14231 -3051 -14161 -5056 -10271 -20319 -48791 -44781
1593 -44781 -9251 28641 -14515 28735 19689 19407 7224 23150 50018 26518 -1425 1999 26425
1580 26425 3991 222 11208 9303 9126 8773 -22985 3014 17312 50323 17302 -41194 -47244
1567 -47244 -2174 -59001 -78600 -8358 -4880 -26104 -63799 -86205 -52390 14598 -35332 -40091
1555 -40091 -73066 -37971 -8377 -3609 -802 25355 24584 13415 12462 42537 6265 -53642 -72143
1542 -72143 -45975 -82150 -49104 -47754 -60600 -46855 -56269 -57543 -7973 -362 37545 73171 3855
1529 3855 -15532 -13826 -25070 -54600 -65561 -57881 -43755 -35757 -7400 -27345 -6186 -3749 8632
1516 8632 6756 10788 -4161 -18743 -28241 15403 22722 15800 4481 -16850 -11116 29746 38241
1503 38241 2181 -31650 -20530 21252 12537 -12579 1418 3461 -25223 -16093 1065 -19761
1491 -19761 -37887 -50935 -26814 13143 -19950 -62776 -61091 -31192 3114 15736 -25303 -20411
1479 -20411 -3945 11410 -15636 -46333 -50986 -35979 -37225 -33322 -39059 -18769 20995 -42869 -64538
1466 -64538 -53194 -3566 -1279 -8935 -31242 -30316 -9236 -34935 -33821 -25980 -4606 -3332 5372
1453 5372 -16296 -49508 -42704 -3458 -21746 -35724 -13637 16800 19194 -4842 910 12088 -2772
1440 -2772 30933 -3062 -34554 -47108 -65960 -5953 16128 39753 1495 -7300 -12137 -19334 61088
1427 61088 44825 22449 55360 30069 8132 -26286 -23743 -33558 25891 6027 -11195 9237
1415 9237 33571 30682 -19512 -4006 19317 26903 3912 -26161 -3891 -6852 -53260 -70389 4508
1402 4508 45244 -513 -53698 -55746 -26551 -951 -21954 -73739 -60677 -13608 -24830 -29598
1390 -29598 -43852 -21288 -38486 -36421 3493 -3047 -31867 -4918 40699 11296 -25237 12429
1378 12429 -11314 -26314 6753 788 39108 42338 39367 -11838 -17263 -31758 -53222 -16312 5406
1365 5406 -28048 -20774 -22141 -74768 -29353 10376 15916 -18837 -49035 -75230 -82343 -49276 -26827
1352 -26827 -32221 -4940 36068 12685 17009 13177 10630 5751 -52831 -72015 -27460 -49723 -11952
1339 -11952 3079 8430 -8959 3606 -14110 6785 -8180 15191 44887 26341 4803 -25812
1327 -25812 8444 40677 12571 16865 1973 17542 59418 76822 45385 -648 26834 50343
1315 50343 9533 -8619 13023 16139 38082 39434 55082 -2783 -20660 -69531 -58195 -40890
1303 -40890 -42370 -11580 -28258 -54493 -23306 -46118 -77812 -100568 -84628 -41200 -29924 4633
1291 4633 19363 -13981 -19195 21929 -28569 -50544 -45763 -16114 -11730 23579 32457 7620 -21692
1278 -21692 -48093 -26291 -4821 -20913 21706 -10574 23123 35538 41498 11424 -16228 -5429
1266 -5429 -27319 -38931 -53962 -40429 5994 -25009 20102 3845 -15141 17848 10223 -6909
1254 -6909 -11057 270 2639 -8694 -35618 -29524 -31352 -24418 -31450 -48405 -48185 -18426 -39982 -75587
1240 -75587 -88954 -35477 -49063 3103 21348 41038 37056 17159 -22081 -7948 6400 -43279
1228 -43279 -47206 -45841 -66502 -5731 -26865 -34598 -21873 9579 -47371 -21586 -22014 -8363 -6628
1215 -6628 -17690 406 -20160 -8100 10630 42348 53434 6929 9029 38096 46222 15555
1203 15555 24674 -98 -30065 -38997 -26397 19169 19797 -27669 -23123 -18165 -30942 -38295 -34320
1190 -34320 -18075 3088 18572 -15662 6035 -4666 81 -1055 -18597 -9800 -16158 -22890 3454
1177 3454 11759 -30582 -67149 16023 6772 -35676 -46388 -10913 -26433 -18360 1926 -26417 -23873
1164 -23873 -23228 -37493 -15464 -23813 -5872 -38753 -54511 -50979 -29124 -3858 17830 9854 -41207
1151 -41207 -44907 -32399 -33515 3252 54382 15611 -19306 -20065 -14036 -30329 -21829 -12239 -5952
1138 -5952 -9685 16866 38569 -10370 21762 21204 34211 19878 -1167 -24297 -14551 19773 44085
1125 44085 70219 34753 31360 23282 22114 23831 4522 6143 28990 23427 -2980 16259 -24261
1112 -24261 3771 -5447 -18957 -32307 -19857 -1020 -5142 13043 -22456 -9677 -34601 -43375
1100 -43375 9711 -13058 -35238 7374 -20235 -6409 -20353 -25386 -45621 -19789 -19323 -14474 -1075
1087 -1075 13803 -39177 -29994 -13546 -26277 28025 16552 -6864 11591 53283 -697 -53208
1075 -53208 -53274 -31845 -22387 -21638 -48059 -24373 -15517 -8773 -22588 9875 28552 -13036 24815
1062 24815 44173 28054 -8755 -25883 -13285 19807 47926 12118 19393 8547 -20593 -11286
1050 -11286 -28810 -38062 -24975 5192 -10552 -28442 -35455 -1780 57071 27815 -24762 -14495
1038 -14495 -38090 -18052 39848 -31355 -15681 7344 -1019 9466 2034 -20207 -12231 -24507
1026 -24507 1990 9608 5237 11243 -12316 -14812 8224 21911 -10870 9474 23634 3731 -22956
1013 -22956 -13208 77059 76159 28788 -10316 -50766 -47966 -19472 4123 9338 -5654 -49406 -24332
1000 -24332 -41690 -66729 -50987 -15092 -25399 -55866 -29183 19588 28424 47864 34166 10969
988 10969 15834 14655 -35316 6799 12866 -20235 -16035 -19428 -39739 -66247 -72766 1005 14998
975 14998 31439 25729 -1887 -3912 2752 9 6844 -37210 -49927 3587 -63796 -70691 -55671
962 -55671 5470 -3218 -24473 -20830 -29412 -35010 -10254 19695 22143 32374 16382 -26880 -36651
949 -36651 -9734 -24699 -60816 -4641 27294 -19031 12996 -15567 -27615 -34107 -35400 -18880
937 -18880 6053 10286 -4109 10603 -1313 -10901 -19969 -33700 -23236 -28462 -5119 8798 18087
924 18087 -5385 18844 51361 21205 21875 20778 25794 32790 -6380 -28571 -46807 -26522 36363
911 36363 40704 12837 -9716 3812 19692 -2362 -18173 -9170 17878 -7685 -61426 -1821
899 -1821 5415 -6383 -20970 -26101 -53510 -65914 -108106 -70089 -48506 -61496 -53648 -26790 -227
886 -227 -14164 -52384 -77695 -36249 -47008 -34336 -37657 -21824 -40702 -47357 -23849 -25583 -23473
873 -23473 -19563 9694 11578 29560 6643 30695 39334 44535 34998 20560 2768 12014 48096
860 48096 43876 19223 9967 443 29987 -1207 4118 44811 9963 -8217 -46995 -34119 26116
847 26116 24510 39324 21774 16548 -4500 -6166 -20981 -28639 -802 11352 15916 -31729 -62438
834 -62438 -32171 -41475 -23885 -331 7248 42668 32844 30337 -12312 -35306 -640 13976 6542
821 6542 -2167 11543 -979 9744 -22446 -24961 30916 -12180 -3776 34377 32375 -26356 -38120
808 -38120 -15174 32446 41651 22760 28965 36050 4137 672 -26139 -7079 29612 26924 44494
795 44494 42339 8742 -22176 -42832 -25249 26757 9457 -3252 -10267 -1816 9281 28207 32327
782 32327 47483 18631 -25987 -6468 -78 -3729 6923 35496 39370 34754 50924 8095 -41997
769 -41997 -38787 -17771 1718 -43185 -22242 1947 5985 -28788 -12713 -13997 10464 -22011 -11943
756 -11943 -6474 -29969 -33429 262 9498 27146 17533 -4641 -6141 -886 -6110 12510 21455 -266
742 -266 6287 29456 8313 32279 22173 514 55609 39822 14082 -31938 -29660 33389 35936
729 35936 16704 13690 17839 15681 -40549 -22419 73366 44756 5356 -8754 -42329 19326 6326
716 6326 16168 -3470 -8713 34924 -18822 -27482 -31140 -40888 -5576 5493 1329 7288 34468 -12812
702 -12812 -22690 55068 98118 79520 28137 24509 8779 -7101 25713 -13083 -26287 -48147
690 -48147 -13527 -6979 -51235 -19033 16687 -32578 -65959 -33212 -2248 -4301 -13349 -32372 -18224
677 -18224 -17397 11907 18544 -7801 248 3362 16877 42895 1932 10900 56458 55874 44767 35669
663 35669 27670 36733 38761 -3015 11843 39192 45984 49801 36937 20382 11774 41511 386
650 386 42067 83149 79074 58504 20197 -552 -45965 -68803 -25431 33838 37056 28741 15496
637 15496 23444 -14348 -32131 7217 34956 56686 9526 14849 891 11191 -5690 -13397 -5122
624 -5122 6524 12041 27319 53108 -3366 -40719 4725 -22072 -3936 19722 47972 24896
612 24896 16051 42153 48390 17150 7157 52444 6674 29772 7518 26786 179 -5022 18126
599 18126 33055 17333 30850 36817 66667 33727 4931 28514 41310 9976 8929 22960
587 22960 18508 23826 19118 5634 21493 29618 24028 -22966 -40635 -37741 -20657 -7880 21549
574 21549 37734 -8660 11507 35323 46725 41642 7815 11763 65642 42847 12196 52992
562 52992 23307 -12483 -9466 25042 -11452 -60675 -37223 54791 47333 -16677 -34696 -23841
550 -23841 -3786 1717 18065 -250 15270 14010 -24240 -31478 -34242 -10327 -27167 1062 -41846
537 -41846 -10105 20153 28274 4772 18048 60006 1733 -31147 -3884 41829 3062 14066
525 14066 4979 -3546 -6614 7535 4614 22164 -21727 12979 6585 -30024 -19406 2806 34147
512 34147 36064 -5282 -10379 32620 39935 21809 6398 -45095 -72495 -20208 -8509 -10951 -24926
499 -24926 -14602 11153 -20914 -29129 9234 -10699 27033 40158 49674 57724 51607 -23292 -25317
486 -25317 7029 32902 -7643 -13326 -1295 -26776 13749 -6863 16886 -18977 7033 8253
474 8253 -6953 -29028 -32153 -14800 -29150 -10754 4836 59860 28087 -7499 36355 6974
462 6974 13548 6932 36961 -6324 -12265 16770 25860 -3359 9626 32179 7653 18013 35123
449 35123 11605 15387 46329 23029 -30511 -29867 -54082 -33957 -988 -193 -39853 -41327 9986
436 9986 29020 24201 7512 27804 40532 33059 31420 41036 51476 57122 50208 59483 57583 28469
422 28469 -1513 34987 55989 10187 -7351 -14924 10209 2301 -31268 -23381 3501 46573 39673
409 39673 15049 13780 3033 -16842 3207 17301 1347 24294 45620 4497 12832 6947 -64193
396 -64193 -9669 36961 26311 67879 -9811 12692 60970 54261 9129 3145 15995 45236
384 45236 23543 -17081 -25846 -42065 -13401 40140 -4620 -13458 11314 2632 24867 8851 -18512
371 -18512 -1672 38737 42659 56884 52197 19095 52719 55161 3263 4235 19838 -2221 4786
358 4786 24027 53353 38173 -15129 -33910 -22086 -31561 -20275 -20754 -26725 -17015 758 -11659
345 -11659 19615 60455 80444 82361 68921 6503 20452 25344 16490 58875 47292 39097 7006
332 7006 17539 6377 7988 26966 48181 44304 30921 48191 16439 -8729 -32968 -13705 19590
319 19590 12957 14535 26112 23471 -3262 35248 20057 37756 35545 10883 4873 -10625 -23787
306 -23787 18154 4909 38246 56327 29741 -842 -13970 32526 55725 97 -58520 41796
294 41796 80830 39352 55801 55328 55623 53292 42007 -4509 22651 2648 -32034 -19526 -26452
281 -26452 3864 22746 -29211 -29407 -25195 -44628 -10028 307 -11943 -1806 -13628 -12268 -6366
268 -6366 -35273 -27023 -1286 11626 -2530 3059 9642 60281 42457 36443 11702 -34296 -27708
255 -27708 -50392 -20324 21748 25265 12718 15421 25167 73480 68677 52996 10796 -2332 4337
242 4337 -9901 24553 39901 38197 -9953 -9429 4032 22160 60859 62091 37590 31715 23311
229 23311 9953 9089 27151 7209 4771 -10919 -24554 19615 55388 45251 25323 -4425 27495
216 27495 21785 19296 -5965 -20847 -748 15686 39998 40596 51524 87539 45761 26282 17385
203 17385 6537 -602 4626 23484 27259 32857 12203 13132 -151 34594 41617 60770 53306 1749
189 1749 -14248 -20195 -6729 46298 49973 26598 37731 23999 -16641 8123 42 8893 -16039
176 -16039 20902 31704 12047 26340 51864 36282 9673 267 -29882 16726 30312 -2188
164 -2188 -15235 -2748 5304 18248 2777 -9866 -14558 3702 39660 39409 56829 43778 13234
151 13234 22807 45345 10152 25830 67809 39057 10949 16004 14337 -31046 19231 49165 49803
138 49803 23036 49698 35995 -11596 -18040 3033 27935 23906 1163 -4717 26602 2169 -3138
125 -3138 -38023 -1598 20808 11403 34286 52595 54544 54001 1017 -39275 2908 8230 5765
112 5765 6807 6440 -31106 1035 16063 20987 32215 26154 40034 4693 51788 65082 54620
99 54620 37637 9930 81 -725 24022 43385 19890 -15883 1319 34482 211 17202 44547
86 44547 17034 23693 25865 14157 4865 -13320 7574 16378 58045 95268 61974 20338 -14171
73 -14171 23180 60404 50762 29224 42385 24562 18941 -51305 -27014 7707 -276 20277 37060
60 37060 55910 42625 43346 29278 38891 25111 -5766 -34228 -33781 -6542 -10271 -16861 -40545 -28686
46 -28686 2941 -8339 -18022 -17080 8434 47029 29433 22757 8925 50953 58423 34541 36138
33 36138 15052 45228 57943 38837 19133 22766 25627 9060 3147 -11263 24426 51328 39782
20 39782 8876 -15648 -19459 -7636 20234 14778 22554 43294 27329 9690 9181 43386 29046
7 29046 36347 2487 1351 22543 30385 29074 40295
0 40295
$$ Imaginary data points
##PAGE= N=2
##DATA TABLE= (X++(I..I)), XYDATA
16383 -685417 -667522 -637749 -616929 -599864 -574834 -598378 -578738 -534518 -507941 -477055 -462268
16372 -462268 -443002 -405812 -419530 -407766 -419721 -381220 -359708 -338216 -312334 -309907 -286247 -283963
16360 -283963 -281392 -268894 -242279 -246690 -203590 -188097 -164305 -136873 -139890 -128615 -143980 -123603
16348 -123603 -108366 -93875 -70782 -59489 -33996 -31523 -4115 18563 3596 20113 66156 52285
16336 52285 76130 120903 167619 169590 144080 161448 153068 167018 211600 199053 240530 217520
16324 217520 190917 243221 281867 320280 333589 343252 369991 361164 365679 348641 342511 351230
16312 351230 390580 434497 448106 477431 481217 486426 482715 516885 529562 510869 520569 559138
16300 559138 563735 542582 553777 572130 620123 651758 672300 669314 704364 712913 720687 749561
16288 749561 763959 726264 737786 764114 753989 790658 835870 852303 815330 816582 856058 873339
16276 873339 911486 878496 885085 922035 937851 922118 934073 947649 945396 959368 978358 974506
16264 974506 980844 999895 982131 993148 989054 1064675 1056060 1008972 1012077 1043954 1046962 1118225
16252 1118225 1123073 1129075 1146602 1129805 1136522 1167865 1144269 1125777 1211583 1234041 1246599 1264451
16240 1264451 1257812 1260661 1264671 1261925 1275281 1255340 1287877 1295344 1226467 1245906 1326832 1308524
16228 1308524 1310471 1325997 1349528 1374505 1348279 1346166 1390161 1440744 1374262 1357666 1384752 1362997
16216 1362997 1358850 1425140 1430544 1444435 1504851 1504138 1498269 1467143 1490033 1494176 1454883 1434729
16204 1434729 1485770 1528670 1531879 1524974 1501401 1494430 1512788 1516344 1573544 1561729 1561516 1570078 1604362
16191 1604362 1553215 1584504 1638159 1633086 1628099 1609561 1618181 1597753 1612868 1572994 1583830 1598707
16179 1598707 1568128 1552084 1604087 1622512 1632166 1625642 1665313 1654818 1682155 1683453 1694978 1647273
16167 1647273 1618026 1613170 1655242 1645537 1627885 1675104 1708411 1732070 1706820 1685783 1709643 1757880
16155 1757880 1716231 1715129 1701598 1731881 1702123 1725950 1744249 1711885 1689487 1717658 1728743
16144 1728743 1703077 1724749 1721858 1755463 1750755 1753684 1740790 1783412 1774686 1828991 1828013 1808254
16132 1808254 1782360 1776789 1808316 1787914 1748699 1755772 1765780 1790364 1808545 1738432 1764693 1760283
16120 1760283 1787909 1822099 1830894 1806909 1787269 1808414 1851813 1877907 1871495 1862302 1875750 1876540
16108 1876540 1835607 1779524 1807898 1830089 1829439 1832922 1791218 1776247 1790771 1806481 1822704 1834789
16096 1834789 1825137 1843665 1822168 1841982 1855960 1816790 1836786 1864691 1914254 1908967 1890781 1880853
16084 1880853 1861363 1888078 1882046 1871689 1896525 1921134 1901841 1874050 1878011 1888535 1907303 1895910
16072 1895910 1870269 1830992 1821167 1862325 1866701 1881004 1899591 1815698 1872281 1883756 1831178 1801588
16060 1801588 1830634 1867814 1883556 1912040 1890087 1894742 1889971 1870395 1895477 1911881 1860334 1857190
16048 1857190 1930527 1910187 1905672 1917156 1899000 1902623 1949078 1916306 1921006 1906496 1931261 1938410
16036 1938410 1909855 1913442 1923576 1905118 1881406 1869245 1848579 1895846 1867426 1870706 1889094 1937281
16024 1937281 1927268 1902341 1864195 1873776 1875057 1870311 1928456 1906909 1878006 1887760 1897328 1886703
16012 1886703 1847728 1849993 1915505 1875225 1860077 1888462 1864769 1870538 1911209 1936562 1909678 1909134
16000 1909134 1899476 1885660 1896847 1891031 1920371 1901235 1885318 1932966 1914499 1892883 1894434 1844595
15988 1844595 1814362 1901903 1941121 1958616 1923123 1920879 1926203 1921681 1934421 1897177 1886176 1896757
15976 1896757 1866195 1915688 1906774 1906550 1944540 1966387 1912374 1908403 1970669 1947831 1923454 1919793
15964 1919793 1874249 1906816 1957331 1976030 1986760 1940184 1944438 1954933 1909684 1894025 1898670 1920655
15952 1920655 1943103 1976219 2012563 1980219 1885890 1883812 1905360 1933560 1922301 1856861 1918150
15941 1918150 1949202 1950283 1944558 1907435 1924147 1934820 1909412 1898917 1923705 1958519 1942252 1918901
15929 1918901 1916656 1937466 1887567 1891814 1900342 1879509 1870193 1872362 1931315 1924432 1941255 1897605
15917 1897605 1900800 1914103 1886960 1941849 1946522 1987394 1962881 1963294 1948828 1893262 1853993 1865967
15905 1865967 1869215 1900220 1924280 1906906 1919703 1924012 1904523 1920288 1899876 1898350 1855447 1856806
15893 1856806 1917016 1918442 1884772 1890491 1916468 1899873 1922339 1937192 1879382 1902470 1930614 1869872
15881 1869872 1880696 1905720 1893003 1902482 1921184 1905835 1943121 1974326 1990417 1957927 1926848
15870 1926848 1940774 1932099 1928029 1926060 1935806 1948455 1918751 1917810 1945708 1935831 1925878 1911681 1914380
15857 1914380 1924352 1950696 1928183 1902614 1882666 1928893 1967663 1945166 1925498 1918286 1909694 1923152
15845 1923152 1941379 1923734 1909088 1885244 1911531 1895386 1883701 1925258 1965117 1945593 1942643
15834 1942643 1893227 1888801 1930301 1954903 1933336 1906989 1937888 1967233 1964697 1978362 1972566 1919574
15822 1919574 1931126 1979540 1902399 1892731 1942142 1973275 1998400 1966544 1969936 1973632 1955548 1950294
15810 1950294 1921058 1914160 1934350 1969747 2013248 1983205 1992673 1998605 1963170 1977423 2008725 1982201
15798 1982201 1978939 1944769 1922559 1904991 1956834 1977056 1964398 1925614 1915787 1956357 1991865 2011851
15786 2011851 1945533 1937879 1964611 1963534 1914144 1963946 2025777 1997055 1974062 1952976 1971824 2016252
15774 2016252 1968063 1942788 1995254 1991600 1965261 1951279 1957942 1967657 1942817 1958364 1966173 1964480
15762 1964480 1966828 1945827 1966816 1969079 1949460 1949318 1976741 1976428 1975204 1956924 1975983 1962489 1961435
15749 1961435 1945381 1912783 1960127 1991364 1978955 1953081 1985256 1946520 1926328 1914464 1917172
15738 1917172 1939005 1967858 1972564 1936849 1978842 1964608 1929193 1946559 1940813 1943998 1957044 1916411
15726 1916411 1912683 1965232 1960512 1981018 1926613 1925151 1949761 1988983 1943549 1952581 1918945 1891435
15714 1891435 1952698 1974865 1975511 1947051 1947699 1931941 1925367 1961520 1990033 1968962 1962809 1966015 1906912
15701 1906912 1931785 1965517 1950615 2004231 1982051 2009531 2008126 1992409 1984439 1946926 1906888 1950114
15689 1950114 2001077 1967272 1998256 2021566 2018244 2002669 1955033 1997997 2005727 2008742 1961737 1940031
15677 1940031 2002408 2018914 2015720 2003167 1984421 1990216 1937360 1924796 1949235 1967466 1993693 1999779
15665 1999779 1962388 1945049 1965744 2003248 2014952 1995544 1954549 1978525 2004041 2006695 1995414
15654 1995414 1970267 1974948 2001401 2001414 2001546 1996531 2012354 1994505 1968750 1977017 1969619 2013300 1994180
15641 1994180 1965980 1947069 1961091 2031202 2079946 2029837 1981408 2009886 2013983 2022639 2000783 1978803
15629 1978803 2003212 2021473 1987179 1968916 1995606 1983063 1985916 2021896 2045393 2049862 2018295 1965305
15617 1965305 1992261 1984990 1985267 1979387 1974593 1967236 2005515 2003609 1994204 1986363 1973733 2025115 1989239
15604 1989239 1933084 1903326 1967404 2036357 2041481 2037098 2056898 2047381 1987502 1974793 2043012 2051073
15592 2051073 2025136 1995731 1992974 1983081 1972715 2015498 1987868 1997731 1998275 1967130 1971733 1996912
15580 1996912 2008339 2022104 2039199 2061722 2051146 2051621 2016467 1945417 1955644 1969563 2012059 2062894
15568 2062894 2025184 2017848 2011341 2027177 2019871 2041577 2034761 1960145 1986547 1998831 1974787 1987275
15556 1987275 1972368 2008778 2012067 2012506 1995624 2003189 1994714 1995319 1982181 1953535 1941585 1989400 1988483
15543 1988483 1953173 2021127 2013767 2040138 2001098 2019631 1997899 2024636 2061900 1988839 1984289 2019577
15531 2019577 2020345 2015909 2049657 2031236 1996653 1943000 1964715 2001824 2001650 2007571 2034501 1989278
15519 1989278 1976209 1992728 2029888 2000977 2011912 2082873 2060317 2069374 2072884 2091896 2045953 2043187
15507 2043187 2015017 2061191 2092430 2059342 2019869 2014046 2013640 2041154 2019927 2014107 1996857 1997664
15495 1997664 2012113 1979839 2001505 2016635 2032820 2044179 2006557 2042703 1992495 1956770 1981313
15484 1981313 1995120 2037169 2045290 2029591 2018270 2027762 2033818 2025958 2027884 2047799 2036982 2019453
15472 2019453 2058507 2062944 2044692 2057531 2043605 2032087 2014858 2022934 2016183 2024387 1988202 2008753
15460 2008753 2025818 2114744 2116413 2053133 2029894 2003174 2046265 2041906 2032505 2027891 2015205 2002801
15448 2002801 2009400 2036124 2011464 2023904 2024842 2017372 2036531 2041350 2013469 1999070 2001793 2012378
15436 2012378 1999339 2014296 2004826 2037827 2029826 1992320 2024408 2027379 2028943 2043879 2051119 2030489
15424 2030489 2013458 2001415 2016758 2007958 2053091 2050707 2041493 2042873 2051623 2037298 2056364 2035642
15412 2035642 2032856 2052458 2011694 2022934 2057361 2041196 2045340 2021941 2044987 2030100 2024829 2041884
15400 2041884 2041006 2075321 2084722 2063325 2028587 2030674 1980645 2008577 2034981 2019822 2014496 2049482
15388 2049482 2037786 2017184 2011729 2025156 1995180 1964778 2032472 2096595 2092822 2081684 2030343 2013388
15376 2013388 2032806 2067670 2064966 2112203 2040484 1983490 2018270 2022221 2000924 2002779 2026085 2044448
15364 2044448 2033312 2089041 2100009 2059707 2040090 2068496 2052163 2003557 2065716 2097158 2066634
15353 2066634 2044728 2028624 2004166 2009549 2023554 2076627 2080788 2088246 2107809 2065744 2064329 2052385
15341 2052385 2062546 2102984 2050405 2036493 2021642 2047116 2072411 2104004 2045253 2010632 1957706
15330 1957706 1998013 1977448 1997783 2037410 2028338 2040752 2058378 2084944 2068666 2035001 2046016
15319 2046016 2054802 2076057 2055141 2057509 2085949 2040377 2044443 2080657 2073115 2101705 2067657 2054301
15307 2054301 2100766 2066807 2071843 2100620 2086897 2056667 2057564 2015575 1997035 1998071 2089220 2047025
15295 2047025 2048222 2032118 2007982 2076427 2100943 2049670 2003341 2028442 2074418 2097585 2090678 2057972
15283 2057972 2001720 2000614 2029563 2024642 2068796 2071322 2034325 2048002 2041664 2096764 2089736 2045845
15271 2045845 2034933 2067448 2032223 2084338 2125527 2095549 2074412 2051619 2051115 2066737 2052954 2067681
15259 2067681 2061275 2091552 2134035 2093960 2084703 2070958 2088810 2093646 2073986 2042676 2062028 2000675
15247 2000675 2014110 2060950 2043717 2015218 2063114 2112927 2071011 2061036 2101583 2133572 2052532
15236 2052532 2039145 2043796 2056921 2104138 2104639 2109844 2103257 2117398 2119159 2159947 2140006 2094557
15224 2094557 2090418 2077520 2076572 2084829 2098007 2123419 2108608 2077893 2061713 2061659 2102877 2097658 2072301
15211 2072301 2092147 2109040 2127861 2147786 2136456 2122409 2127849 2112261 2090744 2066951 2052426
15200 2052426 2101639 2073393 2116114 2101484 2071216 2102380 2143316 2136642 2091802 2090635 2083517 2098441
15188 2098441 2118740 2124675 2088302 2121483 2114924 2090301 2103649 2090033 2056415 2030237 2059593 2098950
15176 2098950 2124786 2108210 2089154 2138099 2094851 2104525 2145781 2105755 2085194 2067200 2129903
15165 2129903 2113727 2047323 2064840 2072978 2106775 2106739 2110263 2095262 2112567 2102800 2107491 2115906 2092799
15152 2092799 2096348 2148737 2144950 2159852 2122251 2113572 2128627 2121321 2113779 2077852 2118515 2146333
15140 2146333 2106616 2068042 2044102 2047444 2083578 2051690 2058823 2104993 2072803 2090584 2080568 2051914
15128 2051914 2086564 2042799 2055082 2106297 2076708 2031732 2055843 2071966 2081322 2081579 2096323 2081162
15116 2081162 2084247 2066978 2120204 2119494 2109132 2112880 2116737 2094925 2120086 2139599 2148542 2138898 2114824
15103 2114824 2148278 2123678 2117359 2111438 2111933 2069243 2089202 2063176 2105692 2107320 2096993 2113240
15091 2113240 2109409 2133851 2126251 2184836 2167446 2116122 2134639 2121089 2083220 2075436 2073861 2101087
15079 2101087 2118387 2157087 2150568 2120509 2086408 2114948 2147403 2121022 2080671 2132873 2148217
15068 2148217 2129531 2156488 2201135 2128199 2128576 2207242 2154377 2121021 2150383 2096810 2073258 2125751
15056 2125751 2121729 2129078 2115016 2074851 2132668 2134772 2142708 2169534 2175877 2145406 2083791 2128026
15044 2128026 2157215 2144915 2117047 2118396 2139749 2138491 2160985 2148105 2079423 2083528 2079222 2149418
15032 2149418 2184750 2153564 2108659 2121856 2125247 2096242 2089217 2072704 2112562 2081708 2107482 2133246
15020 2133246 2118500 2110963 2095199 2131999 2180603 2171871 2154621 2178462 2132168 2165438 2178591 2152371
15008 2152371 2158429 2148634 2136698 2116202 2105314 2162590 2147366 2138233 2104793 2107549 2144731 2144277
14996 2144277 2153992 2148160 2145632 2117923 2138490 2205653 2168287 2150686 2115951 2100138 2145903 2175513
14984 2175513 2157294 2166085 2209256 2198182 2155059 2155576 2182922 2128342 2092370 2125497 2165640 2163119
14972 2163119 2180611 2182905 2164302 2169269 2144798 2153589 2163253 2182432 2172330 2167912 2160296 2112571
14960 2112571 2162227 2159626 2170660 2158462 2159415 2143453 2130636 2156936 2170973 2158848 2143826 2144525
14948 2144525 2123254 2121952 2126656 2170981 2172149 2174538 2130929 2119351 2128789 2166956 2154321 2141216
14936 2141216 2154839 2161338 2177894 2166651 2154827 2125979 2108199 2102146 2129978 2115969 2127956 2161955
14924 2161955 2152657 2168920 2190949 2134426 2132159 2169617 2157989 2186803 2175439 2147665 2183191 2175854
14912 2175854 2132839 2150338 2153960 2170473 2165927 2157195 2190546 2203460 2188635 2176911 2170690 2207336
14900 2207336 2224331 2182400 2166914 2194093 2205496 2192395 2221892 2207700 2159729 2165856 2171702 2152650
14888 2152650 2199345 2181400 2167101 2163510 2187157 2198482 2174005 2163010 2221241 2202786 2203239 2189345
14876 2189345 2204345 2258832 2226135 2195705 2170970 2137612 2152963 2180819 2230613 2204195 2207624
14865 2207624 2174220 2194681 2213715 2175897 2169934 2169973 2181529 2200675 2189739 2187967 2207943 2224164
14853 2224164 2216189 2217195 2213294 2166546 2162533 2197580 2178043 2194576 2207335 2214797 2232005 2217734
14841 2217734 2195859 2170757 2184368 2154891 2197203 2197462 2201249 2200048 2207713 2208237 2181020 2178567 2215952
14828 2215952 2198504 2158385 2186452 2190405 2182617 2191161 2191294 2242151 2222572 2206416 2207751 2185109
$$ [...]
##END NTUPLES=NMR SPECTRUM
##END=
