##TITLE=1H_TG-2340-A1
 CDCl3
 8 sc, 
 9.12.2021
##JCAMPDX= 6.0         $$ Bruker NMR JCAMP-DX V2.0
##DATA TYPE= NMR SPECTRUM
##DATA CLASS= NTUPLES
##ORIGIN= UXNMR, Bruker Analytische Messtechnik GmbH
##OWNER= root
$$ XWIN-NMR		Version 3.5
$$ Thu Dec  9 12:13:01 2021 Russian Standard Time (UT+4h)  she@DPX200
##.OBSERVE FREQUENCY= 200.131346
##.OBSERVE NUCLEUS= ^1H
##.ACQUISITION MODE= SIMULTANEOUS
##.ACQUISITION SCHEME= undefined
##.AVERAGES= 8
##.DIGITISER RES= 18
##SPECTROMETER/DATA SYSTEM= spect
##.PULSE SEQUENCE= zg30
##.SOLVENT NAME= CDCl3
##.SHIFT REFERENCE= (INTERNAL, CDCl3, 0, 15.7282)
##AUDIT TRAIL= $$ (NUMBER, WHEN, WHO, WHERE, WHAT)
$$ ##TITLE= Audit trail, XWIN-NMR		Version 3.5
$$ ##JCAMPDX= 5.01
$$ ##ORIGIN= Bruker BioSpin GmbH
$$ ##OWNER= she
$$ F:/spectra/data/she/nmr/H-F/1/pdata/1/auditp.txt
$$ ##AUDIT TRAIL=  $$ (NUMBER, WHEN, WHO, WHERE, WHAT)
(   1,<2021-12-09 12:11:41.98 +0400>,<she>,<DPX200>,
      <created by zg, POWCHK disabled, PULCHK disabled
       configuration hash MD5:
       00 E9 B6 7A A2 85 ED C7 34 08 36 98 17 FE 4E 26
       data hash MD5: 16K
       FB 2C 2C F1 FA D8 55 7C D8 59 C3 DB 6F 02 A7 E8>)
(   2,<2021-12-09 12:11:46.56 +0400>,<she>,<DPX200>,
      <Start of raw data processing
       efp BC_mod = 2 LB = 0.24 FT_mod = 6 PKNL = 1 PHC0 = -15510.12 PHC1 = 7.200799 SI = 16K 
       data hash MD5: 16K
       F5 67 05 A5 28 B0 7A 25 7E 6F A7 40 19 AE BA ED>)
(   3,<2021-12-09 12:12:05.90 +0400>,<she>,<DPX200>,
      <pk PHC0 = 0.4564035 PHC1 = 0.8 
       data hash MD5: 16K
       F7 A8 FB 57 2D 68 20 08 5A F8 70 51 07 9D 2B 19>)
(   4,<2021-12-09 12:12:09.35 +0400>,<she>,<DPX200>,
      <abs ABSG = 5 
       data hash MD5: 16K
       31 7B 57 07 80 3A 62 F6 65 AC F9 F6 11 18 44 F7>)
$$ ##END=
$$ 
$$ hash MD5
$$ 25 E0 E7 54 63 92 9F 3F A8 D3 EB BE 44 4D B5 F6
##$RELAX= 
##$RELAX= 
##$RELAX= 
##$RELAX= 
##$RELAX= 
##$RELAX= 
$$ Bruker specific parameters
$$ --------------------------
##$DU= <F:/spectra>
##$EXPNO= 1
##$NAME= <H-F>
##$PROCNO= 1
##$TYPE= <nmr>
##$USER= <she>
##$AMP= (0..31)
100 100 100 100 100 100 100 100 100 100 100 100 100 100 100 100 100 100 
100 100 100 100 100 100 100 100 100 100 100 100 100 100 
##$AQSEQ= 0
##$AQ_mod= 1
##$AUNM= <au_zg>
##$AUTOPOS= <>
##$BF1= 200.13
##$BF2= 200.13
##$BF3= 200.13
##$BF4= 200.13
##$BF5= 200.13
##$BF6= 200.13
##$BF7= 200.13
##$BF8= 200.13
##$BYTORDA= 1
##$CFDGTYP= 0
##$CFRGTYP= 5
##$CHEMSTR= <none>
##$CNST= (0..31)
1 1 145 1 1 1 1 1 1 1 1 1 1 1 1 1 1 1 1 1 1 1 1 1 1 1 1 1 1 1 1 1 
##$CPDPRG= <>
##$CPDPRG1= <>
##$CPDPRG2= <>
##$CPDPRG3= <>
##$CPDPRG4= <mlev>
##$CPDPRG5= <mlev>
##$CPDPRG6= <mlev>
##$CPDPRG7= <mlev>
##$CPDPRG8= <mlev>
##$CPDPRGB= <>
##$CPDPRGT= <>
##$D= (0..31)
0 1.2 0 0 0 0 0 0 0 0.06 0 0.03 0 0 0 0 0.0002 0 0 0 0 0 0 0 0 0 0 0 0 
0 0 0 
##$DATE= 1639037501
##$DBL= (0..7)
120 120 120 120 120 120 120 120 
##$DBP= (0..7)
150 150 150 150 150 150 150 150 
##$DBP07= 0
##$DBPNAM0= <>
##$DBPNAM1= <>
##$DBPNAM2= <>
##$DBPNAM3= <>
##$DBPNAM4= <>
$$ [...]
##$SUBNAM2= <"">
##$SUBNAM3= <"">
##$SUBNAM4= <"">
##$SUBNAM5= <"">
##$SUBNAM6= <"">
##$SUBNAM7= <"">
##$SUBNAM8= <"">
##$SUBNAM9= <"">
##$SW= 18.0517287032376
##$SWIBOX= (0..15)
0 0 2 0 0 0 0 0 0 0 0 0 0 0 0 0 
##$SW_h= 3612.71676300578
##$TD= 16384
##$TD0= 1
##$TE= 0
##$TE2= 300
##$TE3= 300
##$TEG= 300
##$TL= (0..7)
0 120 120 120 120 120 120 120 
##$TP= (0..7)
150 150 150 150 150 150 150 150 
##$TP07= 0
##$TPNAME0= <>
##$TPNAME1= <>
##$TPNAME2= <>
##$TPNAME3= <>
##$TPNAME4= <>
##$TPNAME5= <>
##$TPNAME6= <>
##$TPNAME7= <>
##$TPOAL= (0..7)
0.5 0.5 0.5 0.5 0.5 0.5 0.5 0.5 
##$TPOFFS= (0..7)
0 0 0 0 0 0 0 0 
##$TUNHIN= 0
##$TUNHOUT= 0
##$TUNXOUT= 0
##$USERA1= <user>
##$USERA2= <user>
##$USERA3= <user>
##$USERA4= <user>
##$USERA5= <user>
##$V9= 5
##$VALIST= <valist>
##$VCLIST= <CCCCCCCCCCCCCCC>
##$VD= 0
##$VDLIST= <DDDDDDDDDDDDDDD>
##$VPLIST= <PPPPPPPPPPPPPPP>
##$VTLIST= <TTTTTTTTTTTTTTT>
##$WBST= 1024
##$WBSW= 4
##$XGAIN= (0..3)
0 0 0 0 
##$XL= 0
##$YL= 0
##$YMAX_a= 430754
##$YMIN_a= -675571
##$ZGOPTNS= <>
##$ZL1= 120
##$ZL2= 120
##$ZL3= 120
##$ZL4= 120
##$ABSF1= 15.71824
##$ABSF2= -2.33361
##$ABSG= 5
##$ABSL= 3
##$ALPHA= 0
##$AQORDER= 0
##$ASSFAC= 0
##$ASSFACI= 0
##$ASSFACX= 0
##$ASSWID= 0
##$AUNMP= <proc_1d>
##$AZFE= 0.1
##$AZFW= 0.1
##$BCFW= 0
##$BC_mod= 2
##$BYTORDP= 0
##$COROFFS= 0
##$CY= -3
##$DATMOD= 1
##$DC= 0
##$DFILT= <>
##$DTYPP= 0
##$F1P= 0
##$F2P= 0
##$FCOR= 1
##$FTSIZE= 16384
##$FT_mod= 6
##$GAMMA= 0
##$GB= 0
##$INTBC= 1
##$INTSCL= 0
##$ISEN= 128
##$LB= 0.24
##$LEV0= 0
##$LPBIN= 0
##$MAXI= 10000
##$MC2= 0
##$MEAN= 0
##$ME_mod= 0
##$MI= 1.114404
##$NCOEF= 0
##$NC_proc= -5
##$NLEV= 6
##$NOISF1= 3.799351
##$NOISF2= 2.8
##$NSP= 0
##$NTH_PI= 0
##$NZP= 0
##$OFFSET= 15.72816
##$PC= 1
##$PHC0= -15509.66
##$PHC1= 8.000799
##$PH_mod= 1
##$PKNL= yes
##$PPARMOD= 0
##$PSCAL= 0
##$PSIGN= 0
##$REVERSE= no
##$SF= 200.130004681392
##$SI= 16384
##$SIGF1= 3
##$SIGF2= 2
##$SINO= 5.538805
##$SIOLD= 16384
##$SREGLST= <1H.CDCl3>
##$SSB= 0
##$STSI= 16384
##$STSR= 0
##$SW_p= 3612.71676300578
##$SYMM= 0
##$S_DEV= 0
##$TDeff= 16384
##$TDoff= 0
##$TI= <>
##$TILT= no
##$TM1= 0
##$TM2= 0
##$TOPLEV= 0
##$USERP1= <user>
##$USERP2= <user>
##$USERP3= <user>
##$USERP4= <user>
##$USERP5= <user>
##$WDW= 1
##$XDIM= 16384
##$YMAX_p= 531512567
##$YMIN_p= -645770
$$ End of Bruker specific parameters
$$ ---------------------------------
##NTUPLES= NMR SPECTRUM
##VAR_NAME=  FREQUENCY,     SPECTRUM/REAL,   SPECTRUM/IMAG
##SYMBOL=    X,             R,               I
##VAR_TYPE=  INDEPENDENT,   DEPENDENT,       DEPENDENT
##VAR_FORM=  AFFN,          ASDF,            ASDF
##VAR_DIM=   16384,         16384,           16384
##UNITS=     HZ,            ARBITRARY UNITS, ARBITRARY UNITS
##FACTOR=    0.220516191357247, 1,           1
##FIRST=     3147.67671531326, 0,            0
##LAST=      -465.04004769252, 0,            0
##MIN=       -465.04004769252, -645770,      0
##MAX=       3147.67671531326, 531512567,    0
$$ Real data points
##PAGE= N=1
##DATA TABLE= (X++(R..R)), XYDATA
$$ [...]
9319 1244528 1272098 1302838 1377193 1378772 1387058 1409240 1475196 1546637 1556500 1571651 1572208 1615001
9307 1615001 1606449 1557424 1570724 1610681 1647953 1615646 1581378 1593481 1607336 1566574 1577594 1560751
9295 1560751 1510677 1532089 1549967 1497452 1470966 1490167 1478050 1473714 1439441 1416089 1355837 1365382
9283 1365382 1379526 1371188 1378651 1388460 1352067 1409184 1370123 1371827 1386018 1372195 1400818 1443068
9271 1443068 1430952 1425436 1459428 1484957 1519215 1509771 1588362 1599657 1578369 1579097 1625176 1627923
9259 1627923 1602842 1598222 1554634 1551525 1535762 1595056 1591705 1576529 1595832 1604363 1608948 1598255
9247 1598255 1588518 1586938 1607248 1630171 1585532 1560484 1589966 1610914 1604543 1572863 1591870 1681506
9235 1681506 1702296 1721554 1704141 1697455 1671745 1718296 1803819 1801001 1879811 1882578 1952035 2030178
9223 2030178 2090955 2088995 2112869 2162984 2232104 2284622 2311578 2331955 2415583 2398860 2364417 2418012
9211 2418012 2453924 2495750 2520986 2518936 2550995 2553745 2561293 2545149 2596869 2644094 2688056 2705201
9199 2705201 2724284 2774652 2805744 2891980 2964911 2988149 3070405 3188606 3273251 3325728 3450973
9188 3450973 3513480 3574923 3664958 3783636 3913762 3971892 3994636 4022221 4087736 4193342 4242617
9177 4242617 4329402 4386096 4478013 4540442 4597251 4622434 4660200 4739009 4803568 4910059 4991214
9166 4991214 5120385 5233465 5334625 5452185 5617403 5728232 5861017 5972790 6170484 6406538
9156 6406538 6560005 6679883 6785280 6926731 7114504 7256136 7430669 7586128 7724180 7877796
9146 7877796 8063411 8263201 8417605 8587778 8744347 8927482 9137954 9337263 9631234 9869947
9136 9869947 10106738 10418941 10754488 11065072 11428463 11783285 12136177 12553304 13010557 13520996
9126 13520996 14023113 14537590 15129678 15688183 16372716 17035927 17761630 18562694 19450129
9117 19450129 20373024 21380637 22539986 23887458 25369242 27065279 28952777 31142340
9109 31142340 33691645 36572380 39891697 43811717 48543498 54080786 59784132 65177039
9101 65177039 70702604 77464033 85510120 93751308 99480799 101084817 101380484 103112070
9093 103112070 107365713 113214269 116449547 114171897 107455837 97290579 87051849 78696130
9085 78696130 72949059 69588509 67867766 66837791 64984260 62035029 58894678 56128896
9077 56128896 54300846 53573861 53768644 54705664 56421942 58816073 61865396 65801869 70804203
9068 70804203 76845644 83791881 90949962 97805462 104654768 110773239 115453379 119804723
9060 119804723 125424146 132988248 140899707 144376819 143967245 142350918 139348420 134756651
9052 134756651 126414933 112694284 97790380 84539160 74168358 66433878 60664859
9045 60664859 56267327 52848843 50030583 47416782 44351704 40771154 37285114 34151106
9037 34151106 31494925 29357077 27616823 26089550 24769250 23518041 22390425 21328044
9029 21328044 20403490 19528071 18747995 17997895 17341187 16709174 16209425 15737836 15294694
9020 15294694 14831871 14405129 13977946 13545321 13186624 12824940 12359494 12013428 11619471
9011 11619471 11217425 10915239 10652911 10396670 10159098 9899671 9680789 9457564 9145253
9002 9145253 8833477 8524920 8268047 7997689 7746175 7537619 7365785 7177971 7017586 6847241
8992 6847241 6670499 6576026 6439832 6329853 6224234 6129052 6026515 5938196 5834767 5725754
8982 5725754 5604570 5554364 5506355 5400763 5326554 5290702 5142767 5159396 5168311 5060452 5023871
8971 5023871 4945206 4859780 4840953 4802746 4820625 4820065 4818072 4787584 4720480 4698519 4677713 4652944
8959 4652944 4582701 4549674 4537004 4503250 4459220 4437397 4449714 4391489 4422571 4455356 4475243
8948 4475243 4501093 4525178 4535529 4512492 4603522 4621277 4660515 4685125 4662413 4729785 4782146
8937 4782146 4769285 4767849 4799453 4829027 4888170 4961143 5001335 5107658 5150878 5175269 5270898
8926 5270898 5318253 5375589 5463105 5529672 5583756 5650735 5699720 5792906 5896814 5985816 6078285
8915 6078285 6193386 6307360 6403704 6454325 6580099 6681152 6827865 6985761 7095458 7234275
8905 7234275 7404641 7537559 7711349 7890622 8039775 8262334 8416373 8605030 8782565 8962716
8895 8962716 9289455 9520508 9783002 10100072 10411325 10809339 11096659 11449769 11884989 12349518
8885 12349518 12898353 13427428 13948655 14534938 15220311 15855126 16522915 17316328 18102527
8876 18102527 18971977 19826613 20725386 21599116 22492192 23414084 24379474 25475192 26764114
8867 26764114 28265470 30214347 32583274 35398784 38597494 42169541 45764400 49172036
8859 49172036 52769996 56708480 61098628 66311836 70638318 73233836 74604993 75277102
8851 75277102 74236608 70515027 65114946 59944371 56434140 54691193 54118746 54222463
8843 54222463 54618834 54272081 53089020 51642006 50667239 50299627 50452055 50933872 51880455
8834 51880455 53441465 55766400 58840681 62544568 66863298 71244347 75873861 81135453
8826 81135453 87653836 95497527 103933986 112263475 121237091 128812712 134093255 136810511
8818 136810511 135685567 130760908 121975355 112183360 103509794 96799422 92497075 88412254
8810 88412254 82187401 74719466 67552064 62196935 58308171 55183723 52476238 50398634
8802 50398634 48803349 47694272 46855930 46440655 46318036 46651967 47568695 49029769 51131857
8793 51131857 54075090 57532971 61246179 65327820 68784667 70966692 72799969 75196823
8785 75196823 78755537 81696758 84064672 84676228 81730030 76262822 68252713 59438795
8777 59438795 51312217 45057900 40565858 37364935 34924790 33067744 31443713 29643118
8769 29643118 27664808 25746242 24153021 22835742 21764787 20957362 20154966 19394019 18723204
8760 18723204 18166660 17605663 17116426 16627383 16169542 15752677 15332006 14991896 14742565
8751 14742565 14423792 14138155 13915628 13715225 13517849 13384148 13326714 13152563 13051947 12980217
8741 12980217 13000970 13010817 13062781 13172142 13278891 13512907 13738572 14031956 14368045 14726349
8731 14726349 15134826 15492641 15889464 16326653 16769216 17321986 17923953 18539071 19076436
8722 19076436 19681976 20416905 21503280 22668121 23937239 25717615 28183941 31107001
8714 31107001 30934782 28692354 27107500 25857219 25156508 25005019 25399099 26239164 27628009
8705 27628009 29378194 31602119 34262732 37413946 40693414 44276154 48085823 50994193
8697 50994193 52861486 54353821 55607173 57709172 59785657 59009986 55622154 51312792
8689 51312792 47554169 45225611 43305025 40381754 36799527 33447236 30969477 29427016
8681 29427016 28487854 27920642 27676222 27739101 28132487 28810330 29741349 30977779 32644143
8672 32644143 34751239 37074209 39774339 42966203 45565502 47530862 49646119 52508615
8664 52508615 55976443 60011585 64280980 67233645 68023073 66477656 62708240 56646014
8656 56646014 49665773 43513695 39020282 36072968 33860545 32315969 31068689 29348431
8648 29348431 27147434 24880032 23094180 21734586 20804465 20162168 19666770 19359339 19153782
8639 19153782 19260380 19569646 20053150 20833362 21810725 22820981 24063178 25301637 26035619
8630 26035619 26364425 26406693 26444502 27026258 27183936 26054066 24068046 21938371 20330513
8621 20330513 19265242 17950687 16220946 14438354 12847687 11645771 10668142 9890775
8613 9890775 9252209 8711805 8275951 7916074 7534133 7244973 6933403 6650846 6372769 6008788
8603 6008788 5804691 5677520 5492688 5319669 5114277 4942673 4790419 4683467 4557631 4406882
8593 4406882 4306974 4172149 3981863 3817115 3728413 3635658 3569089 3460093 3369837 3275480 3147431
8582 3147431 3041929 2952087 2944203 2856945 2752976 2730375 2687367 2601311 2543428 2501919 2527076
8571 2527076 2467663 2370583 2321082 2265447 2216323 2198835 2104102 2026044 2027100 1979098 1991072 2017629
8559 2017629 1971263 1968267 1898958 1835078 1859450 1866765 1875387 1848847 1876240 1873064 1813127 1792769
8547 1792769 1785099 1760021 1727964 1705902 1713220 1595630 1520630 1511791 1482194 1390213 1302581 1256386
8535 1256386 1241699 1209891 1189856 1164253 1099859 1062823 1095741 1072151 1028697 1053229 1036954
8524 1036954 1000097 985431 977432 991347 982646 998434 1019969 1007459 988798 970216 987423 951244
8512 951244 875852 896644 892409 844278 792499 822749 839340 810866 872840 849029 767433 762365
8500 762365 808720 811439 830387 800744 762559 771616 796170 818779 809160 821788 850414 846759
8488 846759 863348 879652 906014 893951 895996 903936 851296 868996 838039 762469 704887 720325
8476 720325 684287 661367 675156 717526 770384 725015 738834 780201 779530 789374 789861 801366 784847
8463 784847 774906 751495 779900 803928 801286 882293 896706 938500 966113 982509 906712 917809
8451 917809 946033 935428 941816 894080 862773 793102 733053 660879 634116 664816 637990 619580
8439 619580 615622 555163 565408 539466 460510 450403 450717 440196 405466 356955 384618 389497
8427 389497 362318 372529 425135 442302 437883 450819 448381 454405 449803 468350 476569 441601 468921
8414 468921 455164 475626 421735 385786 413409 418956 363157 329011 316472 261845 303762 307087
8402 307087 286898 197379 205177 200697 195690 222026 246365 246303 241797 175167 204226 156992 162869
8389 162869 202373 175953 167680 180656 193766 177492 152884 134522 148123 144292 150167 138292
8377 138292 136935 85753 119542 129931 43610 54213 57833 59273 59677 60738 88622 105975 85253
8364 85253 30597 42562 96620 148208 137048 120460 165879 183675 190714 228482 201278 242260
8352 242260 223098 180131 188532 161552 186069 208109 192531 166657 161275 161510 144121 161033
8340 161033 181284 164165 157433 171170 128079 149145 181209 197469 201135 158821 195787 213418
8328 213418 176610 166161 153738 137252 114474 128647 140628 142590 132983 74452 88613 110681
8316 110681 62815 108601 130020 139552 147858 125251 132351 165258 155625 165828 163472 146504 169809
8303 169809 210468 262933 325300 355554 356519 408654 384280 470166 511853 420380 355046 377190
8291 377190 317995 250434 253381 221934 183312 171957 177036 195136 212449 141095 162154 164755
8279 164755 125882 109411 120615 83124 61243 3834 13501 74027 129256 143666 153057 144746
8267 144746 183499 231284 192597 197371 176057 192468 213604 182525 175725 142978 83983 80151
8255 80151 59439 63254 57582 16920 -64437 -68524 -14165 4819 37400 57581 93391 103838
8243 103838 137456 117449 91346 101628 108566 77196 105425 126474 125208 141474 138393 119659
8231 119659 107445 45421 12441 27001 17003 52470 30733 23566 6436 31281 24897 -8310
8219 -8310 -37355 -15428 -42899 -76952 -74907 -38027 -58791 -48866 -69462 -78977 -99727 -99584 -70234
8206 -70234 -70815 -103317 -118182 -113125 -96184 -144613 -132681 -195513 -124142 -181164 -122310 -208293
8194 -208293 -162143 -464726 -645770 22704 -41952 -64253 -98586 -84543 -86066 -46296 -97438
8183 -97438 -114903 -100182 -76940 -50924 -42548 -35776 -35530 -54065 -38447 -24854 -33865 -28493 -60900
8170 -60900 -28061 -48013 -109145 -116426 -89496 -87110 -100047 -120114 -203236 -184286 -73305 -95862
8158 -95862 -101231 -77145 -87757 -102320 -66847 -73038 -56336 -36493 -5354 -2714 12862 -30795
8146 -30795 -30084 -28567 -28220 -58591 -88260 -73908 -49398 -83942 -116051 -115111 -100602 -48879 -49627 -116107
8132 -116107 -128493 -153456 -159865 -166092 -191445 -121769 -83077 -62253 -25775 -85265 -104282 -100123
8120 -100123 -91073 -55939 -88633 -132243 -152909 -157742 -173958 -267853 -244142 -277175 -311992 -264628
8108 -264628 -261601 -236635 -224266 -246304 -250036 -256110 -235395 -201224 -221914 -183740 -99529 -58141
8096 -58141 -66062 -4687 -3055 -62394 -66833 -30326 -27796 31329 41663 -9079 -15978 -23899 -26706
8083 -26706 -23067 -11064 6343 -20248 -100764 -140604 -71733 -50129 -29725 -58456 -79463 -10008
8071 -10008 44510 -36800 -61422 -109708 -67488 -41418 -51879 -96934 -127508 -135193 -119432 -132358
8059 -132358 -109416 -29393 -54862 -103707 -97091 -106834 -117398 -142089 -188255 -172364 -165758 -199575
8047 -199575 -204232 -177135 -187386 -165388 -142297 -146333 -160691 -157297 -135863 -144880 -198866 -200658 -167080
8034 -167080 -136383 -162665 -185636 -150108 -140566 -119246 -101193 -167210 -138278 -146643 -148936 -122167
8022 -122167 -92906 -120693 -102302 -74767 -47752 27039 22526 58235 45745 31770 86478 56943
8010 56943 31585 -6893 17354 -23898 -10698 -18617 -60553 -91934 -158434 -153570 -186241 -201306
7998 -201306 -178579 -207609 -273610 -268804 -235260 -270867 -187357 -148376 -140408 -86574 -46457 -51100
7986 -51100 -55769 -76535 -81874 -83248 -57206 -37916 -30083 -29913 -40687 -9195 -64520 -30780 -73393
7973 -73393 -98557 -87277 -62405 -103330 -95410 -55930 -45778 -99324 -100770 -96427 -74448 -14672
7961 -14672 -16839 -46535 -47623 -56309 -82737 -45018 -91501 -79708 -53998 -32297 -28361 -22114 -17228
7948 -17228 -85626 -87497 -25353 -55438 -101266 -103811 -75311 -107675 -87708 -97964 -128200 -128255 -103747
7935 -103747 -107571 -125222 -167897 -221258 -201767 -189821 -169309 -188367 -225019 -242079 -208717 -183720
7923 -183720 -241822 -292538 -292640 -315252 -290037 -269274 -238267 -267237 -222319 -166071 -107937 -92850
7911 -92850 -126027 -139134 -56490 -34481 -59545 -61008 -114998 -70687 -73351 -64470 -61685 -74432 -9403
7898 -9403 -48169 -66870 -29324 -51093 -63527 -89682 -115494 -47482 -105048 -133983 -80514 -90646
7886 -90646 -96493 -113379 -73725 -43843 -99893 -118017 -111634 -62358 -49448 -68311 -86323 -99429
7874 -99429 -40415 -63357 8721 22503 -1821 -82533 -112222 -71795 -68671 -66754 -73037 -24387
7862 -24387 -21878 -43547 -59500 -74229 -91034 -101584 -51317 -40976 -87104 -128336 -87741 -65768
7850 -65768 -96583 -142997 -127740 -110042 -85039 -86780 -154096 -190876 -165592 -133801 -100484 -89527
7838 -89527 -96306 -94600 -170606 -176473 -126656 -144537 -182313 -186760 -205989 -161442 -178116 -158747 -158552
7825 -158552 -173503 -167322 -197858 -221984 -184422 -151042 -181695 -214048 -180509 -164031 -154967 -120807
7813 -120807 -159801 -150574 -100163 -86935 -65474 -59693 -44190 2205 -21341 -71554 -81383 -99131
7801 -99131 -115692 -70797 56971 193185 51251 -37538 -44101 -75425 -71323 -74277 -67512 -21721
7789 -21721 -66420 -73078 -68690 -62787 -43982 -40631 -45777 -38408 -31665 -45062 -52046 -69299 -66134 -62991
7775 -62991 -50304 -45763 -92629 -114600 -105029 -88013 -83272 -67023 -92748 -140098 -157520 -176815
7763 -176815 -157207 -124208 -155615 -175011 -151348 -224059 -198332 -185867 -151000 -117981 -68052 -91713
7751 -91713 -102833 -84513 -125701 -98494 -105430 -99791 -90672 -153057 -155443 -136184 -108545 -127747 -85689
7738 -85689 -115213 -68288 -83579 -119765 -113457 -55833 -1890 285 10230 67232 63224 89997 131712
7725 131712 119831 208317 258526 260507 280567 316319 301922 239011 144049 98254 67077 52612
7713 52612 44647 -26 -43075 -14139 -28748 -60629 -85114 -52290 -32558 -32954 8656 23719
7701 23719 1493 8686 -18375 21040 -36841 -39866 -3311 -10285 -34391 -53204 -45595 -50742 -102926
7688 -102926 -66330 -17738 -27443 -8388 -40842 -45305 -45745 -49906 -64886 -20092 13491 -5548 17331
7675 17331 -19386 198 -14532 -8256 -52356 -76114 -60043 -86584 -104893 -88072 -76109 -151368
7663 -151368 -154744 -81195 -79264 -47219 3416 -82336 -108793 -106710 -59367 -92222 -62233 -67132
7651 -67132 -54487 -13182 35295 60288 81062 61005 36018 65014 32098 27150 -3673 15483
7639 15483 -16338 -78764 -59014 -57001 -59446 -9321 8682 -44339 -111409 -135005 -140104 -97716
7627 -97716 -71874 -56697 -28927 -6100 -796 -24235 -33595 -20805 -36553 -46543 -68924 -58427
7615 -58427 -100254 -159837 -136780 -151612 -158162 -132742 -131345 -83762 -52210 -54162 -87882 -96804 -129698
7602 -129698 -175565 -159729 -100980 -17781 -12387 4599 40094 69419 47324 58801 70341 47178
7590 47178 32645 -4 -2568 -21254 -29974 -76200 -65805 -18501 -18268 5584 -14189 18378 5681
7577 5681 -49038 -37210 -55239 -46012 -10194 -7323 51993 42873 16618 19531 3903 -3726 12004
7564 12004 -44914 -106422 -102105 -106604 -146586 -91658 -101852 -112240 -76452 -121660 -136015 -126930
7552 -126930 -110424 -199536 -249571 -258292 -242689 -240521 -226058 -180854 -122454 -107565 -96930 -63152
7540 -63152 -80333 -40810 10984 21776 14850 39970 92103 49200 75244 74089 78114 127845
7528 127845 134971 178348 170927 164379 231877 233999 228477 240809 213575 236268 258911 239400 253701
7515 253701 250087 232226 277533 305410 300989 299635 290628 306692 357274 366903 404306 488082 578577
7502 578577 583094 622762 639627 659303 693584 753884 738506 674866 594229 502027 426346 367030
7490 367030 293694 269286 232574 229925 202035 181218 148873 128102 124737 76573 72317 37871
7478 37871 42203 34021 67843 53393 -23024 35888 15367 -2071 11805 30311 59694 65306
7466 65306 58323 109200 143049 109392 94834 104823 105320 93091 144954 135029 122866 131982 153043
7453 153043 106153 106284 114693 110574 74697 79543 70355 35580 -31037 -32198 -23231 -11063 -54025
7440 -54025 -46976 -185 -35410 -25244 20605 -16862 -59063 -67060 -89890 -55170 4215 -13118
7428 -13118 3094 -1863 42013 33327 35102 76746 55615 42126 54487 48973 35739 50583 19542
7415 19542 31053 93726 120647 151627 137447 143512 154393 164214 157827 129562 169559 187571
7403 187571 155251 185390 169109 123339 152327 175635 202900 224764 207422 158750 151603 135101
7391 135101 143273 104954 37287 -15443 10717 57878 68474 21985 10443 -8284 -31801 -45067
7379 -45067 -53754 -12619 -50471 -87078 -57792 -50881 -50752 -34777 -19209 -57907 -79808 -49261 -23330
7366 -23330 -19735 -25346 -58288 -29571 -31238 -38332 -11042 27101 77876 123874 154984 96143 73573
7353 73573 90611 51470 98407 99252 163048 194022 137508 217079 222866 248203 226383 249402
7341 249402 246049 229245 198295 195207 246922 248488 273608 265605 256915 244139 317979 340334 316661
7328 316661 304430 315300 283015 252188 243636 247086 261755 240900 273261 299850 240320 262427
7316 262427 248118 207563 206512 209737 225043 272224 239832 215198 249207 263296 246072 218372
7304 218372 213671 242836 232807 286932 309327 273248 303339 302640 302194 284281 256849 248650 246265
7291 246265 301083 267549 253065 275275 274446 219781 220811 210514 218830 218921 239544 312678 292193
7278 292193 281518 318433 332299 354589 417218 450954 486002 459095 506992 501429 511224 524581
7266 524581 518649 496266 505953 520852 569893 535087 510685 497901 538284 580482 599951 636401
7254 636401 619681 567681 588945 599608 590300 609517 654494 665148 685571 681378 715814 738416
7242 738416 690441 703429 708712 682995 642878 634446 647213 626324 642148 654575 666685 689869
7230 689869 723133 776311 780373 842372 857642 867754 881910 921733 963701 960643 988097 1021164
7218 1021164 1020248 1012274 1016563 1043331 1036848 1079985 1138770 1151352 1143627 1114170 1146830 1184595 1222693
7205 1222693 1251634 1298477 1360711 1450514 1471880 1537427 1567717 1564796 1606707 1664566 1703765 1757620
7193 1757620 1751959 1783129 1874885 1886133 1934019 1984013 2021337 2025590 2058319 2079555 2105770 2228040
7181 2228040 2338383 2362016 2449601 2543845 2610729 2723394 2860178 2994571 3130475 3169909
7171 3169909 3237379 3336370 3402729 3495421 3555238 3691880 3783741 3910683 4051514 4152893 4300484
7160 4300484 4400786 4485014 4545451 4620631 4727463 4840406 4952139 5058719 5178562 5301452
7150 5301452 5450169 5710646 5958064 6183619 6389324 6574937 6773717 6976206 7124265 7317476
7140 7317476 7569040 7767669 8036156 8365789 8692073 9092229 9471256 9840325 10254761 10674176
7130 10674176 11094222 11547615 11978846 12499210 13129700 13810491 14560572 15406992 16407342
7121 16407342 17496455 18672915 20028005 21568690 23339568 25378248 27797726 30626091
7113 30626091 34086404 38257250 43200057 49069043 56066305 64209713 73668825 84477159
7105 84477159 96654837 109704231 123007842 135977122 147985130 155888059 156577834 148241447
7097 148241447 131382374 110370386 89921277 73266273 60737987 51707561 45031988
7090 45031988 39912974 35826967 32502491 29681904 27299662 25254449 23449251 21869437
7082 21869437 20463387 19078845 17894916 16838116 15888044 14978330 14193308 13530236 12853934
7073 12853934 12262960 11703207 11226496 10770742 10330889 9907905 9606212 9318630 9000818
7064 9000818 8665217 8328886 7948398 7624719 7380968 7097612 6846864 6585112 6265268 6022319
7054 6022319 5761318 5475278 5330795 5155076 4978552 4804977 4646700 4563206 4438040 4236288
7044 4236288 4161480 4033816 3867742 3776945 3642796 3511479 3404890 3262012 3163515 3109116
7034 3109116 3054151 3001930 2964917 2941218 2909261 2859763 2871194 2910483 2909899 2864777 2854326 2884105
7022 2884105 2881555 2892151 2889445 2867702 2813444 2805685 2779614 2705124 2591050 2419060 2263648
7011 2263648 2114241 1972342 1873191 1778001 1732650 1691080 1613440 1505785 1477223 1405123 1357945
7000 1357945 1271144 1195200 1189390 1215572 1193297 1143540 1183523 1097512 1057235 1090671 1109659 1021694
6988 1021694 1024430 993156 961520 975994 945683 917640 855702 883481 848886 846162 836863 846036
6976 846036 860049 820592 812121 816705 770251 763154 714146 696265 690547 688769 692127 720260 712118
6963 712118 620761 579727 560036 552345 534175 528771 544133 526217 517172 527036 482644 459911
6951 459911 434793 504518 565424 531392 491497 498549 464323 448285 480069 480935 431161 407689
6939 407689 441511 505116 488803 476690 455456 447650 444922 400025 390646 401555 359559 357408
6927 357408 314301 321157 376310 430083 421413 343223 355210 405037 423481 347684 342778 343488 381122
6914 381122 342439 362258 376273 350560 340201 344684 298800 293076 265978 181722 220109 242478
6902 242478 232637 211102 212130 216085 144951 126099 181334 191451 140476 83503 91311 117809
6890 117809 74292 79401 108398 131456 190277 150683 186233 216037 203906 165532 182096 189594
6878 189594 140949 104466 65815 82888 57997 56743 36353 11594 56856 86776 135098 172306
6866 172306 87987 32589 63195 90474 97654 101293 106717 148643 204255 252350 297884 248597
6854 248597 201170 146526 143285 175628 186698 150323 123430 107742 86584 83580 36414 61391
6842 61391 72577 43289 47125 75693 99469 92375 126548 94818 57547 89760 111913 60143
6830 60143 103389 108315 86663 61242 -341 33311 -2122 -78804 -111177 -78253 -83323 -56046
6818 -56046 -5177 -1154 5170 22963 -24451 -11214 -18612 10245 64216 97978 73870 50323
6806 50323 93025 144968 136505 157000 115287 78480 93549 79233 46748 23833 29483 37481
6794 37481 13493 8220 -6087 11253 25066 29751 -2755 7665 13104 5608 74798 98482 147939
6781 147939 145791 133068 139269 105004 116342 89557 37555 57794 95183 133902 81975 29021
6769 29021 29123 50807 6100 -35181 -58334 -46816 -17212 15245 -13161 -13706 -27638 12872 36467
6756 36467 70873 89675 106223 72739 60425 56102 20932 48649 98220 121145 92940 81058
6744 81058 88610 92392 84383 62749 98102 66593 49581 93654 65229 54969 42590 48110 48527
6731 48527 88060 103147 99406 114929 106310 129619 96417 62133 58226 53585 64614 53797 -11218
6718 -11218 5273 67997 83045 98112 68821 91987 127222 74254 84288 168200 203856 274947
6706 274947 332689 403935 536658 622740 701677 784245 824488 852469 818176 779035 730763
6695 730763 575629 509546 426272 362763 314833 247410 225541 204327 184978 156448 115662
6684 115662 130560 156318 121094 118889 105459 80121 59730 112754 148853 116462 126834 139308
6672 139308 122878 80310 75978 36333 -3309 -5061 9074 789 -46726 -45967 -33330 -66643 -105417
6659 -105417 -54106 -105542 -103413 -89134 -124282 -86280 -126901 -148724 -128247 -74069 -61576 -22348
6647 -22348 51583 57416 13139 -7359 -3826 12855 66504 87160 58640 -16796 -19865 9627
6635 9627 41064 23055 69073 55287 110319 90625 103183 92887 83597 52850 -13023 31335
6623 31335 54822 44613 86706 121990 84198 20358 40468 18899 -41565 -26527 -23634 -52034
6611 -52034 -31325 -59489 -83118 -49430 -46574 -99604 -115441 -76988 -129476 -138069 -138187 -85029 -58535
6598 -58535 -88068 -79997 -50621 39355 44282 27162 11041 23742 -19403 -63350 -67719 -111220
6586 -111220 -100712 -81923 -101278 -58438 -15816 -15031 4712 14925 472 2718 23915 -7794
6574 -7794 -27609 50666 78943 53169 134131 192130 252195 241604 193067 177305 184312 123424
6562 123424 142880 128005 100341 133801 152238 118229 141344 141391 150986 141752 166687 160615 126288
6549 126288 112142 176695 176350 156250 142667 194769 214068 153798 172434 143403 152960 176664
6537 176664 181155 160563 167227 140862 142526 197329 214125 203307 184208 283129 276659 259850
6525 259850 269832 309128 334035 377191 445700 510231 581284 657385 741464 917390 1023541
6514 1023541 1074703 1260477 1343840 1221986 973582 727701 566831 486029 401801 318613
6504 318613 288498 266237 232994 155580 171306 176374 180463 210556 171896 145718 160905 152714
6492 152714 100428 141038 136663 115079 71755 78997 122838 98903 100707 120199 92730 118966
6480 118966 135563 83685 89393 169380 183242 119634 86307 93934 58737 66003 31759 19535
6468 19535 17149 51148 69158 74904 42649 31761 90589 51132 44496 29520 21066 52643 49040
6455 49040 65969 47520 108100 133013 84253 91713 109123 80674 71479 74611 70500 49003 83667
6442 83667 -5432 -21796 -14762 21443 36558 33777 7687 115 -2472 44347 101139 78674 2521
6429 2521 -44255 -8729 51238 77167 119625 120217 124876 116308 111717 145856 155759 128107 56627
6416 56627 80279 49314 34703 63278 123889 171756 135445 161275 193202 160006 148371 122622
6404 122622 158390 116271 122174 178656 185497 206846 190302 219749 239040 275420 287274 211786
6392 211786 172146 147515 197988 207475 258450 332549 341321 350502 344911 352788 349904 282519 280334
6379 280334 253616 273889 298812 346659 348830 386047 406184 445754 486464 500231 513881 429226
6367 429226 428609 473847 472881 461302 463632 457327 489905 503789 550664 549170 521602 530791 476325
6354 476325 473589 468220 436101 426085 415561 438021 472715 517554 500342 480219 514719 502801
6342 502801 503768 484327 527449 499554 495738 523883 562792 557306 551547 562876 621260 653588 614465
6329 614465 574862 561793 529783 498794 529867 523689 500138 516137 553561 587675 581174 577640
6317 577640 520007 446926 438263 445487 440779 459624 483277 498230 499025 462211 493373 531702 546397
6304 546397 549840 560833 579152 606689 624885 625491 615421 671720 684583 674876 682343 745345 744123
6291 744123 754939 766770 738884 716792 674854 640954 617897 637570 631121 608921 573306 558280
6279 558280 529380 472704 480038 500365 453790 428018 431643 417772 412202 416482 449022 392159
6267 392159 404057 419794 417486 441366 453792 444277 448380 497319 553650 466031 460277 480697
6255 480697 557821 546832 511811 543637 548908 548373 569447 605907 634067 624525 630721 649611 722119
6242 722119 743221 711735 721659 751411 788366 820847 868291 835593 888459 902284 906467 966792
6230 966792 1039755 990887 906079 868643 845013 916772 891396 835051 843705 833333 858303 820768
6218 820768 825778 786164 788623 846324 882114 860113 856904 887561 882435 854966 878846 889834
6206 889834 847841 869847 937434 966189 1057322 1036192 1004449 1071155 1117370 1184034 1240570 1277164
6194 1277164 1329595 1336249 1323666 1358188 1392885 1431940 1441231 1459526 1476821 1464997 1513259 1550161
6182 1550161 1589099 1619613 1624536 1659982 1687358 1770580 1839898 1883018 1870762 1897835 1921278 2004619
6170 2004619 2114309 2122075 2144019 2162570 2205012 2211082 2230824 2295584 2308482 2336859 2371698 2436548
6158 2436548 2529806 2571589 2632203 2673462 2687850 2749985 2834593 2884519 2892221 2973437 3105543
6147 3105543 3160148 3219458 3261208 3314627 3390983 3474044 3526597 3577917 3677880 3750594 3833595
6136 3833595 3862839 3921993 4032408 4099483 4198715 4292446 4354992 4403809 4454278 4531928 4625583
6125 4625583 4694036 4760553 4859134 4938937 5008684 5061922 5111365 5159153 5210618 5224098 5258551
6114 5258551 5250178 5292478 5347493 5368990 5438199 5495607 5524777 5631673 5659293 5765356 5833542
6103 5833542 5824777 5851289 5926725 6045143 6073928 6149159 6175547 6246343 6287430 6405947 6529695
6092 6529695 6648554 6779383 6907972 7034754 7169551 7311581 7454818 7617691 7783088 8018239
6082 8018239 8227115 8431055 8747468 9056588 9443044 9865712 10279296 10719669 11269786 11855530
6072 11855530 12499674 13303649 14253223 15324552 16595059 18117724 19950437 22091098 24527466
6063 24527466 27309894 30358244 33612770 36691954 39359548 42159892 45659700 48520617
6055 48520617 48985987 46849693 43792215 41396410 40261181 40298254 41237077 42384956 43352175
6046 43352175 44483902 46197061 47241818 45788441 41598679 36203123 31211693 27281860
6038 27281860 24444428 22298074 20662455 19411530 18421176 17675562 17126362 16655191 16329003
6029 16329003 16045149 15909681 15864366 15951492 16106246 16311495 16645175 17070746 17587460 18287957
6019 18287957 19131731 20154357 21449340 23089097 25054560 27403987 30223495 33492627
6011 33492627 37189579 41273443 45404757 49114611 52499020 56561796 60841648 63041436
6003 63041436 61658019 57792683 53844649 51218385 50249707 50754349 52026179 53182357
5995 53182357 54229457 56028645 58074845 57886038 53847078 47020121 39715667 33453607
5987 33453607 28643828 25025242 22320481 20158877 18389429 16985717 15740094 14687108
5979 14687108 13822841 13032791 12288414 11687690 11155724 10686334 10239619 9841201 9446322
5970 9446322 9132180 8824296 8495677 8201614 7824006 7554771 7244336 7000517 6720838 6481895
5960 6481895 6320836 6121074 5952642 5748623 5580273 5451837 5333264 5156922 5060404 4955571
5950 4955571 4818771 4716707 4563132 4370116 4258806 4199722 4130729 4092598 4042543 4008527
5940 4008527 3959541 3981395 3911709 3870666 3889326 3885951 3845733 3817278 3777667 3737858 3671249 3574134
5928 3574134 3505952 3449120 3409023 3379035 3338588 3348722 3377045 3345003 3357366 3368400 3348945
5917 3348945 3271424 3218632 3254906 3308353 3297508 3253611 3236304 3313191 3371147 3376218 3394801 3444583
5905 3444583 3501758 3495791 3516330 3547273 3640006 3638133 3654319 3671301 3620272 3609299 3576505 3548650
5893 3548650 3578926 3637871 3701658 3885371 4037720 4182858 4211899 4184746 4142033 4047040 4001656
5882 4001656 4017848 4078676 4184949 4294742 4305629 4275805 4239357 4252789 4244219 4218736 4069621
5871 4069621 3933460 3855482 3827424 3845394 3841100 3838320 3755518 3625317 3405750 3204953 3095241
5860 3095241 2973301 2894644 2843437 2817787 2823573 2797448 2722931 2753144 2750909 2704490 2729917 2830091
5848 2830091 2948621 3042221 3147940 3226341 3383140 3504166 3621584 3840805 4015036 4214639
5838 4214639 4399865 4541066 4582054 4578111 4503985 4464699 4569398 4703853 4906026 5033135
5828 5033135 5081051 5035290 4971172 4903853 4875146 4822721 4671471 4439332 4302674 4178930 4195479
5817 4195479 4252765 4278874 4255863 4097527 3919704 3734449 3621232 3469233 3359893 3320561
5807 3320561 3238257 3159972 3038020 2989777 2898790 2878369 2825760 2775498 2768795 2814653 2792090
5796 2792090 2809488 2834021 2867684 2925968 2948455 2963370 2972375 3044576 3121864 3187180 3194754 3235623
5784 3235623 3304751 3378143 3446608 3509191 3580465 3660469 3680404 3748797 3836300 3878366 3902237
5773 3902237 3987862 4054187 4159409 4242059 4283238 4336908 4480216 4648899 4759661 4900727
5763 4900727 5075257 5207847 5326419 5479856 5614995 5739171 5824400 5920951 5941877 6007961
5753 6007961 6124062 6248845 6353061 6454817 6607512 6794247 7039329 7288838 7578943 7886140
5743 7886140 8223343 8589370 8969966 9365870 9849697 10313703 10908814 11515097 12220252 12949168
5733 12949168 13755209 14702255 15847877 17302333 19114004 21192502 23641923 26543443
5725 26543443 29797519 33133450 36027025 37792879 39075956 40981333 44027364 47598080
5717 47598080 49059354 47030474 42832783 38062781 33474290 29723937 26854226 24872806
5709 24872806 23592908 22833295 22437011 22309622 22581954 23174025 24169037 25617119 27451701
5700 27451701 29742723 32495915 35627832 38873567 41544995 43076915 44167502 46041757
5692 46041757 49165051 52507867 53389109 50648368 45868554 40509288 35377359 31147306
5684 31147306 27997368 25771632 24306764 23323705 22701830 22573168 22817708 23469680 24455914
5675 24455914 25808357 27534005 29489017 31427534 32736875 33327260 34040559 35458621
5667 35458621 37713826 39587640 39228352 36581835 32936221 29138817 25742431 23104257
5659 23104257 21111547 19746670 18879768 18272199 17939557 17852287 18020021 18496592 19203979
5650 19203979 20273877 21723602 23501990 25620629 27957132 30063154 31441773 32133510
5642 32133510 33028921 34735548 37323741 39182462 38300214 34937321 30680656 26282506
5634 26282506 22418508 19279287 16820660 14987509 13571002 12467449 11505035 10648043
5626 10648043 9940644 9303450 8782078 8296427 7859324 7498733 7109647 6776461 6508669
5617 6508669 6245393 5971697 5745901 5544251 5335451 5139585 4933197 4760384 4612986 4389611
5607 4389611 4255938 4201245 4148276 4072918 4026266 3923959 3857111 3823365 3735213 3657184 3584075
5596 3584075 3509696 3492260 3411788 3421499 3448811 3487613 3574787 3644704 3746168 3799131 3933545
5585 3933545 4060417 4199000 4323852 4449723 4603204 4769113 4863983 4877510 4746619 4590904
5575 4590904 4396560 4044444 3787903 3561525 3387607 3236546 3120044 3030815 2964424 2938132
5565 2938132 2874421 2844903 2856167 2867760 2874126 2978570 3120360 3270037 3398888 3562387 3705443
5554 3705443 3884559 4060280 4228886 4513059 4629547 4652790 4552987 4371743 4154380 3900554
5544 3900554 3618301 3364978 3177306 3051550 3009775 2974545 2983250 3009643 3085344 3175784 3288124
5533 3288124 3408342 3485250 3598478 3692552 3839374 3822611 3784552 3702959 3550922 3380870
5523 3380870 3200520 3075882 2925126 2814673 2750590 2649826 2541207 2552794 2527103 2477630
5513 2477630 2408266 2417934 2423312 2447802 2493144 2588984 2628025 2742142 2852849 2889357 2977185
5502 2977185 3116660 3219521 3288751 3330911 3302402 3285490 3128134 2899395 2672480 2478637
5492 2478637 2307058 2202686 2091467 2025143 1982896 1913842 1884367 1838981 1801154 1740960 1687229
5481 1687229 1712303 1704778 1616789 1567529 1625700 1602648 1550291 1554186 1514468 1498293 1477126 1464563
5469 1464563 1488026 1480418 1488170 1441680 1492086 1494907 1520210 1545294 1627088 1602687 1605494 1637490
5457 1637490 1653145 1674523 1645643 1650381 1653243 1650425 1638907 1645586 1674071 1667928 1650879 1690687
5445 1690687 1675977 1629124 1666778 1724003 1702583 1689049 1680895 1715933 1712983 1794895 1719920 1735417
5433 1735417 1798038 1796889 1782401 1767300 1741535 1771607 1798967 1807047 1868705 1950336 2006748 2014457
5421 2014457 2067697 2116446 2129810 2128094 2174057 2213122 2260869 2314981 2365418 2437979 2445318 2397992
5409 2397992 2424717 2406200 2364366 2326135 2337104 2398684 2395258 2417539 2465993 2448370 2442149 2459665
5397 2459665 2511652 2548168 2555182 2563587 2551504 2546038 2552817 2527291 2522769 2513313 2511792 2523705 2500871
5384 2500871 2462221 2477440 2433583 2402380 2401846 2400610 2395199 2422178 2472378 2491000 2512704 2533527
5372 2533527 2588532 2639915 2644502 2601544 2619976 2559138 2584859 2626083 2551872 2517837 2540824 2427245
5360 2427245 2410919 2450797 2449118 2447559 2446979 2421092 2437808 2436393 2406803 2453694 2475589 2524643
5348 2524643 2567845 2566694 2623883 2630337 2652268 2661588 2691562 2753902 2787998 2787770 2785540 2776231 2731108
5335 2731108 2781531 2819915 2880570 2914315 2988427 3125170 3272037 3372556 3474211 3690799
5325 3690799 4025430 4409357 4817114 5318679 5857059 6304774 6597855 6754342 6955816 7344489
5315 7344489 7830918 8373233 8487904 8091942 7491414 6818610 6227844 5576290 5054514 4723096
5305 4723096 4481872 4417834 4401204 4388852 4497676 4631874 4737285 4861376 4959045 5040149
5295 5040149 5237538 5458637 5714588 5774309 5648027 5496299 5387538 5295751 5164191 4972679
5285 4972679 4692866 4440144 4205223 3940061 3659576 3406424 3227898 3076470 2874567 2766073
5275 2766073 2747179 2702077 2684411 2636978 2627148 2656516 2668712 2624447 2603431 2595968 2624432 2683974
5263 2683974 2657760 2691498 2732332 2750502 2721595 2745413 2857103 2950514 2999955 3040284 3142238
5252 3142238 3248812 3325252 3388063 3391918 3402771 3390718 3358911 3369549 3404450 3458032 3417242
5241 3417242 3353201 3266534 3173243 3093510 2996461 2918580 2912992 2910525 2936745 2982728 3047932 3122215
5229 3122215 3162014 3272534 3429366 3554013 3650507 3765535 3868470 3952999 4079018 4173102
5219 4173102 4267509 4367772 4277855 4219449 4240122 4167669 4138054 4059534 4030543 4015191 3955149
5208 3955149 3991054 4076878 4101660 4165506 4240294 4349613 4465547 4554327 4656867 4765780 4862089
5197 4862089 4924609 5051141 5128000 5166720 5262909 5260198 5292175 5312984 5345438 5426159 5469002
5186 5469002 5454851 5481737 5540529 5558046 5646466 5708151 5825149 6017256 6158210 6289905 6454350
5175 6454350 6545251 6694562 6833295 7020295 7163676 7291556 7453614 7614919 7687715 7756413
5165 7756413 7902487 8018119 8097161 8166904 8230286 8327561 8467205 8644135 8846658 9010667
5155 9010667 9202482 9460477 9732383 10052418 10409159 10743826 11153029 11604534 12086985 12685202
5145 12685202 13377668 14029993 14786807 15734869 16766161 17857710 18968679 19960476 20847122
5136 20847122 21943282 23428120 25069870 26024350 26393320 26650838 27171567 28146655 29494628
5127 29494628 31185594 32673532 34019186 36011065 38689222 41404107 42612907 42481687
5119 42481687 41751101 41119990 41309267 42583639 44403655 45537838 46076686 46840137 48084457
5110 48084457 49617397 50865384 52062405 52665716 52357404 52289645 53031988 54236934 54036072
5101 54036072 52872097 51618095 50330632 49639027 50053322 51640539 53165384 53252170 52527740
5092 52527740 51576469 50700170 49654951 48718127 47986459 46409424 44601804 43328574 42847544
5083 42847544 42804124 42494497 41878156 40737543 39685130 39423808 40044897 40567837 39384322
5074 39384322 37036797 34543207 32441842 31049450 30261855 29961390 29789930 29800439 30201068
5065 30201068 31022698 31869839 32133569 32097542 31999642 31838069 31703603 31461581 31214212 31163526
5055 31163526 31540114 32248488 33015687 33209477 32267482 30464213 28384832 26328032 24492217
5046 24492217 23024811 21971060 21348661 21098973 21130155 21360261 21686693 22070172 22549964
5037 22549964 22991697 23227835 23272949 23331567 23560743 23932770 24290579 24608751 24679421 24323805
5027 24323805 23568411 22484886 21394423 20336245 19198332 17976526 16892576 16042813
5019 16042813 15421821 15004531 14746497 14394887 13926709 13550321 13283378 12945808 12664674
5010 12664674 12443097 12317705 12148298 12133293 12149269 12155757 12213975 12387846 12755170 13104333
5000 13104333 13251064 13018917 12605060 12208424 11928954 11770594 11639696 11340276 10938742
4991 10938742 10475878 10095138 9711654 9457463 9229354 9102071 9058301 8931790 8725618 8497381
4981 8497381 8346182 8280165 8266489 8282665 8393269 8500180 8586739 8652871 8578022 8509493 8491158
4970 8491158 8405118 8213440 8052323 7803599 7588993 7394886 7221635 7076600 7027243 7091083
4960 7091083 7246515 7235681 7151379 6958215 6810554 6676744 6569436 6433337 6269174 6108350
4950 6108350 6014745 6000867 5935841 5929220 5898236 5905718 5949160 6061434 6130961 6174535 6063036
4939 6063036 5991650 5912026 5812879 5704261 5674986 5666964 5670704 5631629 5608841 5675231 5715887 5739186
4927 5739186 5707116 5712277 5735646 5694694 5624885 5555528 5514092 5462007 5455923 5461750 5478588 5447216
4915 5447216 5447464 5436965 5482454 5553386 5641031 5791900 5940448 6064546 6259817 6445091 6495064
4904 6495064 6525100 6482060 6338859 6026453 5542243 5048377 4752921 4533716 4297383 4109976
4894 4109976 3947770 3736240 3553907 3476371 3420236 3363856 3337004 3281081 3273889 3227700 3184670
4883 3184670 3140690 3067783 3038157 3059902 3076401 3070889 3103357 3177456 3171048 3227884 3321972 3427022
4871 3427022 3551607 3631400 3717558 3883731 4104353 4266193 4456278 4685655 4753725 4538097
4861 4538097 4193688 3893042 3661385 3535012 3468934 3484169 3536879 3653718 3819694 3972957
4851 3972957 4135123 4255213 4360536 4254366 3938371 3490652 3147222 2982208 2837495 2677487
4841 2677487 2619877 2552944 2430072 2336836 2270111 2256579 2198678 2158581 2162247 2127013 2116353
4830 2116353 2075260 2026839 2045021 2015891 1990164 2004503 2014695 1981630 1998909 2076028 2072493 2075246
4818 2075246 2147026 2215955 2272445 2389654 2469513 2563627 2694838 2795316 2871585 2916363 2920704
4807 2920704 2868650 2823505 2738091 2687097 2648813 2619440 2554384 2581583 2614674 2630710 2675240
4796 2675240 2725984 2716386 2759414 2831754 2920754 3051900 3138684 3291504 3437856 3620044 3781193
4785 3781193 3930718 4104858 4366772 4701855 4938601 4963854 4913848 4931216 5006433 5073172
4775 5073172 5134690 5117522 5116593 5145465 5185044 5324088 5482611 5641391 5884332 6148381 6481960
4764 6481960 6634237 6734263 6877749 7126917 7421203 7617133 7548721 7429552 7268393 7275686
4754 7275686 7277627 7295659 7367199 7351348 7332151 7318879 7378154 7457747 7619506 7801911 7989543
4743 7989543 8119461 8180234 8158969 8241862 8382920 8444680 8421851 8437157 8437434 8488349 8604820
4732 8604820 8808211 8993817 9186986 9452956 9717969 10049549 10371349 10749422 11204134 11670670
4722 11670670 12236329 12907623 13614585 14443204 15450313 16603520 18019037 19741231 21717269
4713 21717269 24068964 26858017 29847765 33263219 36382946 38272874 39708220 42098520
4705 42098520 45804172 49795469 50415825 47728206 44049755 40390826 37727774 36172124
4697 36172124 35788887 36454727 38101935 40604092 44003118 48107070 52932025 57968248
4689 57968248 62349442 66819735 71682084 76213469 80115117 82030549 82610763 82467453
4681 82467453 78149889 70334945 62044841 54361075 48243252 43946292 41197474 39783628
4673 39783628 39420082 39838384 41086913 42859185 45184931 47272373 48035912 48385414 49887842
4664 49887842 52859317 55972767 54766547 49686704 43541853 37318999 32115844 28051644
4656 28051644 25052763 22729776 20875859 19400645 18191938 17145898 16290743 15525281
4648 15525281 14827713 14260207 13798732 13413925 13181786 12992252 12798752 12641747 12603250 12631758
4638 12631758 12643415 12694965 12748611 12629754 12415832 12034327 11608424 11201278 10870004 10600240
4628 10600240 10505978 10372046 10293576 10311879 10364276 10557256 10689797 10868788 11094449 11367098
4618 11367098 11636966 11743010 11805385 11868133 11835416 11851949 11820744 11654872 11466861 11277116
4608 11277116 11175561 11152768 11161747 11297815 11563278 11897118 12013042 12006311 11991327 12102284
4598 12102284 12324365 12561496 12934798 13227546 13445874 13585983 13744714 13996363 14418703
4589 14418703 15016192 15645830 16278725 16934200 17464105 17787936 17844284 17745654 17571450 17146507
4579 17146507 16538471 15904579 15431318 15209038 15249773 15414458 15667257 16049263 16544057 17198384
4569 17198384 17942701 18773116 19719732 20760638 21761823 22803517 23872365 24966513 25914702
4560 25914702 26671515 27489315 28592026 29966192 31710614 33844426 36424147 39415911
4552 39415911 42817562 46584135 50295640 53276469 55811889 59233525 63971273 68400389
4544 68400389 69947825 68405859 65546369 63049374 61784658 61993710 62976412 63960204 65167073
4535 65167073 67722169 71561760 74917087 75350860 72913551 69271286 65822710 63148929
4527 63148929 60979793 59445858 59386399 60794782 62356537 61895884 59208710 55641479 52385499
4518 52385499 50146570 49029945 48528476 47878535 47318812 47677679 48882929 49566685 47848999
4509 47848999 43727961 38579523 33540399 29261077 25894992 23269368 21232800 19665004
4501 19665004 18320766 17253400 16305637 15470497 14676501 14057133 13494828 13004788 12529985
4492 12529985 12104905 11762769 11475070 11147666 10832375 10559881 10235531 9876750 9616934
4483 9616934 9309169 9019843 8822875 8559733 8341073 8172145 7953174 7796998 7679106 7600635
4473 7600635 7528408 7470343 7470701 7465619 7510968 7531684 7588838 7620670 7705304 7760915 7871973 7991828
4461 7991828 8128202 8286525 8395472 8560447 8733737 8978432 9191712 9195503 9079292 9003723
4451 9003723 9015719 9162614 9246332 9432327 9824392 10278132 10508131 10420852 10175915 9827357
4441 9827357 9354031 8933210 8681854 8527358 8503952 8614525 8821623 9117747 9335867 9521517
4431 9521517 9606184 9704571 9748905 9581919 9340762 9172843 9033328 8963125 8856792 8617273
4421 8617273 8366124 8271472 8276006 8298282 8320668 8222652 8072196 7916003 7798599 7844583 7919299
4410 7919299 8081518 8300464 8537896 8757397 8951243 9044684 9115348 9031157 8769253 8474124
4400 8474124 8266755 8141512 8166868 8275856 8489344 8635170 8674801 8651128 8527298 8243116
4390 8243116 7852735 7381729 6995440 6701627 6559795 6506458 6397379 6378987 6405489 6371821
4380 6371821 6185999 5897908 5607881 5374386 5255175 5154903 5044596 5032836 5002056 4970702
4370 4970702 5023941 4985436 4784216 4466063 4091130 3844999 3628646 3436498 3291825 3257276
4360 3257276 3213309 3113161 3040610 2994255 2944376 2888648 2869244 2842454 2818551 2790259 2818622
4349 2818622 2861661 2814855 2827447 2745857 2702916 2611216 2592120 2559406 2538240 2521308 2532496
4338 2532496 2518404 2569669 2596922 2566530 2557037 2578587 2597685 2565044 2635955 2690674 2827502
4327 2827502 2927738 2956524 3033541 3151276 3242905 3275478 3348557 3359507 3425111 3447298 3511712
4316 3511712 3569003 3644933 3656858 3757251 3798856 3849394 3873320 3838338 3802428 3845694 3887220
4305 3887220 3975949 4000744 4094685 4202249 4321702 4314726 4348966 4319615 4305670 4265013 4225915
4294 4225915 4204946 4227611 4232291 4292062 4413438 4572979 4632676 4661066 4703365 4742197 4831189
4283 4831189 4910154 4971325 5064909 5138452 5220571 5348761 5405634 5398715 5354118 5350655 5359942 5392968
4271 5392968 5391156 5435602 5515201 5582190 5632650 5793370 5914076 6054998 6171805 6277812 6450983
4260 6450983 6652590 6820663 6971141 7078151 7226599 7351183 7419407 7493727 7642393 7761814
4250 7761814 7941045 8123318 8298203 8468710 8662005 8799167 8963838 9134877 9336621 9555420
4240 9555420 9812028 10093710 10392911 10710630 11109848 11480694 11888412 12304197 12824038 13304018
4230 13304018 13722589 14189984 14610042 14980118 15375215 15786553 16282102 16625834 17012924
4221 17012924 17276180 17493542 17686224 17923128 18109362 18378060 18583205 18894028 19088075
4212 19088075 19336145 19626493 20032565 20411000 20879372 21360303 21987714 22609816 23259560
4203 23259560 23834962 24504887 25031227 25598197 26157139 26780138 27360206 28109259 28903742
4194 28903742 29789921 30730006 31853477 33042123 34318009 35527557 36871484 38271376
4186 38271376 39802755 41433136 43245085 45034372 47005806 49143334 51679621 54563027
4178 54563027 57946128 61702726 65941359 70618900 75863250 81835240 88838236 96736883
4170 96736883 106116836 117214441 130673444 146773614 166090451 188757431 215621739
4163 215621739 246054597 280333336 318977785 363814338 412645929 462148756 508277260
4156 508277260 531512567 521783069 470294652 394842024 319785273 259718380 216613806
4149 216613806 185216567 161802997 143553428 129046241 117002076 107090845 98752655
4142 98752655 91889594 85864906 80445433 75401546 70654345 65895823 61606293 57706575
4134 57706575 54341494 51296531 48610239 46099525 43848519 41694445 39807043 38039141
4126 38039141 36506347 35075265 33881797 32662813 31531729 30348193 29052958 27724452
4118 27724452 26553741 25314394 24269063 23211392 22296729 21402334 20640676 19923965 19311480
4109 19311480 18665756 18160638 17715998 17296118 16812738 16421901 15953680 15564722 15115258
4100 15115258 14640464 14132088 13631249 13125235 12744980 12316705 11957990 11477348 11030254
4091 11030254 10668562 10372057 10071857 9865301 9704609 9533265 9319651 9124166 8920147
4082 8920147 8759797 8613517 8423887 8147195 7913968 7655637 7497570 7262881 7102578 6966856
4072 6966856 6850003 6751036 6685085 6581242 6481753 6301167 6083765 5901095 5737591 5606279
4062 5606279 5467690 5347029 5196480 5034371 4902010 4720803 4549832 4400470 4219151 4045856
4052 4045856 3956493 3881723 3847949 3790303 3792146 3773890 3768165 3816495 3845445 3821439 3798145 3840474
4040 3840474 3875624 3850684 3788789 3733797 3678112 3652823 3562027 3402284 3283464 3207466 3108009
4029 3108009 2999016 2944760 2898974 2894968 2842993 2858671 2833695 2750276 2712995 2699752 2675127
4018 2675127 2629747 2571426 2529546 2457079 2414999 2454580 2470902 2473592 2446494 2517888 2527421 2530969
4006 2530969 2471952 2416793 2351675 2296647 2189769 2148233 2141909 2068751 1934532 1870172 1805852
3995 1805852 1793551 1790303 1795479 1750692 1707213 1693271 1693026 1678566 1584126 1479539 1466568 1490906
3983 1490906 1467834 1456229 1456890 1486639 1492500 1427760 1367406 1262846 1258056 1267963 1141535 1097182
3971 1097182 1097466 1041154 1100738 1134230 1089749 1020691 979442 902511 888062 828197 796987 795791
3959 795791 858951 886621 866396 906481 953546 981409 1046535 1114494 1130159 1160851 1204634 1248954
3947 1248954 1269755 1243898 1230668 1163274 1163160 1142506 1140238 1143105 1182643 1146890 1145655 1139912 1123501
3934 1123501 1124563 1060083 980622 981531 990509 929757 899004 905952 864813 817036 784283 797450
3922 797450 755249 776437 727918 699058 706687 594907 603475 623514 640764 654808 631651 664263
3910 664263 630126 584605 516983 434160 382323 386656 404747 390755 419492 396024 456955 475102
3898 475102 478435 483987 484172 489132 466763 485986 534488 565669 573228 558902 618809 652129 624252
3885 624252 618389 624657 632136 650032 684293 726495 767500 839873 946687 1006298 1211636 1406935
3873 1406935 1591560 1783287 1983258 2208874 2496031 2755673 3026698 3247976 3312375 3177596
3863 3177596 2747080 2333948 2026324 1808381 1621109 1466694 1306210 1251697 1161931 1112332
3853 1112332 976413 942446 888196 797012 775675 739401 711195 663214 644100 663377 646144
3842 646144 652264 644812 643155 679715 673237 639498 633586 583667 570296 542784 560770 542217 576457
3829 576457 550123 496992 451257 427032 290208 262380 228667 199341 206572 270076 295673 338157
3817 338157 385522 391554 391220 421653 423860 402444 361680 370398 384208 390193 418524 448301 445054
3804 445054 425853 417371 436028 368158 268344 251028 282529 248472 215819 234097 242329 260332
3792 260332 264032 334898 252903 202295 162257 91766 76895 68910 86575 148633 140504 88908
3780 88908 66788 58288 75267 25059 -27697 -50995 -46248 -32764 -38117 -19695 22897 132558
3768 132558 169034 266241 259209 323103 400711 444683 451816 447002 524307 530499 511990 570275
3756 570275 558915 477788 486290 516191 434390 433244 447308 449367 380136 359610 376551 372344
3744 372344 369403 372307 375817 407959 434235 464001 479224 457309 445964 472993 440946 500313
3732 500313 581890 582585 580257 615603 557455 566705 527307 505390 457036 382796 353155 298739
3720 298739 272707 251544 179007 170308 131442 144006 91864 47892 -4733 -17211 -24251 18958
3708 18958 -7466 -13679 34975 68588 120304 200144 219445 214860 290585 320833 319134 326039 370849
3695 370849 452687 531150 542412 528135 509682 480975 475623 464001 471267 453915 412374 441231
3683 441231 446155 450330 441425 438302 452558 522570 481460 402405 378953 404149 376341 413031
3671 413031 402476 389592 411302 357569 351199 384426 410881 384799 317148 326375 256547 224985
3659 224985 202259 146755 90759 86556 91841 98217 117492 124159 149373 188340 166657 172895 155328
3646 155328 222448 249667 245138 236413 256628 207469 217093 188926 181349 215263 217256 176983 183786
3633 183786 168604 180605 173545 143962 146998 180845 183282 210989 186257 240326 298559 262689
3621 262689 318898 393908 387712 349710 270979 301171 278246 261770 284141 308543 316551 265479
3609 265479 261735 227410 175720 104954 62719 -13894 -35261 -57914 -64950 -15548 -57252 -34626
3597 -34626 44440 26978 -33582 -44106 -35886 1029 -5892 -1125 51443 53722 97989 130089 138357
3584 138357 166698 116886 99148 125628 88169 125839 124093 142617 142259 188294 133692 153828
3572 153828 176211 215194 219813 206412 228935 269336 265507 280546 287056 319674 293456 241798
3560 241798 254545 322307 370170 305356 263637 257762 267326 257012 210284 215197 205241 177409
3548 177409 191475 203844 260335 319328 290190 309623 322605 279640 291931 281314 227237 211887
3536 211887 205937 194073 144181 133114 145807 159905 143880 139901 143189 107725 101738 90898
3524 90898 61734 26281 7055 45847 121690 127619 172885 217562 218417 264967 257992 243843 268998
3511 268998 278004 278763 279108 246112 262710 285894 306322 295653 272534 283866 269884 289948 340660
3498 340660 357567 365986 316913 300688 319367 297979 316405 309460 339458 380910 380127 402599
3486 402599 372360 391328 372629 448056 474563 441185 441748 415250 392895 405063 411015 378940
3474 378940 367296 340280 347577 341616 301160 288338 340492 388713 322188 276218 323887 331389
3462 331389 343676 359317 365850 296113 309147 288593 299767 327293 319099 304444 282173 301610
3450 301610 284819 269178 223467 226696 225314 230675 316895 264688 280693 318250 369088 365486
3438 365486 325351 325242 329915 358230 338453 374500 391739 382777 395289 326060 339088 371498
3426 371498 385645 387857 374244 380867 403292 403925 424805 428758 457187 469074 530885 589748 572557
3413 572557 633689 640897 677148 745888 725945 657257 607389 586554 564681 602406 628722 613250
3401 613250 569394 553964 577313 577724 600927 640887 642257 673677 651752 663716 769783 829487
3389 829487 790714 762183 802674 840428 930031 950946 1043980 1119483 1160914 1240000 1308577 1305734
3377 1305734 1188947 1031747 976191 929196 865621 873165 872910 879684 869472 938842 937705 983294
3365 983294 932941 938062 955229 988044 1040037 1055300 1096273 1108094 1140360 1159084 1211909 1256025
3353 1256025 1248159 1238961 1239365 1264449 1282983 1322921 1373658 1349243 1356469 1280902 1244878 1205551
3341 1205551 1226946 1210035 1236248 1223702 1320915 1392854 1294783 1275392 1264648 1287869 1278770 1301945
3329 1301945 1300982 1301421 1403421 1468606 1486273 1471707 1505835 1577591 1606108 1663433 1786348 1873420
3317 1873420 1960625 2067706 2191082 2311967 2370268 2339807 2264240 2274225 2301993 2272583 2297785
3306 2297785 2352076 2452824 2548126 2564973 2526517 2522724 2518326 2511717 2489019 2503585 2578201 2670008
3294 2670008 2673117 2763095 2887445 2981879 3098986 3195736 3394588 3501443 3604755 3768764
3284 3768764 3870494 3922374 4084876 4160642 4165135 4096050 3951756 3913961 3954354 4020806 4012157
3273 4012157 4088671 4135168 4156235 4146565 4202363 4300838 4354452 4433692 4569613 4716403 4921530
3262 4921530 5095106 5380610 5712460 6037074 6350843 6637067 6969291 7317460 7651979 7930161
3252 7930161 8119246 8065681 7915765 7779128 7580288 7194885 6786334 6358504 6032377 5751190
3242 5751190 5557893 5357714 5191418 5053733 4894275 4677750 4480599 4286156 4121123 4007053
3232 4007053 3862498 3771530 3651981 3538994 3482906 3453605 3382016 3354099 3302698 3242885 3193278
3221 3193278 3131241 3132577 2998738 2827962 2724573 2617626 2482703 2418347 2382007 2343332 2336483
3210 2336483 2379856 2398842 2381833 2410015 2487485 2518915 2607980 2657781 2660840 2697058 2710641 2761608
3198 2761608 2711240 2608336 2485793 2351964 2214277 2089882 2045648 2011418 1954386 1922497
3188 1922497 1905831 1881225 1854651 1864087 1824100 1768308 1743130 1744452 1765277 1827487 1895059 1981883
3176 1981883 2076646 2166112 2263024 2351207 2481193 2603905 2757621 2833138 2842470 2919948 2879604
3165 2879604 2702109 2453518 2188381 1942603 1759550 1617794 1490277 1423234 1347409 1276349
3155 1276349 1255657 1278169 1232570 1240806 1204371 1201516 1220599 1209939 1210252 1171866 1224800 1224398 1234337
3142 1234337 1351330 1389845 1393905 1492479 1565517 1628364 1708593 1672746 1575688 1447509 1326691
3131 1326691 1198450 1076141 1057398 1005595 939923 951079 899542 918095 941873 932177 885016
3120 885016 826628 810349 798483 729623 779718 826214 747946 764414 776837 804118 786423 753576
3108 753576 679856 709962 676003 652766 633509 571524 534804 571931 592439 570755 588287 576004
3096 576004 501515 488586 473199 492533 440821 444020 409065 392036 438242 464772 460662 469019
3084 469019 515201 459365 453532 471293 446577 434823 440805 426736 418085 384302 371063 342742
3072 342742 319996 329577 353693 333784 319996 305444 280920 293858 296740 310427 301401 335331
3060 335331 336005 357420 351575 324732 366579 359330 345732 299124 312542 317627 282545 278815 339788
3047 339788 338110 318970 335631 340131 331975 298842 300344 339747 308598 301270 293353 307088 268898
3034 268898 215325 202529 257065 278298 300694 323811 300861 291043 318573 315239 319511 338416
3022 338416 359749 367652 347031 326681 307370 277226 298217 280974 274821 256328 210046 207080
3010 207080 220959 226623 221412 214666 184410 182747 174275 256207 272546 242532 277181 284902 314584
2997 314584 330765 335008 322828 319666 371940 389989 392647 419942 423951 372881 397298 384923
2985 384923 367185 357784 335548 371391 396454 434169 481330 553662 533184 539429 567229 583796
2973 583796 638802 624606 704944 718020 699451 739196 727410 701025 658125 642537 634629 627860
2961 627860 633480 568310 547310 568301 573287 559183 605826 639600 666274 682703 720785 746905
2949 746905 771812 810101 855388 908247 908233 954300 990095 1039665 1060599 1114268 1136403 1152298
2937 1152298 1172219 1153154 1171281 1178833 1161254 1135074 1117178 1076580 1079728 1074383 1121532 1104997
2925 1104997 1141338 1170265 1203871 1261405 1296183 1313079 1318295 1361592 1427290 1517639 1637619
2914 1637619 1715825 1803878 1862436 1940118 2019046 2048440 2131765 2151207 2176043 2111181 2092250
2903 2092250 2075769 1996587 1916261 1835209 1754197 1742180 1702264 1691577 1709044 1679949 1650747
2892 1650747 1628410 1631307 1628420 1662088 1646222 1611657 1615231 1616300 1599434 1660430 1614100 1615046 1636490
2879 1636490 1597007 1626979 1583224 1569586 1533174 1524152 1498542 1474173 1428104 1391808 1340689 1343545
2867 1343545 1381439 1354713 1328597 1302186 1289546 1324917 1308940 1233315 1166461 1133771 1114761
2856 1114761 1090530 1046219 976655 931442 873219 838180 804512 794311 729431 686826 659040
2845 659040 557677 514331 513939 501119 465028 435798 473465 500198 454053 480336 465180 456268
2833 456268 393202 396729 422293 450864 484438 474493 463949 452218 382921 341023 345887 288610
2821 288610 296566 300897 227615 144416 170428 199007 233570 165023 114286 148529 156467 170657
2809 170657 140403 151703 110736 151322 209500 207263 238207 255838 215464 262695 281218 254105
2797 254105 242564 243177 237963 239824 301904 232742 195666 222702 214308 178596 168916 134181 109261
2784 109261 40796 9373 24810 23523 -1258 24158 24076 81490 82494 93381 130076 143384 161095
2771 161095 125787 94077 88634 65117 63209 90616 106779 76571 80701 6598 -19059 -14137
2759 -14137 20538 208 18681 25916 -26768 9613 29304 71722 57745 66566 71704 78126 56578
2746 56578 36171 8574 -24967 -2035 3230 17700 16985 33912 66708 47462 -781 -31639
2734 -31639 -45453 -74668 -147592 -169587 -121076 -81233 -69050 -43472 -36511 -25283 34028 -3452
2722 -3452 31627 -19807 -85532 -74238 -63996 -47496 -40034 -22058 -19546 -52106 -42681 -72112 -108994
2709 -108994 -138562 -108102 -135569 -122977 -119610 -115683 -137048 -78573 -46385 -31755 -8702 16701
2697 16701 67139 33273 19755 61286 43211 34632 58102 15006 43237 43018 58143 25801
2685 25801 1260 -51341 -48180 -46177 -46406 -62402 -95019 -139815 -126373 -114778 -94931 -96177 -109102
2672 -109102 -68550 -40758 -43161 -82716 -60650 -88194 -23620 -11336 -60350 -80976 -86750 -105602
2660 -105602 -103096 -138984 -126296 -117664 -120632 -118892 -181334 -155564 -189308 -177664 -195201 -217538
2648 -217538 -278752 -225533 -200027 -191785 -160436 -157878 -169135 -181320 -154198 -140945 -129848 -132252
2636 -132252 -146512 -220896 -181675 -170219 -179131 -201964 -232692 -217815 -239860 -209938 -150283 -168968
2624 -168968 -171282 -145145 -137834 -140600 -105396 -75913 -111796 -99246 -49885 599 80740 42563
2612 42563 38774 61699 13556 13907 -17550 -83011 -115392 -102956 -92537 -57033 -89260 -102989
2600 -102989 -126735 -113745 -81113 -73713 -99908 -127845 -150638 -148311 -96239 -37714 -16022 26263
2588 26263 -716 -43516 -33314 -21924 -59864 -57286 -48922 -94726 -133103 -171363 -125229 -124285 -84844
2575 -84844 -99621 -138165 -130366 -135515 -165909 -167411 -199851 -167182 -123770 -133957 -146835 -71052
2563 -71052 -38006 -31981 -92015 -74983 -80573 -41862 -2924 -7951 -83208 -128797 -121855 -185631 -227488
2550 -227488 -183267 -216084 -174398 -110894 -160452 -187624 -168662 -127534 -101909 -75563 -110261 -85526
2538 -85526 -53173 -35023 -3523 13759 15915 54809 57560 96486 68348 56376 23054 -21074
2526 -21074 -24667 -9056 12779 -35614 -110800 -97997 -63874 -75222 -82066 -99243 -134908 -145618
2514 -145618 -165795 -131614 -105757 -124803 -143316 -151739 -154877 -98362 -117922 -106258 -127452 -91040
2502 -91040 -70025 -98469 -91325 -34630 -122965 -137101 -100461 -44239 -16484 -45590 -46259 -2452
2490 -2452 40310 21388 -16635 2742 43648 2360 -17421 2980 -18837 -36861 -48185 -29552
2478 -29552 -28767 -39840 7180 -38333 -70171 -62829 -103823 -141768 -193337 -191693 -161905 -177873 -178456
2465 -178456 -164551 -151942 -153649 -115589 -133249 -169061 -221324 -168145 -224396 -199753 -151007 -128018
2453 -128018 -175402 -168705 -122224 -177745 -200870 -179655 -183329 -189862 -219002 -235856 -251095 -248231
2441 -248231 -232366 -248780 -236477 -248297 -205569 -205505 -262592 -283434 -292198 -274651 -261149 -228848
2429 -228848 -201936 -134748 -87088 -94304 -109992 -100293 -103614 -125677 -48440 -42163 1681 48600
2417 48600 49679 92508 101227 88423 109972 142232 106682 93485 38119 52808 91099 60587
2405 60587 54143 66479 17861 -42532 -66298 -108536 -128676 -128432 -175291 -171063 -173989 -182155 -118163
2392 -118163 -60463 -59220 -58158 -85268 -114997 -136367 -162524 -185561 -179904 -119696 -92978 -86586
2380 -86586 -48016 -92640 -95896 -108776 -108678 -108743 -124874 -126348 -88706 -115520 -157192 -144427 -144630 -136712
2366 -136712 -144072 -67160 -45161 -88891 -50274 -15363 -6379 23539 -25107 -57896 -64953 -10918
2354 -10918 -23434 3589 -17698 -9857 -48850 -5377 38762 22121 27348 28448 52397 42510 54823
2341 54823 -22266 -10381 -15010 -23245 -34290 7889 52468 86863 66219 50087 15988 -22438
2329 -22438 -3460 -4091 -46634 -59789 -68717 -46500 -84743 -32623 -15352 -62103 -28709 -66147
2317 -66147 -11982 -77877 -65112 -91379 -95496 -88337 -36322 -19405 -43160 -1609 21907 -3184
2305 -3184 25998 -20465 -10211 -69354 -14635 -71774 -91727 -71126 -70496 -112653 -113859 -57710 -44755
2292 -44755 -39172 -96448 -106616 -58823 -15262 -60034 -61686 -59557 -93835 -81853 -48282 -60154
2280 -60154 -20794 -6797 -16654 -59216 -44824 -7120 -10576 -31115 -24568 -30184 -43730 -87236 -37336
2267 -37336 -32875 -79855 -64525 -79765 -127423 -115943 -103263 -154949 -148211 -134464 -145522 -101450
2255 -101450 -89795 -79625 -125604 -27312 6435 19176 -5168 -45537 -29376 -3318 -84804 -74031
2243 -74031 8101 53250 9463 -183 -18816 -25956 -17646 -90173 -72859 -48209 -12276 -14101 8390
2230 8390 5638 10596 84657 117246 91278 139518 153931 149609 127653 130445 119605 98736 78296
2217 78296 116330 101463 94351 122569 139256 152525 150168 153133 71231 126265 130542 160539 147765
2204 147765 167513 243206 262191 163236 159539 209573 220985 226681 253443 254902 247671 245051 229539
2191 229539 209026 202945 238203 255487 174218 196506 250024 188741 243590 220151 212991 244753
2179 244753 304833 322882 335856 357748 396439 425124 427237 452425 462255 481485 510876 494148
2167 494148 521380 596377 652479 640929 602414 630317 678652 709197 658949 680280 773314 831480
2155 831480 844422 892452 909198 930039 964558 993915 1018803 1077491 1170480 1261481 1348961 1384320
2143 1384320 1411926 1466868 1525379 1571440 1600748 1708357 1784054 1849530 1903010 1980651 2050908
2132 2050908 2204936 2383061 2552032 2748945 2949720 3177092 3380718 3725486 4114179 4480783
2122 4480783 4833562 5291425 5808587 6508388 7376680 8388464 9648796 11224933 12798585
2113 12798585 14628803 16818847 19913212 23476319 26583991 25605887 21471733 17091517
2105 17091517 13179310 10495731 8654978 7356537 6322747 5628086 5075659 4625358 4318690
2096 4318690 4078153 3830388 3641172 3426363 3231657 2930239 2649130 2447590 2301967 2137037
2086 2137037 2004560 1853633 1803418 1747146 1654253 1543253 1510168 1476651 1431540 1359339 1321243
2075 1321243 1228382 1187760 1109498 1106265 1065839 1003166 940021 899218 857542 844402 820361 775736
2063 775736 706178 642737 585337 591843 555832 543282 502487 414265 417264 395810 448256 440540
2051 440540 408124 419512 389837 377212 323648 337430 324610 301950 354918 409635 410954 379270
2039 379270 404596 382539 374877 387510 376968 365452 321435 281020 257682 255128 243053 241933
2027 241933 271192 239152 196487 184601 187683 170118 140571 158368 101762 71764 89546 99022
2015 99022 78434 81002 94152 78022 107251 102042 61003 69766 55033 20322 12214 34766 90935
2002 90935 71008 78120 -4848 47 26472 80696 82495 72553 27652 -19489 7330 -9320 -1149
1989 -1149 49502 23862 56775 39892 32308 46271 22807 7973 -8927 44721 -18220 -247
1977 -247 38811 44701 39164 23407 -19012 710 72399 105393 60150 91998 79272 89126 96204
1964 96204 74113 106804 88742 102361 87926 124305 152080 118605 88674 91392 91473 93888 79455
1951 79455 38710 38051 50583 55229 14571 -11204 -38033 -57880 -34224 14702 -12231 14436
1939 14436 10860 -23424 -13556 -10049 75847 55290 31571 34375 20268 -3727 639 3410 -22001
1926 -22001 -22950 -17363 -19482 15063 10468 -42968 -72701 -64124 -41699 -53360 -75702 -92342 -101085
1913 -101085 -96758 -106531 -93571 -51888 -45695 -62615 -77144 -80851 -81433 -54147 -132907 -174937 -119495
1900 -119495 -95657 -87821 -176931 -164279 -130441 -115211 -138360 -91053 -75948 -126736 -150276 -131965
1888 -131965 -138961 -101815 -101643 -112039 -97980 -8946 -15093 -35534 1544 -23430 -62304 -86801
1876 -86801 -76186 -115082 -95048 -90571 -71330 -43853 -55923 -55504 -44843 -21266 3250 -12150
1864 -12150 21147 36529 56864 63597 20415 26130 1963 -2855 -4023 -30106 7593 -6353 -32904
1851 -32904 -34494 3036 -54209 -78282 -65389 -43226 -56425 -62480 -64989 -24315 -21559 -43902 -57212
1838 -57212 -34869 24472 -28671 -89445 -116731 -73049 -61298 -33490 -41349 -17080 1469 -37212
1826 -37212 -55902 -52277 -61079 -89071 -157240 -175493 -149191 -132775 -138676 -83155 -54288 -66886
1814 -66886 -86670 -53793 -60341 -125723 -87237 -109299 -86774 -94840 -61670 -12968 29686 -7503
1802 -7503 16446 17212 -1725 -19388 -11910 -57729 -83252 -89245 -79462 -80286 -79520 -72329 -52992 -20950
1788 -20950 5613 32952 10267 9903 46646 28014 43112 43257 14595 18898 27552 39729 5823
1775 5823 14630 31196 -31250 -55199 -37443 -68364 -27735 7610 -52053 -66059 -73126 -75910 -57172
1762 -57172 -30823 11341 1540 34828 -5948 -27506 8138 49867 9711 2782 56728 64761
1750 64761 61806 79889 79691 87316 71132 46426 -39034 -68962 -93243 -95760 -77490 -118294 -102407
1737 -102407 -58078 -68483 -39394 -90171 -76779 -71083 -93169 -119840 -150095 -118989 -94110 -84503
1725 -84503 -25237 -31100 -77232 -56839 -71240 -59307 -77577 -41253 -48772 -73111 -102381 -156227
1713 -156227 -116409 -87311 -129588 -109181 -37971 -32205 -66016 -38983 -30842 -64702 -58037 -24396
1701 -24396 2417 -31268 -16191 23880 32633 -13151 -36983 -25549 -10338 -28535 -63124 -113063
1689 -113063 -99753 -85503 -101396 -107941 -122067 -108716 -146583 -125535 -105996 -99548 -111659 -107633
1677 -107633 -68745 -23111 -5553 -33374 15383 12781 -51286 -18657 -10845 -16505 -49649 -43581
1665 -43581 21832 -22992 -49676 -74274 -146105 -176528 -160497 -143372 -130668 -142073 -149657 -121479
1653 -121479 -94590 -50922 -100612 -98985 -73622 -67142 -51721 -67293 -59346 -65618 -73590 -38192 -10292
1640 -10292 -25796 6987 12132 -21326 -30809 -83822 -97741 -118764 -127310 -88618 -12393 -42750
1628 -42750 -49122 -26074 -23990 4945 681 28195 -8076 38555 52737 26410 -49210 -57523 -45029
1615 -45029 -37896 -63582 -105827 -27832 -11882 -71215 -104222 -167346 -166064 -97457 -127311 -120257
1603 -120257 -101066 -77187 -83293 -73983 -51368 -1988 30374 18284 -4364 51151 48117 88091
1591 88091 63389 81065 84281 91233 85797 60842 74071 45070 19338 31878 72047 34330
1579 34330 -6396 -12974 -49166 -65188 -27803 -48109 -16406 -27377 -53126 -42107 -18246 13566
1567 13566 15690 26757 -24019 -30136 -14684 -39210 -37316 -23895 -78715 -101004 -55054 -53965 -125421
1554 -125421 -105067 -65488 -129299 -71204 -109269 -125747 -83295 -100521 -85571 -98702 -72201 -26311
1542 -26311 28889 -4128 -62622 -1573 15821 28196 -23384 1293 30292 63379 20817 -7949
1530 -7949 -8442 -6346 -38249 -76332 -69477 -28139 -31248 -28524 -26557 -71457 -77659 -91177 -42621 -33786
1516 -33786 -54187 -38548 -30456 -24225 -23763 -8161 -22108 -2424 -8103 -29458 -105643 -160020 -152217
1503 -152217 -142378 -108334 -82332 -41593 -44087 -98803 -87689 -82965 -129376 -157594 -123920 -113942
1491 -113942 -113961 -73223 -42414 -5407 -13798 7453 -11817 -37060 -53542 -73021 -79070 -75101 -97176
1478 -97176 -47241 -36708 -67090 -65794 -2121 -16833 -25922 -20954 -32481 -20755 -64243 -34897
1466 -34897 -16093 2514 307 -16536 3149 -12704 -49932 -28892 -20720 -53245 -43167 -33482
1454 -33482 -50705 -46835 -19434 -97670 -112615 -113212 -141757 -125761 -116617 -162292 -187813 -96107 -41100
1441 -41100 -55232 -94294 -72594 -111806 -106028 -88715 -119301 -109419 -52484 -51070 -60510 -33379 -53066
1428 -53066 -40508 -31124 -20133 -46359 -67551 -85386 -110174 -75450 -25090 -58730 -77351 -68278
1416 -68278 -55806 -27991 -19555 -14556 -34961 -30180 -32195 -3425 21478 14785 68017 10470 -29193
1403 -29193 -23256 3687 15094 11109 19808 10029 33850 32302 -3372 -44418 -61680 -89009 -65346
1390 -65346 -2225 19659 24752 36573 21783 2489 20975 -33732 -36630 -34439 -37683 -25065 53679
1377 53679 36297 -46577 -57155 -41404 -44731 -83286 -80442 -24745 -14237 -10681 -14426 -28215 -35979
1364 -35979 -997 -9641 -24933 -36379 -36642 -30347 -40878 -41977 -17760 6063 2693 34537 3427
1351 3427 -6198 -2884 -62134 -71450 -47154 -48971 -21021 -87792 -86088 -74846 -86914 -54330 -4308
1338 -4308 -78900 -111585 -74408 -24666 -39366 -37799 -22888 44878 49869 53124 48219 39794 -22604
1325 -22604 -48886 -49582 -105287 -43784 -46882 -77001 -107129 -112247 -85493 -111620 -92330 -84992 -86900
1312 -86900 -67474 -77332 -86901 -32402 -15522 -36468 -32822 19139 38407 44467 56962 25297 31318
1299 31318 10269 -36424 -81276 -82595 -115992 -101187 819 -8671 6260 -23373 -65907 -45996
1287 -45996 -68707 -31609 -43300 -71619 -68219 -91507 -102187 -94513 -85121 -92722 -62199 -25430 -38795
1274 -38795 -35335 -106164 -148099 -118948 -75970 -86710 -32840 11257 -16046 -34511 -26808 -42254
1262 -42254 4148 15203 -26776 35406 17632 -30393 -50076 -5560 17812 -31676 42409 43983
1250 43983 3215 15161 42003 36996 41852 -40477 -59486 -95609 -63069 -77572 -101021 -93508
1238 -93508 -54192 -4132 -37282 -29539 18979 50373 26 -48415 -107354 -117755 -88795 -40070
1226 -40070 -104787 -52768 -35155 -71921 -63416 -4479 7544 -48031 -45027 21887 -1852 -59834
1214 -59834 10328 27293 46929 6914 -49914 -45641 -64110 15390 51862 3437 30456 38803
1202 38803 45589 91221 43620 44041 34639 21494 51663 42005 -5542 -5217 61966 42793 25512
1189 25512 -18943 15582 73727 99775 77531 51208 70829 57913 93012 60331 82020 102027
1177 102027 74205 85751 58674 46906 48584 20807 27267 31321 44618 49487 20978 34338
1165 34338 -10052 -82847 -73101 -71838 -37376 -35738 -86638 -91549 -94658 -76897 -44119 -6294 4655
1152 4655 -15866 -45636 2036 137 -28749 -8578 -56290 -53680 -48651 -12426 -12917 -64529 -33649
1139 -33649 -52946 -74451 -30954 17016 -43504 -60091 -51033 -58181 -34812 -27587 -22365 -16775 -8268
1126 -8268 18532 50529 28105 21526 28502 61167 43559 13158 -26926 26970 22534 -60378 -29412
1113 -29412 -18514 -53827 -105070 -50051 -3697 -24873 -14356 -41738 -76825 -3192 11970 -68957
1101 -68957 -71147 -16289 -40236 -2299 9206 3982 12978 -27166 19911 39601 -16841 53314
1089 53314 54176 -15749 -24238 -70677 2065 35397 -43703 -79808 -59294 -5419 -14007 -42774 -10691
1076 -10691 -20581 -26829 -18595 -23307 -14896 13758 30097 11485 -6450 18833 15465 13428 32342
1063 32342 70975 4477 -9146 -37194 -37675 -43880 -29018 -35254 -26832 -18518 15265 28069 10558
1050 10558 -8452 31849 60598 4591 -1187 -1556 43409 66552 61462 45945 91722 46306 54781
1037 54781 38885 44855 43889 30097 -12472 -13032 -60492 -48633 -52015 -44886 -31959 -23701 -13495
1024 -13495 -40328 -55961 -52096 -18797 -29649 16887 19465 -44526 -6255 22379 34114 47942
1012 47942 52184 55506 26556 -11051 -24742 -7391 7657 25753 65151 29311 7390 54461
1000 54461 50026 64885 94643 103900 77055 -36191 -18318 52480 18695 52811 73046 63116
988 63116 61339 74390 58534 22846 32158 64833 69576 33527 26575 48247 30464 52890 58898
975 58898 88715 52916 51862 78823 64193 64041 90067 86474 84880 40589 42386 19720 23024
962 23024 5503 -20782 -33021 -55371 -92773 -108227 -99508 -80745 -81786 -109211 -93189 -48729
950 -48729 -70446 -100296 -89447 -114571 -76493 -42922 -8631 -12165 -46284 -380 -35779 -42985
938 -42985 -49239 -30618 3616 -12085 -50244 -94102 -12068 37964 -30042 -97969 -51519 456
926 456 2605 -41553 22116 30100 58532 23658 7485 8562 50471 52553 54373 45172 56445 99470
912 99470 76327 92653 71891 55490 39907 38288 45623 45749 60401 54028 27312 5055 -18446
899 -18446 -12419 9836 -29210 -18207 -4445 -38855 -45394 -13138 -15481 10159 -36026 -50321 -28643
886 -28643 -14768 36647 50563 9740 -20093 32544 32146 -7469 -38117 -36619 32684 -22073 -61811
873 -61811 -70979 -15009 7023 -75602 -71736 -35428 -37366 -53664 17766 65047 75757 72971 58331
860 58331 1209 5070 18091 13400 50508 106888 75287 53406 47602 49207 25494 6921 -3174
847 -3174 6338 22987 19585 -24233 -22421 -7416 39679 39575 23655 9567 -10523 -37385 30024
834 30024 25367 29024 10322 38209 134944 144871 137743 113839 68298 9460 5572 10357 -23933
821 -23933 -24428 -49737 -57827 8237 -26494 -12664 46819 9503 18095 28027 71936 112300 81446
808 81446 76343 86340 83954 109924 121088 135670 117558 133722 156232 127498 110292 106639 108846
795 108846 73994 70496 29550 713 27380 17731 41664 51291 22617 42056 27928 7333
783 7333 -2352 11579 16550 49059 33300 -9939 -46511 -45043 -78324 -28131 -51575 3648 15915
770 15915 -85392 -8727 28126 -19524 -48185 -32906 -6031 -40308 -69005 -75300 -49414 -30013
758 -30013 -32357 -56387 -82411 -137129 -69626 -27860 -62781 -36062 -38354 -57815 -16671 44701
746 44701 57453 47444 -5786 -57525 -102478 -90232 -25769 -44918 -31565 -55677 5430 -2347
734 -2347 -3798 21917 1942 828 15234 43628 103944 128465 67430 68515 109647 142018 106687
721 106687 77679 75553 77421 86154 106837 87026 32958 50519 66641 39313 38032 -19423 -44995
708 -44995 -23178 -14806 3470 7570 34882 37071 38532 68335 57891 43708 38132 80390 40857
695 40857 18747 -43161 52034 81030 47224 14564 24072 -1845 -37286 -31903 -20150 30303
683 30303 -14557 -62637 -24537 -52326 -4394 25298 31908 63202 50865 9778 -53817 -54130 -72810
670 -72810 -18328 -6323 -13787 14061 31026 -4586 -13198 -9448 -49752 6505 48783 75899 59415
657 59415 35152 50709 50530 67329 12217 -36377 8804 2780 4583 18448 -2875 37610 54645
644 54645 78440 99303 97894 102217 127449 123627 87265 73879 80944 87936 106591 93470 123930
631 123930 54140 23760 47873 37848 54346 51801 45678 53380 77639 60509 78478 75144 87585
618 87585 79858 59975 72931 79768 150208 135761 124646 129841 104021 74600 43465 54809 56748
605 56748 67381 79809 76575 72729 51582 41210 29651 36733 60803 56536 45889 55478 52013
592 52013 61015 81403 53901 75271 86336 84772 72448 7949 -33737 -8724 -15074 -69340 -7781
579 -7781 25655 24457 -48537 -31628 -30760 -34934 26032 -38440 -77851 -31350 -4826 -53860 -26088
566 -26088 12172 55038 33264 36667 63808 40028 28422 55185 24414 53130 111714 69163
554 69163 32517 55406 31848 29697 65382 54400 25805 30761 64380 122136 104480 56996
542 56996 81259 91748 96536 108615 61417 48337 66721 63123 88503 78585 107933 117750 114162
529 114162 85598 58580 68560 83150 80728 89808 107362 125106 142180 175720 202956 124493
517 124493 48918 27106 43866 62301 53584 18349 5083 23233 -20574 14411 50755 67068
505 67068 17683 16573 30450 51905 47811 -4703 -16358 -5887 -29901 -50499 -23103 3434
493 3434 10842 -17127 -30686 -58435 -54870 -11857 -32248 -33538 -14020 -26249 -38134 835 -38359
480 -38359 -69807 -38054 -30983 19358 69617 41748 20676 41616 70641 63513 33691 19055
468 19055 28667 15844 4527 42829 61127 77763 101656 126090 117469 139826 134753 156094 131122
455 131122 164847 190313 176520 150194 99443 132492 161034 127156 161773 148506 153246 156578
443 156578 171544 140885 164858 130317 119910 75820 83718 93773 80623 86474 78673 100200
431 100200 84356 87764 29924 35353 28458 57301 74084 112299 92416 113783 97400 20118
419 20118 17017 55837 28911 84106 80830 80239 71795 40715 46163 100034 102594 68470 33948
406 33948 2634 76076 63365 -5680 13002 16873 27378 9837 5392 5924 21157 12527 47505
393 47505 82476 55804 20740 -10949 39660 -6628 -35274 -20362 42726 -13603 35707 73933
381 73933 48875 58305 49339 75783 42562 41875 94206 54874 27369 74139 105567 135142 167512
368 167512 133484 82514 118808 100201 19766 25879 22042 37461 63303 62797 48125 22564 42607
355 42607 141658 122950 87097 99828 46334 17229 68583 113950 129949 106510 92630 76245
343 76245 65610 121851 110698 73053 12678 45343 40690 13939 -4074 18653 74046 54329
331 54329 4187 -32148 -24580 14057 -10345 13268 33115 -9361 12923 -30021 -37500 5637
319 5637 37217 -207 24474 66299 48201 85483 31631 3618 56167 20008 95 6081
307 6081 26252 34120 56002 77324 43688 33345 39096 36918 8468 -24662 -2700 8949 3814
294 3814 -33910 -14497 -1777 -16220 33415 17247 13643 29241 10446 2264 24619 53434 24755
281 24755 -42209 -40780 -9674 56997 69319 5317 41644 72655 82969 120099 110514 147746
269 147746 105985 82837 99022 104584 76690 64349 100484 81067 64627 94364 49767 71455
257 71455 99663 76779 80482 68229 31604 50923 26891 37305 111753 114161 95007 106770
245 106770 91048 88244 132723 151875 117623 85419 94159 112162 82047 76509 140730 164178
233 164178 122898 101910 141207 112238 61957 55468 44313 82835 46619 66436 89217 123774
221 123774 81333 68410 79756 44214 45866 46874 27783 1894 -36338 -30068 12661 -17093
209 -17093 14040 8679 65279 46093 9190 49612 41242 -1699 -9386 4868 21104 19191 70886
196 70886 80518 97709 83484 68684 89894 113461 85985 84090 51573 17718 -6680 10847
184 10847 27102 33182 32577 24725 25504 35858 56374 64003 22241 32809 34627 50724 74687 73340
170 73340 108565 124233 144480 149080 169613 195046 151294 150476 155339 135963 99075 79408 47057
157 47057 79531 74402 37870 53398 57358 44963 53190 77160 75917 62042 77155 68250 51375
144 51375 72895 61353 31926 63844 90496 91129 94413 40290 36813 60771 15117 12577 -10318
131 -10318 -35202 -17941 -37802 -33360 -27884 5333 2364 7560 26382 16845 -16948 5360 17321
118 17321 -6009 20593 59845 62272 76948 76007 90106 79957 136112 150595 93048 65669 55016
105 55016 58165 24183 7024 19974 -1097 36931 48226 82129 69240 83265 73466 115220
93 115220 110826 67768 53504 46774 38034 62979 111353 99735 98937 85603 84205 70364 80240
80 80240 73418 72720 91948 84273 75765 66497 67654 120097 116113 66432 77834 67119 44663 86878
66 86878 88841 54954 53928 92105 78338 71218 100522 127155 119554 93649 54716 77967 83721
53 83721 64358 93555 61615 80641 75189 51108 67345 74795 67304 79605 72089 61087 39887
40 39887 37937 51590 63000 92919 142111 158356 150409 143306 109326 126913 144232 106563 103590
27 103590 68123 67171 80758 89955 86690 83971 52165 69909 39447 13102 15598 13603 -4006
14 -4006 -6924 -2022 15204 75425 95091 86056 59441 80923 93424 84852 83812 64745 68113 89358
0 89358
$$ Imaginary data points
##PAGE= N=2
##DATA TABLE= (X++(I..I)), XYDATA
16383 -674406 -646811 -641693 -615981 -570426 -597739 -547505 -525580 -541405 -539100 -509616 -467981 -434381
16371 -434381 -425735 -399033 -362408 -382374 -384821 -372330 -356104 -359381 -342793 -346939 -338466 -287892
16359 -287892 -228165 -206919 -215535 -203964 -168314 -164286 -125663 -110800 -115683 -114257 -106819 -97383 -45273
16346 -45273 -56250 -25697 57108 55310 42533 88779 109608 125644 162334 115071 89472 135242
16334 135242 179857 178854 170867 198054 235775 271918 259656 252367 290135 315144 314501 368050
16322 368050 356043 374690 356331 382938 423232 430682 497279 524521 533425 537572 553809 519309
16310 519309 527584 547380 545420 578603 598445 603840 662900 678550 695383 710312 700967 750573
16298 750573 760774 783854 785080 805474 816018 812818 792519 836947 859846 881853 872874 892692
16286 892692 937113 929511 934759 973255 955397 938540 979877 1001156 1000628 1053864 1047411 1034081
16274 1034081 1043697 1107094 1127813 1140988 1114119 1102964 1145899 1133236 1095420 1151135 1156615 1186373
16262 1186373 1177797 1180121 1224404 1213069 1236058 1272441 1278719 1272065 1248048 1230961 1253839 1295577
16250 1295577 1311485 1296002 1304198 1306207 1376705 1360301 1361188 1365369 1391975 1405791 1379831 1445095
16238 1445095 1429648 1415324 1428582 1439827 1491042 1460856 1518512 1567141 1602055 1550122 1524326
16227 1524326 1556058 1544504 1552372 1540839 1529921 1564360 1586720 1584226 1595807 1626439 1678139 1698529
16215 1698529 1666555 1692642 1679360 1628709 1643026 1673681 1640434 1673527 1662702 1682818 1702495
16204 1702495 1744423 1748136 1744579 1690225 1718798 1720117 1736600 1759114 1740474 1715592 1761401 1775005
16192 1775005 1810855 1815729 1843456 1883212 1852601 1898895 1887816 1884750 1823317 1854598 1888131 1934337
16180 1934337 1963827 1904057 1872257 1880024 1874116 1887163 1882726 1869351 1880252 1893029 1935585 1890668
16168 1890668 1805983 1902649 1896972 1910126 1960288 1931588 1958064 1923583 1930131 1912368 1899472 1947692
16156 1947692 1946650 1907216 1932309 1943232 1960110 2038815 2018028 1968400 1952311 1975373 1969714 1968003
16144 1968003 1975628 2005369 2020970 1979106 1963828 1939412 2001360 2020215 2034048 2018248 2018118 2036233
16132 2036233 2065670 2063686 2029005 2055559 2034758 2027789 2021426 2056955 2049574 2027860 2020993 2046845
16120 2046845 2071231 2070563 2061065 2074960 2109357 2123108 2122541 2092289 2091831 2110543 2136583 2129143 2112844
16107 2112844 2095726 2093708 2103616 2136996 2121909 2073845 2097007 2047796 2064034 2055716 2066129 2089655
16095 2089655 2094221 2135953 2137734 2118426 2124342 2117363 2173950 2160335 2116692 2104205 2085706 2105232
16083 2105232 2089168 2061175 2124726 2113239 2118104 2117649 2097828 2044521 2067830 2052428 2078582 2073196
16071 2073196 2078314 2072488 2047362 1999387 2032803 2101294 2121460 2152632 2189528 2154579 2145447 2208324
16059 2208324 2168840 2116172 2085745 2086887 2090290 2110170 2139992 2161612 2112819 2117915 2146470 2120019
16047 2120019 2126793 2161961 2142128 2153832 2180547 2167328 2178846 2176011 2175938 2147398 2155147 2189606
16035 2189606 2240535 2209284 2132052 2145012 2178396 2197275 2176224 2136471 2083896 2111282 2117919
16024 2117919 2164273 2173219 2209966 2183939 2205104 2166352 2156543 2153684 2220949 2192267 2146615 2190030
16012 2190030 2216468 2199932 2220805 2190769 2207093 2193137 2210860 2209066 2167457 2159252 2185637 2178027
16000 2178027 2150049 2158512 2166391 2246095 2214894 2198262 2191855 2177892 2211332 2158357 2176503 2189985
15988 2189985 2148318 2189203 2138407 2141324 2165207 2142617 2211255 2237110 2206280 2219411 2232705
15977 2232705 2212186 2160303 2106818 2086745 2102994 2193348 2194912 2158936 2205436 2172227 2149319
15966 2149319 2168885 2190138 2151452 2133861 2141026 2116021 2154261 2108637 2068556 2108606 2198388
15955 2198388 2212814 2154067 2174775 2160558 2199080 2161624 2144782 2144263 2142005 2136886 2125781 2155397
15943 2155397 2199264 2211002 2215097 2149405 2190425 2207136 2179596 2233117 2249606 2257818 2212181 2185940
15931 2185940 2225824 2241990 2267002 2247420 2222812 2213687 2238763 2269905 2276214 2273069 2276950 2231294
15919 2231294 2233863 2203286 2177770 2175014 2194750 2180378 2167406 2217602 2212859 2217322 2197186 2196463
15907 2196463 2129889 2166306 2184888 2200394 2221899 2172088 2181476 2256426 2256982 2279883 2222439 2215947
15895 2215947 2199926 2139118 2152003 2208474 2192963 2170149 2163950 2141532 2190587 2187784 2172387 2136916
15883 2136916 2119509 2092618 2140678 2159618 2132811 2146823 2212296 2189893 2207297 2200157 2218121
15872 2218121 2207304 2168308 2131787 2170140 2215534 2202433 2229666 2220272 2201059 2213057 2179252
15861 2179252 2184749 2204369 2161053 2162892 2189830 2219761 2269400 2237302 2246212 2266377 2232071 2217955
15849 2217955 2216107 2190353 2178457 2223701 2213292 2273297 2247322 2231565 2230785 2182655 2174082 2185227
15837 2185227 2201158 2195354 2145772 2196186 2264931 2225605 2216271 2226944 2217339 2217808 2200251 2230151
15825 2230151 2225910 2178322 2245588 2240591 2254622 2273533 2261677 2255549 2259231 2273126 2220721 2217772
15813 2217772 2228152 2220613 2172029 2192419 2232262 2187826 2174015 2153141 2152726 2168114 2213695 2228896
15801 2228896 2207582 2220837 2206505 2215860 2234238 2241565 2238619 2233291 2183631 2189951 2188002 2211505
15789 2211505 2222350 2240577 2221197 2203597 2181554 2218541 2265593 2256424 2191954 2210767 2248101
15778 2248101 2260975 2305622 2337098 2348586 2315981 2307077 2269618 2222125 2251942 2255137 2239943 2197762
15766 2197762 2181647 2161050 2188624 2222493 2213872 2231683 2184787 2184189 2242311 2209361 2205670 2213438
15754 2213438 2182224 2228679 2244278 2255047 2227688 2279256 2309472 2269606 2230183 2214752 2224821
15743 2224821 2256779 2264958 2248795 2241403 2283206 2268877 2265758 2230570 2237007 2247585 2254829 2321725
15731 2321725 2343606 2334935 2346553 2277717 2261757 2297695 2324381 2272582 2257822 2268937 2259952 2273251
15719 2273251 2227043 2256965 2254678 2235264 2227906 2224144 2204509 2226246 2242902 2222769 2195741 2219620
15707 2219620 2196819 2215070 2266890 2247033 2241286 2187224 2162113 2138765 2174707 2143597 2187452
15696 2187452 2225024 2204484 2237577 2242808 2274668 2256778 2243585 2323572 2258836 2236366 2265131
15685 2265131 2246694 2231541 2274624 2271503 2251938 2272980 2288232 2334822 2286480 2277091 2258728 2288953
15673 2288953 2306237 2316195 2317049 2281486 2215853 2305737 2296630 2249205 2203999 2231575 2228336 2194371
15661 2194371 2243693 2227162 2233128 2188880 2205945 2269647 2292721 2276858 2312841 2304127 2307172 2337274
15649 2337274 2343125 2346215 2314106 2349272 2381131 2347714 2302103 2341101 2303420 2293543 2267761 2266603
15637 2266603 2241026 2262544 2265787 2216595 2225824 2236002 2242397 2213384 2212870 2199807 2215622 2242484
15625 2242484 2234115 2205437 2221300 2161850 2193882 2234061 2261883 2272793 2271889 2285221 2287094 2266494
15613 2266494 2255260 2260860 2312088 2321984 2277573 2256841 2269724 2281990 2272519 2267732 2260698 2316836
15601 2316836 2306889 2292414 2268042 2245407 2277465 2277870 2303703 2321487 2306852 2280244 2271803 2268280
15589 2268280 2269819 2279828 2255785 2246519 2277922 2266871 2315166 2321493 2300255 2340923 2326794 2305398
15577 2305398 2297336 2297927 2290687 2285438 2319928 2275658 2272432 2255424 2264598 2281595 2265934 2261999 2244606
15564 2244606 2289630 2317962 2303255 2284543 2245317 2250075 2268232 2263811 2225648 2237234 2285101 2298462
15552 2298462 2253560 2271819 2268251 2248478 2238570 2232068 2274941 2287220 2316293 2322097 2383600 2320128
15540 2320128 2334608 2373853 2327626 2318999 2330496 2337812 2273045 2268728 2308583 2272797 2317369 2316597
15528 2316597 2312880 2315598 2344588 2345390 2353334 2299633 2285503 2281894 2298688 2314017 2309473 2330195 2282410
15515 2282410 2257744 2301460 2308024 2347856 2355744 2291721 2284365 2271335 2307137 2342527 2296367 2300362
15503 2300362 2308490 2283153 2279474 2261848 2292714 2328366 2348323 2282839 2242508 2253217 2276228 2295327
15491 2295327 2264136 2290582 2285852 2267083 2247477 2243657 2300490 2318299 2320456 2281313 2289821 2313514
15479 2313514 2348339 2313868 2310827 2389675 2368127 2350715 2311880 2357469 2337706 2374235 2376089 2341436
15467 2341436 2386612 2351737 2379336 2322340 2318605 2304791 2314755 2301513 2296894 2272057 2330008 2387800
15455 2387800 2410420 2369647 2342725 2344066 2299911 2278301 2319344 2287118 2265601 2290641 2269032
15444 2269032 2233084 2326915 2323110 2324172 2333641 2299031 2280661 2279949 2274639 2263198 2252114 2271045
15432 2271045 2274082 2295368 2343864 2302714 2343399 2300334 2256923 2224328 2273579 2263872 2274565 2319056
15420 2319056 2304226 2251281 2230246 2233402 2304349 2361513 2309058 2257372 2316514 2328066 2382727
15409 2382727 2338545 2289159 2325151 2378479 2347846 2376592 2407187 2419956 2363679 2331525 2364667
15398 2364667 2346983 2381527 2353922 2294038 2289392 2399809 2409505 2376810 2347679 2355736 2370430 2372576
15386 2372576 2398422 2416573 2405313 2415515 2358711 2325323 2361746 2354981 2337023 2300402 2277060
15375 2277060 2310061 2364205 2394496 2365368 2339282 2280083 2237350 2246447 2317464 2321004 2301093 2270662
15363 2270662 2280554 2297440 2307360 2298990 2298526 2338559 2287635 2307004 2329969 2334036 2307678 2306835 2313744
15350 2313744 2295319 2314186 2359470 2296919 2322174 2294928 2311631 2355990 2343382 2339682 2295252
15339 2295252 2285466 2268412 2293873 2266540 2265336 2323237 2332079 2359999 2379713 2363800 2358638 2317137
15327 2317137 2349311 2428545 2458268 2473249 2471533 2459993 2431196 2381413 2362117 2397287 2401954 2400192
15315 2400192 2410406 2373730 2324610 2373398 2386501 2303362 2301836 2330261 2391413 2388152 2326018 2321779
15303 2321779 2353053 2292016 2271411 2306951 2297944 2259632 2301975 2334359 2414825 2424203 2400048 2381201
15291 2381201 2346219 2355380 2357771 2366793 2378851 2361282 2322122 2322317 2369343 2394655 2399709 2380266
15279 2380266 2374416 2423114 2418801 2394182 2393415 2422643 2395241 2383673 2377491 2330780 2345903 2405859
15267 2405859 2432768 2428938 2430813 2414954 2394045 2415333 2408451 2344137 2305232 2334270 2364424 2345861
15255 2345861 2357684 2345444 2340251 2361170 2353546 2365582 2396736 2411677 2390188 2375680 2376000 2404513
15243 2404513 2433153 2420216 2379813 2388378 2381964 2395060 2372778 2355867 2352260 2345040 2342324 2364116
15231 2364116 2329505 2385477 2389669 2382749 2420615 2449507 2444729 2424940 2399475 2404234 2418127 2409198
15219 2409198 2424210 2382784 2375545 2386357 2406553 2372549 2385005 2376045 2365262 2322116 2339899 2386192
15207 2386192 2363803 2350975 2363413 2338612 2325277 2337026 2338850 2353097 2373170 2381741 2361460 2358117
15195 2358117 2377252 2400960 2389546 2399291 2397578 2316971 2343088 2396317 2346338 2322994 2342461 2335337
15183 2335337 2353286 2370530 2413239 2346901 2301445 2364337 2350259 2349872 2325723 2371829 2349811 2359631
15171 2359631 2402001 2372820 2394526 2400662 2380100 2346376 2356855 2370302 2325980 2348621 2353786 2372193
15159 2372193 2372235 2362081 2384214 2350205 2385116 2417070 2440028 2429927 2350077 2333155 2367073 2424530
15147 2424530 2475890 2476161 2475639 2468405 2441559 2433105 2448147 2471359 2457733 2430382 2397639 2417001
15135 2417001 2443730 2445039 2413739 2417903 2419087 2430887 2481347 2454406 2432920 2401388 2421442 2396072
15123 2396072 2401533 2380009 2375710 2392401 2367263 2419130 2440635 2451467 2456041 2450606 2466218 2464205
15111 2464205 2403083 2395490 2404383 2418392 2415532 2365253 2384329 2413092 2376469 2368172 2405677 2388575
15099 2388575 2365840 2348649 2395871 2381640 2404133 2389864 2342966 2401708 2418256 2410801 2402312 2390140
15087 2390140 2431367 2420735 2372566 2367056 2327341 2377770 2425915 2420501 2370893 2380581 2397847 2432244
15075 2432244 2430496 2389130 2428317 2411708 2434669 2445462 2465010 2461011 2456699 2481277 2469898 2475095
15063 2475095 2474861 2442201 2446752 2453998 2457784 2494666 2459491 2490032 2509416 2492316 2470145 2472410
15051 2472410 2485064 2463159 2456022 2438984 2491390 2520766 2539035 2493640 2468257 2452875 2474698
15040 2474698 2479108 2441032 2476613 2465017 2472352 2484857 2459002 2447340 2476174 2469248 2474835 2470196
15028 2470196 2496069 2519165 2507803 2442878 2439108 2487212 2440492 2446384 2432545 2410333 2431169 2495073
15016 2495073 2503848 2419713 2443346 2445349 2415366 2446062 2418884 2418668 2427834 2453566 2460212 2443190
15004 2443190 2440382 2459833 2477614 2459916 2419214 2430338 2465424 2443214 2416425 2426606 2456441
14993 2456441 2463176 2498153 2489520 2435580 2389935 2411353 2370611 2355487 2393758 2370301 2386659 2463256
14981 2463256 2438883 2504481 2496632 2471296 2445217 2383637 2403863 2403704 2390972 2389599 2391062 2401681
14969 2401681 2450947 2450454 2407310 2376770 2464349 2462986 2429873 2445610 2436327 2480464 2487963 2483347
14957 2483347 2521219 2496014 2501745 2503321 2481679 2478755 2485890 2490161 2496275 2464443 2439756 2474523
14945 2474523 2477740 2478835 2473513 2493837 2514231 2578076 2528929 2469625 2481412 2463035 2440356 2423022
14933 2423022 2465824 2479097 2468165 2473741 2443350 2423650 2449266 2455440 2455801 2499015 2519650 2501133
14921 2501133 2462179 2437143 2464389 2447363 2399600 2439521 2480606 2497676 2489294 2498279 2490114 2489893
14909 2489893 2476626 2441648 2470684 2492692 2482502 2452206 2458291 2469252 2469329 2441466 2414376 2438034
14897 2438034 2507200 2484344 2510096 2490220 2522098 2491499 2460806 2485597 2474973 2482800 2447206
14886 2447206 2399554 2463644 2496390 2475119 2475755 2508394 2488249 2406179 2432787 2478398 2439211 2463533
14874 2463533 2454086 2442176 2457265 2447636 2454739 2508969 2507408 2495311 2565811 2630390 2582436 2537701
14862 2537701 2564264 2577844 2633314 2598346 2535128 2535647 2528148 2512697 2501811 2469803 2448839 2459161
14850 2459161 2458115 2490109 2497756 2466915 2433981 2436193 2459922 2492991 2498532 2475574 2470676 2434601
14838 2434601 2496644 2499995 2514117 2513205 2500904 2496109 2485879 2465802 2484818 2518898 2485679 2469124
14826 2469124 2502384 2478745 2484895 2481755 2524062 2485883 2506743 2539124 2505878 2512061 2544039 2507358
14814 2507358 2500524 2478858 2476253 2501396 2499597 2467872 2479085 2432228 2466074 2504191 2432665 2459967
14802 2459967 2482611 2496054 2531595 2518101 2443813 2468198 2479836 2490289 2495451 2495669 2510064 2552296
14790 2552296 2553739 2514179 2526172 2556109 2543720 2548286 2543160 2580677 2560646 2578485 2556398 2529717
$$ [...]
##END NTUPLES=NMR SPECTRUM
##END=
