##TITLE=1H_TG-2340-A
 CDCl3
 8 sc, 
 8.12.2021
##JCAMPDX= 6.0         $$ Bruker NMR JCAMP-DX V2.0
##DATA TYPE= NMR SPECTRUM
##DATA CLASS= NTUPLES
##ORIGIN= UXNMR, Bruker Analytische Messtechnik GmbH
##OWNER= root
$$ XWIN-NMR		Version 3.5
$$ Wed Dec  8 11:34:30 2021 Russian Standard Time (UT+4h)  she@DPX200
##.OBSERVE FREQUENCY= 200.131346
##.OBSERVE NUCLEUS= ^1H
##.ACQUISITION MODE= SIMULTANEOUS
##.ACQUISITION SCHEME= undefined
##.AVERAGES= 8
##.DIGITISER RES= 18
##SPECTROMETER/DATA SYSTEM= spect
##.PULSE SEQUENCE= zg30
##.SOLVENT NAME= CDCl3
##.SHIFT REFERENCE= (INTERNAL, CDCl3, 0, 15.726)
##AUDIT TRAIL= $$ (NUMBER, WHEN, WHO, WHERE, WHAT)
$$ ##TITLE= Audit trail, XWIN-NMR		Version 3.5
$$ ##JCAMPDX= 5.01
$$ ##ORIGIN= Bruker BioSpin GmbH
$$ ##OWNER= she
$$ F:/spectra/data/she/nmr/H-F/1/pdata/1/auditp.txt
$$ ##AUDIT TRAIL=  $$ (NUMBER, WHEN, WHO, WHERE, WHAT)
(   1,<2021-12-08 11:33:09.95 +0400>,<she>,<DPX200>,
      <created by zg, POWCHK disabled, PULCHK disabled
       configuration hash MD5:
       00 E9 B6 7A A2 85 ED C7 34 08 36 98 17 FE 4E 26
       data hash MD5: 16K
       66 11 DF 19 E9 FF E3 7C 12 4F E9 62 56 64 7E 62>)
(   2,<2021-12-08 11:33:13.07 +0400>,<she>,<DPX200>,
      <Start of raw data processing
       efp BC_mod = 2 LB = 0.24 FT_mod = 6 PKNL = 1 PHC0 = -15515.07 PHC1 = 12.8008 SI = 16K 
       data hash MD5: 16K
       7A 22 31 68 5F 84 19 D5 27 7C A1 79 79 8B B4 D7>)
(   3,<2021-12-08 11:33:33.26 +0400>,<she>,<DPX200>,
      <pk PHC0 = 2.6093 PHC1 = -1.4 
       data hash MD5: 16K
       A1 48 2D 85 42 CA 19 06 F0 27 B5 37 C2 B8 14 00>)
(   4,<2021-12-08 11:33:36.20 +0400>,<she>,<DPX200>,
      <abs ABSG = 5 
       data hash MD5: 16K
       CE 1F A5 AC BE 58 24 01 A6 DC 73 66 04 E4 6E 8C>)
$$ ##END=
$$ 
$$ hash MD5
$$ A5 DB AE 23 FB F6 BC 1C 71 44 69 0C 93 36 DD D1
##$RELAX= 
##$RELAX= 
##$RELAX= 
##$RELAX= 
##$RELAX= 
##$RELAX= 
$$ Bruker specific parameters
$$ --------------------------
##$DU= <F:/spectra>
##$EXPNO= 1
##$NAME= <H-F>
##$PROCNO= 1
##$TYPE= <nmr>
##$USER= <she>
##$AMP= (0..31)
100 100 100 100 100 100 100 100 100 100 100 100 100 100 100 100 100 100 
100 100 100 100 100 100 100 100 100 100 100 100 100 100 
##$AQSEQ= 0
##$AQ_mod= 1
##$AUNM= <au_zg>
##$AUTOPOS= <>
##$BF1= 200.13
##$BF2= 200.13
##$BF3= 200.13
##$BF4= 200.13
##$BF5= 200.13
##$BF6= 200.13
##$BF7= 200.13
##$BF8= 200.13
##$BYTORDA= 1
##$CFDGTYP= 0
##$CFRGTYP= 5
##$CHEMSTR= <none>
##$CNST= (0..31)
1 1 145 1 1 1 1 1 1 1 1 1 1 1 1 1 1 1 1 1 1 1 1 1 1 1 1 1 1 1 1 1 
##$CPDPRG= <>
##$CPDPRG1= <>
##$CPDPRG2= <>
##$CPDPRG3= <>
##$CPDPRG4= <mlev>
##$CPDPRG5= <mlev>
##$CPDPRG6= <mlev>
##$CPDPRG7= <mlev>
##$CPDPRG8= <mlev>
##$CPDPRGB= <>
##$CPDPRGT= <>
##$D= (0..31)
0 1.2 0 0 0 0 0 0 0 0.06 0 0.03 0 0 0 0 0.0002 0 0 0 0 0 0 0 0 0 0 0 0 
0 0 0 
##$DATE= 1638948789
##$DBL= (0..7)
120 120 120 120 120 120 120 120 
##$DBP= (0..7)
150 150 150 150 150 150 150 150 
##$DBP07= 0
##$DBPNAM0= <>
##$DBPNAM1= <>
##$DBPNAM2= <>
##$DBPNAM3= <>
##$DBPNAM4= <>
##$DBPNAM5= <>
$$ [...]
##$SUBNAM2= <"">
##$SUBNAM3= <"">
##$SUBNAM4= <"">
##$SUBNAM5= <"">
##$SUBNAM6= <"">
##$SUBNAM7= <"">
##$SUBNAM8= <"">
##$SUBNAM9= <"">
##$SW= 18.0517287032376
##$SWIBOX= (0..15)
0 0 2 0 0 0 0 0 0 0 0 0 0 0 0 0 
##$SW_h= 3612.71676300578
##$TD= 16384
##$TD0= 1
##$TE= 0
##$TE2= 300
##$TE3= 300
##$TEG= 300
##$TL= (0..7)
0 120 120 120 120 120 120 120 
##$TP= (0..7)
150 150 150 150 150 150 150 150 
##$TP07= 0
##$TPNAME0= <>
##$TPNAME1= <>
##$TPNAME2= <>
##$TPNAME3= <>
##$TPNAME4= <>
##$TPNAME5= <>
##$TPNAME6= <>
##$TPNAME7= <>
##$TPOAL= (0..7)
0.5 0.5 0.5 0.5 0.5 0.5 0.5 0.5 
##$TPOFFS= (0..7)
0 0 0 0 0 0 0 0 
##$TUNHIN= 0
##$TUNHOUT= 0
##$TUNXOUT= 0
##$USERA1= <user>
##$USERA2= <user>
##$USERA3= <user>
##$USERA4= <user>
##$USERA5= <user>
##$V9= 5
##$VALIST= <valist>
##$VCLIST= <CCCCCCCCCCCCCCC>
##$VD= 0
##$VDLIST= <DDDDDDDDDDDDDDD>
##$VPLIST= <PPPPPPPPPPPPPPP>
##$VTLIST= <TTTTTTTTTTTTTTT>
##$WBST= 1024
##$WBSW= 4
##$XGAIN= (0..3)
0 0 0 0 
##$XL= 0
##$YL= 0
##$YMAX_a= 383623
##$YMIN_a= -600697
##$ZGOPTNS= <>
##$ZL1= 120
##$ZL2= 120
##$ZL3= 120
##$ZL4= 120
##$ABSF1= 15.61027
##$ABSF2= -2.441578
##$ABSG= 5
##$ABSL= 3
##$ALPHA= 0
##$AQORDER= 0
##$ASSFAC= 0
##$ASSFACI= 0
##$ASSFACX= 0
##$ASSWID= 0
##$AUNMP= <proc_1d>
##$AZFE= 0.1
##$AZFW= 0.1
##$BCFW= 0
##$BC_mod= 2
##$BYTORDP= 0
##$COROFFS= 0
##$CY= -3
##$DATMOD= 1
##$DC= 0
##$DFILT= <>
##$DTYPP= 0
##$F1P= 0
##$F2P= 0
##$FCOR= 1
##$FTSIZE= 16384
##$FT_mod= 6
##$GAMMA= 0
##$GB= 0
##$INTBC= 1
##$INTSCL= 0
##$ISEN= 128
##$LB= 0.24
##$LEV0= 0
##$LPBIN= 0
##$MAXI= 10000
##$MC2= 0
##$MEAN= 0
##$ME_mod= 0
##$MI= 1.114404
##$NCOEF= 0
##$NC_proc= -5
##$NLEV= 6
##$NOISF1= 3.799351
##$NOISF2= 2.8
##$NSP= 0
##$NTH_PI= 0
##$NZP= 0
##$OFFSET= 15.72596
##$PC= 1
##$PHC0= -15512.46
##$PHC1= 11.4008
##$PH_mod= 1
##$PKNL= yes
##$PPARMOD= 0
##$PSCAL= 0
##$PSIGN= 0
##$REVERSE= no
##$SF= 200.130005122837
##$SI= 16384
##$SIGF1= 3
##$SIGF2= 2
##$SINO= 5.538805
##$SIOLD= 16384
##$SREGLST= <1H.CDCl3>
##$SSB= 0
##$STSI= 16384
##$STSR= 0
##$SW_p= 3612.71676300578
##$SYMM= 0
##$S_DEV= 0
##$TDeff= 16384
##$TDoff= 0
##$TI= <>
##$TILT= no
##$TM1= 0
##$TM2= 0
##$TOPLEV= 0
##$USERP1= <user>
##$USERP2= <user>
##$USERP3= <user>
##$USERP4= <user>
##$USERP5= <user>
##$WDW= 1
##$XDIM= 16384
##$YMAX_p= 432477191
##$YMIN_p= -387142
$$ End of Bruker specific parameters
$$ ---------------------------------
##NTUPLES= NMR SPECTRUM
##VAR_NAME=  FREQUENCY,     SPECTRUM/REAL,   SPECTRUM/IMAG
##SYMBOL=    X,             R,               I
##VAR_TYPE=  INDEPENDENT,   DEPENDENT,       DEPENDENT
##VAR_FORM=  AFFN,          ASDF,            ASDF
##VAR_DIM=   16384,         16384,           16384
##UNITS=     HZ,            ARBITRARY UNITS, ARBITRARY UNITS
##FACTOR=    0.220516191357247, 1,           1
##FIRST=     3147.23641089905, 0,            0
##LAST=      -465.480352106727, 0,           0
##MIN=       -465.480352106727, -387142,     0
##MAX=       3147.23641089905, 432477191,    0
$$ Real data points
##PAGE= N=1
##DATA TABLE= (X++(R..R)), XYDATA
$$ [...]
7146E025331K07008K44764K38963J89332K17442L09733K71922L68333L35566L34268
$$ 5025331 5232339 5477103 5716066 5905398 6122840 6432573 6704495 7072828 7408394 7742662
7136G742662L69938M11217M21529M58460M72462N48609O26169O85845Q24312R47514
$$ 7742662 8112600 8523817 8945346 9403806 9876268 10424877 11051046 11736891 12561203 13508717
7126A3508717J100045J256990J441482J620086J942756K416703K870906L374939
$$ 13508717 14608762 15865752 17307234 18927320 20870076 23286779 26157685 29532624
7118B9532624L955670M646623N349556O142555P002723Q264534R620698J1401182
$$ 29532624 33488294 38134917 43484473 49627028 56629751 64894285 74514983 85916165
7110H5916165J2310246J1715259P397152N95704p484410j3771080j6100026j5129833
$$ 85916165 98226411 109941670 117338822 117934526 110450116 96679036 80579010 65449177
7102F5449177j1926707q878741o393937m818747l700073l002484k416082k121196
$$ 65449177 53522470 44643729 38249792 33431045 29730972 26728488 24312406 22191210
7094B2191210j698645j519469j385815j250656j079169r53893q13896p61352o65715
$$ 22191210 20492565 18973096 17587281 16336625 15257456 14303563 13489667 12728315 12062600
7085A2062600p03123o42350n34770m34221m76919l73207l18885l18506l09298
$$ 12062600 11359477 10717127 10182357 9748136 9271217 8898010 8579125 8260619 7951321
7076G951321k70701k84034j98817k08058j83939j98086j84210k17418j37843j00828
$$ 7951321 7680620 7396586 7197769 6989711 6805772 6607686 6423476 6206058 6068215 5967387
7066E967387j51968k17753j73420k19264j82637j47547j49659j46257q6102j12961
$$ 5967387 5815419 5597666 5424246 5204982 5022345 4874798 4725139 4578882 4492780 4379819
7056D379819r5290p8488N161p7467m8324L1798O6896K3886O0177J19152J04681
$$ 4379819 4284529 4206041 4211202 4133735 4085411 4117209 4184105 4207991 4268168 4387320 4492001
7045D492001J49659J84270K86542K84274L46619M26075M43997M32352M09699M18786
$$ 4492001 4641660 4825930 5112472 5396746 5743365 6169440 6613437 7045789 7455488 7874274
7035G874274L22911R5326k27040n32513p93546p92089o83005o27139m30897l80372
$$ 7874274 8197185 8292511 8065471 7532958 6739412 5947323 5264318 4637179 4206282 3825910
7025C825910k46376k19310k29793k70482j39467j06900j02694j31465j06585p1730
$$ 3825910 3579534 3360224 3130431 2859949 2720482 2613582 2510888 2379423 2272838 2201108
7015B201108j07739m5165p8169q8211o6088o5924k8353r890n650o7280q7088j22903
$$ 2201108 2093369 2048204 1970035 1881824 1815736 1749812 1721459 1711569 1705919 1638639 1551551 1428648
7003A428648l592k6110l7708r7809q085o8124n2917K823n1873m2780K1745R668
$$ 1428648 1425056 1398946 1361238 1263429 1255344 1187220 1134303 1137126 1085253 1042473 1064218 1073886
6991A073886p5976k0786l1595m7278l2530o0790k2078O2609j2115m0920l3366
$$ 1073886 997910 977124 945529 898251 865721 804931 782853 845462 833347 792427 759061
6980G59061J1807M0753o2200n551K5731r441j3238J080J0214k9158j067J1989
$$ 759061 770868 811621 749421 743870 769601 760160 746922 748002 758216 729058 727991 739980
6968G39980j5272l5428o3022k7237j6072N5364J053q1904P0033k9400n4618j6659
$$ 739980 724708 689280 626258 599021 582949 638313 639366 557462 627495 598095 543477 526818
6956E26818K4180P568m2090L0978l0637l4969k9442K2191k7220o566R013q820
$$ 526818 550998 558566 516476 547454 516817 481848 452406 474597 447377 440811 449824 441004
6944D41004L0057P5n2378j1178K3048M85k2208J1560r002M235n3409m9932j1367
$$ 441004 471061 471136 418758 407580 430628 431113 408905 420465 411463 415698 362289 312357 300990
6931C00990l2762K9001j0453o896L893k6284K4451M1288r1218k4484M9802K4296
$$ 300990 268228 297229 286776 279880 283773 257489 281940 323228 232010 207526 257328 281624
6919B81624K8627p8178j5236N0150K1952J6403O381j5819M763j9794m7060K700
$$ 281624 310251 232073 216837 266987 288939 305342 311723 295904 300667 280873 233813 236513
6907B36513k9145R752M1923L3785l3680j4194J6502R027j9743m1701J1766M5218
$$ 236513 207368 217120 259043 292828 259148 244954 261456 270483 250740 209039 220805 266023
6895B66023m0606L087k6000j031L3327n354j7375L1348l1107m8642O068j7259
$$ 266023 225417 228504 202504 201473 234800 229446 212071 243419 212312 163670 169738 152479
6883A52479O5668j1336r469k135p2773P149J2507K5950n495o151k8946J8235M071
$$ 152479 218147 206811 197342 195207 122434 129583 142090 168040 162545 156394 127448 145683 149754
6870A49754K2654l7609k0259J6861L9863K008k9148J7499l3554k6365M1420P464
$$ 149754 172408 134799 114540 131401 171264 173272 144124 161623 128069 101704 143124 150588
6858A50588N33L1809p750m080l9981k6615M8331l813k514o896o6822M3407M2558
$$ 150588 151121 182930 175180 171100 131119 104504 152835 149022 146508 139612 72790 116197 158755
6845A58755j209k1961K9099K0949l6669K4353j8337k87J7446n6944L6104j2646
$$ 158755 157546 135585 164684 185633 148964 173317 154980 154693 172139 115195 151299 138653
6833A38653j2517K8144k9765l9539J1057m2183j5119N390J7054K6491m4687k7601
$$ 138653 126136 154280 124515 84976 96033 53850 38731 44121 61175 87666 42979 15378
6821A5378K4405K3481P680n424k5727j0427Q852K3696M180m101J1113l2418n7314
$$ 15378 39783 63264 70944 65520 39793 29366 38218 61914 66094 61993 73106 40688 -16626
6808a6626L062P639L2332Q115J3581p658O939M9154n3407l0120o76K1335k9440
$$ -16626 -13564 -5925 26407 34522 48103 40445 47384 96538 43131 13011 12335 33670 4230
6795D230N895r167o73M8127N4550n897l8232p184k4878K5716J3921k0929k5432
$$ 4230 10125 958 285 48412 102962 97065 58833 51649 26771 52487 66408 45479 20047
6782B0047l6542m803M6419L3895k9580N725J816k3806M7437j6820J5126N3431
$$ 20047 -16495 -21298 25121 59016 29436 35161 36977 13171 60608 43788 58914 112345
6770A12345o3328m6642M1359K0532j504J4600M890J2356m291m1060K5046N1126
$$ 112345 49017 2375 43734 64266 62762 77362 82252 94608 90317 49257 74303 125429
6758A25429j6894j5355k2724N4595l2551o6588n2876R72K1388P8675L3974R282
$$ 125429 108535 93180 70456 125051 92500 25912 -26964 -25992 -4604 74071 108045 117327
6746A17327o967n4848k1713K5181j396J4982J9449o5558K9541M226j8409l8179
$$ 117327 110360 55512 33799 58980 57584 72566 92015 26457 55998 60224 41815 3636
6734C636M6510J0957J4709K7621m0332M6812k0648l0168j128O918K3821j186K7660
$$ 3636 50146 61103 75812 103433 63101 109913 89265 59097 57969 64887 88708 87522 115182
6721A15182j4300N485M4780L3726K667K2961m888L4005J8704N5681O2547P4644
$$ 115182 100882 106367 151147 184873 187540 210501 205613 239618 258322 314003 376550 451194
6709D51194L858M0001R8408M9913j7993r6480j25180n9624p7224n206m9859l4259
$$ 451194 455052 495053 593461 643374 625381 528901 403721 344097 266873 261667 211808 177549
6697A77549K1654j9355l8283n2914J4655k202j4579K415k331j7266J7455l6670
$$ 177549 199203 179848 141565 88651 103306 101104 86525 88940 86609 69343 86798 50128
6685E0128O254K3964k1703P092m829L219k2705l0625m457L6863K5098J3110m7636
$$ 50128 56382 80346 58643 65735 60906 64125 41420 10795 6338 43201 68299 81409 33773
6672C3773K2317L9039Q97k6493n4129O4539j6150j3659j3871J213J8228k5250
$$ 33773 56090 95129 96026 69533 15404 79943 63793 50134 36263 37476 55704 30454
6660C0454l3858L0724n0241j4221J4713J2938L6210K7164K7857k9556m3566K1747
$$ 30454 -3404 27320 -22921 -37142 -22429 -9491 26719 53883 81740 52184 8618 30365
6648C0365M3630k0247n849j826j0842k8001J0071L0046J5157L6509m3146L6873
$$ 30365 73995 53748 47899 46073 35231 7230 17301 47347 62504 99013 55867 92740
6636I2740k6589k6385K4269k3555l015j6351O898O478l2904L2616p9922l8943
$$ 92740 66151 39766 64035 40480 37465 21114 28012 34490 1586 34202 -45720 -84663
6624h4663K1323K9207N9093n8659l2935m559L1116K3662J1887L1344k2544P715
$$ -84663 -63340 -34133 24960 -33699 -66634 -71193 -40077 -16415 -4528 26816 4272 11987
6612A1987L719J7033J6981l4648j9825k6341m391N4172j1812k4039J4622K4130
$$ 11987 15706 32739 49720 15072 -4753 -31094 -35485 18687 6875 -17164 -2542 21588
6600B1588J3635n9492L9997O9928l4198q1316N272O1292K9454o805J0306j8113
$$ 21588 35223 -24269 15728 85656 51458 -29858 -24586 36706 66160 59355 69661 51548
6588E1548J5126j2015m2533O538Q196N74q57J701M0293K0874K0116j8405k4978
$$ 51548 66674 54659 12126 18664 26860 27434 26577 28278 68571 89445 109561 91156 66178
6575F6178r063k373N749L2223K521l7203O47J2256J9001K9998J7765k7479l4284
$$ 66178 57115 54742 60491 92714 95235 58032 58679 70935 89936 119934 137699 110220 75936
6562G5936O464l7626K8962K3007J8903k1823l0092O5347L0227j9699k4733M0321
$$ 75936 82400 44774 73736 96743 115646 93823 63731 129078 159305 139606 114873 155194
6550A55194P4134N2055k2791m7096l4833j4311J4458M3891k8653j7295K8289J9883
$$ 155194 229328 281383 258592 211496 176663 162352 176810 220701 192048 174753 203042 222925
6538B22925J2067J5081R887l7383K4940O1230M4353O7721J809N3091J00612J35316
$$ 222925 234992 250073 259960 222577 247517 308747 353100 420821 422630 475721 576333 711649
6526G11649J37229J22163J61429J95819K18987J171j65123k82116l31260k00602
$$ 711649 848878 971041 1132470 1328289 1547276 1548447 1383324 1101208 769948 569346
6516E69346j25628q6453l6548J6337o2607k9575K621l8522l8878Q055J0579j028
$$ 569346 443718 357265 320717 337054 274447 244872 247493 208971 170093 178148 188727 187699
6504A87699N1316J453m5873j753j7411m6614J5135j6020P222l8021n3161K4026
$$ 187699 239015 240468 194595 192842 175431 128817 143952 127932 135154 97133 43972 67998
6492F7998P3790J4335k2386n2067M821j9654j187Q905J6699M616n7391N0157k5747
$$ 67998 141788 156123 133737 81670 86491 66837 65650 74555 91254 95870 38479 88636 62889
6479F2889k8936j8647L8523K2185j704j7195J6050J4023l7072J1443m3056J3133
$$ 62889 33953 15306 53829 76014 74310 57115 73165 87188 50116 61559 18503 31636
6467C1636L1911k0135K4068K3671m4954j0187K2085k2563K3782K6980n1293n168
$$ 31636 63547 43412 67480 91151 46197 36010 58095 35532 59314 86294 35001 29833
6455B9833J6442j1346J5923q01K5965r861l0142L5558k538n4657j2872N1082L6970
$$ 29833 46275 34929 50852 50051 76016 66155 36013 71571 69033 14376 1504 52586 89556
6442H9556j6593K4443L5186n7634r722k5310J3519M4292k8665Q478M9817j4371
$$ 89556 72963 97406 132592 74958 65236 39926 53445 97737 69072 77550 127367 112996
6430A12996N396M48k2867j7346k3230J3676K667N835O182P01k1948o284M2982
$$ 112996 118392 118840 95973 78627 55397 69073 71740 77575 83757 84458 62510 56226 99208
6417I9208K1526M985K738l764j1207j5732J3928k6152J8048O600L578K4891N0115
$$ 99208 120734 125719 128457 124693 113486 97754 111682 85530 103578 110178 113756 138647 188762
6404A88762K5335j1504j774M8366l0758j7610P844K2718P9655L6037k2195l2529
$$ 188762 214097 202593 200819 249185 218427 200817 208661 231379 311034 347071 324876 292347
6392B92347p2703k6009J374N6217K9571n964m5604L647K0984J0872j1782q187
$$ 292347 219644 193635 195009 251226 280797 274833 229229 232876 253860 264732 252950 244763
6380B44763L404K7000K3258m9390k0664n9720N4592J0361j5381M2356k7802m051
$$ 244763 248167 275167 298425 249035 228371 168651 223243 233604 218223 260579 232777 228726
6368B28726j3379M068M473j809J6390m7650R7748l2790l1363l4117K080O3706
$$ 228726 215347 219415 223888 222079 238469 190819 288567 255777 224414 190297 192377 256083
6356B56083k1276P757o070j738L9478l3790M7940L7686K5248M2456m496J9140
$$ 256083 234807 242564 236494 234756 274234 240444 288384 326070 351318 393774 389278 408418
6344D08418j8869K2672L0194p107l3916K5077Q82l6047j2710J3085J5550N836
$$ 408418 389549 412221 442415 435308 401392 426469 427351 391304 378594 391679 407229 413065
6332D13065J297k5823N3460r730j2657K205m4822m4638m1089L5522L3954J8222
$$ 413065 414362 388539 441999 432269 419612 421817 376995 332357 291268 326790 360744 378966
6320C78966o3845p5648o891M4375L0321j2644L0340k8473K899N2484J2323q247
$$ 378966 315121 239473 232582 276957 307278 294634 324974 296501 299400 351884 364207 355960
6308C55960m4505k624L8266N8956J6842m0304L4650Q85N224R197k6266J2300m903
$$ 355960 311455 308831 347097 406053 422895 382591 417241 418126 423350 432547 406281 418581 413678
6295D13678j2471j8493k8926J7916K8294l0787j4938j394j3593M073K8532p893
$$ 413678 401207 382714 353788 371704 399998 369211 354273 352879 339286 343359 371891 363998
6283C63998R288J6856m1097L1053l5136N211J2440m5984J288J0701Q2344k0582
$$ 363998 373286 390142 349045 380098 344962 350173 362613 316629 317917 328618 410962 390380
6271C90380m1969O573l3402K8193M1644K1695p209j9664N763M226L4619M2232
$$ 390380 348411 354984 321582 349775 391419 413114 405905 386241 392004 396230 430849 473081
6259D73081k8466j0360L0113k9627N7602j0757j5486J0275N2966K1384J6410J5309
$$ 473081 444615 434255 464368 434741 492343 481586 466100 476375 529341 550725 567135 582444
6247E82444J8743N351N0240P6816M1262Q119k1694o77n5298r774k1872k8069j4894
$$ 582444 601187 606538 656778 733594 774856 782975 761281 760604 705306 695532 673660 645591 630697
6234F30697l0832K16J2630k1513O599R581J809J4725l8567L512J2044R6352J7332
$$ 630697 599865 600081 612711 591198 597797 607378 609187 623912 585345 588857 600901 697253 714585
6221G14585n7637K5955J8368r740k7267M9576N3727J6797K4017j8631k1813J5936
$$ 714585 656948 682903 701271 691531 664264 713840 767567 784364 808381 789750 767937 783873
6209G83873K6885j1328m1609P2163M0746K3194k3094l9928j584L3115M2274L002
$$ 783873 810758 799430 757821 829984 870730 893924 870830 830902 829318 862433 904707 907709
6197I07709j9536P4388L0843O817K2809K4634j36k6395K1139K8544L2223j1957
$$ 907709 888173 962561 993404 1000221 1023030 1047664 1047528 1021133 1042272 1070816 1103039 1091082
6185A091082J4811M0844N922l1412P6058R297l9975P894M0600O358K0828L2200
$$ 1091082 1105893 1146737 1152659 1121247 1197305 1206602 1166627 1174521 1215121 1221479 1242307 1274507
6173A274507j2298O1312j1579L6706n620K0486L8460o6391R326O5312M8273K1474
$$ 1274507 1262209 1323521 1311942 1348648 1343028 1363514 1401974 1335583 1344909 1410221 1458494 1479968
6161A479968j4416L68O4789M1275M0763J0297k5283M0481O7522M3831K4659M2
$$ 1479968 1465552 1465920 1530709 1571984 1612747 1623044 1597761 1638242 1705764 1749595 1774254 1774296
6149A774296M4388L8253K4406N8621N9049L7922O6303J5843Q37O8673R482J8619
$$ 1774296 1818684 1856937 1881343 1939964 1999013 2036935 2103238 2119081 2119918 2188591 2198073 2216692
6137B216692O7440R6467L7441N5188N1827P678L9651M2435M0183L168L6527N6805
$$ 2216692 2284132 2380599 2418040 2473228 2525055 2532733 2572384 2614819 2655002 2658170 2694697 2751502
6125B751502K1928K2318P9484M9753M0355L9237L0195N6952L0616J9506P2101
$$ 2751502 2773430 2795748 2875232 2924985 2965340 3004577 3034772 3091724 3122340 3141846 3213947
6114C213947L9663N9751l366M0511J18488N0208O2853Q8719K1424L8295O4149
$$ 3213947 3253610 3313361 3309995 3350506 3468994 3519202 3582055 3670774 3692198 3730493 3794642
6103C794642P0743J02178P7156J00810J02825J41634J23675J29463J39265J84728
$$ 3794642 3865385 3967563 4044719 4145529 4248354 4389988 4513663 4643126 4782391 4967119
6093D967119J82604K11933J67238K02577K95234J99303K54539K83779M03102L97580
$$ 4967119 5149723 5361656 5528894 5731471 6026705 6226008 6480547 6764326 7167428 7565008
6083G565008M35822M83800N53707P35843Q40860J003240J140693J309369J529399
$$ 7565008 8000830 8484630 9038337 9774180 10615040 11618280 12758973 14068342 15597741
6074A5597741J767764J892145K237654K571598K987880L233397L146105K136078
$$ 15597741 17365505 19257650 21495304 24066902 27054782 30288179 33434284 35570362
6066C5570362J55262j866273k753088k309448j239002l55929L08017J153688J702058
$$ 35570362 35725624 33859351 31106263 28796815 27557813 27201884 27509901 28663589 30365647
6057C0365647K034657K028687J096856q46711k962192m174994m034356l123681
$$ 30365647 32400304 34428991 35525847 34679136 31716944 27541950 23507594 20383913
6049B0383913k349640j624294j185790r62026p89907o27530m85009l55246k56963
$$ 20383913 18034273 16409979 15224189 14262163 13472256 12844726 12359717 12004471 11747508
6040A1747508k11524j02438o4400R311O6824J24483K02016K63494L13004L98960
$$ 11747508 11535984 11433546 11369146 11378457 11445281 11569764 11771780 12035274 12348278 12747238
6030A2747238M97038O81081Q25588J108835J232545J486876J774490K023236K307503
$$ 12747238 13244276 13925357 14750945 15859780 17092325 18579201 20353691 22376927 24684430
6021B4684430K592338L077580L681525M021041M165287L415316J511209j260884
$$ 24684430 27276768 30354348 34035873 38056914 42222201 45637517 47148726 45887842
6013D5887842l298022l553699k571071j191481o2389Q27255J724596K324765K616450
$$ 45887842 42589820 39036121 36465050 35273569 35211180 36038435 37763031 40087796 42704246
6004D2704246K066457J72740k765015n169847n821152m933989l687686k769361
$$ 42704246 44770703 44943443 42178428 37008581 31187429 26253440 22565754 19796393
5996A9796393k070159j712769j325974j171545r84166q23582o45209n85941m57686
$$ 19796393 17726234 16013465 14687491 13515946 12531780 11708198 11062989 10477048 10019362
5987A0019362m78125m38544l72815l38026l31497l04756k53792k36379k69581
$$ 10019362 9541237 9102693 8729878 8391852 8060355 7755599 7501807 7265428 6995847
5978F995847k26598k10983j24957j95554j83984j27099j25771j19396j38701j15797
$$ 6995847 6769249 6558266 6433309 6237755 6053771 5926672 5800901 5681505 5542804 5427007
5968E427007j38892j19748q2564r9912j08510j13686m1742j13515j17366m5692
$$ 5427007 5288115 5168367 5085803 4985891 4877381 4763695 4721953 4608438 4491072 4445380
5958D445380l5351k3804m6725o2468p8163n2987k3406l2142l7757R453m4520l0902
$$ 4445380 4410029 4386225 4339500 4277032 4198869 4145882 4122476 4090334 4052577 4062030 4017510 3986608
5946C986608n467k529l6959j4154N0445R7946k1953K3882K977m1544n3879l0603
$$ 3986608 3981141 3978612 3941653 3927499 3977944 4075890 4053937 4077819 4080796 4039252 3985373 3954770
5934C954770J811m0494j254K0744j03703l9477K9904J7081M6285J6128j7820l9356
$$ 3954770 3956581 3916087 3914833 3935577 3831874 3792397 3822301 3839382 3885667 3901795 3883975 3844619
5922C844619M277K257l751N2470P9566K5809m3495k1595J6042J32479L9640m0068
$$ 3844619 3848896 3851153 3847402 3899872 3979438 4005247 3961752 3940157 3956199 4088678 4128318 4088250
5910D088250mQ8945O4280N0713j2165K5401L3062j8675O9623Q2865Q0620Q8510
$$ 4088250 4088246 4177191 4241471 4292184 4280019 4305420 4338482 4319807 4389430 4472295 4552915 4641425
5898D641425J39630J26885J26232J65970K63810K16083K84506J70606j5028p0040
$$ 4641425 4781055 4907940 5034172 5200142 5463952 5680035 5964541 6135147 6120119 6050079
5888F050079k5179L1457J23234K58587K22295J94780O1976j26613j59299j1199
$$ 6050079 6024900 6056357 6179591 6438178 6660473 6855253 6917229 6790616 6631317 6620118
5878F620118M6349o2300j86833k13987k14074r1183L0030J14595P8174p6910k09002
$$ 6620118 6666467 6604167 6417334 6203347 5989273 5898090 5928120 6042715 6120889 6043979 5834977
5867E834977l41586k95996k66974j41749r6788j77897p1511n6926p8306Q1137
$$ 5834977 5493391 5197395 4930421 4788672 4691884 4513987 4442476 4385550 4307244 4388381
5857D388381n0118k3202K0867O9274R3557J11063J44807J17231J07311N5032J39564
$$ 4388381 4338263 4315061 4335928 4405202 4498759 4609822 4754629 4871860 4979171 5034203 5173767
5846E173767K19580K45475K73744L36540M14269L64636J00910j3965j00895n1436
$$ 5173767 5393347 5638822 5912566 6249106 6663375 7028011 7128921 7114956 7014061 6962625
5836F962625R6203J98668K87521K86193R7330o1094p6412k7306O2182n9531k38646
$$ 6962625 7058828 7257496 7545017 7831210 7928540 7867446 7791034 7763728 7825910 7766379 7527733
5825G527733l23975k50869j88042m8647J05373J37333L4918j48208m37082m68539
$$ 7527733 7203758 6952889 6764847 6716200 6821573 6958906 6993824 6845616 6408534 5939995
5815E939995l68710l21953k57547j40527m7097p1209r1232m8621m8103m9243n248
$$ 5939995 5571285 5249332 4991785 4851258 4804161 4732952 4641720 4593099 4544996 4495753 4490505
5804D490505P273m764n8604L4915N9416R2829R4231J07446P3194P1784J33745
$$ 4490505 4497778 4493014 4434410 4469325 4528741 4621570 4715801 4823247 4896441 4968225 5101970
5793E101970J07696J83969J82804J97898K58739K98661L32480L42249L71629L62147
$$ 5101970 5209666 5393635 5576439 5774337 6033076 6331737 6664217 7006466 7378095 7740242
5783G740242M10614L58462L76662L52890K75768R1147j06275l26476m07264l70826
$$ 7740242 8150856 8509318 8885980 9238870 9514638 9605785 9499510 9173034 8765770 8394944
5773H394944l21813k03074j69054r1259K3104P0304J53579K02000L10354L60961
$$ 8394944 8073131 7870057 7701003 7609744 7632848 7703152 7856731 8058731 8369085 8730046
5763H730046M33788M85008N01741N28623O03926O27683N36371N12102M69097K49425
$$ 8730046 9163834 9648842 10150583 10679206 11283132 11910815 12447186 12959288 13428385 13677810
5753A3677810m8007j73693k83545k85202k5791K04457M73446P35476Q89254J218641
$$ 13677810 13629803 13456110 13172565 12887363 12861572 13066029 13539475 14274951 15164205 16382846
5743A6382846J446791J685842J897371K100402K426323K813539K777338K564644
$$ 16382846 17829637 19515479 21412850 23513252 25939575 28753114 31530452 34095096
5735C4095096K562953J892922m14644k794167m019947m074463l370039k570853
$$ 34095096 36658049 38550971 38136327 35342160 31322213 27247750 23877711 21306858
5727B1306858j782476j224610q65442o00894l43011p8327J86478L89468O24859
$$ 21306858 19524382 18299772 17434330 16833436 16490425 16412098 16598576 16988044 17612903
5718A7612903R46996J205784J442746J730002J968282K195674K538557K896067
$$ 17612903 18559899 19765683 21208429 22938431 24906713 27102387 29640944 32537011
5710C2537011K673456K482954K518908J381329j208156l455077m477841m386196
$$ 32537011 35210467 37693421 40212329 41593658 40385502 36930425 32452584 28066388
5702B8066388l523935k612182j858202j419063r79950o72623l84534j52965J19576
$$ 28066388 24542453 21930271 20072069 18653006 17673056 17000433 16615899 16462934 16582510
5693A6582510L59939N98374Q60890J008739J183502J445096J707464J791069J717847
$$ 16582510 16942449 17540823 18401713 19410452 20593954 22039050 23746514 25537583 27255430
5684B7255430J640181J621371N33743j424142k747121l135260k940047k333890
$$ 27255430 28895611 30516982 31050725 29626583 26879462 23744202 20804155 18470265
5676A8470265j640791j148633p95336n54765m08626k59582m2600O6765K31678
$$ 18470265 16829474 15680841 14885505 14330740 13922114 13662532 13619932 13686697 13918375
5667A3918375M50714O26679Q96994J095070J248223J421388J703458J972291K105513
$$ 13918375 14369089 14995768 15892762 16987832 18236055 19657443 21360901 23333192 25438705
5658B5438705J817340J820591J599613N8239j974923l312128l634588l260039
$$ 25438705 27256045 29076636 30676249 30734488 28759565 25447437 21812849 18552810
5650A8552810k539618j942861j476914j176515r50326q00448o67168n78467m54498
$$ 18552810 16013192 14070331 12593417 11416902 10466576 9666128 8998960 8420493 7965995
5641G965995m63149m19902l18320k70872k57790k70187k05794k82516j52194j57800
$$ 7965995 7502846 7082944 6764624 6493752 6235962 5965775 5759981 5477465 5325271 5167471
5631E167471j66045j53121j36294j43931m6971j30010q1593l7099j40508q8859
$$ 5167471 5001426 4848305 4712011 4568080 4521109 4391099 4309506 4272407 4131899 4043040
5621D043040m914l6420J2369q0636j16393K5110j0615k8907j5597O3100j1848
$$ 4043040 4038126 4001706 4014075 3933439 3817046 3842156 3831541 3802634 3787037 3850137 3838289
5610C838289q4152o680o324n1805J3013L6746j15N437Q9853P5556Q2539J45541
$$ 3838289 3754137 3747457 3741133 3689328 3702341 3739087 3738972 3744409 3834262 3909818 3992357 4137898
5598D137898J04297J56695K39026K29245K67617K06032L20590M29073N09089L76282
$$ 4137898 4242195 4398890 4637916 4867161 5134778 5340810 5661400 6090473 6599562 6975844
5588F975844L02729R2780k180j28897l16866m18645m97186m27755l23248k74860
$$ 6975844 7278573 7371353 7369173 7240276 6923410 6504765 6007579 5579824 5256576 4981716
5578D981716j55694q1171j46334j0784o5319K6598N4198Q7982P1621J45318J94464
$$ 4981716 4826022 4744851 4598517 4587733 4522414 4549012 4603210 4691192 4762813 4908131 5102595
5567E102595J91833K96381K12057L20275L37465L83771M81137M11069K63731N5219
$$ 5102595 5294428 5590809 5802866 6123141 6460606 6844377 7325514 7736583 8000314 8055533
5557H055533j27347k44632l94968m94192n15502n23149l43798j48084k19180j47159
$$ 8055533 7928186 7683554 7288586 6794394 6278892 5755743 5411945 5263861 5044681 4897522
5547D897522p0832K2904N9586R2904J27882J35823J49122L01462K86443J83006
$$ 4897522 4826690 4849594 4909180 5002084 5129966 5265789 5414911 5716373 6002816 6185822
5537F185822R8588J9622j40128k43865l43700m58589l90279l21504j79729j23749
$$ 6185822 6284410 6304032 6163904 5920039 5576339 5117750 4727471 4405967 4226238 4102489
5527D102489j09161j53700j28488p6470n6921j4156m6846j0469l8088l1643J21096
$$ 4102489 3993328 3839628 3711140 3634670 3577749 3563593 3516747 3506278 3468190 3436547 3557643
5516C557643J62027R7719J70210K42838K16412K59675K93719K08632M7039k0896
$$ 3557643 3719670 3817389 3987599 4230437 4446849 4706524 5000243 5208875 5255914 5235018
5506E235018j02220k04757l27156m09670l76868l34093l14640j85418j27986j62478
$$ 5235018 5132798 4928041 4600885 4191215 3814347 3480254 3165614 2980196 2852210 2689732
5496B689732j22340r5601q7510m7131o2941k2018k9646m1697o5801k0575k5779
$$ 2689732 2567392 2471791 2384281 2337150 2274209 2252191 2222545 2180848 2115047 2094472 2068693
5485B068693q3871j3793k6998j07018J8296k0340l9930k4295k2761l0928J2831
$$ 2068693 1984822 1971029 1944031 1837013 1855309 1834969 1795039 1770744 1747983 1717055 1729886
5474A729886j8013j5243j1154L003n1105K5869J3271k6401J9174J5613L0426r515
$$ 1729886 1711873 1696630 1685476 1688479 1637374 1663243 1676514 1650113 1669287 1684900 1715326 1705811
5462A705811J3209L0352l946k1356l0169K9275N750l0664m6344N4074K0786K4297
$$ 1705811 1719020 1749372 1745426 1724070 1693901 1723176 1728926 1698262 1651918 1705992 1726778 1751075
5450A751075K5744J8232K5964o106k4272p746j7277L030N6027J5614l8365j1564
$$ 1751075 1776819 1795051 1821015 1814909 1790637 1782891 1765614 1768644 1824671 1840285 1801920 1790356
5438A790356L1875L2564M1672m5396J6153L6317K4392l920o682M0339O8805M9172
$$ 1790356 1822231 1854795 1896467 1851071 1867224 1903541 1927933 1924013 1917331 1957670 2026475 2075647
5426B075647l3513j7691k0270k3644J1504Q611J8238o110l9543j6004k542l8289
$$ 2075647 2042134 2024443 2004173 1980529 1992033 2000644 2018882 2012772 1973229 1957225 1954683 1916394
5414A916394O378j4485L7559k3134L5939J9774M9962N363O8770N4028m7951l8272
$$ 1916394 1922772 1908287 1945846 1922712 1958651 1978425 2028387 2033750 2102520 2156548 2108597 2070325
5402B070325L2301J3217L6336n3708k6569n2821n3117k8885o0871J0460j9013
$$ 2070325 2102626 2115843 2152179 2098471 2071902 2019081 1965964 1937079 1876208 1886668 1867655
5391A867655m3823M2184m6364o8794m5983M3408M3288j6850N995J2184k0037M1376
$$ 1867655 1823832 1866016 1819652 1750858 1704875 1748283 1791571 1774721 1780716 1792900 1772863 1814239
5379A814239L0109m9397N0508P7127J2320k7697j5950m7215L46l7158k7320k0575
$$ 1814239 1844348 1794951 1845459 1922586 1934906 1907209 1891259 1844044 1844390 1807232 1779912 1759337
5367A759337R885J206J4458j9462M4581K0052L1028N1242L2593N4148K2901M2906
$$ 1759337 1769222 1770428 1784886 1765424 1810005 1830057 1861085 1912327 1944920 1999068 2021969 2064875
5355B064875N2422k0742L7948J13528J37340O9985N7685J03232J35961J65652
$$ 2064875 2117297 2096555 2134503 2248031 2385371 2455356 2513041 2616273 2752234 2917886
5345B917886K09360K30071K92926L21143L31330K92263K81064K65690K63484L62443
$$ 2917886 3127246 3357317 3650243 3971386 4302716 4594979 4876043 5141733 5405217 5767660
5335E767660K39183j33407l30569l38323m24239m03382l29261k58226j71639j10967
$$ 5767660 6006843 5873436 5542867 5204544 4780305 4376923 4047662 3789436 3617797 3506830
5325C506830j42616m1775K7402J934M8488Q8849Q0277O2150L4727R1488J60912
$$ 3506830 3364214 3322439 3349841 3351775 3400263 3489112 3569389 3631539 3666266 3757754 3918666
5314C918666O6686q5063p8138r7786r1764l9910r1814j35236j89185j78363j43004
$$ 3918666 3985352 3900289 3822151 3724365 3632601 3592691 3500877 3365641 3176456 2998093 2855089
5303B855089j24599q8303l1901o4146l2989m9285m8448J3054p0431j11850p5964
$$ 2855089 2730490 2642187 2610286 2546140 2513151 2463866 2415418 2428472 2358041 2246191 2170227
5292B170227q8905o1262k5874m0468q0680l6659J011j147M8712M2146k0395O551
$$ 2170227 2081322 2020060 1994186 1953718 1873038 1836379 1837390 1836243 1884955 1927101 1906706 1913257
5280A913257N8580Q717L7162J3640k2081J5003P419L56J0371K3558R4045M9237
$$ 1913257 1971837 1980554 2017716 2031356 2009275 2024278 2031697 2032053 2042424 2065982 2160027 2209264
5268B209264M3201Q5185R7038O9776M9897J8438q583K4400J1208K6722M648M3038
$$ 2209264 2252465 2337650 2434688 2504464 2554361 2572799 2564216 2588616 2599824 2626546 2631194 2674232
5256B674232j00748j05095o263j1539q4620q2998p1842m0459O3445L3136Q696
$$ 2674232 2573484 2468389 2462126 2450587 2365967 2282969 2211127 2170668 2234113 2267249 2275945
5245B275945L325L4345P2339P9468N6244Q1931R5781M3957R0852O8355Q8177Q3009
$$ 2275945 2279270 2313615 2385954 2465422 2521666 2603597 2699378 2743335 2834187 2902542 2990719 3073728
5233C073728K6350j4963J1468k3127l1795K8897k9558J8966K8446L3763L2542
$$ 3073728 3100078 3085115 3096583 3073456 3041661 3070558 3041000 3059966 3088412 3122175 3154717
5222C154717J9590K4615P7299M9239k5649K7675K9902N5303O1232j6621M4896
$$ 3154717 3174307 3198922 3276221 3325460 3299811 3327486 3357388 3412691 3473923 3457302 3502198
5211C502198J36019P9820N8598O9809J09729J06708N0132K1577O3149M2410P7461
$$ 3502198 3638217 3718037 3776635 3846444 3956173 4062881 4113013 4134590 4197739 4240149 4317610
5200D317610M0296j8401R0388Q6448N2339P3013L7906K7314K2926R6473J48341
$$ 4317610 4357906 4339505 4429893 4516341 4568680 4641693 4679599 4706913 4729839 4826312 4974653
5189D974653J81852J71218J02808J36858J74832K51868K21229K27559K04010K32769
$$ 4974653 5156505 5327723 5430531 5567389 5742221 5994089 6215318 6442877 6646887 6879656
5179F879656J30689O8645N4263k0207l0097m4658j19204j48496j11034m6316K7375
$$ 6879656 7010345 7078990 7133253 7113046 7082949 7038291 6919087 6770591 6659557 6613241 6640616
5168F640616J6756L0421J06728J31328J66170J16072J88468K30292K64237L25202
$$ 6640616 6657372 6687793 6794521 6925849 7092019 7208091 7396559 7626851 7891088 8216290
5158H216290L90399M14973N10231N83547O40794P19337P77976R31008J000409
$$ 8216290 8606689 9021662 9531893 10115440 10756234 11475571 12253547 13184555 14184964
5149A4184964J101430J103117J047877O87401J28954q5026N5946M63544P57053
$$ 14184964 15286394 16389511 17437388 18124789 18253743 18168717 18224663 18688207 19445260
5140A9445260J056184J453160J745912J835071J912242J878355R02723j13256
$$ 19445260 20501444 21954604 23700516 25535587 27447829 29326184 30228907 30115651
5132C0115651o25342l73218J69124P61192J133490R07801O33119N13533R03045
$$ 30115651 29490309 29117091 29286215 30047407 31180897 32088698 32721817 33235350 34138395
5123C4138395J267240R85517P92964P03138M87123K74702M31393N86475j69668
$$ 34138395 35405635 36391152 37184116 37887254 38374377 38649079 39080472 39666947 39497279
5114C9497279j068264j296719q13508m4736N65497J099219J207395L94890m14207
$$ 39497279 38429015 37132296 36318788 36274052 36839549 37938768 39146163 39541053 39126846
5105C9126846o33988l91748o13197p21846q17064j145449j159035r51298m99968
$$ 39126846 38492858 38101110 37487913 36766067 35949003 34803554 33644519 32693221 32193253
5096C2193253j40879k69573k83360j24920J97435M29680P04185M37753o60740
$$ 32193253 32052374 31782801 31499441 31374521 31571956 32001636 32705821 33143574 32482834
5087C2482834j574723j814640j391184p67235k17853L29599Q05495R05550Q98687
$$ 32482834 30908111 29093471 27702287 26935052 26717199 27046798 27852293 28757843 29656530
5078B9656530Q66223O61867L8864m98712q38690j089238j504263j700556j609844
$$ 29656530 30522753 31184620 31223484 30724772 29886082 28796844 27292581 25592025 23982181
5069B3982181j483249j241508q98341o78890n00328l08727j75273j44705j17899
$$ 23982181 22498932 21257424 20359083 19680193 19179865 18871138 18695865 18551160 18433261
5060A8433261o1846N7160K04032L69654L84904L47818M12788M74196M07997L10427
$$ 18433261 18371415 18428575 18632607 19002261 19387165 19734983 20147771 20621967 21029964 21340391
5050B1340391O9706j09601r0800k37681k64073j63817J1672j55866m49868n82964
$$ 21340391 21410097 21300496 21209696 20972015 20707942 20544125 20555797 20399931 19950063 19367099
5040A9367099n32440m86421n68676o14396p18459o67467o75317m45684j24980
$$ 19367099 18834659 18348238 17779562 17165166 16446707 15779240 15103923 14658239 14533259
5031A4533259O7138K52504M44860N21898N59130N93758N95764N70625N95875N43416
$$ 14533259 14600397 14852901 15297761 15819659 16378789 16972547 17568311 18138936 18734811 19278227
5021A9278227L73721M25756M85830M48244L29369L84803M17900r2985o25384q69990
$$ 19278227 19651948 20077704 20563534 21011778 21341147 21725950 22143850 22050865 21425481 20555491
5011B0555491q53410n42339l51738l52737m57616p65226r89534r50625o68471
$$ 20555491 19702081 19159742 18808004 18455267 17997651 17232425 16242891 15292266 14623795
5002A4623795l09194r3420J24979L55443K88547L02987N2067j10489j53995j54326
$$ 14623795 14314601 14221181 14346160 14701603 14990150 15293137 15345204 15234715 15080720 14926394
4992A4926394k03253k61899j99753k40697l30945l40400l11987k34703j76240
$$ 14926394 14723141 14461242 14261489 14020792 13689847 13349447 13037460 12802757 12626517
4983A2626517q9663O416j11537j70761k10774j90754k33962j72966q9505j05276
$$ 12626517 12536854 12543270 12431733 12260972 12050198 11859444 11625482 11452516 11363011 11257735
4973A1257735j13335n2907j21145j99820j90014j95443j29933o6080q0125j44119
$$ 11257735 11144400 11091493 10970348 10770528 10580514 10385071 10255138 10189058 10108933 9964814
4963I964814j51662j47134j18683j84110j20829p7683j07320R858J4419K4811
$$ 9964814 9813152 9666018 9547335 9363225 9242396 9164713 9057393 9067251 9081670 9106481
4953I106481r173R1636J07660J00802J00320R5421K7068l4407j28053j15634j86278
$$ 9106481 9097308 9188944 9296604 9397406 9497726 9593147 9620215 9585808 9457755 9342121 9155843
4942I155843k16920r4016l4220o2666j9429L4041N7480m2492l4545q721j11888
$$ 9155843 8938923 8844907 8810687 8748021 8728592 8762633 8820113 8777621 8743076 8734355 8622467
4931H622467o2441J871n4786j210l2826o307j1352O5665R0575Q5746M7181O3245
$$ 8622467 8560026 8561897 8507111 8505901 8473075 8466768 8455416 8521081 8611656 8697402 8744583 8807828
4919H807828Q9410J44567J70682K68650L59871L62814L50601K69942K62721J23733
$$ 8807828 8897238 9041805 9212487 9481137 9841008 10203822 10554423 10824365 11087086 11210819
4909A1210819j03954m75440p81739q34020o62848m83262l52595l21295l37032
$$ 11210819 11106865 10631425 9849686 9015666 8352818 7869556 7516961 7195666 6858634
4900F858634l60053k94425k00257j43796j38722j17925j10316j01177n7925q9621
$$ 6858634 6498581 6204156 6003899 5860103 5721381 5603456 5493140 5391963 5334038 5244417
4890E244417k8202l1572j4819k393j7810P6752P5667J08806R6714R8044O2128
$$ 5244417 5216215 5184643 5169824 5167431 5149621 5226373 5302040 5410846 5507560 5605604 5667732
4879E667732N5826N1115J64961K64840L50032L52429N83731O80946O26954K70043
$$ 5667732 5723558 5774673 5939634 6204474 6554506 6906935 7490666 8171612 8798566 9068609
4869I068609m24073q00638p50473n22539k80011p8643p726j0316Q9750J16636
$$ 9068609 8644536 7843898 7093425 6570886 6290875 6212232 6204506 6194190 6283940 6400576
4859F400576J63763L29624M55460N19745K37793k86548p66338q44470o86165m59591
$$ 6400576 6564339 6893963 7349423 7869168 8106961 7820413 7054075 6209605 5523440 5063849
4849E063849l14808k68459k34766j34241l2580j42704j87041j67534r3375j30065
$$ 5063849 4749041 4480582 4245816 4111575 4078995 3936291 3749250 3581716 3488341 3358276
4839C358276p0868n4084l3833n1649k5712N724m3756k2016o679K7010M1040j8280
$$ 3358276 3287408 3233324 3199491 3147842 3122130 3127854 3084098 3062082 3055403 3082413 3123453 3105173
4827C105173J8754M8222M6094R4315O3993O3656J25862J29587J14503J67316K15888
$$ 3105173 3123927 3172149 3218243 3312558 3376551 3440207 3566069 3695656 3810159 3977475 4193363
4816D193363J97935M8733j24937j43561j60296j30515o1182j03340J6803P5261
$$ 4193363 4391298 4440031 4315094 4171533 4011237 3880722 3819540 3716200 3733003 3808264
4806C808264P0684R6591J33942J30102J57922K40935K69458K95717L47752L76259
$$ 3808264 3878948 3975539 4109481 4239583 4397505 4638440 4907898 5203615 5551367 5927626
4796E927626L76259M08036M20402J57423r649m2987N6545J02173K044j64607j91342
$$ 5927626 6303885 6711921 7132323 7289746 7280097 7237110 7293655 7395828 7397872 7233265 7041923
4785G041923q6235L1488J38373K74905L79726M63984M64569M39588M12243K94850
$$ 7041923 6955688 6987176 7125549 7400454 7780180 8244164 8708733 9148321 9560564 9855414
4775I855414K52240L06283L98696J91282k03770m15479m84982k75013j26276j28941
$$ 9855414 10107654 10413937 10812633 11003915 10800145 10384666 9899684 9624671 9498395 9369454
4765I369454j64238j49376j27176j07575k0813M4135K26875K45603N8021L8505
$$ 9369454 9205216 9055840 8928664 8821089 8800276 8844411 9071286 9316889 9374910 9413415
4755I413415O7174L0510J0865o449K248k12591l91515l64025k61431j42605n4894
$$ 9413415 9480589 9511099 9521964 9515515 9517763 9305172 8913657 8549632 8288201 8145596 8090702
4744H090702k6471R1537J10560R7445J26188K36876K87867K83604L08663L94189
$$ 8090702 8064231 8155768 8266328 8363773 8489961 8726837 9014704 9298308 9606971 10001160
4734A0001160M04521N33456O02703P68989Q60414J059951J224491J435743J655406
$$ 10001160 10405681 10939137 11541840 12310829 13171243 14231194 15455685 16891428 18546834
4725A8546834J795212K025209K301826K697960K918565K645537K735766K245695
$$ 18546834 20342046 22367255 24669081 27367041 30285606 32931143 35666909 37912604
4717C7912604k90269k518566l422237l038543k012504j026077k15800L87229R44723
$$ 37912604 37622335 35103769 31681532 28642989 26630485 25604408 25388608 25775837 26720560
4708B6720560J467066K013277K448831K923095L527998M099071M391987M601732
$$ 26720560 28187626 30200903 32649734 35572829 39100827 43199898 47591885 52193617
4700E2193617N221353M677674K033654J60657j457205m310001o378551o802493
$$ 52193617 57414970 62092644 64126298 64286955 62829750 58519749 52141198 45338705
4692D5338705n804471m371555k964505j856725j037392m75194M0795N54973R42258
$$ 45338705 39534234 35162679 32198174 30341449 29304057 28828863 28869658 29424631 30366889
4683C0366889J266371J752782K270086K436994K189739K368002J366556j778731
$$ 30366889 31633260 33386042 35656128 38093122 40282861 42650863 44017419 42238688
4675D2238688m277873n254255m815138l719752k743371j984834j563353j165656
$$ 42238688 37960815 32706560 27891422 24171670 21428299 19443465 17880112 16714456
4667A6714456r87127q52699o38405n13560m43743l63270k47372k57347k94994
$$ 16714456 15727329 14874630 14236225 13722665 13278922 12915652 12668280 12410933 12115939
4658A2115939k27891k65211j98855k02715j98746j14592m4607N0168J11512J72688
$$ 12115939 11888048 11622837 11423982 11221267 11022521 10907929 10863322 10913490 11025002 11197690
4648A1197690K57094K65226L37438L53433K94446R0788j95146l58366l86231l15978
$$ 11197690 11454784 11720010 12057448 12410881 12705327 12796115 12600969 12242603 11856372 11540394
4638A1540394k68071j41771n3397p0033L3964J10032J87722K81237M22880N21689
$$ 11540394 11272323 11130552 11077155 11007122 11041086 11151118 11338840 11620077 12042957 12564646
4628A2564646N97988O39149N79635M10546K02206K14252K12475R4551p2126k92253
$$ 12564646 13162634 13801783 14381418 14791964 14994170 15208422 15420897 15515448 15443322 15151069
4618A5151069l58447l12491m5084J48766K35212N1654j63955l27785l48907j37297
$$ 15151069 14792622 14480131 14435047 14583813 14819025 14870679 14706724 14378939 14030032 13892735
4608A3892735J05353K82245M56171N76383N46123M30495J80801N0313J9146K47107
$$ 13892735 13998088 14280333 14736504 15312887 15859010 16289505 16470306 16520619 16539765 16786872
4598A6786872N09685P15276Q56447J059845R86761P54470N19203K11317k62182
$$ 16786872 17296557 18011833 18868280 19928125 20914886 21669356 22188559 22399876 22137694
4589B2137694o28674q65422q67650p23415o14064n42172l20830j32464J56159
$$ 22137694 21509020 20643598 19775948 19052533 18438469 17896297 17575467 17443003 17599162
4580A7599162L57814N57665O65035R18357J210003J321970J479690J683243J643026
$$ 17599162 17956976 18514641 19179676 20098033 21308036 22630006 24109696 25792939 27435965
4571B7435965J506080J325832J404741J654312K007386K236635K308350K475095
$$ 27435965 28942045 30267877 31672618 33326930 35334316 37570951 39879301 42354396
4563D2354396K708154K931151K964216K924278K613493J149793j304513l082749
$$ 42354396 45062550 47993701 50957917 53882195 56495688 57645481 56340968 53258219
4555E3258219l351947k452436j075705J69971J393508K276764K688916K835919
$$ 53258219 49906272 47453836 46378131 46548102 47941610 50218374 52907290 55743209
4547E5743209K594604J083556j212914k800413l007345k028876n86868N13974
$$ 55743209 58337813 59421369 58208455 55408042 52400697 50371821 49784953 50298927
4539E0298927J016871J153433R19746l93875k289955l627735l743313k839636
$$ 50298927 51315798 52469231 53388977 52995102 50705147 47077412 43334099 40494463
4531D0494463j834218p52205L5030O46618R15742J012597P30312o84907k639151
$$ 40494463 38660245 37908040 37943070 38589688 39505430 40518027 41248339 40563432 37924281
4522C7924281l952791m234123l629111k749284k139172j706570j370178j150092
$$ 37924281 33971490 29737367 26108256 23358972 21219800 19513230 18143052 16992960
4514A6992960r69252q31928o99471n63793n26622m55931k83835l28553k66246
$$ 16992960 16023708 15191780 14492309 13928516 13401894 12945963 12662128 12333575 12067329
4505A2067329k42666k18584j85527j17076j20737j57712j77052k17786j76915
$$ 12067329 11824663 11606079 11420552 11303476 11182739 11025027 10847975 10630189 10453274
4496A0453274j81678j87975j64333k32474j64766j96114j41122j72132j09910
$$ 10453274 10271596 10083621 9919288 9686814 9522048 9325934 9184812 9012680 8902770
4487H902770m2559o0468o2246K7590r835O3261J02028Q9283J20266J55760J63483
$$ 8902770 8860211 8799743 8737497 8765087 8755252 8818513 8920541 9009824 9130090 9285850 9449333
4476I449333K13743K41044K48774L52045L63573N58058O23436N83768N10564K81184
$$ 9449333 9663076 9904120 10152894 10504939 10868512 11426570 12050006 12633774 13144338 13425522
4466A3425522r9626m44097n34654l49314n1581J50200L40432L28621M48593J24627
$$ 13425522 13325896 12881799 12347145 11997831 11946250 12096450 12436882 12765503 13214096 13338723
4456A3338723l84976o50928n60315k38341k7719K48399M03643N24541O41517P03604
$$ 13338723 12953747 12302819 11742504 11504163 11476444 11724843 12128486 12653027 13294544 13998148
4446A3998148N12369J95920r0327k94940k19655l4862J62522L81189N39091M92305
$$ 13998148 14510517 14706437 14616110 14321170 14101515 14066653 14229175 14610364 15149455 15641760
4436A5641760K58617l65193j014238j176941r99045o60496l41315r5137L8214
$$ 15641760 15900377 15535184 14520946 13344005 12344960 11684464 11343149 11248012 11286226
4427A1286226K08267L26251L01298J52628o7384k00010k39022j97174M2780K99228
$$ 11286226 11494493 11820744 12122042 12274670 12207286 12007276 11768254 11571080 11613860 11913088
4417A1913088M85221O56233P17396O46862L43711j75832p59946q63688p22256
$$ 11913088 12398309 13054542 13771938 14418800 14762511 14586679 13826733 12963045 12240789
4408A2240789m37551j28664N6208L43707N05582O10579M66614J59833l86559q71847
$$ 12240789 11803238 11674574 11730782 12074489 12580071 13190650 13657264 13817097 13430538 12558691
4398A2558691j055564r33512o70360l27840j14674N0604J15532Q5747p9657m03815
$$ 12558691 11503127 10569615 9899255 9571415 9456741 9507345 9622877 9708624 9628967 9225152
4388I225152o08199n23020l68840k33260j66905L057R0718J49595J56051J11896
$$ 9225152 8616953 8093933 7725093 7491833 7324928 7327985 7418703 7568298 7724349 7836245
4378G836245j42931m68215o71951n62560m58912l41808k74414k30389j52641j46370
$$ 7836245 7693314 7225099 6553148 5990588 5531676 5189868 4915454 4685065 4532424 4386054
4368D386054j63093j46686o7302j01007q8607o1853p0441o2683l7471m9630j7036
$$ 4386054 4222961 4076275 4008973 3907966 3819359 3757506 3687065 3624382 3586911 3537281 3520245
4357C520245l4817o8494m5025j1023N2374M934k4133n5391K9883L3591K3471N3858
$$ 3520245 3485428 3416934 3371909 3360886 3413260 3418194 3394061 3338670 3368553 3402144 3425615 3479473
4345C479473N1741j8705Q160J8537O45k2821P5033L1467J9078J3258J4070O7164
$$ 3479473 3531214 3512509 3520669 3539206 3539851 3517030 3592063 3623530 3642608 3655866 3669936 3737100
4333C737100L2579R498Q053K943m8830J1863K1434N9646N7328P2049J13803J00346
$$ 3737100 3769679 3779177 3787230 3790173 3741343 3753206 3774640 3834286 3891614 3963663 4077466 4177812
4321D177812Q8229M8889j4544k0945j1285o1332J3449J25945M7512L0460K0473
$$ 4177812 4266041 4314930 4300386 4279441 4268156 4206824 4220273 4346218 4393730 4424190 4444663
4310D444663M5085J3702j3993j6961J0925L6520Q49k8526J16104O7082P5825N3714
$$ 4444663 4489748 4503450 4489457 4472496 4483421 4519941 4520790 4492264 4608368 4675450 4751275 4804989
4298D804989K2786R425l6028l4958m4713m6600K1780K2398j7788j7542j3102J4206
$$ 4804989 4827775 4837200 4801172 4766214 4721501 4674901 4696681 4719079 4701291 4683749 4670647 4684853
4286D684853n9338J7940n2457n1389J2913K9011J4812j6202L7994Q9969L4444
$$ 4684853 4625515 4643455 4590998 4539609 4552522 4581533 4596345 4580143 4618137 4708106 4742550
4275D742550O7406O0614L488N8466L2998M8056m867q787J8547O0687J3558L3121
$$ 4742550 4809956 4870570 4874058 4932524 4965522 5013578 5008711 4999924 5018471 5079158 5092716 5125837
4263E125837M9933P4059Q2132M9999K3825J74613J97873R0963J22602J47319J04193
$$ 5125837 5175770 5249829 5331961 5381960 5405785 5580398 5778271 5869234 5991836 6139155 6243348
4252F243348J22354J37155J44332J14259J23903J87623K35543K05871K52736K57393
$$ 6243348 6365702 6502857 6647189 6761448 6885351 7072974 7308517 7514388 7767124 8024517
4242H024517K81435L15324L39287K82626K30337J88192J70837Q8406Q9874J50193
$$ 8024517 8305952 8621276 8960563 9243189 9473526 9661718 9832555 9920961 10010835 10161028
4232A0161028R8753J01272J47323J50357J85513J42845K36544K57008K87519K12214
$$ 10161028 10259781 10361053 10508376 10658733 10844246 10987091 11223635 11480643 11768162 11980376
4222A1980376K69171K58651J95130K09048K90319K50154K23562K42648K92119
$$ 11980376 12249547 12508198 12703328 12912376 13202695 13452849 13676411 13919059 14211178
4213A4211178K29928K65416L42148K56684K43941K51764K63946L11005K73730
$$ 14211178 14441106 14706522 15048670 15305354 15549295 15801059 16065005 16376010 16649740
4204A6649740M18737M70310M46680N51325N97275N85029P32438P45301Q89685
$$ 16649740 17068477 17538787 17985467 18536792 19134067 19719096 20451534 21196835 22086520
4195B2086520R17190R95357J047608J168920J200096J305174J278199J322399
$$ 22086520 23003710 23999067 25046675 26215595 27415691 28720865 29999064 31321463
4187C1321463J472348J534033J640774J754431J931094K243293K634480L008281
$$ 31321463 32793811 34327844 35968618 37723049 39654143 41897436 44531916 47540197
4179D7540197L467072L913596M407489N075630N738347O581214P758748R367835
$$ 47540197 51007269 54920865 59328354 64403984 70142331 76723545 84482293 93850128
4171I3850128J1328875J3497534J5753426J8428474K1023699K3693916K7195321
$$ 93850128 105179003 118676537 134429963 152858437 173882136 197576052 224771373
4164B24771373L1925832L8674491M6054648M8805518L4571313P674016k6351760
$$ 224771373 256697205 295371696 341426344 390231862 424803175 432477191 406125431
4157D06125431n0002185n6514377n0392477l9418150l0539335k3589749j8647103
$$ 406125431 356123246 299608869 249216392 209798242 179258907 155669158 137022055
4150A37022055j4687107j1971475r707466q256867p143768o460824n639203m995763
$$ 137022055 122334948 110363473 100656007 92399140 85255372 78794548 73155345 68159582
4142F8159582m489835m127355l641012l257837k834785k750329k424796k302492
$$ 68159582 63669747 59542392 55901380 52643543 49808758 47058429 44633633 42331141
4134D2331141k111794j786185j552849j468908j237223j255088j177165j127136
$$ 42331141 40219347 38433162 36880313 35411405 34174182 32919094 31741929 30614793
4126C0614793r13795r04416q18196q00073o98035o93037o30804o31075n77350
$$ 30614793 29700998 28796582 27978386 27178313 26480278 25787241 25156437 24525362 23948012
4117B3948012n42602m25533m12064l36684k41389j88564m11510p01553r88707
$$ 23948012 23405410 22979877 22567813 22231129 21989740 21801176 21389666 20688113 19699406
4108A9699406j068288r49206p94999o89550n85651n39278m64440m06081m14772
$$ 19699406 18631118 17681912 16886913 16197363 15611712 15072434 14607994 14201913 13787141
4099A3787141l68978l62310l61959l19974k32296j95158k88115k52153k60327
$$ 13787141 13418163 13055853 12693894 12373920 12141624 11946466 11658351 11406198 11145871
4090A1145871k29100k05360k86441k36263k18576j88393j03577k57041j78618
$$ 11145871 10916771 10711411 10424970 10188707 9970131 9781738 9678161 9421120 9242502
4081I242502j18325j70640k65061j32329j35557j85677j37081j19270j37980j62422
$$ 9242502 9124177 8953537 8688476 8556147 8420590 8234913 8097832 7978562 7840582 7678160
4071G678160j46893j62317j19025m4100r0838j4340m9392l4454j2781O7232O5629
$$ 7678160 7531267 7368950 7249925 7205825 7114987 7100647 7051255 7016801 7004020 7071252 7136881
4060G136881P8629J08766J11233R1002R7442J05792M398r536j7595j12779k28136
$$ 7136881 7215510 7324276 7435509 7526511 7623953 7729745 7734143 7724607 7707012 7594233 7366097
4049G366097k66958l30195k95062l02385k56579k57405k29630k16817k37003j30193
$$ 7366097 7099139 6768944 6473882 6171497 5914918 5657513 5427883 5211066 4974063 4843870
4039D843870j69732j47839q9605r7266m7030r2084j23446n5470k7504o0698q41
$$ 4843870 4674138 4526299 4436694 4339428 4292398 4200314 4076868 4021398 3993894 3933196 3932355
4028C932355m960P988m7934n1215j5319q2551l4581p0820q4894k9164r4589m7635
$$ 3932355 3927395 3935383 3887449 3836234 3820915 3738364 3703783 3632963 3548069 3518905 3424316 3376681
4016C376681j40570K8148J1266p9904q4976l1643k0887p6479n280J5701o8404
$$ 3376681 3236111 3264259 3275525 3195621 3110645 3079002 3058115 2981636 2976356 2992057 2923653
4005B923653p6712n185m2638N734K85R094o5087r1298O721m5446l2846j03643
$$ 2923653 2846941 2841756 2799118 2804852 2805137 2814231 2749144 2657846 2664567 2619121 2586275 2482632
3993B482632o4942n8774o2609q8441q9579l3547m5158r9572j01465l1909k5302
$$ 2482632 2417690 2358916 2296307 2207866 2118287 2084740 2039582 1940010 1838545 1806636 1781334
3982A781334k5669r508l62l5512M193k4887J0032P971r650j8762j2226K7933j888
$$ 1781334 1755665 1746157 1745795 1710283 1714476 1689589 1699621 1707592 1697942 1679180 1666954 1694887 1692999
3969A692999J230M3068R572M912M1844k8563R5829J2089M9803M5199P1068M0874
$$ 1692999 1694229 1737297 1746869 1751781 1793625 1765062 1860891 1872980 1922783 1967982 2039050 2079924
3957B079924O2658R283O3966k7909m6657o3226p1091p0325p9141l9812l5438P399
$$ 2079924 2142582 2151865 2215831 2187922 2141265 2078039 2006948 1936623 1857482 1817670 1782232 1789631
3945A789631j2099M752j2887k7108m6431j0589M9248k4465l6319o3315K1848Q761
$$ 1789631 1777532 1782284 1769397 1742289 1695858 1685269 1734517 1710052 1673733 1610418 1632266 1641027
3933A641027j3028j2532p3731m8798K636j1603n2902l7920j0825J462j2506k0523
$$ 1641027 1627999 1615467 1541736 1492938 1495574 1483971 1431069 1393149 1382324 1383786 1371280 1350757
3921A350757k5259m298j0420l5757m5619K7458K2393m1510k4386K0435o024k1252
$$ 1350757 1325498 1321200 1310780 1275023 1229404 1256862 1279255 1237745 1213359 1233794 1227770 1206518
3909A206518o6696K7530J7471k9500K990K1291J1077k0092R259l4638o303O5268
$$ 1206518 1139822 1167352 1184823 1155323 1158313 1179604 1190681 1170589 1179848 1145210 1138907 1204175
3897A204175L6029k241N6973L6175j4152O3638K6031N8927M0572P7078M6715P5767
$$ 1204175 1240204 1237963 1294936 1331111 1316959 1380597 1406628 1465555 1506127 1583205 1629920 1705687
3885A705687M8209K6768l2147J9313K1923J7933Q7360O1525R4997J25276J20059
$$ 1705687 1753896 1780664 1748517 1767830 1789753 1807686 1895046 1956571 2051568 2176844 2296903
3874B296903J90711K29602K84372K53723K47669J18584k250j97293k66309k33987
$$ 2296903 2487614 2717216 3001588 3255311 3502980 3621564 3619314 3422021 3155712 2921725
3864B921725k19758k06866j95702j74010j25233k20926o4110j01032o4067n5808
$$ 2921725 2701967 2495101 2299399 2125389 2000156 1779230 1715120 1614088 1550021 1494213
3854A494213n1458j8724q3999O906k8196q9323m0211K1496J6511q967J2217J5358
$$ 1494213 1442755 1424031 1340032 1346938 1318742 1229419 1189208 1210704 1227215 1218248 1230465 1245823
3842A245823k1506m5619N2849k0580k6624P1302J0565K2256L7193L973n3891n6584
$$ 1245823 1224317 1178698 1231547 1210967 1184343 1255645 1266210 1288466 1325659 1329632 1275741 1219157
3830A219157r44o7645l6473m8052J5146n3344n1866k6811m5620K4587o161q532
$$ 1219157 1218213 1150568 1114095 1066043 1081189 1027845 975979 949168 903548 928135 921974 913442
3818I13442k723j701p5956K619j8319P322J1260J5203n0943K0083j2654p475l6193
$$ 913442 910719 909018 833062 835681 817362 824684 835944 851147 800204 820287 807633 800158 763965
3805G63965k29q179l1531j0660P6466n5659o996K2071k895j7572p874N664k6955
$$ 763965 763736 755557 724026 713366 789832 734173 727177 749248 746353 728781 720907 726571 699616
3792F99616J8117L4211l2142J510o599l0061L1645j810J2455r136K3276L2037
$$ 699616 717733 751944 719802 721312 714713 684652 716297 714487 726942 717806 741082 773119
3780G73119J8559N7125L7970K5821M6882N5060l8385M2181j0872J5958o254k6239
$$ 773119 791678 848803 886773 912594 959476 1014536 976151 1018332 1007460 1023418 1017164 990925
3768I90925K1685l3619J7061J4893m9578l1617N311M083j8519K5386J4432j0379
$$ 990925 1012610 978991 996052 1010945 961367 929750 935061 939144 920625 946011 960443 950064
3756I50064n1508k9680L3861o4106P937l984q884L8025l0465M6195N6096J8652
$$ 950064 898556 868876 902737 838631 846568 842584 833700 871725 841260 887455 943551 962203
3744I62203Q0936q8192k8582L2550n8404L6479k8356m0106l893k304m8786l5331
$$ 962203 1043139 954947 926365 958915 900511 936990 908634 868528 864635 862331 813545 778214
3732G78214R3399k1106j5816L8215k2094l047k6282j0293M5100k7547J0670J7644
$$ 778214 871613 850507 834691 872906 850812 847765 821483 811190 856290 828743 839413 857057
3720H57057p7391q046L5874l3241k3678P5158k3546J8217l010M7002K4919M063
$$ 857057 779666 771620 807494 774253 750575 825733 802187 820404 817394 864396 889315 893378
3708H93378j9160J0737K8440r7606j0278J778j4123Q511M1798L9217k0891p844
$$ 893378 874218 884955 913395 815789 805511 807289 793166 801677 843475 882692 861801 853957
3696H53957L8216j038m0866n952k5367n3227l8496J0473K1342m2912K9019k227
$$ 853957 892173 891135 850269 844317 818950 765723 727227 737700 759042 716130 745149 742922
3684G42922N9881m2703Q968k6899r682M760N2119L7589k3781l9812K88o0326k8310
$$ 742922 802803 760100 769068 742169 732487 737247 789366 826955 803174 763362 763650 703324 675014
3671F75014J5142K2399L6313n030n4144k8310K0287K5844J352k4312N9107j7104
$$ 675014 690156 712555 748868 743838 689694 661384 681671 707515 708867 684555 743662 726558
3659G26558j2141n0078n5954J22j8906K2920j3439n0113l0901K8119J8892k0521
$$ 726558 714417 664339 608385 608507 589601 612521 599082 548969 518068 546187 565079 544558
3647E44558M2016P389J8720k3964P473J5598n8311p148k5272p918n402k8993j928
$$ 544558 586574 593963 612683 588719 596192 611790 553479 546331 521059 513141 507739 478746 476818
3634D76818M4687J0952k2414m8903j9790J1140K8576M980l6634L2658N607k0032
$$ 476818 521505 532457 510043 461140 441350 452490 481066 486046 449412 482070 487677 467645
3622D67645J1443M4475L1372m310n6875j8728k0789j0329K415L4904k0540J7011
$$ 467645 479088 523563 554935 550625 493750 475022 454233 443904 446319 481223 460683 477694
3610D77694M6298L1431n2721k6112M8325Q652j4152j7847K3145k2387M2518J2803
$$ 477694 523992 555423 502702 476590 524915 533567 519415 501568 524713 502326 544844 557647
3598E57647j7676M015J8066k7386k5531O665q425M8994K3914k7432l1980J8048
$$ 557647 539971 543986 562052 534666 509135 515800 507375 556369 580283 552851 520871 538919
3586E38919k4046k8811P9797k2148m3844J4868L25N1528k3960Q264k4777n4496
$$ 538919 514873 486062 565859 543711 499867 514735 515060 566588 542628 550892 526115 471619
3574D71619J6356J1313m864k0824J5674L8443k7748j6646q251J9962K7607o4475
$$ 471619 487975 499288 494424 473600 489274 527717 499969 483323 475072 495034 522641 458166
3562D58166P0241O4974j9613o1959O531N7844j4040J4713j2697J734k2846M1792
$$ 458166 528407 593381 573768 511809 518340 576184 562144 576857 564160 565894 543048 584840
3550E84840n2998j1487P486j4640p178J871M4060J2404j4850J9581K5659r6461
$$ 584840 531842 520355 527841 513201 506023 507894 551954 564358 549508 569089 594748 498287
3538D98287q630J1528K8499m4775j6552J5435K3786L0541M1068J163o2106K1079
$$ 498287 489657 501185 529684 484909 468357 483792 507578 538119 579187 580350 518244 539323
3526E39323J7969n846K1050m4696l7802L0586J0363J1225M0365L401m502p285
$$ 539323 557292 551446 572496 527800 489998 520584 530947 542172 582537 585938 581436 574151
3514E74151K730Q033p8293K192K2823L8574K9201J7831r687m2427R378M0268l820
$$ 574151 576881 584914 506621 508813 531636 570210 599411 617242 607555 565128 574506 614774 610954
3501F10954L3074M1387j5539j5107J7788J7831J7851m5624l7720m373Q592j578
$$ 610954 644028 685415 669876 654769 672557 690388 708239 662615 624895 620522 629114 627536
3489F27536k595n818n230k6948l8878L809j1927K4810j0769o7176k4355K4984
$$ 627536 624941 619123 613893 586945 548067 551876 539949 564759 553990 486814 462459 487443
3477D87443N9500J882j7722M5150N435L4151k214n1624L9259L8082m3232J0041
$$ 487443 546943 548825 531103 576253 581688 615839 613625 562001 601260 639342 596110 606151
3465F06151O6836n1805l7627K4493O541J4512j1478k9218J2804Q0508k9154k9191
$$ 606151 672987 621182 583555 608048 614589 629101 617623 588405 601209 681717 652563 623372
3453F23372j6754M066J2854k0532J0900k3480n9K1245n3027O026K9364J9305M017
$$ 623372 606618 610684 623538 603006 613906 590426 590367 611612 558585 564611 593975 613280 617297
3440F17297K5518K2087M6827m4973j6811P544m9843L4081L3824M061J9040O9000
$$ 617297 642815 664902 711729 666756 649945 657489 607646 641727 675551 679612 698652 767652
3428G67652k1751r454O5242M3111j676J5599R2659J1804k6903L3963k5523p7983
$$ 767652 745901 736447 801689 844800 843124 858723 951382 963186 936283 970246 944723 866740
3416H66740M2378m8497r640j706j8493L0882L762Q925O3381L8770l8325J00397
$$ 866740 909118 860621 850981 849275 830782 861664 865426 874351 937732 976502 938177 1038574
3404A038574O1517M9287J15659O7767P5526R0191L9286k536l9780j18585k3168
$$ 1038574 1100091 1149378 1265037 1332804 1408330 1498521 1537807 1535271 1495491 1376906 1353738
3393A353738n889J8755O2710K829J18449M534m9514j00137j08943p027m453n90
$$ 1353738 1347849 1366604 1429314 1432143 1550592 1555126 1505612 1405475 1296532 1289505 1285052 1284462
3381A284462j2055n5697k8566m6017l110l4871j6484J331n405j824Q658R5456
$$ 1284462 1272407 1216710 1188144 1142127 1139017 1104146 1087662 1088993 1083588 1081764 1090422 1185878
3369A185878j1879k7385q924J3014M7102M3143J6215J3314N1503L5641O0834j5500
$$ 1185878 1173999 1146614 1137690 1150704 1197806 1240949 1257164 1270478 1321981 1357622 1418456 1402956
3357A402956O1577M1027l5578k4412K4063N8516M5554L1977M3635K2378K606m3508
$$ 1402956 1464533 1505560 1469982 1445570 1469633 1528149 1573703 1605680 1649315 1671693 1674299 1630791
3345A630791p2489l6679k483J86O681N3835J1935L8975J1797J7339K4142K3003
$$ 1630791 1558302 1521623 1519140 1519326 1526007 1579842 1591777 1630752 1642549 1659888 1684030 1707033
3333A707033L7746K3643P9534Q2859k439J2620Q9211N5744J1941P2818J61833
$$ 1707033 1744779 1768422 1847956 1930815 1928376 1940996 2030207 2085951 2097892 2170710 2332543
3322B332543J00968M2001L9359K8699O107J0644J7331K9201L4006j0230N9136
$$ 2332543 2433511 2475512 2514871 2543570 2549677 2560321 2577652 2606853 2640859 2630629 2689765
3311B689765J4461j8292L5797l138o0315j3982P0125O1350R7158Q0030Q0272P1471
$$ 2689765 2704226 2685934 2721731 2718593 2658278 2644296 2714421 2775771 2872929 2952959 3033231 3104702
3299C104702R8839J12235N9705J15060J23450J55196J20416J63795J11074J55951
$$ 3104702 3203541 3315776 3375481 3490541 3613991 3769187 3889603 4053398 4164472 4320423
3289D320423J54343O5505k7761m6169o4915L8127R2769K9162J17525J31685J20221
$$ 4320423 4474766 4540271 4512510 4466341 4401426 4439553 4532322 4561484 4679009 4810694 4930915
3278D930915M9729L9500L8371J00250O6471Q6320R8711J11731J73015J55935K77563
$$ 4930915 4980644 5020144 5058515 5158765 5225236 5311556 5410267 5521998 5695013 5850948 6128511
3267F128511K80914K56992L29140L77559L56187L79572L72927M46074L38346K97250
$$ 6128511 6409425 6666417 6995557 7373116 7729303 8108875 8481802 8927876 9266222 9563472
3257I563472K27039J17433M9239K3674O591j70257k05658j92582k65492l43764
$$ 9563472 9790511 9907944 9957183 9980857 9987448 9817191 9611533 9418951 9153459 8809695
3247H809695l49827l61767l20437k78954k45181l65735l35176k88735k39556k18250
$$ 8809695 8459868 8098101 7777664 7498710 7253529 6887794 6552618 6263883 6024327 5806077
3237E806077k62861k70951k05870k05969j18133j19678j16948p3985j00763n1935
$$ 5806077 5543216 5272265 5066395 4860426 4742293 4622615 4505667 4431682 4330919 4278984
3227D278984j09051p4326l6785j18747o5467j63964j32790k8381p2544q1115l0807
$$ 4278984 4169933 4095607 4058822 3940075 3874608 3710644 3577854 3549473 3476929 3395814 3365007
3216C365007k8278Q456O8290L5775M2023N2202P8726J365K0252p8653j54210j92873
$$ 3365007 3336729 3345185 3413475 3449250 3491273 3543475 3622201 3623566 3643818 3565165 3410955 3218082
3204C218082k03802j40561j77026n6231o8371j25602o7602q044J328l9985m7411
$$ 3218082 3014280 2873719 2696693 2640462 2572091 2446489 2378887 2370843 2372171 2332186 2284775
3193B284775m613L5594o107l2661j2225l7819l8659M8492K8551R9327L9708P1138
$$ 2284775 2280162 2315756 2309649 2276988 2264763 2226944 2188285 2236777 2265328 2364655 2404363 2475501
3181B475501R5769Q1969J29043J04860J13617J2396r5328j95125k40609j75958
$$ 2475501 2571270 2653239 2782282 2887142 3000759 3013155 2917827 2722702 2482093 2306135
3171B306135j23645j28347j25965m5671j9954j06437n4332o6107j0148p347K792
$$ 2306135 2182490 2054143 1928178 1882507 1862553 1756116 1701784 1635677 1625529 1618182 1620974
3160A620974J6913m0563P965P525k0903l5628m9985m9031p25J00172J2820N8519
$$ 1620974 1637887 1597324 1605289 1612814 1591911 1556283 1506298 1457267 1456542 1556714 1569534 1628053
3148A628053Q7039L250N1352N8994m6409p6978p0445p2996q8235r5420m1436m2398
$$ 1628053 1715092 1718342 1769694 1828688 1782279 1705301 1634856 1561860 1473625 1378205 1336769 1294371
3136A294371r1029K758L2015m2745p927q7277k0387l3634j4474J2466l7982J9473
$$ 1294371 1203342 1206100 1238115 1195370 1187443 1100166 1079779 1046145 1031671 1044137 1006155 1025628
3124A025628j8548o581R368n0465m4661L215M959m7247J038o2319J5371K4910
$$ 1025628 1007080 1000499 1009867 959402 914741 917956 922915 875668 876706 814387 829758 854668
3112H54668K3777k7379J7112M272n7483l125J5637k9299l9253K2637K4126Q561
$$ 854668 878445 851066 868178 872450 814967 811842 827479 798180 758927 781564 805690 814251
3100H14251m0182K51k4027j3352M1506j669m0568j4344m764o489q319P154O0009
$$ 814251 774069 774320 750293 736941 778447 776778 736210 721866 717102 710613 702294 709448 769457
3087G69457K392k3177j1060p7797j6834j3313J7685K4191j1825M4624l420o640
$$ 769457 771849 748672 737612 659815 642981 629668 647353 671544 659719 704343 700923 694283
3075F94283p4586J5188L4734o6380l8696o585M4768O5045k1169J0575L3702n0569
$$ 694283 619697 634885 669619 603239 564543 557958 602726 667771 646602 657177 690879 640310
3063F40310J3995k9434l3302n668M9156j4317l8584m841P644o1717r807L6468
$$ 640310 654305 624871 591569 585901 635057 620740 582156 577315 584959 523242 513435 549903
3051E49903j0190m4L9130L515J3209m719J5367p1933m4074N8012m8285k7562M1872
$$ 549903 539713 539669 578799 582314 595523 590804 606171 534238 490164 548176 499891 472329 514201
3038E14201M6367J965l1110j859R241r747Q57J4500L3668l6586k5866K7874N6883
$$ 514201 560568 562533 531423 529564 538805 529058 529915 544415 578083 541497 515631 543505 600388
3025F00388o508M401m3986P449L4574R723k6847l4807O9730J9046j1218K234M576
$$ 600388 593880 598281 554295 561744 596318 606041 579194 544387 614117 633163 621945 624179 628755
3012F28755J4942J4062J915Q5844k3023m0312Q051J1226K307K1194l794j1350
$$ 628755 643697 657759 659674 745518 722495 682183 690234 701460 703767 724961 721167 709817
3000G09817K5833j4811L0355R520L891l907M2201Q060l50j1609k5146R769K0122
$$ 709817 735650 720839 751194 760714 764605 760698 802899 810959 810609 799000 773854 783623 803745
2987H03745N8822K7889o509M0199j4304n469K3061r767L3295L3086j1434K7188
$$ 803745 862567 890456 883947 924146 909842 904373 927434 917667 950962 984048 972614 999802
2975I99802j049l3157l2650M8257J411N244O0284p86q923p004m38J2522O9643
$$ 999802 998753 965596 932946 981203 982614 987858 1048142 1047356 1038433 1031429 1030991 1043513 1113156
2962A113156j4552J6797j1962M2064M9021K5904l059P687M4623Q6398J7615j6235
$$ 1113156 1098604 1115401 1103439 1145503 1194524 1220428 1217369 1225056 1269679 1356077 1373692 1357457
2950A357457N5473P6612R2147M3509N9290J01915Q4781O7717L3680M5720R2580
$$ 1357457 1412930 1489542 1581689 1625198 1684488 1786403 1871184 1938901 1972581 2018301 2110881
2939B110881M3392K9547O4603J373L8558P1369J1457J977O704j3929K3975N1699
$$ 2110881 2154273 2183820 2248423 2249796 2288354 2359723 2371180 2373157 2379861 2365932 2389907 2441606
2927B441606P4355j3007L0868L031M081Q6450L2810P7393R7912P2338P5857J40887
$$ 2441606 2515961 2502954 2533822 2536853 2540934 2627384 2660194 2737587 2835499 2907837 2983694 3124581
2915C124581J20870J28446J22780J45706J62178K10010J56453J48137j5326j99575
$$ 3124581 3245451 3373897 3496677 3642383 3804561 4014571 4171024 4319161 4303835 4104260
2905D104260k30695k41076k28514k08731j02146r5618r9828o2873m4944k6409
$$ 4104260 3873565 3632489 3403975 3195244 3093098 2997480 2897652 2834779 2789835 2763426
2895B763426J815l931o4562l446K1421N9854p918J4241k935K4950J1445M7901
$$ 2763426 2765241 2761310 2696748 2693302 2714723 2774577 2766659 2780900 2777965 2802915 2814360 2862261
2883B862261n3809L387M3397j6323o5999k6693j8269k9986p8804j24435l9244
$$ 2862261 2808452 2811839 2855236 2838913 2772914 2746221 2727952 2697966 2619162 2494727 2455483
2872B455483j30356r4116p2717p7355o8787k2840n6772l7111l8889n7548p2242
$$ 2455483 2325127 2231011 2158294 2080939 2012152 1989312 1932540 1895429 1856540 1798992 1726750
2861A726750o1074l8586k4411q4614l3631l1162k9043o4082m5510o668n2897m7004
$$ 1726750 1665676 1627090 1602679 1518065 1484434 1453272 1424229 1360147 1314637 1307969 1255072 1208068
2849A208068q8224j7665j6202j6956j5756o201k7517n3477j8908r117j0099K9884
$$ 1208068 1119844 1102179 1085977 1069021 1053265 1047064 1019547 966070 947162 938045 927946 957830
2837I57830l7524n5090r738J9261k9614L336l3861q839p415l4514m4765m5544
$$ 957830 920306 865216 855478 874739 845125 848461 814600 805761 798346 763832 719067 673523
2825F73523M615l9806k4805J7769M3841l0313k8102k5326O564j1483J725j1657
$$ 673523 678138 638332 613527 631296 675137 644824 616722 591396 597960 586477 588202 576545
2813E76545k8480p557J9000j2511j5611j12587J1723j6245J2505K5127o952k409
$$ 576545 548065 540508 559508 546997 531386 418799 430522 414277 426782 451909 444957 442548
2801D42548J7164L4117J0340q498k3239p8572K011J4638M7766J2051o4603p1662
$$ 442548 459712 493829 504169 495671 472432 393860 395871 410509 458275 470326 405723 334061
2789C34061k0093p002K1567J5524j0548M3130p9818N219L2329L384Q446J5332
$$ 334061 313968 306966 328533 344057 333509 376639 296821 302040 334369 337753 346199 361531
2777C61531k9866k9616k0514k6427J206J9271k7791L7724K7258k1111k5572P319
$$ 361531 331665 302049 281535 255108 256314 275585 247794 285518 312776 291665 266093 273412
2765B73412l6149l4131j4498K9499J6728m326K8706K9514m1452L6868l1889q3094
$$ 273412 237263 203132 188634 218133 234861 230535 259241 288755 247303 284171 252282 169188
2753A69188J1741m1939L9592P03j5116k1402N7540K5589m4598l5421k9791j851
$$ 169188 180929 138990 178582 179285 164169 142767 200307 225896 181298 145877 116086 114235
2741A14235L8100Q951M44j8109k0941J3019L784l337M372k2685p302M1315K0116
$$ 114235 152335 161286 161730 143621 122680 135699 139483 136146 140518 117833 110531 151846 171962
2728A71962q7127K7301j3596J0395P608l5484K2632k8359L0651O207N304j2862
$$ 171962 84835 112136 98540 108935 116543 81059 103691 75332 105983 112190 117494 104632
2716A04632l1610k4548O974K2652M6389K7352o813l5874L394m3658k933j0265
$$ 104632 73022 48474 55448 78100 124489 151841 145028 109154 112548 68890 65957 55692
2704E5692N0257o85N540K7980m0978J6118N195k6731k1228k5961o40l3677N0380
$$ 55692 105949 105264 110804 138784 97806 113924 119119 92388 71160 45199 44559 10882 61262
2691F1262O8189J004m7461l751n584j8093L518M7371O633j5013l9150k2837K6600
$$ 61262 129451 130455 82994 79243 73659 55566 59084 106455 113088 98075 58925 36088 62688
2678F2688L5805n7213l2822M3393J6058M3898Q46Q627O938m7347q72m4094k0720
$$ 62688 98493 41280 8458 51851 67909 111807 112653 121280 128218 80871 79999 35905 15185
2665A5185L926N0784l517J2439K1910m0831K5992J2988k58L1664p63j0358l2221
$$ 15185 19111 69895 66378 78817 100727 59896 85888 98876 98618 130282 129519 119161 86940
2652H6940j2431L9226l5959n130m3022L1674l7561r109J7846l3395J4328M3322
$$ 86940 74509 113735 77776 72646 29624 61298 23737 14628 32474 -921 13407 56729
2640E6729k1280k193L8144K1820L1228l5567J2482j2131k7167L1855k5503o252
$$ 56729 35449 33256 71400 93220 124448 88881 101363 89232 62065 93920 68417 62165
2628F2165k7293N0146L3718J7694r481l4246J0288L1940k9194O355J1569P596
$$ 62165 34872 85018 118736 136430 126949 92703 102991 134931 105737 112092 123661 131257
2616A31257k6996l94L0172j0389o0410R759J0632l9643J4687R119J2195L75J9148
$$ 131257 104261 103867 134039 123650 63240 72999 83631 43988 58675 67794 79989 80364 99512
2603I9512L462j1340j9830k4053L6793m0792p876m970j5931J2912N8844l6201
$$ 99512 102974 91634 71804 47751 84544 43752 35876 30906 14975 27887 86731 50530
2591E0530j4993j1385N1124m244j729K4125k4788N151m9279J5648J2242L6438
$$ 50530 35537 24152 75276 71032 69303 93428 68640 73791 24512 40160 52402 88840
2579H8840l1343o673M793q614o657K341L9339r625n701j498m2935n469J8428R975
$$ 88840 57497 50824 55617 47003 40346 42687 82026 72401 66700 65202 22267 16798 35226 45201
2565D5201l2336L7731j1055k4462j2476N234k1050K6567Q190L7695l3388l3684
$$ 45201 12865 50596 39541 15079 2603 7837 -13213 13354 21544 59239 25851 -7833
2553g833K0796M1312n1191p229L1429O801m241o1029L9812L6519j092l1256R150
$$ -7833 12963 54275 3084 -4145 27284 34085 29844 -31185 8627 45146 44054 12798 21948
2540B1948Kj3685J4539p402m981r262K9155l6904k3612J4316j7024J7473J4854
$$ 21948 21950 8265 22804 15402 10421 1159 30314 -6590 -30202 -15886 -32910 -15437 -583
2527e83l887L5796m9141j4595N282k17L6855m8674l2927M0583L6705l2231K2736
$$ -583 -4470 31326 -17815 -32410 -27128 -27345 9510 -39164 -72091 -31508 5197 -27034 -4298
2514d298j8202j0400K5921K3009J2999k4923j1274J0343J7927J6126k4795L794
$$ -4298 -22500 -32900 -6979 16030 29029 4106 -7168 3175 21102 37228 12433 16227
2502A6227l0189k6066J2946J7828J2141J6072k945M8970j8186o6980L3685O444
$$ 16227 -13962 -40028 -27082 -9254 2887 18959 16014 64984 46798 -20182 13503 19947
2490A9947l7123m1874P0604J3895m4845M9749M1074j8232m8864j157k7530K6961
$$ 19947 -17176 -59050 11554 25449 -19396 30353 71427 53195 4331 3174 -24356 2605
2478B605j170l9844J6866J04l328j9079K2684K3333k1418K6254O738k7952J4953
$$ 2605 1435 -38409 -21543 -21439 -24767 -43846 -21162 2171 -19247 7007 13745 -14207 746
2465G46K1121j4513O2815K046o2156J0926j55Q943L6115p8608r364N5112k6053
$$ 746 21867 7354 70169 72215 10059 20985 20830 29773 65888 -12720 -22084 33028 6975
2452F975j1801J4056P668m5421K7677K2979l1184L9862p563L7673J9470k8005
$$ 6975 -4826 9230 16898 -28523 -846 22133 -9051 30811 23248 60921 80391 52386
2440E2386M963j4186l9774l2824M0618k6706J3231M1389K0653l258n5449N088
$$ 52386 57349 43163 3389 -29435 11183 -15523 -2292 39097 59750 56492 1043 6131
2428F131O888m8395J8972K0636j799l539N864q938L6246j1074j2628k3677J0573
$$ 6131 13019 -35376 -16404 4232 2433 -1106 4758 -4180 32066 20992 8364 -15313 -4740
2415d740j4299L0950j631l6760M210M0473O3786n5067J2904K737Q702o337m4094
$$ -4740 -19039 11911 10280 -26480 -22270 18203 81989 26922 39826 42563 51265 44928 834
2402H34L3069L1622m9244J1935M015l0785j7191N3823p13J1241K2216n2771L9172
$$ 834 33903 65525 16281 28216 32231 1446 -15745 38078 37365 48606 70822 18051 57223
2389E7223l1449J3458m512J3618J2713P431J0410J6554j1695K5011M764n3254
$$ 57223 25774 39232 34720 48338 61051 68482 78892 95446 83751 108762 113526 60272
2377F0272N8701O801m6641k7474P846r23O075J5897m2762m4398N7303m003j9011
$$ 60272 118973 125774 79133 51659 59505 58582 64657 80554 37792 -6606 50697 46694 27683
2364B7683j8214P97j4148k2202J4550L7578n268j8702R207K787r010J4957m688
$$ 27683 9469 10266 -3882 -26084 -11534 26044 20776 2074 11281 14068 5058 20015 15327
2351A5327j2335L221J1303o100j1937J726L3717k2228j0829J190l0927L396K3977
$$ 15327 2992 6213 17516 11416 -521 1205 34922 12694 1865 3055 -27872 -24476 -499
2338d99K5502l5283J4674J8066K087J6363j0212r043m675J3475k9501J030R034
$$ -499 25003 -10280 4394 22460 24547 40910 30698 21655 16980 30455 954 1984 11018
2325A1018K8372m2895L1622P669j6032O6146l3187k8666l3557j675M8745J972
$$ 11018 39390 -3505 28117 35786 19754 85900 52713 24047 -9510 -11185 37560 39532
2313C9532m6670m1795p532K1267O1234K41n706M1356m5900O545K6767L305m5662
$$ 39532 -7138 -48933 -56465 -35198 26036 26277 20571 61927 16027 22572 49339 52644 6982
2300F982J8642m315L7992k9423o334L5572J0730n4807L647N4015j3378L552n737
$$ 6982 25624 21309 59301 29878 23544 59116 69846 15039 18686 72701 59323 62875 57138
2287E7138Q446j0322M727M30K2218N294r197m0782j1965l7350o351L6726K0013
$$ 57138 65584 55262 59989 60419 82637 87931 78734 37952 25987 -11363 -17714 19012 39025
2274C9025k3665M126L3830j7705K1065m8400j4381O4002q623J4008k2160O119
$$ 39025 15360 19486 53316 35611 56676 8276 -6105 57897 49274 63282 41122 47241
2262D7241K7925j293k5748p968K0816K6252J6296l3296n948j3784K8400Q516p479
$$ 47241 75166 73873 48125 40157 60973 87225 103521 70225 64277 50493 78893 87409 79930
2249G9930P758j9214p322K3090m019N1228L7233l0327r906l5636J6473l5774L3615
$$ 79930 87688 68474 61152 84242 80223 131451 168684 138357 128451 92815 109288 73514 107129
2236A07129L2196K6226l6070m1006N240M6627N5490R703k5326m1045J1651j6451
$$ 107129 139325 165551 129481 88475 93715 140342 195832 205535 180209 139164 150815 134364
2224A34364j7300M2185J1929k2265J4897k9801R933N0141Q766l0601j5085O205
$$ 134364 117064 159249 171178 148913 163810 134009 143942 194083 202849 172248 157163 163368
2212A63368N1035K0881m7961j0180K5587j1466K4096j4866k4202k4206M3962N535
$$ 163368 214403 235284 187323 177143 202730 191264 215360 200494 176292 152086 196048 201583
2200B01583O900j3681L4520O811J9612M411M6511K7064j1512m4269O7223O844
$$ 201583 208483 194802 229322 236133 255745 260156 306667 333731 322219 277950 345173 352017
2188C52017o46P9899k225l5059K0444J4844O969O5466k6473K7228O010K1602l2921
$$ 352017 351371 431270 429045 393986 414430 429274 436243 501709 475236 502464 508474 530076 497155
2175D97155K9334o969L5045N3959o0667m5212K9814K5162K2011l009K921J5446
$$ 497155 526489 519520 554565 608524 547857 502645 532459 557621 579632 576623 579544 594990
2163E94990Q230L0066P3029Q096m5469L7369J0221K4597l4757M5450M9057l7770
$$ 594990 603220 633286 706315 714411 668942 706311 716532 741129 706372 751822 800879 763109
2151G63109L3289N9951N2444K0358M9041N1786R3032J5850K8833N5045J09551
$$ 763109 796398 856349 908793 929151 978192 1029978 1123010 1138860 1167693 1222738 1332289
2140A332289P0618P8279J00753M6185O9218J38100J07688J55921J09365J41538
$$ 1332289 1402907 1481186 1581939 1628124 1697342 1835442 1943130 2099051 2208416 2349954
2130B349954K54637K80697K26023K92306L52267L66981L40246L38385M13800O69370
$$ 2349954 2604591 2885288 3111311 3403617 3755884 4122865 4463111 4801496 5215296 5884666
2120E884666O91556R14651J037551J335996J546253J677583K009389K625748L314706
$$ 5884666 6576222 7490873 8528424 9864420 11410673 13088256 15097645 17723393 21038099
2111B1038099M531147J818460l379651m277996l986489l239791k276323j557709
$$ 21038099 25569246 27387706 24008055 19730059 15743570 12503779 10227456 8669747
2103H669747j236197q87269p11870m97505m20352l41518k86234j61795j97194
$$ 8669747 7433550 6546281 5834411 5336906 4916554 4575036 4288802 4127007 3929813
2094C929813l07619k75807k62205k54447j90817j72431j49817j05954r1152j51204
$$ 3929813 3622194 3346387 3084182 2829735 2638918 2466487 2316670 2210716 2119564 1968360
2084A968360j47153q2078o3691l8623m0783m8380j10438p1239l9373m1301k8470
$$ 1968360 1821207 1739129 1675438 1636815 1596032 1547652 1437214 1365975 1326602 1285301 1256831
2073A256831k9303j01294K1683r7250l5183J2579K148l5620j24984j6644j3118
$$ 1256831 1227528 1126234 1147917 1050667 1015484 1028063 1030211 994591 869607 852963 839845
2062H39845m4815l6654m0438k6208L719m761r956K2416j3394n5486l4152l8131
$$ 839845 795030 758376 717938 691730 695449 690688 680732 703148 689754 634268 600116 561985
2050E61985n2800k2575O151K9985L7244k6498o4811k2092j3401k4550N2939j0657
$$ 561985 509185 486610 492761 522746 559990 533492 468681 446589 433188 408638 461577 450920
2038D50920l4108J6660k858L2797k5080l3348p854L3714J4902n6573n3009J3613
$$ 450920 416812 433472 430614 463411 438331 404983 397129 430843 445745 389172 336163 349776
2026C49776j8710k1577L3706J8740j6778J2845j9940j9673m5938P751k6021j3137
$$ 349776 331066 309489 343195 361935 345157 358002 338062 318389 272451 280202 254181 241044
2014B41044M9514k5669k7300N051k0366J2524n9581o2361P7235l4345J1005n55
$$ 241044 290558 264889 237589 242640 222274 234798 175217 112856 190091 155746 166751 166196
2002A66196J2560N9843m7896p1401J1223L6714J770Q627j3095K4312p6591r367
$$ 166196 178756 238599 190703 119302 130525 167239 169009 177636 164541 188853 112262 102895
1990A02895L9139j8657k428k1675K7351K353P854l0034K9060K2717K042l4613
$$ 102895 142034 123377 120949 99274 126625 128978 136832 106798 135858 158575 160617 126004
1978A26004J3277M2719n3361j8480m815k107j8072k1767M1954j5066m7789k1243
$$ 126004 139281 182000 128639 110159 105344 103237 85165 63398 105352 90286 42497 21254
1966B1254K7568K7601J7870O424J6310j6744o253J292l9232M0693j9857r141r094
$$ 21254 48822 76423 94293 100717 117027 100283 94030 95322 56090 96783 76926 67785 58691
1953E8691J5144j0805J0060l281J8402l4203k6981K3294M159J4036j6748K3015
$$ 58691 73835 63030 73090 69809 88211 54008 27027 50321 54480 68516 51768 74783
1941G4783j6132k9556M5387m0096m2780L6284L3644J5700l9487j2017p947j592
$$ 74783 58651 29095 74482 34386 -8394 27890 61534 77234 37747 25730 17783 16191
1929A6191J1600J0691j0389l2312P80Q3390k4705M616m0625k2127k7686J4674
$$ 16191 27791 38482 28093 -4219 -3439 79951 55246 59862 19237 -2890 -30576 -15902
1917a5902P6780O2933J1453k2325r4135q752k0492j327N0553N0458l2415Q815
$$ -15902 60878 123811 135264 112939 18804 10052 -10440 -11767 38786 89244 56829 65644
1905F5644L1246n9103j7634j2996n364l6930L4829R576k602j3567L1693R825M6235
$$ 65644 96890 37787 20153 7157 1793 -35137 -308 9268 6666 -6901 24792 34617 80852
1892H0852n725j2932k2383J6232l2612r576J3384K943K08k1382j1291K6432j8204
$$ 80852 75127 62195 39812 56044 23432 13856 27240 30183 30391 9009 -2282 24150 5946
1879E946k2009J8222j7696L119L9146L311J1386K2530j6174J515j9820k3639j9235
$$ 5946 -16063 2159 -15537 -12418 26728 30039 41425 63955 47781 49296 29476 5837 -13398
1866a3398M8770m710l0547O6387k3069m085r747k3409P0918l8519M2793K9992
$$ -13398 35372 30662 115 66502 43433 39348 29601 6192 77110 38591 81384 111376
1854A11376l3907K455n379j7776p525o395m8723J7252L8172l251K852N8227R648
$$ 111376 77469 79924 74545 56769 49244 42849 -5874 11378 49550 46299 49151 107378 117026
1841A17026L5262P489n1088J448j6375m1827J2136R465l0872l4851o3832K9857
$$ 117026 152288 159777 108689 110137 93762 51935 64071 73536 42664 7813 -56019 -26162
1829b6162K4495M0776j3779m7543m851j4654K6269R997M108l3073m301K2575K4085
$$ -26162 -1667 39109 25330 -22213 -27064 -41718 -15449 -5452 -1344 -34417 -38718 -16143 7942
1816G942j5078j7207j0265J8034J9504K1759K0526K02m5136k1207m460N246M3170
$$ 7942 -7136 -24343 -34608 -16574 2930 24689 45215 45417 281 -20926 -25386 -20140 23030
1803B3030K2466j7904p3981k8316N4699q1R614K37L5567L5017k5435o1944q507
$$ 23030 45496 27592 -46389 -74705 -20006 -20087 -10473 -10236 25331 60348 34913 -27031 -35538
1790c5538J2287k848j3189N425p786M3132K2873l8115j4154j0995M3133l0995
$$ -35538 -23251 -26099 -39288 -33863 -41649 1483 24356 -13759 -27913 -38908 4225 -26770
1778b6770J2719L4446N062o517K5302l6318j2407J0689k2042N79L0130k6587J8000
$$ -26770 -14051 20395 25457 18940 44242 7924 -4483 6206 -15836 -15257 14873 -11714 6286
1765F286J0090j8475N334k7881j3588N1571l354m666m9938k9551O3730N696k3609
$$ 6286 16376 -2099 3235 -24646 -38234 13337 9983 5317 -44621 -74172 -10442 -4746 -28355
1752b8355o053K4481M0025l7409N13q424K8644P962n9794K6007n224l5213M5659
$$ -28355 -34408 -9927 30098 -7311 -6798 -15222 13422 21384 -38410 -12403 -17627 -52840 -7181
1739g181j320k1583j7293M0820K7828n391L598p73M094J5677K8627k1137k9160
$$ -7181 -8501 -30084 -47377 -6557 21271 15880 19478 18705 22799 38476 67103 45966 16806
1726A6806J1053n123l9464J4557k924j5680M5117J2835k2819l6410j3516L6171
$$ 16806 27859 22736 -16728 -2171 -5095 -20775 24342 37177 14358 -22052 -35568 603
1714F03J3943k993j1024m1207k2982J3522j2470N8347J6310J1203J0706J197q930
$$ 603 14546 11553 529 -40678 -63660 -50138 -62608 -4261 12049 23252 33958 35155 26225
1701B6225p7703J0899K9079p0546M7375j2322k1917j8209K2466N740Q5808K0533
$$ 26225 -51478 -40579 -11500 -82046 -34671 -46993 -68910 -87119 -64653 -58913 26895 47428
1689D7428m6573l8645l5376L0497n340Q8405j0831k2715m1400O8428l499q4945
$$ 47428 855 -37790 -73166 -42669 -48009 40396 29565 6850 -34550 33878 30379 -54566
1677e4566K5621K9042m0510q10j7167K4493K2667J9797K6906o5698K0567j1643
$$ -54566 -28945 97 -40413 -41223 -58390 -33897 -11230 8567 35473 -30225 -9658 -21301
1665b1301N729k7458P317Q255q815J457L6290j3527K3548k294M351J0058l259
$$ -21301 -15572 -43030 -35713 -27458 -36273 -34816 1474 -12053 11495 9201 13552 23610 20351
1652B0351l7928J3433M5392o6053l0138K3716J5134j5235j937p78K1956m9088
$$ 20351 -17577 -4144 41248 -24805 -54943 -31227 -16093 -31328 -33265 -34043 -12087 -61175
1640f1175M412M6334j739K4060J8005J773n6823K5731k8163k3517M9531l4357
$$ -61175 -56763 -10429 -12168 11892 29897 31670 -25153 578 -27585 -51102 -1571 -35928
1628c5928m097k970J4601O2322L0004n3449K101J1006m1368P2396l1159q7122
$$ -35928 -40025 -42995 -28394 33928 63932 10483 12584 23590 -17778 54618 23459 -63663
1616f3663J7761N8240l932l1059o496J147O5400l6023R625m496l0595k8060J1249
$$ -63663 -45902 12338 8406 -22653 -29149 -28002 37398 1375 11000 6504 -24091 -52151 -40902
1603d0902K4906N951k0597o56L8098l838o2858K8147J4813J4024J6011m1004j0042
$$ -40902 -15996 -10045 -30642 -31298 6800 2962 -59896 -31749 -16936 -2912 13099 -27905 -37947
1590c7947K1983o595K4286J3478o9836M5980K6515j7373l2428L6273j0112J6753
$$ -37947 -15964 -22559 1727 15205 -54631 -8651 17864 491 -31937 4336 -5776 10977
1578A0977M216q656R967n5973K6967K49L194L0563L786l8607k2460j2321K1773
$$ 10977 15193 6537 16504 -39469 -12502 -12253 -9059 21504 25290 -13317 -35777 -48098 -26325
1565b6325K5302l093k3219o394q657l8247L2085K1124l431L580K0326K2185l0851
$$ -26325 -1023 -4116 -27335 -33729 -42386 -80633 -48548 -27424 -30855 -27275 -6949 15236 -15615
1552a5615k168M5166J4095j2372J4638k9137l8390J9332L2147n5838R010L1777
$$ -15615 -17783 27383 41478 29106 43744 14607 -23783 -4451 27696 -28142 -19132 12645
1540A2645K2538j990n2262m2835j8341L0486l4898Q1361L606j1861J2451K3808
$$ 12645 35183 33193 -19069 -61904 -80245 -49759 -84657 -3296 310 -11551 900 24708
1528B4708p907m6578M2912J7956p813k8000K6021k927l8281J4260K5143j6377
$$ 24708 16801 -29777 13135 31091 23278 -4722 21299 18372 -19909 -5649 19494 3117
1516C117L1220K2769k3125k1381K641k733K9580l3556M0561j7925p7292M9961
$$ 3117 34337 57106 33981 12600 15241 12508 42088 8532 49093 31168 -46124 3837
1504C837r552j4788L7457l1479l3157J3343M596N5010l563l5995L5826j3964K7895
$$ 3837 -5715 -20503 16954 -14525 -47682 -34339 -29743 25267 21704 -14291 21535 7571 35466
1491C5466k6918k2758N4825j5187k9635l1205J9819M5090J3121n2403l2395j5690
$$ 35466 8548 -14210 40615 25428 -4207 -35412 -15593 29497 42618 -9785 -42180 -57870
1479e7870J7750q581j3755K7212k5457P632Q2590j4197l9262k9384l600K1357
$$ -57870 -40120 -48701 -62456 -35244 -60701 -53069 29521 15324 -23938 -53322 -56922 -35565
1467c5565k2388J0276L2487K0911K8996j590k3559N548n344l7252j7863K066J4773
$$ -35565 -57953 -47677 -15190 5721 34717 33127 9568 15116 9772 -27480 -45343 -43277 -28504
1454b8504l080K6307K7534k9091j426J0051J7299q789o5768k7928j3494M3320
$$ -28504 -31584 -5277 22257 -6834 -8260 1791 19090 10301 -55467 -83395 -96889 -53569
1442e3569L1570n6268K5373K7149N439J557j7603K7917M890j9737j9055K3177
$$ -53569 -21999 -78267 -52894 -25745 -20306 -18749 -36352 -8435 -3545 -23282 -42337 -19160
1430a9160K7788K013K7107n6284K1392K9954o3168P641q703K446k2865M416M9940
$$ -19160 8628 10641 37748 -18536 2856 32810 -30358 -22717 -31420 -28974 -51839 -47423 2517
1417B517M284m8798J9493o540J8358j8983J2634J7810l5039L3298K2j6084k5087
$$ 2517 6801 -41997 -22504 -29044 -10686 -29669 -17035 775 -34264 -966 -944 -17028 -42115
1404d2115M135L2019l2241L5648k1050k8588R275N6511n2661l1864L4973j3519
$$ -42115 -37980 -5961 -38202 -2554 -23604 -52192 -42917 13594 -39067 -70931 -35958 -49477
1392d9477J9557K2031L7445M68L892J3342l079n5489J5737j9671j934J0276Q888
$$ -49477 -29920 -7889 29556 30024 33916 47258 44179 -11310 4427 -15244 -17178 -6902 1986
1379A986L137L5761M250l4024J9902m4106m5660M0890N2266L3101r191k8540m4653
$$ 1986 5123 40884 45134 11110 31012 -13094 -58754 -17864 34402 67503 58312 29772 -14881
1366a4881n772j3637K0094L8049l9475N375j8383n634j6681K5068L2817k8329
$$ -14881 -20653 -34290 -14196 23853 -15622 -10247 -28630 -34264 -50945 -25877 6940 -21389
1354b1389O1096l3531j1269l9416J3839M6927R01J7168n1099J0483j694j470J5843
$$ -21389 39707 6176 -5093 -44509 -30670 16257 17158 34326 -16773 -6290 -7984 -9454 6389
1341F389j7465N2004r955j2222k1335J9832k7835k5149j8135P56J0040k9122L4838
$$ 6389 -11076 40928 30973 18751 -2584 17248 -10587 -35736 -53871 -53115 -43075 -72197 -37359
1328c7359l3363K2505K5483l2583n690k2715L7809Q1169m3603o0451M639O0479
$$ -37359 -70722 -48217 -22734 -55317 -61007 -83722 -45913 35256 -8347 -68798 -64159 -3680
1316c680O0034j9129j9684o5241m1536L3777K4550K1215M6369O848o147m1534
$$ -3680 56354 37225 17541 -47700 -89236 -55459 -30909 -9694 36675 43523 37376 -4158
1304d158n042j3454O395j4708J0935N2328l4374l4591K261K6316j9967R006m9796
$$ -4158 -9200 -22654 -16259 -30967 -20032 32296 -2078 -36669 -34408 -8092 -28059 -19053 -68849
1291f8849j2387O3959K2961K0708l9694j512K6077k510l5614o428N2923j5796
$$ -68849 -81236 -17277 5684 26392 -13302 -14814 11263 8753 -26861 -33289 19634 3838
1279C838j4363M8433k0147k9761J2809M424R52l5047K5351k0495m1915L7607P484
$$ 3838 -10525 37908 17761 -12000 809 5233 6185 -28862 -3511 -24006 -65921 -28314 -20830
1266b0830L1543m0423n217K0085j0074J2178k4109J1807l8917N9483R963o5044
$$ -20830 10713 -29710 -34927 -14842 -24916 -12738 -36847 -25040 -63957 -4474 5489 -59555
1254e9555j6940K8547k526J4333J4217m47J5364r21m8655J2635J3436K5687l3387
$$ -59555 -76495 -47948 -50474 -36141 -21924 -22371 -7007 -7928 -56583 -43948 -30512 -4825 -38212
1241c8212N776l7795P3935K2485m2385J8745j2843J4621K968N399k6785j1533
$$ -38212 -32436 -70231 3704 26189 -16196 2549 -10294 4327 7295 12694 -14091 -25624
1229b5624J6431k574J0291Q457j1375l626l1618j2392M0959J3396L675R08J8397
$$ -25624 -9193 -11767 -1476 6981 -4394 -8020 -39638 -52030 -11071 2325 6000 6908 25305
1216B5305J5041n385R882J2261k7056m9686R839k1080J9313J2667J2218J1140
$$ 25305 40346 34961 44843 57104 30048 -19638 -9799 -30879 -11566 1101 13319 24459
1204B4459j2792K0041j7055k5478j725n0861J8852k5324M0537J2144m7695J6179
$$ 24459 11667 31708 14653 -10825 -12550 -63411 -44559 -69883 -29346 -17202 -64897 -48718
1192d8718J5714k5314R445q604M133l190k3479m859j9167N3946N7233q607j3509
$$ -48718 -33004 -58318 -48873 -57477 -53344 -56534 -80013 -84872 -104039 -50093 7140 -1467 -14976
1179a4976j0713L9237j7067N3012p392m4171K1349K1036k8090K5064o934n7763
$$ -14976 -25689 13548 -3519 49493 42101 -2070 19279 40315 12225 37289 30355 -27408
1167b7408O915J5445J7972m1968n5138K4732L3233p150M17l064J3075l2031Q428
$$ -27408 -20493 -5048 12924 -29044 -84182 -59450 -26217 -33367 -32950 -36014 -22939 -54970 -46542
1154d6542J0529N8207K0884j8151J3230Q46l8729k633O694r025j2531m6502j3924
$$ -46542 -36013 22194 43078 24927 38157 39003 274 -2359 4335 -4690 -17221 -63723 -77647
1141g7647J8885L1760J458j5628M5290j6394j7104L8470q853J3252K9673j1938
$$ -77647 -58762 -27002 -25544 -41172 4118 -12276 -29380 9090 237 13489 43162 31224
1129C1224q737n0830j6883M5438N0347m3008k1606q758j5077l1390J060L9906
$$ 31224 22487 -28343 -45226 212 50559 7551 -14055 -22813 -37890 -69280 -68220 -28314
1117b8314J2379n020m158L3157n3311K2255K0947J2855m6006J1954M8261r4772
$$ -28314 -15935 -20955 -25113 8044 -45267 -23012 -2065 10790 -35216 -23262 24999 -69773
1105f9773l0684M9387L0879j0585O1316J7579l9907k8650j3616J7873l7389J5716
$$ -69773 -100457 -51070 -20191 -30776 30540 48119 8212 -20438 -34054 -16181 -53570 -37854
1093c7854l4065O4423L1501k7922q273l0774L3990J6208J9360l0957k5172K313
$$ -37854 -71919 -7496 24005 -3917 -12190 -42964 -8974 7234 26594 -4363 -29535 -27222
1081b7222M6097R292k7141J7028n0179q5041M5125N5990K1401r649j5876k8416
$$ -27222 18875 28167 1026 18054 -32125 -117166 -72041 -16051 5350 -4299 -20175 -48591
1069d8591N735J5906L5301M304k5953l2822K2502N2213j4676k7099m7824J8774
$$ -48591 -42856 -26950 8351 12655 -13298 -46120 -23618 28595 13919 -13180 -61004 -42230
1057d2230J1892j0303L3737k367m4760L4435N492k7058J8613L3629M1355K2774
$$ -42230 -30338 -40641 -6904 -9271 -54031 -19596 -14104 -41162 -22549 11080 52435 75209
1045G5209k0488j0124p4175k1050K6845L323O949K463l4058J1087J5121L612J493
$$ 75209 54721 44597 -29578 -50628 -23783 -20460 -13511 -11048 -45106 -34019 -18898 -15286 -13793
1032a3793K78j6831r092L1965J53M252J2516n295l889k9701j1209m763K3410M7751
$$ -13793 -13515 -30346 -39438 -7473 -7320 -3068 9448 4153 264 -29437 -40646 -45409 -21999 25752
1018B5752j1848m6572l9344N0554K3603J4510p5968n471N2938j9103m558j193
$$ 25752 13904 -32668 -72012 -21458 2145 16655 -59313 -64784 -11846 -30949 -35507 -36700
1006c6700o207M6419k2120j6198K1274p482M3415j9702n8559L4618J3266M618
$$ -36700 -42907 3512 -18608 -34806 -13532 -21014 22401 2699 -55860 -21242 -7976 -3358
994c358Q886N8008k8380j0230j0765j2899j8046k4983K0343k0084l0370K5142
$$ -3358 5528 63536 35156 24926 14161 1262 -16784 -41767 -21424 -41508 -71878 -46736
982d6736j7584L980L2084L1223j6567L6864P1854n1266N746m1333r322N8103J7025
$$ -46736 -64320 -60340 -28256 2967 -13600 23264 95118 43852 49598 8265 -1057 57046 74071
969G4071l5059k9932j5933K0078M1822k7495n4890L5215m2835j0582k544k6771
$$ 74071 39012 9080 -6853 13225 55047 27552 -27338 7877 -34958 -45540 -48084 -74855
957g4855M1965M0944j5328R781l4623L8766L172l7100K2523m2787K2580O774k8378
$$ -74855 -32890 8054 -7274 2507 -32116 6650 9822 -27278 -4755 -47542 -24962 -18188 -46566
944d6566J8848L7618J045m7867N1064k0468N501J2430L619j6161n860M4936l6270
$$ -46566 -27718 9900 10945 -36922 14142 -6326 -825 11605 15224 -937 -6797 38139 1869
931A869J661J8261l4332k9854K2704M6519J7050j6890k5997k0670J7792L555N197
$$ 1869 3530 21791 -12541 -42395 -19691 26828 43878 26988 991 -19679 -1887 1668 6865
918F865m8895K7295K0402r064K4093k2273J8315l97m372Q689l5200P1690j5274
$$ 6865 -42030 -14735 5667 -3397 20696 -1577 16738 16341 11969 20658 -14542 57148 41874
905D1874j5460N515j7428J9378j4779p983k4515J2083j4671L7106J3947o798n980
$$ 41874 26414 31929 14501 33879 19100 11117 -13398 -1315 -15986 21120 35067 28269 22289
892B2289j655k0432m0429M6551M8608j756o2648j7830K9846L1761j440n067j7454
$$ 22289 20634 202 -40227 6324 54932 53176 -9472 -27302 2544 34305 32865 27798 10344
879A0344n313k2285J4385J184n3532K8388K9722l2385j5621L0681L0996P51r033
$$ 10344 5031 -17254 -2869 -1685 -55217 -26829 2893 -29492 -45113 -14432 16564 17315 8282
866H282K6017j8168j7873j8156m436j7112J5920L1957j2119K8266R072m9126j5412
$$ 8282 34299 16131 -1742 -19898 -24334 -41446 -25526 6431 -5688 22578 31650 -17476 -32888
853c2888m3260J9349L9223K174J004k4166j9173k552M1431p832j7497L0042R159
$$ -32888 -76148 -56799 -17576 -15402 -14398 -38564 -57737 -60289 -18858 -26690 -44187 -14145 -4986
840d986P22j8994p378O6227k6574k3297k3223k1096L8608K0280j785l8225P790
$$ -4986 -4264 -23258 -30636 35591 9017 -14280 -37503 -58599 -19991 289 -1496 -39721 -31931
827c1931Q00l6445Q3063p309o2879k3869M9101K0575J6699J864k2942k0527N6528
$$ -31931 -31131 -67576 15487 8178 -54701 -78570 -29469 -8894 7805 9669 -13273 -33800 22728
814B2728L3091q1522J3589r02k380L3608k0942l2999j3910M2622K0971j9505J2326
$$ 22728 55819 -25703 -12114 -13016 -15396 18212 -2730 -35729 -49639 -7017 13954 -5551 6775
801F775q49l9105L101M3064k3166J5312J2659M509k1497q151O014j3894K5912
$$ 6775 5926 -33179 -30078 12986 -10180 5132 17791 22300 803 -7348 -1334 -15228 10684
788A0684l080m004j8667j1881L0188j8088N7274k8255K1770Q212j358l4123k8780
$$ 10684 7604 3600 -15067 -26948 3240 -14848 42426 14171 35941 44153 42795 8672 -20108
775b0108L3413k518k5206j4480N9506k3006l1672k1359O708K2138j6614k491k1553
$$ -20108 13305 10787 -14419 -28899 30607 7601 -24071 -45430 -38722 -16584 -33198 -35689 -57242
762e7242L5791j6983J4959L37j5368n647K606M407M7900M9526J8801n4413m816
$$ -57242 -21451 -38434 -23475 -23138 -38506 -44153 -41547 -37140 10760 60286 79087 24674 19858
749A9858J7635k6675j5695o3721M4563M1929o561m2743M4459l7496j6841N9564
$$ 19858 37493 10818 -4877 -68598 -24035 17894 11333 -31410 13049 -24447 -41288 18276
737A8276K0596j2656J1217j2513J0866m451m5640m332r73j1917L2007P346l366
$$ 18276 38872 26216 37433 24920 35786 31335 -14305 -18637 -19610 -31527 480 7826 4460
$$ [...]
##END NTUPLES=NMR SPECTRUM
##END=
