##TITLE=1H_TG-2340-5
 CDCl3
 8 sc, 
 7.12.2021
##JCAMPDX= 6.0         $$ Bruker NMR JCAMP-DX V2.0
##DATA TYPE= NMR SPECTRUM
##DATA CLASS= NTUPLES
##ORIGIN= UXNMR, Bruker Analytische Messtechnik GmbH
##OWNER= root
$$ XWIN-NMR		Version 3.5
$$ Tue Dec  7 12:06:45 2021 Russian Standard Time (UT+4h)  she@DPX200
##.OBSERVE FREQUENCY= 200.131346
##.OBSERVE NUCLEUS= ^1H
##.ACQUISITION MODE= SIMULTANEOUS
##.ACQUISITION SCHEME= undefined
##.AVERAGES= 8
##.DIGITISER RES= 18
##SPECTROMETER/DATA SYSTEM= spect
##.PULSE SEQUENCE= zg30
##.SOLVENT NAME= CDCl3
##.SHIFT REFERENCE= (INTERNAL, CDCl3, 0, 15.7315)
##AUDIT TRAIL= $$ (NUMBER, WHEN, WHO, WHERE, WHAT)
$$ ##TITLE= Audit trail, XWIN-NMR		Version 3.5
$$ ##JCAMPDX= 5.01
$$ ##ORIGIN= Bruker BioSpin GmbH
$$ ##OWNER= she
$$ F:/spectra/data/she/nmr/H-F/1/pdata/1/auditp.txt
$$ ##AUDIT TRAIL=  $$ (NUMBER, WHEN, WHO, WHERE, WHAT)
(   1,<2021-12-07 12:05:24.76 +0400>,<she>,<DPX200>,
      <created by zg, POWCHK disabled, PULCHK disabled
       configuration hash MD5:
       00 E9 B6 7A A2 85 ED C7 34 08 36 98 17 FE 4E 26
       data hash MD5: 16K
       DE 41 EE F1 1E 71 D8 2A BF FE CF 5F 11 15 4A 10>)
(   2,<2021-12-07 12:05:29.12 +0400>,<she>,<DPX200>,
      <Start of raw data processing
       efp BC_mod = 2 LB = 0.24 FT_mod = 6 PKNL = 1 PHC0 = -15510.28 PHC1 = 7.6008 SI = 16K 
       data hash MD5: 16K
       7F 83 8A F5 E2 92 F3 67 B5 EF 63 79 0E E3 90 32>)
(   3,<2021-12-07 12:05:46.12 +0400>,<she>,<DPX200>,
      <pk PHC0 = 0.1134136 PHC1 = 0.5999998 
       data hash MD5: 16K
       B5 E7 94 FF 31 1D D6 B0 24 A9 EA 10 FC 68 EA 1B>)
(   4,<2021-12-07 12:05:49.18 +0400>,<she>,<DPX200>,
      <abs ABSG = 5 
       data hash MD5: 16K
       C8 3D 6E 8C 39 58 09 19 C3 D8 98 19 0A 6B 2C 33>)
(   5,<2021-12-07 12:06:12.56 +0400>,<she>,<DPX200>,
      <abs ABSG = 5 
       data hash MD5: 16K
       44 BE A1 A8 1C FF A1 5A 56 5C 07 8A CE 53 C7 D5>)
$$ ##END=
$$ 
$$ hash MD5
$$ 37 6F 96 59 F6 75 97 75 3D 85 1F E7 B9 E0 C7 AF
##$RELAX= 
##$RELAX= 
##$RELAX= 
##$RELAX= 
##$RELAX= 
##$RELAX= 
$$ Bruker specific parameters
$$ --------------------------
##$DU= <F:/spectra>
##$EXPNO= 1
##$NAME= <H-F>
##$PROCNO= 1
##$TYPE= <nmr>
##$USER= <she>
##$AMP= (0..31)
100 100 100 100 100 100 100 100 100 100 100 100 100 100 100 100 100 100 
100 100 100 100 100 100 100 100 100 100 100 100 100 100 
##$AQSEQ= 0
##$AQ_mod= 1
##$AUNM= <au_zg>
##$AUTOPOS= <>
##$BF1= 200.13
##$BF2= 200.13
##$BF3= 200.13
##$BF4= 200.13
##$BF5= 200.13
##$BF6= 200.13
##$BF7= 200.13
##$BF8= 200.13
##$BYTORDA= 1
##$CFDGTYP= 0
##$CFRGTYP= 5
##$CHEMSTR= <none>
##$CNST= (0..31)
1 1 145 1 1 1 1 1 1 1 1 1 1 1 1 1 1 1 1 1 1 1 1 1 1 1 1 1 1 1 1 1 
##$CPDPRG= <>
##$CPDPRG1= <>
##$CPDPRG2= <>
##$CPDPRG3= <>
##$CPDPRG4= <mlev>
##$CPDPRG5= <mlev>
##$CPDPRG6= <mlev>
##$CPDPRG7= <mlev>
##$CPDPRG8= <mlev>
##$CPDPRGB= <>
##$CPDPRGT= <>
##$D= (0..31)
0 1.2 0 0 0 0 0 0 0 0.06 0 0.03 0 0 0 0 0.0002 0 0 0 0 0 0 0 0 0 0 0 0 
0 0 0 
##$DATE= 1638864324
##$DBL= (0..7)
$$ [...]
##$SUBNAM2= <"">
##$SUBNAM3= <"">
##$SUBNAM4= <"">
##$SUBNAM5= <"">
##$SUBNAM6= <"">
##$SUBNAM7= <"">
##$SUBNAM8= <"">
##$SUBNAM9= <"">
##$SW= 18.0517287032376
##$SWIBOX= (0..15)
0 0 2 0 0 0 0 0 0 0 0 0 0 0 0 0 
##$SW_h= 3612.71676300578
##$TD= 16384
##$TD0= 1
##$TE= 0
##$TE2= 300
##$TE3= 300
##$TEG= 300
##$TL= (0..7)
0 120 120 120 120 120 120 120 
##$TP= (0..7)
150 150 150 150 150 150 150 150 
##$TP07= 0
##$TPNAME0= <>
##$TPNAME1= <>
##$TPNAME2= <>
##$TPNAME3= <>
##$TPNAME4= <>
##$TPNAME5= <>
##$TPNAME6= <>
##$TPNAME7= <>
##$TPOAL= (0..7)
0.5 0.5 0.5 0.5 0.5 0.5 0.5 0.5 
##$TPOFFS= (0..7)
0 0 0 0 0 0 0 0 
##$TUNHIN= 0
##$TUNHOUT= 0
##$TUNXOUT= 0
##$USERA1= <user>
##$USERA2= <user>
##$USERA3= <user>
##$USERA4= <user>
##$USERA5= <user>
##$V9= 5
##$VALIST= <valist>
##$VCLIST= <CCCCCCCCCCCCCCC>
##$VD= 0
##$VDLIST= <DDDDDDDDDDDDDDD>
##$VPLIST= <PPPPPPPPPPPPPPP>
##$VTLIST= <TTTTTTTTTTTTTTT>
##$WBST= 1024
##$WBSW= 4
##$XGAIN= (0..3)
0 0 0 0 
##$XL= 0
##$YL= 0
##$YMAX_a= 632568
##$YMIN_a= -851867
##$ZGOPTNS= <>
##$ZL1= 120
##$ZL2= 120
##$ZL3= 120
##$ZL4= 120
##$ABSF1= 15.73146
##$ABSF2= -2.32039
##$ABSG= 5
##$ABSL= 3
##$ALPHA= 0
##$AQORDER= 0
##$ASSFAC= 0
##$ASSFACI= 0
##$ASSFACX= 0
##$ASSWID= 0
##$AUNMP= <proc_1d>
##$AZFE= 0.1
##$AZFW= 0.1
##$BCFW= 0
##$BC_mod= 2
##$BYTORDP= 0
##$COROFFS= 0
##$CY= -3
##$DATMOD= 1
##$DC= 0
##$DFILT= <>
##$DTYPP= 0
##$F1P= 0
##$F2P= 0
##$FCOR= 1
##$FTSIZE= 16384
##$FT_mod= 6
##$GAMMA= 0
##$GB= 0
##$INTBC= 1
##$INTSCL= 0
##$ISEN= 128
##$LB= 0.24
##$LEV0= 0
##$LPBIN= 0
##$MAXI= 10000
##$MC2= 0
##$MEAN= 0
##$ME_mod= 0
##$MI= 1.114404
##$NCOEF= 0
##$NC_proc= -4
##$NLEV= 6
##$NOISF1= 3.799351
##$NOISF2= 2.8
##$NSP= 0
##$NTH_PI= 0
##$NZP= 0
##$OFFSET= 15.73146
##$PC= 1
##$PHC0= -15510.17
##$PHC1= 8.2008
##$PH_mod= 1
##$PKNL= yes
##$PPARMOD= 0
##$PSCAL= 0
##$PSIGN= 0
##$REVERSE= no
##$SF= 200.130004020279
##$SI= 16384
##$SIGF1= 3
##$SIGF2= 2
##$SINO= 5.538805
##$SIOLD= 16384
##$SREGLST= <1H.CDCl3>
##$SSB= 0
##$STSI= 16384
##$STSR= 0
##$SW_p= 3612.71676300578
##$SYMM= 0
##$S_DEV= 0
##$TDeff= 16384
##$TDoff= 0
##$TI= <>
##$TILT= no
##$TM1= 0
##$TM2= 0
##$TOPLEV= 0
##$USERP1= <user>
##$USERP2= <user>
##$USERP3= <user>
##$USERP4= <user>
##$USERP5= <user>
##$WDW= 1
##$XDIM= 16384
##$YMAX_p= 385626992
##$YMIN_p= -322718
$$ End of Bruker specific parameters
$$ ---------------------------------
##NTUPLES= NMR SPECTRUM
##VAR_NAME=  FREQUENCY,     SPECTRUM/REAL,   SPECTRUM/IMAG
##SYMBOL=    X,             R,               I
##VAR_TYPE=  INDEPENDENT,   DEPENDENT,       DEPENDENT
##VAR_FORM=  AFFN,          ASDF,            ASDF
##VAR_DIM=   16384,         16384,           16384
##UNITS=     HZ,            ARBITRARY UNITS, ARBITRARY UNITS
##FACTOR=    0.220516191357247, 1,           1
##FIRST=     3148.3370765181, 0,             0
##LAST=      -464.379686487684, 0,           0
##MIN=       -464.379686487684, -322718,     0
##MAX=       3148.3370765181, 385626992,     0
$$ Real data points
##PAGE= N=1
##DATA TABLE= (X++(R..R)), XYDATA
$$ [...]
7336B1228K1002O075j3503P849K5874K1120j6043J5386L0780R125q026K366k9522
7323I3711N747K1617J2235Q956N037K2321l020r782J4979Q467R117K4383N962
7310B19730j5391K72J1159J8190K1973J5217k0977j5892p995N525j4682l976M034
7297B17187k5310n722J786J1162K2489k1085N977Q450l832k2996J247k247n451
7284A81655L3156k57J5299k0810k5169J0351O99O276j5817K0081M746j4964J2750
7271B07996q498J3538l1970k5480K1584j1678n664J1262k113J719M94k7939K4405
7258A67656R522J4947K982J9180J7449K766q097J1356L6560N392O0520r921K0349
7245C50661L8387K6493K7536K040J9608P86J327K133Q231L0494j4695J1879K8050
$$ plain form
7336 21228 42230 48305 34802 42651 68525 89645 73602 88988 119768 128893 120867 123233 93711
7323 93711 99458 121075 133310 142266 147303 169624 166604 156822 171801 180268 189385 213768 219730
7310 219730 204339 204611 215770 233960 255933 271150 250173 234281 226286 231811 217129 213153 217187
7297 217187 191877 186155 187941 199103 221592 200507 206484 214934 211102 188106 189353 187106 181655
7284 181655 214811 214554 229853 209043 183874 194225 194924 201200 185383 205464 210210 195246 207996
7271 207996 199498 213036 181066 155586 177170 165492 159828 171090 168977 170696 171190 143251 167656
7258 167656 177178 192125 195107 214287 231736 234502 226405 237761 274321 279713 340233 330312 350661
7245 350661 389048 415541 443077 445117 464725 465511 466838 468971 477202 507696 493001 504880 532930
7232E32930N71K0225J6072k593J3396J4579n13k5217K2052L5740J3954K2005L7913
7219G01114j080J0787L3583L0275K8632L0824n098j4788K134l331K0443L4232
7207H67727K6621j8884j2218L1002N0296Q544K1904J4007O165L0282K5285j0828
7195A039903Q827J8619L319M522J5325M622j6484K5272M5208M0435M1594M4476
7183A275638O4076M266K4214M6363J0525J7557K2992M0071J3985K0327M3657N9129
7171A642800N9009L1284L1232L4286J9334J974K7098N8217N0640Q8681R8005Q7932
7159B230492Q9999R5662Q3483Q4451Q6976O3002N5835O6480N8091L4183N8522
7148C007176M7991N5828K7607M4991J9269K0164J8491L1605M9873O2219P2685
$$ plain form
7232 532930 533501 553726 569798 567205 580601 595180 594667 569450 591502 627242 641196 663201 701114
7219 701114 700034 710821 744404 774679 803311 834135 829037 814249 816383 813052 833495 867727
7207 867727 894348 875464 863246 894248 944544 953088 974992 988999 995164 1025446 1050731 1039903
7195 1039903 1048730 1067349 1070668 1075190 1090515 1095137 1078653 1103925 1149133 1189568 1231162 1275638
7183 1275638 1339714 1343980 1368194 1414557 1425082 1442639 1465631 1505702 1519687 1540014 1583671 1642800
7171 1642800 1701809 1733093 1764325 1798611 1817945 1819919 1847017 1905234 1955874 2044555 2142560 2230492
7159 2230492 2320491 2416153 2499636 2584087 2671063 2734065 2789900 2856380 2914471 2948654 3007176
7148 3007176 3055167 3110995 3138602 3183593 3202862 3223026 3241517 3273122 3322995 3385214 3457899
7137C457899O9292M9544Q3185N6707L9329R9523O8688J02881J56651J46613J82750
7126D513062K12503K44714K64926K29526K38249K64552K68550K60233K72243L24141
7116G092699L70719L81537L38655L90144M08275M04359M30061M18134M30737M53107
7106A1118427N35814N63503O99154P73807R05127J038458J164538J290287J499511
7097A9588626J710012J967944K346692K760421L240853L821229M417634N049828
7089D4903239N824390O659615P675283Q918582J0100842J1104798J1203347J0099199
7081A16489295N230828k272650r940831j5791428j7107098j4792707j1375328
7074E0440081q469546o296707m845689l819123l089894k451791k016295j547879
$$ plain form
7137 3457899 3527191 3576735 3659920 3716627 3755956 3855479 3924167 4027048 4183699 4330312 4513062
7126 4513062 4725565 4970279 5235205 5464731 5702980 5967532 6236082 6496315 6768558 7092699
7116 7092699 7463418 7844955 8183610 8573754 8982029 9386388 9816449 10234583 10665320 11118427
7106 11118427 11654241 12217744 12916898 13690705 14595832 15634290 16798828 18089115 19588626
7097 19588626 21298638 23266582 25613274 28373695 31614548 35435777 39853411 44903239
7089 44903239 50727629 57387244 65062527 73981109 84081951 95186749 106390096 116489295
7081 116489295 121720123 119447473 109506642 93715214 76608116 61815409 50440081
7074 50440081 41970535 35673828 30828139 27009016 23919122 21467331 19451036 17903157
7066A7903157j292669j117320j012214r07951q57967q10193p29171o48434o09383
7057I917855n36170m83825m72527m57001m21331l59136l17416k96561k65762k35302
7047F072824j81707j87526j85973j61893j70136j47096j69180k27277j61824j32063
7037D348149j28402q8030q8872q2802p2207q1989j03218j32969j36899j38198
7027C294563j18765j24768j11489j01208q8207q4502n0779q5940o4733r6389j50369
7016B217414j15175j00241p5347p6993j07985m4476k8015l2436l0057j1453j9789
7005A575447j5360j0988J0050J9256p833l312n5215l9047n8627q5991q2580o3990
6993A181810r0875o7632m8427o0768k6700k7962j5826n2844n6250l3880l3990
$$ plain form
7066 17903157 16610488 15493168 14480954 13573003 12715036 11904843 11175672 10527238 9917855
7057 9917855 9381685 8897860 8425333 7968332 7547001 7187865 6870449 6573888 6308126 6072824
7047 6072824 5891117 5703591 5517618 5355725 5185589 5038493 4869313 4642036 4480212 4348149
7037 4348149 4219747 4131717 4042845 3960043 3887836 3805847 3702629 3569660 3432761 3294563
7027 3294563 3175798 3051030 2939541 2838333 2750126 2665624 2614845 2528905 2464172 2367783 2217414
7016 2217414 2102239 2001998 1926651 1849658 1741673 1697197 1669182 1636746 1606689 1595236 1575447
7005 1575447 1560087 1549099 1559149 1578405 1570572 1567260 1512045 1472998 1414371 1328380 1245800 1181810
6993 1181810 1090935 1023303 974876 914108 887408 859446 843620 790776 734526 700646 666656
6982F66656N236k2066m7326k3607J9948q443J5021n143j598L215k8945m5015k6253
6969E01680m6016n8113l9843j8393J031r574m790r484j1993R23j2082N206n843
6956B92709R146K893k0047P054r687j6710k9373m4180J2812P406N028j3063J3165
6943B17153J9288j2154r899J4082J7784J5476K1112J6187p681k7254k1553k6497
6931B16044l678J4228j6623k0700K9051j1454q898O81O773K813M068J2167P712
6918B32184J2484Q250L741J1979n413j1625J1837j550j0156J6620j2303j7559
6906B38489J5937j7508m886o198p830M197j0312k2508l331N434r454j8616j037
6893A62377r233m7063o060j2167J0293l3069j5743j048N292k309j1692J4543r269
$$ plain form
6982 666656 671892 649826 602500 578893 598841 590398 605419 600276 598678 601893 572948 527933 501680
6969 501680 455664 397551 357708 339315 340346 330772 325982 316498 304505 305428 293346 298552 292709
6956 292709 301855 304748 284701 291755 282068 265358 235985 191805 204617 212023 217051 203988 217153
6943 217153 236441 224287 214388 228470 246254 261730 282842 299029 291348 264094 242541 216044
6931 216044 212366 226594 209971 189271 218322 206868 197970 198651 205424 208237 212305 224472 232184
6918 232184 244668 252918 256659 268638 263225 251600 263437 261887 251731 268351 256048 238489
6906 238489 254426 236918 232032 225834 218004 222201 211889 189381 186050 191484 182030 163414 162377
6893 162377 153144 106081 100021 87854 98147 65078 49335 48287 53579 51270 39578 54121 44852
6880D4852k3911j5010L2737j0797j8358J4189J5290n684k5339k0493K2781J4976
6868B5233j9132k6544J5107m4717l6051L095M432q769j5644j140P285m546K745
6855i8646M449j9588J6996J2710J285P124K8690J5768J0796j7136l3090J8167
6843e2475R853K0432j4546k9330l180J7900j3370K2723J0948l5222J5075J2362
6831c8830K261J1964K4509r557p413K1440j1389j2091K123m48J6914K369j2451
6818a0599k1581n452m013k537l30q426o277n629J1672M552N81J7277n224k263
6804c8249k1285j0476q306K0003K095Q690j3302k3805J9929J3887p903j8258M72
6791g6508j4545k587J6454J0498j0202j3473K1264q70j0248J3007K7533j2656
$$ plain form
6880 44852 20941 5931 38668 27871 9513 23702 38992 33308 7969 -12524 10257 25233
6868 25233 6101 -20443 -5336 -50053 -86104 -83009 -78577 -87346 -102990 -104130 -96845 -101391 -98646
6855 -98646 -94197 -113785 -96789 -84079 -82794 -75670 -46980 -31212 -20416 -37552 -70642 -52475
6843 -52475 -42622 -22190 -36736 -66066 -69246 -51346 -64716 -41993 -31045 -66267 -51192 -38830
6831 -38830 -36569 -24605 -96 -9653 -17066 4374 -7015 -19106 -16983 -17431 -517 1852 -10599
6818 -10599 -32180 -37632 -41645 -44182 -44512 -52938 -59215 -64844 -53172 -48620 -48039 -30762 -35986 -38249
6804 -38249 -59534 -70010 -78316 -58313 -56218 -47528 -60830 -84635 -64706 -50819 -58722 -76980 -76508
6791 -76508 -91053 -93640 -77186 -66688 -76890 -90363 -69099 -69969 -80217 -67210 -39677 -52333
6779e2333n640J3041r967J7184M408k5901l037r225R281K2312q547J6521qj5689
6765d7600l958J4031J095r975K1317j0343r345r949J1405l4581J7217J2565o783
6752e4904L962J4170L469l406j0598l20L0431P742l251j6700k4773L6549K4139
6739F510l7414k756M3828J2824n403K790n787O137P781o115J862j1200J4716K2663
6725E0436j9219J0559L626L392r351k2661l650J0708j5316m061k286o713j4643
6712a9179l017j7007J8473P663K6213k1236j2708N152Q624k02J0771J0879j3818
6699F08R299J0320K104M1758J5333P820l038L0510K3882L6566K7728L4586N0005
6686B87481O504N4050N2882M3343L4948N3048L6802j6614j1237p0653r0933r1008
$$ plain form
6779 -52333 -57973 -44932 -54899 -37715 -33307 -59208 -62245 -71470 -62189 -39877 -48424 -31903 -31911 -47600
6765 -47600 -51558 -37527 -36432 -46407 -25090 -35433 -44778 -54727 -43322 -77903 -60686 -48121 -54904
6752 -54904 -50942 -36772 -33303 -36709 -47307 -47627 -17196 -9454 -12705 -29405 -54178 -17629 6510
6739 6510 -30904 -33660 10168 22992 17589 20379 14592 20729 28510 22395 24257 13057 27773 50436
6725 50436 31217 41776 45402 48794 39443 16782 13132 23840 8524 4463 2177 -4536 -19179
6712 -19179 -22196 -39203 -20730 -13067 13146 -8090 -20798 -15646 -7022 -7224 3547 14426 608
6699 608 9907 20227 22331 64089 79422 87242 84204 114714 138596 175162 202890 237476 287481
6686 287481 293985 348035 400917 444260 479208 532256 569058 552444 541207 470554 379621 288613
6674B88613m1140o6435n2227k1823m780k0421k4237J4879j6110l3059j4750L6857
6662D5367k2425m540P34L054q291j4736j0331k6741Q648J9679j1117J7156J5852
6649A2309j9003j6564p406K6957j7534r281j746j7672R966K9359j779k9773J9496
6636b2671J5983n396p609j2635j9700R69M348Q922k6209o244M0926k371j2499
6623d4186p706q926j2897M973L3549j5866k1669o904J7707r10K3666l526q643
6610e1338n677P910j5207O6R185L597j7247K247K8162k1897q130K9437Q238j2112
6596d2766j57K955j0676J5822L00R588j2788R489k9769j2764O965j8253J9994
6583f2060K7251J5818k8985k1608j1811J2460R855Q847J2871J7933l2667K125
$$ plain form
6674 288613 247473 181038 128811 106988 102208 81787 57550 72429 56319 23260 8510 45367
6662 45367 22942 18402 19136 22190 13899 -837 -11168 -37909 -29261 -9582 -20699 -3543 12309
6649 12309 -6694 -23258 -30664 -3707 -21241 -30522 -32268 -49940 -39974 -10615 -12394 -42167 -22671
6636 -22671 -6688 -12084 -19693 -32328 -52028 -51059 -46711 -37789 -63998 -70242 -29316 -31687 -44186
6623 -44186 -51892 -60818 -73715 -68742 -35193 -51059 -72728 -79632 -61925 -62835 -39169 -42695 -51338
6610 -51338 -57015 -49105 -64312 -64246 -55061 -51464 -68711 -66464 -38302 -60199 -68329 -38892 -30654 -42766
6596 -42766 -42923 -39968 -50644 -34822 -34522 -24934 -37722 -28233 -58002 -70766 -63801 -82054 -62060
6583 -62060 -34809 -18991 -47976 -69584 -81395 -68935 -59080 -50233 -37362 -19429 -52096 -49971
6571d9971Q755J0576L722j6174j2427k5005N311J5160m474J4867J3458m986r412
6558e0600M892M861r371j0078l021k730K2069J4734j1688j165j6564K727l705
6545e9639J0744m811O387K2669l384P874j2665k890L356J2721Q492k15J2985r093
6531g469j9812j1267O784K3642j007k7843J63J1429K1494N124k0787L3549K149
6518A6149N977K057J0504J5533J7252j0896o145j6577J1569L2016n741O460J6792
6505I4950r679L956l543K8416J135N847k090j3836j1351l871j3365k646J0305
6492H4228Q096K7485O229p968r224J9788J2733j5710o191K7556n623j2001j4180
6479A15218J0083Q769j1283j3397j012n369J665k7226L4914J7607l201k8284j82
$$ plain form
6571 -49971 -41216 -30640 -26918 -43092 -55519 -80524 -75213 -60053 -64527 -49660 -36202 -41188 -50600
6558 -50600 -45708 -40847 -50218 -60296 -63317 -66047 -43978 -29244 -40932 -42097 -58661 -55934 -59639
6545 -59639 -48895 -53706 -47319 -24650 -28034 -20160 -32825 -35715 -32359 -19638 -11146 -11361 1624 -7469
6531 -7469 -27281 -38548 -31764 -8122 -9129 -36972 -36809 -25380 -3886 1238 -19549 14000 16149
6518 16149 22126 24183 34687 50220 67472 56576 50431 33854 45423 77439 71698 78158 94950
6505 94950 85271 89227 85684 114100 115235 121082 118992 105156 93805 89934 76569 73923 84228
6492 84228 92324 119809 126038 118070 108846 128634 141367 125657 119466 147022 141399 129398 115218
6479 115218 125301 134070 122787 109390 108378 103009 104674 77448 112362 129969 126768 98484 98302
6466I8302J3036j5695j1279K1917J3231J947j3530k5641j657L3436J011r928j7326
6453H7824k8185l556P122J4354k7651J8436j4525j5549J2888o306R487j2327j6372
6440B5640K6168P34l1124K4684q926J2547K0074k2914j3288j3841J2361J393P469
6427D0977j8678J3929j62k4963N380N999j4156M687K4998J5572j1548k334p892
6414C1809j7351K0101K898P616J2806j8067J111K996L161k7K7923K938m7891l0959
6400i36R686K8580L784j1892J5856J4709j0091j1061N189k675j0889j0143M616
6387B4733J3173Q71r483j172J097M2565M602l5750K297R974K0683l480q828J4152
6373G5434J9199j0699j6823j5779n492J6650K9399K294J1975J4894K5722J2401
$$ plain form
6466 98302 111338 95643 84364 106281 119512 121459 107929 82288 80631 114067 115078 105150 87824
6453 87824 59639 56083 63205 77559 49908 68344 53819 38270 51158 44852 54339 42012 25640
6440 25640 51808 52542 21418 46102 37176 49723 69797 46883 33595 19754 32115 33508 40977
6427 40977 22299 36228 36066 11103 16483 22482 8326 13013 38011 53583 42035 39701 31809
6414 31809 14458 34559 37457 45073 57879 39812 40923 43919 47080 47053 74976 77914 30023 -936
6400 -936 8750 37330 41114 29222 45078 59787 49696 38635 43824 41149 30260 20117 24733
6387 24733 37906 38777 29294 28122 29219 71784 76386 40636 42933 52907 73590 70110 61282 75434
6373 75434 94633 83934 67111 51332 45840 62490 91889 94183 106158 121052 146774 159175
6361A59175Q5J9491K2712k865P263l4o504j7765J978j3642k318K0159j1572p996
6347A68167O836J1608Q149j6617l6166m468k2999p445r256O196l04J36j5068Q014
6333I6783K375p595K485l900j4738J0708R907O053P215k0374J3212K4082N420
6320A31633j555k328J2051J1448R582L9810J2071K5321K131j9923M1543K1149
6308B82933m404J0611o978r324j4685J1118N522K1770J567j6940k235J3863R691
6295C02509R005l9847k7208j7716j5711j8969K0848p54l7923M367J862j0655r624
6282A60184o881J7681P842o659N631K5130P035J6694l180j6640J4785M249N701
6269B31572L683J721j2482l952j2705l561N184K360N107N82J1753k771j4766j4026
$$ plain form
6361 159175 159260 178751 201463 198598 205861 205827 199323 181558 183536 169894 167576 187735 176163 168167
6347 168167 175003 186611 194760 178143 141977 137509 114510 107065 97809 104005 103701 103837 88769 96783
6333 96783 99158 91563 94048 90148 75410 86118 96025 102078 109293 88919 102131 126213 131633
6320 131633 130078 127750 139801 151249 160831 200641 212712 238033 240164 220241 261784 282933
6308 282933 278529 289140 282162 272838 258153 269271 274793 296563 298130 281190 278955 292818 302509
6295 302509 311514 271667 244459 226743 211032 192063 212911 212157 174234 178601 180463 169808 160184
6282 160184 153303 170984 178826 172167 177798 202928 209963 226657 223477 206837 221622 225871 231572
6269 231572 235255 236976 224494 220542 207837 204276 209460 211820 216927 217509 229262 226491 211725 197699
6255A97699p789J2042O620K3099j6830k1473J3141P329N372O09O476K89Q474o315
6241B28743m4765K7442J7317L07Q363j0446j2575N076k1757J7691k1485o042Q484
6228A96353L1982J3698k5978Q54q589N919Q884p63K6482m268q232L2834l536J3510
6214B79150L0307N865o959j6825r434N112P822M144J9176J4819j2530Q604Q097
6201C37348n911m41j1238K8355J8758J4011K3279j4260n746N828J6464J5731J2204
6188D34382j5825l148L3804j9231M678K4648J3834Q115o161J8761O749J9181K2054
6175E41841J583K8859j2803J1647k7160J0558K6040j6099J5789K3453K6166l133
6163F26741J0378p940L1948j3620k2365l4442L488M908l201K2541J2129n349L2217
$$ plain form
6255 197699 189910 201952 208572 231671 214841 193368 206509 213838 219210 219819 226295 226584 235058 228743
6241 228743 183978 211420 228737 229044 237407 226961 214386 219462 197705 215396 193911 187869 196353
6228 196353 228335 242033 216055 216909 208320 214239 223123 222360 248842 244574 236342 269176 265640 279150
6214 279150 309457 315322 308363 291538 282104 287216 295038 299182 318358 333177 320647 329251 337348
6201 337348 331437 330996 319758 348113 366871 380882 404161 389901 384155 389983 406447 422178 434382
6188 434382 418557 415409 449213 429982 434660 459308 473142 481257 475096 493857 500606 519787 541841
6175 541841 543424 572283 559480 571127 543967 554525 580565 564466 580255 603708 629874 626741
6163 626741 637119 629179 661127 647507 625142 590700 594188 599096 595895 618436 630565 625216 657433
6150F57433J2618R403N475j777l938K2504K0667J1552K6653K9984M945K2873J4765
6137H33157J3501K4075K4931J9326J4682K0164M683N1807N4478K3483l701L9471
6125A120057J5591K8420N5633J2808L2524l786J0955R206j4103K3163M4774L3389
6113A368631O4088M3095J8944O1097K9411J2386K0784N537R073J9738K8338K0918
6101A702040K9234L4951K9124M7896M3376L5312L7391J1891J3066M1079O3096
6090B088456L5919O788M2121L9498M1886L0356M5640J2828L5053N2754O9879M8766
6078B549944M5073O6994O4215R8455R8977O9320J07016R6320J04361R4375J10053
6067C505103J29296J40672J64509J47602J30303J49688J89414J75479J89492K12341
$$ plain form
6150 657433 670051 679454 684929 683152 679214 701718 722385 733937 760590 790574 795519 818392 833157
6137 833157 846658 870733 895664 914990 929672 949836 954519 1006326 1060804 1084287 1080586 1120057
6125 1120057 1135648 1164068 1219701 1232509 1265033 1261247 1272202 1281408 1267305 1290468 1335242 1368631
6113 1368631 1432719 1475814 1494758 1555855 1585266 1597652 1618436 1623973 1633046 1652784 1681122 1702040
6101 1702040 1731274 1766225 1795349 1843245 1886621 1921933 1959324 1971215 1984281 2025360 2088456
6090 2088456 2124375 2131163 2173284 2212782 2254668 2285024 2330664 2343492 2378545 2431299 2501178 2549944
6078 2549944 2595017 2662011 2726226 2824681 2923658 2992978 3099994 3196314 3300675 3395050 3505103
6067 3505103 3634399 3775071 3939580 4087182 4217485 4367173 4556587 4732066 4921558 5133899
6057E133899K29487K05168K12645K58246K79887L26130L13971L91241M40845M61757
6047H253276N10273N67280O64005P52318R30529J099576J279279J521027J678176
6038A7255739J902567K137173K338170K302635K051818K101052K639892K778966
6030C5508012J305243j017347k496800k325364j311158l56566L75698O42337O42394
6021C0966449Q17558J380291J322811m96480k941774m227190l934376l029609
6013A9857680k206787j679172j247551r97709q16423o09188m61453l05204j76480
6004A1357713j22244l2661L3330R3094J73519K67990K89721L79902M45419N31517
5994A3417300O18484P41339R42428J220401J454446J691779J980960K294436K603663
$$ plain form
6057 5133899 5363386 5568554 5781199 6039445 6319332 6645462 6959433 7350674 7791519 8253276
6047 8253276 8763549 9330829 9994834 10747152 11677681 12777257 14056536 15577563 17255739
6038 17255739 19158306 21295479 23633649 25936284 27988102 30089154 32729046 35508012
6030 35508012 36813255 35795908 33299108 30973744 29662586 29306020 29681718 30324055 30966449
6021 30966449 31784007 33164298 34487109 33990629 31048855 26821665 22887289 19857680
6013 19857680 17650893 15971721 14724170 13726461 12910038 12300850 11839397 11534193 11357713
6004 11357713 11235469 11202808 11236138 11329232 11502751 11770741 12060462 12440364 12885783 13417300
5994 13417300 14035784 14777123 15719551 16939952 18394398 20086177 22067137 24361573 26965236
5985B6965236K879741L002406K751432K537204K918061L590078K833788J63557
5977D7641503k616577l446245k597541j278850j00285N44980O31381O81056J199216
5968D0658638J737053N59397k439186n169500n764837m907736l770918k818589
5960A8084322k179286j768147j456419j262634j021586q07249o50027n27957m96393
5951G914624m16280l94167l66283l40222l18098k83619k13638k27972k28647j98216
5941D927482j99446j58565j67134j70972j34741j30939j06394q2048j07226j16494
5931C553523j14307j23560j06469q6566r4820r6978p2172p8765n0414n0827q9732
5920B588913m9785l4077n4731q3658p5166p3669o3577o5557p3591n6313o7880
$$ plain form
5985 26965236 29844977 32847383 35598815 38136019 41054080 44644158 47477946 47641503
5977 47641503 45024926 41578681 38981140 37702290 37602005 38146985 38778366 39459422 40658638
5968 40658638 42395691 42955088 40515902 35346402 29581565 24673829 20902911 18084322
5960 18084322 15905036 14136889 12680470 11417836 10396250 9589001 8938974 8411017 7914624
5951 7914624 7498344 7104177 6737894 6397672 6079574 5795955 5582317 5354345 5125698 4927482
5941 4927482 4728036 4569471 4402337 4231365 4096624 3965685 3859291 3777243 3670017 3553523
5931 3553523 3439216 3315656 3209187 3122621 3027801 2930823 2858651 2779886 2729472 2678645 2588913
5920 2588913 2539128 2505051 2450320 2366662 2291496 2217827 2154250 2088693 2015102 1958789 1890909
5909A890909k2123m5054j9675k8036o5470m8449k6718l7352l5296m0988l1663
5898A490085j7072k4653l5096k6130j3547o925o600J3579k6147k1822P218J2776
5886A345666j7259l384l6773n9789m0750k4700l9188o3020j6477o265k101l6653
5874I99307k9862M711J5231m8244l2505l5635j3048j1939p507j8532K0986J631
5862H44594k1176K2115L086K7335q857k6116J416r705M248m362q746J3310q489
5849H28653k499J473o44j6791j289K398l012m4735J4684J4691M1428J7237o917
5836H44677p597O768J4922o963L595K0434K0177p776N414n32J3263l0698J9494
5823H95178R025L2381j4855j1211K0078k840o462K929Q15L189J4645J8999K0916
$$ plain form
5909 1890909 1868786 1823732 1804057 1776021 1710551 1662102 1635384 1598032 1562736 1521748 1490085
5898 1490085 1473013 1448360 1413264 1387134 1373587 1366662 1360062 1373641 1347494 1325672 1332890 1345666
5886 1345666 1328407 1325023 1288250 1228461 1187711 1163011 1123823 1060803 1044326 1038061 1035960 999307
5874 999307 969445 974156 989387 941143 908638 873003 859955 848016 840509 821977 842963 844594
5862 844594 823418 845533 848619 875954 867097 840981 842397 832692 836940 832578 823832 837142 828653
5849 828653 826154 827627 826983 810192 808903 811301 808289 763554 778238 792929 834357 851594 844677
5836 844677 837080 843848 858770 851807 855402 875836 896013 888237 893651 893119 906382 875684 895178
5823 895178 904203 936584 921729 910518 930596 927756 921294 924223 925038 928227 942872 961871 982787
5810I82787P507J1192j226k144M4193o35n224M7529N956J8387j1127J3906j4401
5797A096700k178k157k273r15k900L1661l644J8870L387o948L6884N0872L5584
5784A252943l4J890k399q833L5739M0175j3151q470j5637J2155m601J0871M1857
5771A342505N992J844J5615K8490J9942J5880K8086N4389K5505L0067M5611N4037
5759A667963M3798N0987L6954K6318M9629K4148J0832M9498N2678K4226M5030
5748B082061P33p429M6818Q416J695M2609M4229L6621K1344M5596L2589R5016
5736B450298P3999N2761O8544N8156O4863O1591J08346J40481R8700P8278J21854
5725C377871R5693J02185J14645J09822R5583R9679Q9428J07993J10658J42162
$$ plain form
5810 982787 990294 1001486 1000260 998116 1042309 1041674 1036450 1083979 1089935 1108322 1097195 1111101 1096700
5797 1096700 1094522 1092365 1090092 1089177 1086277 1117938 1114294 1133164 1136551 1129603 1166487 1217359 1252943
5784 1252943 1252909 1254799 1252400 1243567 1279306 1319481 1306330 1297860 1282223 1294378 1289777 1300648 1342505
5771 1342505 1348497 1350341 1365956 1394446 1414388 1430268 1458354 1512743 1538248 1568315 1613926 1667963
5759 1667963 1711761 1762748 1799702 1826020 1875649 1899797 1910629 1960127 2012805 2037031 2082061
5748 2082061 2082794 2075365 2122183 2130599 2132294 2174903 2219132 2255753 2277097 2322693 2355282 2450298
5736 2450298 2524297 2577058 2645602 2703758 2768621 2830212 2938558 3079039 3177739 3256017 3377871
5725 3377871 3473564 3575749 3690394 3800216 3895799 3995478 4084906 4192899 4303557 4445719
5715D445719J39683J66527J63913J77631J96820K22093K32823K45669K46921L03076
5705F540875L51837L98012M76306N29890N53585O41655P00679P86328R49348J139468
5695A3067983J413868J682644J962396K197144K304292K008094J287458Q14370
5687B6738249J028084J551016K135626K385240J643114l32025k323388l461224
5679B9364692l682852l124637k280343j566088j059720o49493m09047j29834J41990
5670A6604668M50175P38269J138112J478809J779885K101915K175652J927352
5662B8394837J188515O60531Q40088J414208K060134K349573J647176l91387k535602
5653C5628073l769920m040100l478441k653468j875724j283795q67422n41727
$$ plain form
5715 4445719 4585402 4751929 4915842 5093473 5290293 5512386 5745209 5990878 6237799 6540875
5705 6540875 6892712 7290724 7767030 8296920 8850505 9492160 10192839 10979167 11928515 13067983
5695 13067983 14481851 16164495 18126891 20324035 22628327 24636421 25923879 26738249
5687 26738249 27766333 29317349 31452975 33838215 35481329 35149304 32825916 29364692
5679 29364692 25681840 22557203 20276860 18710772 17651052 17001559 16592512 16462678 16604668
5670 16604668 17054843 17793112 18931224 20410033 22189918 24291833 26467485 28394837
5662 28394837 29583352 30243883 31083971 32498179 34558313 36907886 38555062 38163675 35628073
5653 35628073 31858153 27818053 24339612 21686144 19810420 18526625 17659203 17117476
5645A7117476j65796J32918M62138P90235J096327J304568J322028R97262M56414
5636B3513570L25335O56257J098785J491831J437743M22679j240369k420276k924779
5627B2360776k769123k202290j613914j118342p21817n37375l19038j20640R3437
5618A3051674L42225O02110Q88508J129773J365233J537651J525456J105635N13127
5609B2061392L48859O76090J164234J596789J577758N17729j302275k738847l385028
5600B0516701l303771k727883k076330j587208j234175j017709q12656o92111
5592G064858n83923m83874l67958l29918k65856k62312k21849k02152k09141k09146
5582C928729j53391j49664j73298j37274j22193j39424j12130j30624j18763j13863
$$ plain form
5645 17117476 16951680 17084598 17546736 18336971 19433298 20737866 22059894 23057156 23513570
5636 23513570 23838905 24495162 25593947 27085778 28523521 28946200 27705831 25285555 22360776
5627 22360776 19591653 17389363 15775449 14657107 13935290 13397915 13078877 12958237 13051674
5618 13051674 13393899 13996009 14884517 16014290 17379523 18917174 20442630 21548265 22061392
5609 22061392 22410251 23086341 24250575 25847364 27425122 27942851 26640576 23901729 20516701
5600 20516701 17212930 14485047 12408717 10821509 9587334 8569625 7756969 7064858
5592 7064858 6480935 5997061 5629103 5299185 5033329 4771017 4549168 4347016 4137875 3928729
5582 3928729 3775338 3625674 3452376 3315102 3192909 3053485 2941355 2810731 2691968 2578105
5572B578105r4874r0496j11323r3392p9257p2589q2075n0180o8331n7342k5382
5561A752864m5875o5991m8995l1261l3360l1078j6946l0693m1791o0321l5419
5550A311134k1535n8678l2296k1666n2215l4767k6944l1779o7756j6667j6013
5539I30818j1779k1356j8883k1510k2839l1791L857j5893k5197k8577j4578R347
5527G31619Q111k9394j4586n271N110m4871k7735Q297k507j2720k7473J4049J6144
5514F18773m2735j6633K7967Q495r809k9301N038j9096K6231J289k2814k4025
5502E23380K3236k608J3817j446J429J6436K60q622l92j6087l3926N816Q124k712
5488E26705J0733k506J9904q584k6993r817Q322J3122j721j5500j389p311j1420
$$ plain form
5572 2578105 2483231 2392735 2281412 2188020 2108763 2036174 1954099 1903919 1835588 1778246 1752864
5561 1752864 1706989 1640998 1592003 1560742 1527382 1496304 1479358 1448665 1406874 1346553 1311134
5550 1311134 1289599 1230921 1198625 1176959 1124744 1089977 1063033 1031254 963498 946831 930818
5539 930818 919039 897683 878800 857290 834451 802660 806517 790624 765427 736850 722272 731619
5527 731619 739730 710336 695750 690479 695589 650718 622983 631280 628773 616053 588580 602629 618773
5514 618773 576038 559405 587372 595867 586058 556757 561795 542699 568930 570219 547405 523380
5502 523380 546616 544008 557825 556379 557808 574244 574504 565882 565490 549403 515477 521293 529417 526705
5488 526705 537438 534932 554836 546252 519259 509442 517764 530886 529165 513665 512276 504965 493545
5475D93545J2407j2813L099j0697q092j3890k1712K4699n248q704M910j8122k3143
5462D16239L101q2M065k0822n406l300J7992P565m4651j9881m430r630l485J804
5448C39079J1058p926k4817p91l0698n448K922P800j4501j3496K178K4197P305
5435B96862j4104n382j1950k7929k1833q303K7354J5312j0357q47j0914k7926
5423A99983J0238K5953n30l120l659j5472k334j3429n725n548K0588p383l1863
5410A67699Q826J2775k717M551J5931o494j4225K2794K4697Qj2418L4252n378
5397B50301K884m80J2776r59n479K5287n739n182k3839M884J2993L158k49n41
5383B69815K858j3440K1409R477K2289K4838L740M396K2559R888k1063q86j5535
$$ plain form
5475 493545 505952 493139 496238 485541 477449 463559 441847 466546 461298 452594 457504 439382 416239
5462 416239 419340 419258 423323 402501 397095 393795 411787 419352 374701 354820 350390 340760 337275 339079
5448 339079 350137 342211 317394 316603 285905 280457 283379 291179 276678 263182 265360 289557 296862
5435 296862 282758 277376 265426 237497 215664 207361 234715 250027 239670 238823 227909 199983
5423 199983 210221 236174 235644 232524 228865 213393 211059 197630 191905 186357 206945 199562 167699
5410 167699 176525 189300 186583 191134 207065 200571 186346 209140 233837 233845 221427 255679 250301
5397 250301 253185 252705 265481 264522 259043 284330 278591 273409 249570 254454 267447 270605 270356 269815
5383 269815 272673 259233 280642 290119 312408 337246 340986 345382 367941 377829 356766 355880 340345
5370C40345J6777j2637n807o658J4684N316M301J2707P222o166L8603N438J4805
5357D28930K1771J4187J4662n862K3284K2182L7373K4814k3901K1606K6937m3086
5345E62897l2674q126m3951j9083J5421m965j676m146k23j3857L728M4690J1199
5332E09234j1161J8655M0013K4598O546M214M159J280j4277J7803O921p200k1166
5319E79619m957R736k1013l2813l2492K9600K7207k0530k6948K5599K7684q509
5307E52183P881L1611P222Q956R66J2659M143q923O083J5448K8720J2590L6127
5294G15666L9865l7259m920J7344l5113R193K8695O5094L8809K9518N3376M6210
5282I66478R708J8429O4013L5059J7826K4963l2124m5415p3770o2035l1233m0003
$$ plain form
5370 340345 357122 344485 338678 332020 346704 352020 356321 369028 376250 370084 408687 414125 428930
5357 428930 450701 464888 479550 473688 496972 519154 556527 581341 557440 579046 605983 562897
5345 562897 530223 522097 478146 459063 474484 469519 467843 463697 463474 449617 453345 498035 509234
5332 509234 498073 516728 556741 581339 587885 592099 596258 597538 583261 601064 607985 600785 579619
5319 579619 574662 584398 563385 530572 498080 527680 554887 534357 507409 533008 560692 552183
5307 552183 560064 591675 598897 607853 608819 621478 625621 616698 622781 638229 666949 679539 715666
5294 715666 755531 718272 713352 730696 695583 704776 733471 798565 837374 866892 920268 966478
5282 966478 976186 994615 1058628 1093687 1111513 1136476 1104352 1058937 985167 923132 891899 851896
5270H51896l2816j791j3648k0759j1715p388l1356p459K6950M314L660J7800R602
5257G87290K4850L6050r450j0341n083j6948j021k8551o378k7038n6502m5505
5245F41373L3513r136l700o357O909l581j4407J9327N285j0461o772K1376K3715
5232F97084R984m555L0180J1451J7627Q224J4847j7825L6066j187m314J9767J9422
5219H36771K2026J4917J8532K3854J3197K5363K2090K5275J813L8654L7996J8118
5207A098606L0154l213J503l882L057J297L199J9237k635J4750M8221M389m573
5194A210110N2214J7387J3998M25N459N351K3439L8062K8343J3607M8195K9504
5182A486094L3562K0082J6770K3086L0097L4724K6507M2270P205N5965M0070K6239
$$ plain form
5270 851896 819080 817289 803641 782882 771167 763779 732423 724964 751914 756228 759888 777688 787290
5257 787290 812140 848190 838740 828399 823316 806368 805347 776796 770418 743380 686878 641373
5245 641373 674886 665750 662050 655693 662602 659021 644614 663941 669226 658765 651993 673369 697084
5232 697084 707068 702513 732693 744144 761771 769995 784842 767017 803083 801896 797582 817349 836771
5219 836771 858797 873714 892246 916100 929297 954660 976750 1002025 1003838 1042492 1080488 1098606
5207 1098606 1128760 1125547 1127050 1123168 1126225 1127522 1130721 1149958 1147323 1162073 1210294 1214683 1210110
5194 1210110 1262324 1279711 1293709 1294134 1299593 1304944 1328383 1366445 1394788 1408395 1456590 1486094
5182 1486094 1519656 1539738 1556508 1579594 1609691 1644415 1670922 1713192 1720397 1776362 1816432 1842671
5170A842671M5112J6230O201L4625L9169M4823N6046K9944M0817O6774L4107M1548
5158B298067P3956M1923L4855O6510P1990O7555L8325O3156N4768K4093O4346
5147B899544Q2668O5676N6892P3519R4242P5352J03850Q4403Q7866J18431J19332
5136C861775J00673J07200J43244J15925J30337J48006J46697J69699J56840J67807
5126E248203J91553J94983K31606K55325K78371L15658L47952L56525M44970N46531
5116H411677N77806O56030P37012Q32977Q78893Q44023P52549P80835R84611J218056
5106A6674469J311419R08739L30019J87091L55326O40416J018251J072447R09049
5097B3407226J132065J598234K034510K051549R60914k99016p46621m60174L06322
$$ plain form
5170 1842671 1887783 1904013 1910214 1944839 1984008 2028831 2084877 2114821 2155638 2222412 2256519 2298067
5158 2298067 2372023 2413946 2448801 2515311 2587301 2654856 2693181 2756337 2811105 2835198 2899544
5147 2899544 2982212 3047888 3104780 3178299 3272541 3347893 3451743 3536146 3624012 3742443 3861775
5136 3861775 3962448 4069648 4212892 4328817 4459154 4607160 4753857 4923556 5080396 5248203
5126 5248203 5439756 5634739 5866345 6121670 6400041 6715699 7063651 7420176 7865146 8411677
5116 8411677 8989483 9645513 10382525 11215502 12094395 12938418 13690967 14471802 15456413 16674469
5106 16674469 17985888 18894627 19224646 19411737 19767063 20407479 21425730 22498177 23407226
5097 23407226 24539291 26137525 28172035 30223584 31184498 30885482 30138861 29678687 29985009
5088B9985009R94924J311362Q52668N13595N06816Q15991J053389Q81356M48858
5079C7363968K10869J19487J93083O24543P68049k04563j085445j354409j235531
5070C5400051m96360L84200R56555J016366L02114o19229r80752q77933r29894
5061C4155118r09901o93388j041842j337779j079483n42348j81545l22555q20186
5052B7226091j150712q41346j65546L24148M18152p42877j903080k230337j939970
5043A8994523j378519r17984p49196p10468n02670k10685l4062r5930o56350j206766
5033A2531893j312161j165754r36440o85901n43711m60906m05803l28834k80987
5024F411396k07231j44561j38788j43957j46843p0395o9370q0138o7476j89799
$$ plain form
5088 29985009 30979933 32291295 33143963 33657558 34164374 34980365 36033754 36915110 37363968
5079 37363968 37574837 37694324 37887407 38511950 39279999 39075436 37989991 36635582 35400051
5070 35400051 34903691 35287891 36244446 37260812 37562926 36943697 35962945 35085012 34155118
5061 34155118 33245217 32551829 31509987 30172208 29092725 28550377 28368832 28046277 27226091
5052 27226091 26075379 25234033 25068487 25392635 25810787 25067910 23164830 20934493 18994523
5043 18994523 17616004 16698020 15948824 15238356 14735686 14525001 14490939 14395009 13738659 12531893
5033 12531893 11219732 10053978 9117538 8431637 7887926 7427020 7021217 6692383 6411396
5024 6411396 6204165 6059604 5920816 5776859 5630016 5559621 5490251 5410113 5342637 5152838
5014E152838k56626k29505k14403k07806j61543j12761j09467j14387m7365p4619
5004C624356o5507p6934r7946q9708o6256o5260k1947k3297k5564n499o4060q0606
4992B941772q1039q1890j33954j14434q5132j02296r4915n2205o8015p4647q9925
4981A963320p3123o0677r6875q5314m9033o4730l9316l9859l8837m3648k3920
4970A347988q311m9160j9535k9585m8844j1510j9643k8952j7162l7840k5826j0692
4958A040928k5455k0335l9175j9408k3732q352k070k1113j2583k3944n557l353
4946H35851n713l8722l558M0472m385j0017l7162j7259J5372l1198R191k495p445
4933G42932j1415m458N488k6226L308r971k785J1323O641j3326K2364J8010J4581
$$ plain form
5014 5152838 4896212 4666707 4452304 4244498 4082955 3970194 3860727 3746340 3698975 3624356
5004 3624356 3558849 3481915 3383969 3294261 3228005 3162745 3140798 3117501 3091937 3086438 3022378 2941772
4992 2941772 2860733 2778843 2644889 2530455 2445323 2343027 2248112 2195907 2127892 2053245 1963320
4981 1963320 1890197 1829520 1732645 1647331 1598298 1533568 1494252 1454393 1415556 1371908 1347988
4970 1347988 1339677 1290517 1270982 1241397 1192553 1181043 1161400 1132448 1115286 1077446 1051620 1040928
4958 1040928 1015473 995138 955963 936555 912823 904471 902401 881288 868705 844761 839204 835851
4946 835851 830138 791416 787858 828330 823945 813928 776766 759507 774879 743681 752872 750377 742932
4933 742932 731517 727059 732547 706321 709629 699658 696873 708196 714837 701511 723875 741885 756466
4920G56466Q007K0463k0200j3820j2312J2050M4650K6408r247j5297n0277K7185
4908G74076K5081J6377j3503Q395O874M610K563L0239K2336P466k4054r955l327
4895H47178j7469j0181m4047l6504J828J7632l2253k1132Q250j3868O9O076J3854
4882G19433p137l693M758l445J1988k1499k4070m6779k3259j9338k0518k5649
4870E40792m896m0136K0563L933j0307j2789R852p320P19m814k4597j044J8241
4857D88197n3p984p298j7817L009n017q936K4265o639l1755j8398j1543J8040
4844D18071n989N160Q458L0854m688L197p682J346j1863r83P652L1721P808J937
4830D84999Q809Q493J0587K2072K3365n630R198K968K9124n98R679J0234K2858
$$ plain form
4920 756466 764473 784936 764736 750916 738604 750654 795304 821712 812465 797168 746891 774076
4908 774076 799157 815534 802031 810426 817300 821910 824473 854712 877048 884514 860460 850505 847178
4895 847178 829709 819528 775481 738977 740805 758437 726184 705052 713302 699434 699503 705579 719433
4882 719433 712296 708603 713361 709916 721904 700405 676335 629556 606297 586959 566441 540792
4870 540792 535896 495760 516323 520256 509949 497160 507012 499692 500411 495597 471000 469956 488197
4857 488197 488144 480160 472862 455045 458054 453037 444101 468366 461727 429972 411574 400031 418071
4844 418071 412082 417242 425700 456554 451866 455063 447381 448727 436864 435881 443533 475254 483062 484999
4830 484999 493808 502301 512888 534960 558325 552695 561893 564861 593985 593387 603066 613300 636158
4817F36158K4069N487m205K585L0393L0017L532K9074j1862j286J7769L2211n495
4804G88447L5592J9098K6954l458j2492J8862K1210K2422J7656L7563J4638k8586
4792I57906J1836L1484K926K0328K3264L4790L3267j2255M35J6270J3134L1071
4780A164456N478Q764J7946K8760J1474M290L8083K7909O402J2210L2856J8928
4768A377556L1626J5488J9624M7670K3872K1450K0301R651q747L0711K2634K8796
4756A640632N1481N2079R7139M2127L0596O4777O5078L5073L3415K0917N9965
4745B193279N6108P999Q220M1630J7612L3188L9399N4109L6229L4061Q3143M1137
4733B646114P3093P8882Q0706R1924N1610O0003N9213M4602O9511N7736P4899
$$ plain form
4817 636158 660227 665714 661509 664094 694487 724504 728036 757110 745248 743962 761731 793942 788447
4804 788447 824039 843137 870091 866633 854141 873003 894213 916635 934291 971854 986492 957906
4792 957906 969742 1001226 1004152 1024480 1047744 1082534 1115801 1103546 1103981 1120251 1133385 1164456
4780 1164456 1169934 1178698 1196644 1225404 1236878 1241168 1279251 1307160 1313562 1325772 1358628 1377556
4768 1377556 1409182 1424670 1444294 1491964 1515836 1537286 1557587 1567238 1558491 1589202 1611836 1640632
4756 1640632 1692113 1744192 1841331 1883458 1914054 1978831 2043909 2078982 2112397 2133314 2193279
4745 2193279 2249387 2257386 2265606 2307236 2324848 2358036 2397435 2451544 2487773 2521834 2604977 2646114
4733 2646114 2719207 2798089 2878795 2970719 3022329 3082332 3141545 3186147 3255658 3313394 3388293
4722C388293P1427P6494R5971R1380R5328J01301J13524J06362J06046J13933
4712D360059J30742J51150J46648J66307J00492J43112J52434J32283J60557J92326
4702E836110J91529J69977K26595K33258K59614K77049L22966L80335M11132M74842
4692H783407M98597N47883O03454O41273P36414Q35877J032195J254094J458963
4683A6392157J696743J907389K116997K330393K037181J166837J043933J654965
4675C0346595K416032L024290K356986l62066k437555l057304k608422j564958
4667B8113598o07466J96953Q89798J527885K202628K758473L307051L367528K905740
4658D4662188L083842L235277K800398L021445K968527J420325K65688j156161
$$ plain form
4722 3388293 3459720 3536214 3632185 3723565 3818893 3920194 4033718 4140080 4246126 4360059
4712 4360059 4490801 4641951 4788599 4954906 5055398 5198510 5350944 5483227 5643784 5836110
4702 5836110 6027639 6197616 6424211 6657469 6917083 7194132 7517098 7897433 8308565 8783407
4692 8783407 9282004 9829887 10433341 11074614 11811028 12646905 13679100 14933194 16392157
4683 16392157 18088900 19996289 22113286 24443679 26480860 27647697 28691630 30346595
4675 30346595 32762627 35786917 38143903 37781837 35344282 32286978 29678556 28113598
4667 28113598 27506132 27703085 28592883 30120768 32323396 35081869 38388920 41756448 44662188
4658 44662188 47746030 50981307 53781705 56803150 59771677 61192002 61457690 60301529
4650F0301529m209749o182913o468402n605376m091599k677082j563847p43911
4642B8758650l2634N62293J032254J456913J230886L16542K41302R75603J824755
4633C6366564K441265J543201j776196m279215n091427m713409l677080k746591
4625A8067112k065766j649042j338032j092387r04089p23644n79465m81153l92541
4616H840993l37913l17851k62448k73470k39007k51650k31076j76465j85653j74171
4606F391289j60406j54935j28877j25431j18442j35568j40537j11712p4996j03944
4596E136441m6750m0020j5451n1999j8082q922o0204l7318m7332j2062k0868j8084
4584D759349J4303J11N641j1552M362o568k3655k6627m4156p070K713K8453p521
$$ plain form
4650 60301529 56091780 49908867 43440465 37835089 33743490 31066408 29502561 28758650
4642 28758650 28726016 29288309 30320563 31777476 33008362 33324904 33566206 34541809 36366564
4633 36366564 38807829 40351030 38574834 34295619 29204192 24490783 20813703 18067112
4625 18067112 16001346 14352304 13014272 11921885 11017796 10294152 9714687 9233534 8840993
4616 8840993 8503080 8185229 7922781 7649311 7410304 7158654 6927578 6751113 6565460 6391289
4606 6391289 6230883 6075948 5947071 5821640 5703198 5567630 5427093 5315381 5240385 5136441
4596 5136441 5089691 5049671 5034220 4982221 4964139 4955217 4895013 4857695 4810363 4798301 4777433 4759349
4584 4759349 4773652 4773763 4779404 4767852 4772214 4765646 4741991 4715364 4671208 4664138 4666851 4695304 4687783
4571D687783K6543Q924L7273K1229M435k3423J1985N9995P0301J11500J03912
4560E120457J07964R5310J08639Q4211Q0600R3908J02413J37520J33035J33484
4550F197541J35345J73178J83527J78400J97403K21023K20835K42311K67128K80247
4540H296938L22374L55725M14042M79852N01025N55070O29074O90104P86475Q85501
4530A3916180J043170J211429J498803J802240K044117K351221K672520K910306
4522B9449986K970308K578790K046027K158478K956653L758491L623005J702039
4514E1243777r32152k345050k244937j248021k47978Q5653J79618P73383J875411
4505D7139704K787477K625689P12021j715748k896025k779439k256171j675705
$$ plain form
4571 4687783 4714326 4723250 4760523 4781752 4786187 4762764 4774749 4834744 4905045 5016545 5120457
4560 5120457 5228421 5323731 5432370 5516581 5597181 5691089 5793502 5931022 6064057 6197541
4550 6197541 6332886 6506064 6689591 6867991 7065394 7286417 7507252 7749563 8016691 8296938
4540 8296938 8619312 8975037 9389079 9868931 10369956 10925026 11554100 12244204 13030679 13916180
4530 13916180 14959350 16170779 17669582 19471822 21515939 23867160 26539680 29449986
4522 29449986 32420294 34999084 37045111 39203589 42160242 45918733 49541738 51243777
4514 51243777 50311625 47966575 45721638 44473617 44225639 44311292 44490910 45264293 47139704
4505 47139704 49927181 52552870 53264891 51549143 48653118 45873679 43617508 41941803
4497D1941803q76003K22240J269769J427086J13965j765309k759920k593873j750598
4488C5229160j000702p44848p65473l97545K96205R43934P02754q65806k879698
4479C0517981l953391l882145l216117k484838j875772j515634j224142j009863
4471A1356079q82469p33215n74263m67440m46917l93480k97993k81691k80238
4462F998373k61873k55278k05815k27950k33079j60347j51009j69771j68614j32050
4452E032587j43755j26224r6325o7495o7003o3921m5539m0241m3109P942p714
4441D339203M2141J6419L3430Q8384J25066J85504J77116M1810j38071l04632
4431D606370l81952l16293k77361k27666j86080j49346j06780j10861o0800p0711
$$ plain form
4497 41941803 41065800 41288040 42557809 43984895 44098860 42333551 39573631 36979758 35229160
4488 35229160 34228458 33483610 32718137 32320592 32616797 33560731 34263485 33397679 30517981
4479 30517981 26564590 22682445 19466328 16981490 15105718 13590084 12365942 11356079
4471 11356079 10473610 9740395 9166132 8698692 8251775 7858295 7560302 7278611 6998373
4462 6998373 6736500 6481222 6275407 6047457 5814378 5654031 5503022 5333251 5164637 5032587
4452 5032587 4888832 4762608 4666283 4598788 4531785 4467864 4422325 4382084 4338975 4346917 4339203
4441 4339203 4381344 4397763 4431193 4519577 4644643 4830147 5007263 5049073 4911002 4606370
4431 4606370 4224418 3908125 3630764 3403098 3217018 3067672 2960892 2850031 2789231 2718520
4421B718520l7471o2499o7183n3015p6602n1149l4632p4335m3332k9297p4793
4410B114212n8161o1597p2567o9459n270n6979k3696R13M565j2320l4755K2987
4398A747873J4569j213J1335J7099Q987l1560k88m250j5244J505j9623K3957L499
4385A756646l6742M85K6708J739K971O2739J8185o030K4762L5931J6017M5159
4373A948570J9269J0499J0928m241J365N168j8502j4052k9770k9538j0721k5400
4361A863575n566Q959N1216O7179L0556N2169N0489R5120Q6769R8424J08546J29675
4349B637111J10500L6874j4804j7461L15O3856R1360J20805J11159O5383j032
4338C204066J694r551n7956j49728j66852j79293r4939r2949m7896o8335o7056
$$ plain form
4421 2718520 2681049 2618550 2551367 2498352 2421750 2370601 2335969 2261634 2218302 2189005 2114212
4410 2114212 2056051 1994454 1921887 1852428 1847158 1790179 1766483 1767396 1771961 1759641 1724886 1747873
4398 1747873 1762442 1761229 1772564 1789663 1798650 1767090 1766802 1762552 1747308 1748813 1729190 1753147 1756646
4385 1756646 1719904 1720389 1747097 1748836 1751807 1814546 1832731 1826701 1851463 1887394 1903411 1948570
4373 1948570 1967839 1978338 1989266 1985025 1986390 1991558 1973056 1959004 1929234 1899696 1888975 1863575
4361 1863575 1858009 1866968 1918184 1985363 2015919 2068088 2118577 2213697 2300466 2398890 2507436 2637111
4349 2637111 2747611 2784485 2769681 2752220 2752535 2816391 2907751 3028556 3139715 3205098 3204066
4338 3204066 3205760 3196209 3138253 2988525 2821673 2642380 2547441 2454492 2406596 2338261 2271205
4327B271205p1419k9675m4138K252K0158K4442o705J1863J6592N6862N7938L8998
4315B348373O5702P8482Q6785J07431J30728J07353N2189O203N3792J1017R950
4304C058005p158J2483O096l7827k0164j5357k0438l2636J4428j272j9483K0651
4292B957328k2659j1194K8474O1550O2031P2675O1280M8147K4003K4736K5021
4281C331392P0190K8251L5925K0932o378L7628M4789L491L3468O4324J08619O7198
4269C839829N9996O6632L8292K3046K0629K2979L1242L98N2032K8320J3451K886
4257D199732J4589M6207N0983J06327J38065J44843J64070J50516J24250Q6379
4247E225961Q4982N1349O4069L9331M1045P4998R5354R7020J00121J14600J58183
$$ plain form
4327 2271205 2199786 2170111 2125973 2128225 2148383 2172825 2166120 2177983 2194575 2251437 2309375 2348373
4315 2348373 2414075 2492557 2579342 2686773 2817501 2924854 2977043 2983246 3037038 3048055 3058005
4304 3058005 3050847 3063330 3069426 3031599 3011435 2996078 2975640 2943004 2957432 2956160 2936677 2957328
4292 2957328 2934669 2923475 2951949 3013499 3075530 3148205 3209485 3257632 3281635 3306371 3331392
4281 3331392 3401582 3429833 3465758 3486690 3480312 3517940 3562729 3566220 3599688 3664012 3772631 3839829
4269 3839829 3899825 3966457 4004749 4027795 4048424 4071403 4102645 4103043 4155075 4183395 4196846 4199732
4257 4199732 4214321 4260528 4311511 4417838 4555903 4700746 4864816 5015332 5139582 5225961
4247 5225961 5310943 5362292 5426361 5465692 5506737 5581735 5677089 5774109 5874230 5988830 6147013
4236F147013J12811J73322J10343Q4466P7852J04567J70940K24988J83351J97989
4226G587642K34023K69890K43039K74056K69125K52317K36190J94303J61136J45875
4216I867596J67133J97597J42389J44462N1013Q9811L8410N3697J08025J51961
4206A1012094J89620K51143K09426J97865J91706J88510J51663J53015K42138
4197A2787180K98516L47353M47250M51093N18699N80663O64427P05159P43777
4188A7544117P19076P14459P55028Q59956Q74244R50693R76584J082841J140803
4179B5617801J278381J367175J435126J443850J459122J420177J419194J574928
4171C7015754J821964K098068K438096K754005L048069L425491L860596M406338
$$ plain form
4236 6147013 6259824 6433146 6543489 6627955 6705807 6810374 6981314 7206302 7389653 7587642
4226 7587642 7821665 8091555 8334594 8608650 8877775 9130092 9366282 9560585 9721721 9867596
4216 9867596 10034729 10232326 10374715 10519177 10570190 10660001 10698411 10752108 10860133 11012094
4206 11012094 11201714 11452857 11662283 11860148 12051854 12240364 12392027 12545042 12787180
4197 12787180 13085696 13433049 13880299 14331392 14850091 15430754 16095181 16800340 17544117
4188 17544117 18263193 18977652 19732680 20592636 21466880 22417573 23394157 24476998 25617801
4179 25617801 26896182 28263357 29698483 31142333 32601455 34021632 35440826 37015754
4171 37015754 38837718 40935786 43373882 46127887 49175956 52601447 56462043 60868381
4163F0868381N069401N789521O615843P719193R135373J0826753J2465529J4085483
4155A32575477J5915705J8316566K0977110K4528274K8953103L5213379M2494110
4148C18973724M3519864K3133404q276743m0466511n5427139n1550111m2351050
4141A87555438l1909313k4077994j8245167j4512738j1684748r607008p519188
4134F9999282n877106m389809l619618l253075l386458l411320l282607k907730
4126C9871559k594899k238047k038859j800333j709781j576022j529385j371882
4118B5012351j244462j044060r89563q28643q18388o74094p14123n96532n35100
4109A7567386m16519m44893m47189m58609m55155m88319m05868l66893l11274
$$ plain form
4163 60868381 65937782 71727303 78343146 86062339 95197712 106024465 118489994 132575477
4155 132575477 148491182 166807748 187784858 212313132 241266235 276479614 318973724
4148 318973724 362493588 385626992 377350249 336883738 281456599 229906488 187555438
4141 187555438 155646125 131568131 113322964 98810226 87125478 77518470 69999282
4134 69999282 64122176 59732367 56112749 52859674 49473216 46061896 42779289 39871559
4126 39871559 37276660 35038613 32999754 31199421 29489640 27913618 26384233 25012351
4118 25012351 23767889 22723829 21734266 20905623 20087235 19413141 18699018 18102486 17567386
4109 17567386 17150867 16705974 16258785 15800176 15345021 14856702 14450834 14083941 13772667
4100A3772667l04836l08727l74116l82443m14692l98420m35625l80226l81639
4091A0391943l37122l35311k49036k38913k16587k61766k98862l74062l39483
4082G740801l62137l14004l02572l03239k42124j85170j99320j77606j50486j23943
4072E380200m0916n206K7643P225k4754k6840n1040q3588j42981j29549j79557
4061D730637k15642k90474k84078k22623j92754j56838j07866j05770j07486j02781
4051B944325j28275j28559j12499p7306n9966n6566o5914n3231m4962r76J5041
4040B231112m381m2438p7584j17890j15591j22682j18220q0294n5895o5789r0890
4029A339458n6135j7124m7490n665r377J4484J9550K3357j4340j8161j5294l602
$$ plain form
4100 13772667 13467831 13159104 12784988 12402545 11987853 11589433 11153808 10773582 10391943
4091 10391943 10054821 9719510 9470474 9231561 9014974 8753208 8454346 8080284 7740801
4082 7740801 7378664 7064660 6762088 6458849 6216725 6031555 5832235 5654629 5504143 5380200
4072 5380200 5339284 5334078 5361721 5368946 5344192 5317352 5266312 5182724 5039743 4910194 4730637
4061 4730637 4514995 4224521 3940443 3717820 3525066 3368228 3260362 3154592 3047106 2944325
4051 2944325 2816050 2687491 2574992 2497686 2437720 2381154 2315240 2262009 2217047 2216071 2231112
4040 2231112 2226731 2184293 2106709 1988819 1873228 1750546 1632326 1552032 1496137 1430348 1339458
4029 1339458 1283323 1266199 1218709 1213044 1203667 1218151 1237701 1261058 1246718 1228557 1213263 1209661
4017A209661l0113n2011k8027k2368j1669K0108K884k7969k8401q469K7775p062
4005A044339J5298L3765L1102J0059j5279j2017m9256k4524l9374j4701k5067
3994I54345O000k1548J541J5532R507J494k067J2887J5438j7047K4844M7156M1433
3981A089515M4916O9296K891p231j2763Q589j0367r534k3354j7450l4756l2303
3969A067449k8155o979k3339k4553j3822j0230l0243k6478n0355k0271n1020o1089
3957G20915n5557l5800m758k760k6705l502r769j9773k7553k8459l1734o786l0956
3944D36803j6909J3834J963L1180K0764n8546N209O341L2535N217o284j5634l1376
3931D25097n5151o4682l5856o5064o1209l2647k3071j4660j9283k0555J6438l862
$$ plain form
4017 1209661 1179548 1127537 1099510 1077142 1065473 1085581 1088465 1060496 1032095 1023626 1051401 1044339
4005 1044339 1059637 1093402 1124504 1134563 1119284 1107267 1058011 1033487 994113 979412 954345
3994 954345 960345 938797 940338 955870 965377 966871 964804 977691 993129 976082 1000926 1048082 1089515
3981 1089515 1134431 1203727 1206618 1199387 1186624 1195213 1184846 1175312 1151958 1134508 1099752 1067449
3969 1067449 1039294 1032315 1008976 984423 970601 960371 930128 903650 853295 833024 782004 720915
3957 720915 665358 629558 624800 622040 595335 591833 582064 562291 534738 506279 474545 467759 436803
3944 436803 419894 433728 435691 466871 487635 429089 434298 440639 473174 478391 472107 456473 425097
3931 425097 369946 305264 269408 204344 143135 110488 87417 72757 53474 32919 49357 45495
3919D5495L951L9807J5524J313m786p294L5474J116K1190R818K1039J6659J1848
3906B11154R537K5234J1641r325l2506O713n089k6455L6547N2910K974J6961M8635
3893C48931L0873k4672J4490j7124j1456L2952J4169l3673J3424k7562q711k7021
3881C04620k7386l4001K4396R534Q480M2467K4732L0362L6917J8519K3550l00
3869D61890L9059P9486N5393N9833Q2736J11948J18120J29543J46836J87805K24649
3858A697298K04826J61336K305j69409k95301k91347k37962j81991j29593j13254
3848F46908j13123p2878o4392m1026j3404k1136l4543m069l4216O765k3755l2377
3836A98754r346r957j559J709k2082k3682L2116J5259l915Q987Q031m3593p786
$$ plain form
3919 45495 49446 89253 104777 106090 101304 94010 129484 130600 151790 161608 182647 199306 211154
3906 211154 220691 245925 257566 248241 215735 222448 217359 190904 227451 280361 283335 300296 348931
3893 348931 379804 355132 369622 352498 341042 373994 388163 354490 367914 340352 331641 304620
3881 304620 277234 243233 267629 277163 285643 328110 352842 383204 420121 438640 462190 461890
3869 461890 500949 580435 635828 695661 778397 890345 1008465 1138008 1284844 1472649 1697298
3858 1697298 1902124 2063460 2065765 1896356 1601055 1309708 1071746 889755 760162 646908
3848 646908 533785 460907 396515 355489 342085 320949 286406 282337 248121 254886 231131 198754
3836 198754 189408 179451 177892 179601 157519 133837 165953 181212 177297 186284 194315 150722 142936
3823A42936j769O83j638n4007J1971J4675r641L5985Q398J0323j131J2008O222
3810A75015k0446K924j9459l605K5691J811j2175k248P605J5445J1209j2800o302
3797A62665K3759j1519k4122J6072M420q53k1466j7887l0351K3378K239J7400
3785A43735L5923j3025j4256j6363m1099r914p094j7454k5432J153o213j3015
3773A6946k1069P189k8940k5236j939j6016l1453M2864M4808K6941J3810J9279
3761D7184K0819K4807o997J6803J8988m905j6648j9433P904o927J057J3971l946
3748I2677l5649j4108R867j42K6257J674l1909O16P640j7982q731j2791j3991
3735C428M917K2759J3211l1822P759R781P309l511j197j0027j3902R047l305m536
$$ plain form
3823 142936 141167 141850 140212 86205 98176 112851 103210 139195 147593 157916 156785 168793 175015
3810 175015 154569 157493 138034 134429 160120 161931 149756 147508 155113 170558 181767 168967 162665
3797 162665 186424 174905 150783 166855 171275 170422 148956 131069 100718 124096 126335 143735
3785 143735 179658 166633 152377 136014 94915 85001 77907 60453 35021 36174 29961 16946
3773 16946 -4123 3066 -25874 -51110 -53049 -69065 -100518 -57654 -12846 14095 27905 47184
3761 47184 68003 92810 85813 102616 121604 116699 100051 80618 88522 81595 82652 96623 92677
3748 92677 57028 42920 52787 52645 78902 80576 48667 49283 56923 38941 30210 17419 3428
3735 3428 8345 31104 44315 12493 20252 30033 37342 33831 32634 22607 8705 17752 14447 9911
3721I911j1093M278j5756M520p584J5316p421l952L315J2235k6658j8323N828
3708c5384m870L1032m0852k0362k609L7403J4003l4681M811l921K8485J9517J1677
3695D249k0759Q04K2627j2084j8782l173J6048m6N927P72j0273r172J1578K277
3681a0007j9050O340K7380J3929j6945k4068p552j5354j7893m973J7027J3367
3669c7799J7960J036J8656J2214J6448l696K314l4427J7154J1337l133P663m770
3656B0957k2532j423Q273J8579k4640k1242l9384j2255J7696j451j5974o576L4179
3643d5793O574j3213J6475K3446J1251J1425R136Q663j1697o992r286j3531L274
3630a0268K3676L756k974k23j934k171N890r999j220p877j8278j0806q299M754
$$ plain form
3721 9911 -1182 3096 -12660 -8140 -15724 -408 -7829 -11781 -8466 3769 -22889 -41212 -35384
3708 -35384 -40254 -9222 -50074 -70436 -73045 -35642 -21639 -56320 -51509 -55430 -26945 -7428 4249
3695 4249 -16510 -15706 6921 -5163 -23945 -27118 -11070 -11116 -5189 -4417 -14690 -23862 -12284 -10007
3681 -10007 -29057 -22717 4663 18592 1647 -22421 -29973 -45327 -63220 -68193 -51166 -37799
3669 -37799 -19839 -18803 -147 12067 28515 24819 27133 -7294 9860 21197 18064 25727 20957
3656 20957 -1575 -2998 5275 23854 -786 -22028 -61412 -73667 -55971 -57422 -73396 -79972 -45793
3643 -45793 -39219 -52432 -35957 -12511 -1260 10165 19301 27964 16267 9275 -11 -13542 -10268
3630 -10268 13408 17164 14190 13967 12033 9862 15752 5753 4533 -3344 -21622 -32428 -40727 -35973
3616c5973o682j923j9307j2279J3184N283J3757j08j3609J7671K074J7081j4560
3603c5391j1719J7891J8187j4023Q912r41j3551l132J0815K1989k5538j0864n880
3590d3245J8940J0524j6998l345J7802r321j598M599J4616j001j7139Q282J3104
3577d780R673L561J534L375l59J5979P116L518J4170J3032j4708J6024k782m0378
3563B4975k7816K0424K1289k1046j3452n516J5442k5833k349m874k2064O029O785
3550b8006R856j0931r150J1696j3913l398J5100P123J5645k1882l352K1918J8813
3537I519J1237r677k3432P467R170q096J2908p458j5405K7305j4099J9863j013
3524A8289j7253j4501K3241J8286j0882n891j3586o354j2909L7318M219p379j45
$$ plain form
3616 -35973 -42655 -44578 -63885 -76164 -62980 -57697 -43940 -44048 -57657 -39986 -37912 -20831 -35391
3603 -35391 -47110 -29219 -11032 -25055 -16143 -17084 -30635 -33767 -22952 -963 -26501 -37365 -43245
3590 -43245 -24305 -13781 -30779 -34124 -16322 -25643 -27241 -22642 -8026 -9027 -26166 -17884 -4780
3577 -4780 4893 8454 9988 13363 13004 28983 36099 39617 53787 66819 52111 68135 65353 24975
3563 24975 -2841 17583 38872 17826 4374 -1142 14300 -11533 -13882 -18756 -40820 -34791 -28006
3550 -28006 -18150 -29081 -38231 -26535 -40448 -43846 -28746 -21623 -5978 -27860 -31212 -9294 9519
3537 9519 20756 11079 -12353 -4886 4284 -3812 9096 1638 -13767 13538 -561 19302 18289
3524 18289 1036 -13465 9776 28062 17180 11289 -2297 -8651 -21560 15758 19977 12598 12453
3511A2453N246k1503K598J0128r433l522J5298k182L982K7654J4404R825l0280
3498C4668j7598K81K011J2203N619J2674j2232m761R787Q642J5k7818O384p67
3484B9108q39J0666O890l1732N724j7636q947K4484J5320N207k1226k8174K6463
3471A5308N658L860m609J5931K1534l1425l6956J6968M695P182Q908p467L248
3458B2835Q336M783j99J5500m270j9564L689l068N865O06Q458P800o847q751j7669
3443A7504l010R798K4371k4218l1248o991K4716Q179Q161j5340J943L122j2276
3430D711j545O083L0799J4063r626J9636Q753O925j1432o216k8321J6169K5234
3417G5233J503J985K9851l45l1919K5389j725J5191r124l740K3117O606m206q716
$$ plain form
3511 12453 17699 -3804 -1206 8922 -511 -4033 11265 9083 13065 40719 55123 64948 34668
3498 34668 17070 17351 19362 31565 37184 49858 37626 32865 42652 51294 51309 23491 29875 29108
3484 29108 28269 38935 45825 14093 19817 2181 -6766 17718 33038 38245 17019 -11155 15308
3471 15308 20966 24826 20217 36148 57682 26257 -10699 6269 10964 18146 27054 19587 22835
3458 22835 31171 35954 35755 51255 46985 27421 31110 28042 33907 34513 42971 50771 43924 35173 17504
3443 17504 14494 24292 48663 24445 -6803 -13794 10922 19101 27262 11922 13865 16987 4711
3430 4711 3166 9249 40048 54111 44485 64121 72874 79799 68367 62151 33830 49999 75233
3417 75233 76736 78721 108572 108227 76308 101697 99972 115163 106039 102299 125416 132022 127816 119100
3403A19100K9700J5919J8189k428M7158K5665O98J9468L4641K9487L5438L9500
3391D12535K1184k0832j1938o6813l5218j5239k7765k1165k9901j8607R559J0408
3379B06208k0896q606m608J0967q851p280K831P153K6165J1045j1040J619K3517
3366B28224J3326M369J4578P174J678J4956K5047l726j2864j0937k6138l2242
3354B23445j2778J4136j3380J3447J1249K4696J521j3762K3189L491Q435O631
3342B90320K0742J8844p685j23J6370j9661K6067J5529J9563j5506M033J9491
3330C87984K2988M3694J0887j4121k1823J7077l751j487L186k8874K513J0593
3318D28866K7176R064L1525L89Q948L9578J6609k4510J0369J7772N675J4530L2762
$$ plain form
3403 119100 148800 164719 182908 180480 227638 253303 254001 273469 308110 337597 373035 412535
3391 412535 433719 412887 400949 334136 298918 283679 255914 234749 204848 186241 195800 206208
3379 206208 185312 176706 172098 183065 174214 166934 169765 176918 203083 214128 203088 204707 228224
3366 228224 241550 245919 260497 267671 269349 284305 309352 305626 292762 281825 255687 223445
3354 223445 210667 224803 211423 224870 236119 260815 262336 248574 271763 275254 283689 290320
3342 290320 311062 329906 322221 322098 338468 318807 344874 360403 379966 364460 368493 387984
3330 387984 410972 454666 465553 451432 429609 446686 442935 441448 444634 415760 418273 428866
3318 428866 456042 465106 496631 497020 505968 545546 562155 537645 548014 565786 571461 585991 618753
3305F18753L8842M438K2613L6446J0518l007K4602J4950J0522p060K2237J8279
3293H12133p271J7479K1452N4717L7313n77L0642L0356J7263M5071J3002P933
3281A079513L4939K2686M7620O0663N9637N5061N7046O2623L9063M6984N6594
3270A622429N6544M3948L5262M9042Q2647N9325M3860M8833P6611P1905Q3739
3259B274145J20803J03932J15261J30573J33786J19002R5887P8031M1678q58o2955
3248C149285r8742j08294j34422j40689j48077q8305r9683o0211q7559j66654
3238B016649j26325r3332o6016r0989p6447n9183n2864p1421n7815o8388n4365
3227A199504m2800p4384l9885k7115n8333l6555o700m3238k1490l4383l5450M174
$$ plain form
3305 618753 657595 662033 684646 721092 731610 728603 753205 768155 778677 771617 793854 812133
3293 812133 804862 822341 843793 898510 935823 935246 965888 996244 1013507 1058578 1071580 1079513
3281 1079513 1114452 1137138 1184758 1245421 1305058 1360119 1417165 1479788 1518851 1565835 1622429
3270 1622429 1678973 1722921 1758183 1807225 1889872 1949197 1993057 2041890 2118501 2190406 2274145
3259 2274145 2394948 2498880 2614141 2744714 2878500 2997502 3093389 3171420 3213098 3212240 3149285
3248 3149285 3050543 2942249 2807827 2667138 2519061 2430756 2331073 2270862 2183303 2016649
3238 2016649 1890324 1796992 1730976 1639987 1563540 1504357 1451493 1380072 1322257 1253869 1199504
3227 1199504 1156704 1082320 1042435 1015320 956987 920432 913732 870494 849004 814621 779171 783345
3215G83345l1703L729O160l0094J5744n69j6321j7116r441k6113l5539k455l9545
3202F00082l7313j4905l8123M521j4857k621o168k3227j4238n917J475m939l912
3189D39858j9126Q591k1426k7290l210L185p711k0747j747l605k241j9987l589
3176C20955M462O163p882N035j2179n664n500k9479K1095j887j9236J3681k6601
3163B62963p514J3238m140j7466l4482J3708J2561k6357j5207k264j0208j0703
3151A74129k446j8851J0719J2882J5723J7730K469j5652l4058k059L825j1794
3139A52617J9718R683J0580O896k1338k3604j1529J1251j86k4622j1577J175J2793
3126A31857n602j192M2766j112j1114L482j6149k066N884L355k4193J0125l50
$$ plain form
3215 783345 751642 755371 761531 731437 747181 746612 730291 713175 703734 677621 642082 639627 600082
3202 600082 562769 547864 509741 514262 499405 496784 490616 467389 453151 447234 448709 443770 439858
3189 439858 420732 429323 407897 380607 377397 380582 372871 352124 350377 346772 344531 324544 320955
3176 320955 325417 331580 323698 328733 316554 310890 305390 275911 297006 295119 275883 289564 262963
3163 262963 255449 268687 264547 247081 212599 226307 238868 212511 197304 195040 184832 174129
3151 174129 171683 152832 163551 176433 192156 209886 212355 196703 162645 160586 164411 152617
3139 152617 172335 182018 192598 199494 178156 154552 143023 154274 154088 129466 117889 119064 131857
3126 131857 126255 125063 167829 166717 155603 159085 142936 140870 146754 150109 125916 136041 135691
3113A35691j9068r529J1765J113j6453j3506Q64J9759j1601l604p193k2979K481
3100F7740J2132R873j3690J1700O028j4519O101J2063k0890j9124J7377j1312
3088F3479J5304k110M571J962r758j2135J5633m698j44l530L843j7414j3518J304
3074D2789K9725J0135J6906k7544M810J48j1468J9938M141k3465k1669K2603j0112
3061E6937L04j5880R007K4406j8584j1630K4037L524j2588K42k6388n788L3089
3048F0688j183J1379M114J3606M466l4671j0935J6201n796k2306R065J3541l430
3035E4739K2581k1792J1227J1791j5470J1653j0689n538j865L2835j6377R512
3023H2607k0812l0900J486K7856K0429m29m521k2482J1193J9559M859j3174J0324
$$ plain form
3113 135691 116623 107094 118859 119972 103519 90013 90877 110636 99035 95431 88238 65259 67740
3100 67740 79872 89745 76055 87755 93783 79264 85365 97428 76538 57414 74791 63479
3088 63479 78783 76673 81244 83206 73448 61313 76946 72248 72104 68574 72417 55003 41485 42789
3074 42789 72514 82649 99555 72011 76821 76969 65501 85439 89580 66115 44446 67049 56937
3061 56937 57241 41361 50368 74774 56190 44560 68597 72121 59533 59775 33387 27599 60688
3048 60688 59505 70884 74998 88604 93070 58399 47464 63665 57869 35563 44628 58169 54739
3035 54739 77320 55528 66755 78546 63076 74729 64040 58502 56637 89472 73095 82607
3023 82607 61795 30895 32381 60237 80666 80237 75716 53234 64427 83986 88845 75671 85995
3010H5995l067q800L957p169m398J3209J5753P314R344J763j3542J6119K1082
2997A37560j5305o181J1460J3987j291k55J0337j4760J1234L7537j0143k4863
2985A49317o278QJ7931j556J1671p430L700j4670n777K7034K2287J658j626k714
2971A93555K4371K4362j3663q25n226o755N284K5088K4560j3854j2965K8073K1083
2958B93088q272j1131R819L105J2476J2952q193j873M7264L0475k24K3928M088
2945D07502J9305K8140K8399K4483J3754N621M0932K9305K7201N0366J9012J1047
2933G05067J8122K5921L2969J0089J3981Q806J917j1475J0455K5559l701p865
2921H29845R361m00J026K7938J5677R277L4688J8494J6538L0800N7978M3488O3505
$$ plain form
3010 85995 82928 74128 78085 70916 66518 79727 95480 102794 112138 113901 100359 116478 137560
2997 137560 122255 116074 127534 141521 140230 139975 150312 135552 146786 184323 174180 149317
2985 149317 143039 143047 160978 159422 171093 163663 167363 152693 146916 173950 196237 197895 196269 193555
2971 193555 217926 242288 228625 227800 222574 215819 221103 246191 270751 256897 243932 272005 293088
2958 293088 284816 273685 283504 286609 299085 312037 303844 301971 349235 379710 379486 403414 407502
2945 407502 426807 454947 483346 507829 521583 527204 568136 597441 624642 675008 694020 705067
2933 705067 723189 749110 782079 792168 806149 814955 816872 805397 815852 841411 837710 829845
2921 829845 839206 838806 839832 867770 883447 892724 927412 945906 962444 993244 1051222 1094710 1158215
2908A158215J1019L5695N1346O0824J05411O5864K2040n9834q2109q9491q3451
2897A195529m9556p2198p7503m4206k1392j5820k9931k0390n6114k1883K0372
2886H06908L232j6631Q346o76J8271L4265j5149j6911J5775J40j5135r397L6095
2873H49133k2541l2291k9683p003j3101l4797o3253k5357k073k9994m0062j7090
2861E31888k1185o117o051o080k4524k1694k1074j0882j4041k5048l790m1682
2849C29720K3769j0129q723l108k2354N702j5065O857j2866j9959J545j1713q358
2836B55318j4979j262Q910j3411j6193j7842j0452J1759k3222k1694k3899K1128
2824A54161j7692k7912J4408R598k777j812J5322j0399k0527O201J5793p707j0714
$$ plain form
2908 1158215 1169234 1204929 1256275 1317099 1422510 1488374 1510414 1450580 1368471 1278980 1195529
2897 1195529 1145973 1073775 996272 952066 930674 914854 884923 864533 808419 786536 806908
2886 806908 810140 793509 801855 801179 819450 853715 838566 821655 837430 837570 822435 813038 849133
2873 849133 826592 794301 764618 757615 744514 709717 646464 621107 619034 589040 548978 531888
2861 531888 510703 504586 498535 492455 467931 446237 425163 414281 400240 375192 371402 329720
2849 329720 353489 343360 334637 331529 309175 314877 299812 306669 293803 273844 275389 263676 255318
2836 255318 240339 239077 247987 234576 218383 200541 190089 201848 178626 156932 133033 154161
2824 154161 136469 108557 122965 132563 129786 127974 143296 132897 112370 118571 134364 126657 115943
2811A15943K946L102k1303P778L315j7969j8008r698k128L8692q415q932J1193
2798I6516l3069K630L3565l852j5293N304M742j7312n3620J5603k461k4022j0427
2785a696K0533J0468j5902M370L040k713o429j5270j5311K6177N606L409m269
2772A2013J0756J7758n1515r588P695J1463J232J5327j212P938l3214q021K2726
2759C358N406j2263j6656q779L158J8278k4262p45J5802O466k5369k2697J3518
2746d4785L4933j4286K08K150o741j0601K968K783k5544k54k724L219J3394k9829
2732g5109J9471J0542L450q942q224J8949p401L240k9282L4826N598k1731J2751
2719d1862r570J8062j752K062K420j154j4517M006j3643l814k049j2401J2380
$$ plain form
2811 115943 118889 121991 100688 108466 111781 93812 75804 66106 63978 102670 94255 85323 96516
2798 96516 63447 66077 99642 95790 80497 85801 90543 73231 19611 35214 32753 8731 -1696
2785 -1696 18837 29305 13403 17773 20813 18100 11671 -3599 -18910 7267 12873 16282 12013
2772 12013 22769 40527 -10988 -20576 -12881 -1418 -186 15141 13929 21867 -11347 -19368 3358
2759 3358 8764 -3499 -20155 -28934 -25776 -7498 -31760 -32505 -16703 -10237 -35606 -58303 -44785
2746 -44785 -9852 -24138 -23930 -21780 -28521 -39122 -36154 -33371 -58915 -59169 -61893 -58674 -45280 -75109
2732 -75109 -55638 -45096 -41646 -50588 -58812 -39863 -47264 -44024 -73306 -38480 -32882 -54613 -41862
2719 -41862 -51432 -33370 -35122 -33060 -30640 -31794 -46311 -42305 -55948 -59762 -61811 -74212 -61832
2706f1832L3957n85k0327J255Q95r339L229K3257l4379j5252R879N801J2761k718
2692e3398L517l151j8022m264J3671j717K3630J3295o803J2080k6410O022q890
2679e0440l167k79k0610J0441K0435K08j650M739m736R397j0276j2990J6746l710
2665d5892j5624K0242j9077J0927K3059k693k8377j0555O256J8772k0396L284
2653f0074K7983j4842n83Q56J1998J4644Q692k3116O733N78j3524j7367N047j3504
2639f6479N241L4891O305n2J1890l5849R195N188l2797n341M2254k6165j3129
2626f4848m156M509Q05J1544M677q425K774J4700J2854l0515q429L042K3798j7023
2612e4693n860Q169k2422K0817J1956P22m674j2984R16K6117L628j2670m776p853
$$ plain form
2706 -61832 -27875 -28460 -48787 -47532 -46637 -55976 -52747 -29490 -63869 -79121 -69242 -63441 -50680 -53398
2692 -53398 -49881 -53032 -71054 -75318 -61647 -63364 -39734 -26439 -33242 -21162 -47572 -41550 -50440
2679 -50440 -53607 -53886 -74496 -64055 -43620 -43412 -45062 -40323 -45059 -35662 -45938 -58928 -42182 -45892
2665 -45892 -61516 -41274 -60351 -49424 -26365 -29058 -57435 -67990 -61734 -42962 -63358 -60074
2653 -60074 -32091 -46933 -47516 -46660 -34662 -20018 -11326 -34442 -27709 -27131 -40655 -58022 -52975 -66479
2639 -66479 -61238 -26347 -20042 -20094 -8204 -44053 -34858 -29670 -62467 -67808 -25554 -51719 -64848
2626 -64848 -69004 -64495 -63690 -52146 -47469 -55894 -53120 -38420 -25566 -56081 -64510 -61468 -37670 -54693
2612 -54693 -60553 -52384 -74806 -53989 -42033 -41311 -45985 -58969 -58053 -31936 -28308 -40978 -45754 -53607
2598e3607O489m089R069j6726k506K4557L749j0951K102p431N046J2927o703k119
2584d0193J2764j3808Q185q029n08l289J6824r061K662j3021P086J1629J2468
2571a6291l2493j6680J1119o180R751K6977j701k3289j692J350n429j5408j2209
2558h2175J2289J4926J4056q111K109J778j5626j3184N735m57j1976J5197P435
2545e8004j0079O110M1745j6217j3495Q934K786j7662J642J2405J539M300j2990
2532d8986j5578R254K2546l990Q687o638j2909O400m951N790j5977q645R065J0990
2518d4942j6873J6014p140j3483J0009K122j3133j0543K0103K7352k7024R458
2506d8080J6305j762k6043k512J6037K911N462j0886M28n850J459m659k504j0125
$$ plain form
2598 -53607 -47118 -51207 -42138 -58864 -61370 -36813 -33064 -44015 -41913 -49344 -44298 -31371 -38074 -40193
2584 -40193 -27429 -41237 -33052 -41081 -41589 -44878 -28054 -37115 -34453 -47474 -40388 -28759 -16291
2571 -16291 -48784 -65464 -54345 -60525 -50774 -23797 -25498 -48787 -50479 -49129 -54558 -69966 -82175
2558 -82175 -69886 -54960 -40904 -49015 -46906 -45128 -60754 -73938 -68203 -68660 -80636 -65439 -58004
2545 -58004 -68083 -61973 -20228 -36445 -49940 -41006 -38220 -55882 -54240 -41835 -40296 -35996 -48986
2532 -48986 -64564 -55310 -32764 -36754 -28067 -34705 -47614 -41214 -46165 -40375 -56352 -64997 -55932 -44942
2518 -44942 -61815 -45801 -52941 -66424 -56415 -54293 -67426 -77969 -57866 -30514 -57538 -48080
2506 -48080 -31775 -33537 -59580 -62092 -46055 -43144 -37682 -48568 -48140 -53990 -52531 -57190 -59694 -69819
2492f9819j086O041P0K978L763L293j3630K709Q930J3110J2408l366O627k2708
2478e0680m237P876P867k0961j095K2341j6691j1123L649K427j0012n310J7414
2465e8535j623j232J4228j2313K0330j9831r502J7200o343O186M52p351j9983
2452g8317O765K514J544K7581k888M666l258j2131r449R422N934J8603k2181N491
2438d5704J7867j6698j5197j6126J6158n322j5745P159P624O093J6344j2907j9696
2425g6150l070K2477N994p243j4091J9932J5941J2523j7034j845l949Q708j4580
2412e2387l571J7352j426j1180J4840Q98r600M500J2286n026j6024J7291k0863
2399e2910J2265J2028k4966J7191J7563n003R888J0102p48l3323R486J1910j6169
$$ plain form
2492 -69819 -70905 -64864 -64794 -61816 -58053 -54760 -68390 -65681 -56751 -43641 -31233 -34599 -27972 -50680
2478 -50680 -54917 -47041 -39174 -60135 -61230 -38889 -55580 -66703 -63054 -60627 -70639 -75949 -58535
2465 -58535 -60158 -61390 -47162 -59475 -39145 -58976 -68478 -51278 -57621 -51435 -50983 -58334 -78317
2452 -78317 -71552 -69038 -67494 -39913 -42801 -38135 -41393 -53524 -62973 -53551 -47617 -29014 -51195 -45704
2438 -45704 -27837 -44535 -59732 -75858 -59700 -65022 -80767 -73608 -65984 -59891 -43547 -56454 -76150
2425 -76150 -79220 -56743 -50749 -57992 -72083 -52151 -36210 -23687 -40721 -42566 -46515 -37807 -52387
2412 -52387 -55958 -38606 -40032 -51212 -36372 -35474 -45074 -40574 -28288 -33314 -49338 -32047 -52910
2399 -52910 -40645 -28617 -53583 -36392 -18829 -23832 -13944 -3842 -4590 -37913 -28427 -16517 -32686
2386c2686M666j84J0800R230k6641J2157J8049L1514K5058j1344k8747J0386r9
2373B2159K029j856l1838m424P788j235p329k0105J338j0966r270L1351J547K719
2359a8092p748r821J0628K0815q767k5721N040J6915k155P831j0206p830P292
2346b1819Q110k8875J9068P661k4094J1878k792L1366j344k7735j9726o744o728
2333f1774J8632K0609J0661L440p817j2923m685K1475j9344p903J0464p587j4541
2320e1293k997L6487R774q064J7404P164p105k6911K012J2151m91R363O598k360
2306A732j8099j8945J0096q553J9563J74j2079J3212j7217l473J258K474j7558
2293d7415o20K402L677M26q711K292q089J147K2770J066J65Q892L831o091j1988
$$ plain form
2386 -32686 -28020 -28204 -17404 -8174 -34815 -22658 -4609 26905 51963 40619 11872 22258 22159
2373 22159 24188 22332 -9506 -13930 -6142 -7377 -14706 -34811 -33473 -44439 -53709 -22358 -20811 -18092
2359 -18092 -25840 -35661 -25033 -4218 -12985 -38706 -33666 -16751 -18906 -11075 -21281 -29111 -21819
2346 -21819 -13709 -42584 -23516 -15855 -39949 -28071 -30863 503 -841 -28576 -48302 -55046 -61774
2333 -61774 -43142 -22533 -11872 -8432 -16249 -29172 -33857 -12382 -31726 -39629 -29165 -36752 -51293
2320 -51293 -54290 -17803 -8029 -16093 1311 8475 1370 -25541 -23529 -11378 -11869 -2506 4092 1732
2306 1732 -16367 -35312 -25216 -33769 -14206 -14032 -26111 -12899 -30116 -33589 -32331 -29857 -47415
2293 -47415 -48035 -45633 -41956 -41530 -50241 -47949 -56038 -54891 -32121 -31055 -30890 -21998 -18167 -24258 -36246
2278c6246L2067N605j8722R160j102R269r189j741Q936m991K0310j5878k527J0294
2264E245O367J9266K44k9475J5859O707k5857J91j1591J565J5593j0697k3598
2251c0181J4056L2090R398R77Q222J826k9320L4283R272m255j4514j9715J6375
2238B8514r211n854p185J4729J5539j540j2231K5180O519l589J023l2155K2167
2225D1906K2250k3657J8813K0971j6340J0300j3204N439j4226J3863P8j2508J2797
2212F6482o362L867O301J3734J489P363n810J0657Q07q597j2297K3675j1257J0583
2198A00635J79J6115M362K5711r071l0296K036K5841J4237O356o080j0933J5867
2185A54959J14k1131K1895J7264P473J438K327J1841J5441J7092j89J273j6877
$$ plain form
2278 -36246 -4179 1426 -17296 -8136 -9238 31 -9158 -10899 -1963 -6954 13356 -2522 -5049 5245
2264 5245 11612 30878 31122 1647 17506 24213 -1644 -1453 -13044 -11479 4114 -6583 -30181
2251 -30181 -16125 15965 25363 26340 34562 36388 7068 41351 50623 46368 31854 12139 28514
2238 28514 19303 13449 6264 20993 36532 34992 22761 47941 54460 50871 51894 19739 41906
2225 41906 64156 40499 59312 80283 63943 74243 61039 66478 52252 66115 66193 53685 66482
2212 66482 60120 63987 70288 84022 85511 92874 87064 97721 98528 89931 77634 101309 90052 100635
2198 100635 100814 116929 121291 147002 137931 107635 109671 135512 149749 156105 150025 139092 154959
2185 154959 155073 133942 155837 173101 180574 182012 184339 196180 211621 228713 228524 229797 212920
2172B12920m280q848n412J5485J2989O278r012k3106J0608Q447K4026N939j0347
2159B35687J4767J9394M169J0627J6363Q141K8785l024M238P705Q711K3168L4252
2146D12983L8137L8905L3728J3604K3606J2333K5244M5634L8524M2208K6828O0534
2134H12268M6538J1648N5923M2127L7769O9980R8571O9244J05864J01751J36227
2123A587910J78403J38369R8871J93098K02596K39199L02251L75340L67287M85056
2113D168380N75554P10667P83115J074235J521892J700839O2660j471025j050974
2104H075343j219025j275017j031856q05984n92058m61400l35806k63110k24356
2095A866731j45129p5617n5760q2429j24895q8828j01268j10106o0907n7223p6592
$$ plain form
2172 212920 208640 199792 194380 209865 222854 229132 220120 197014 207622 216069 240095 246034 235687
2159 235687 250454 269848 274017 284644 301007 309148 337933 334909 339147 346852 355563 378731 412983
2146 412983 451120 490025 523753 537357 560963 573296 598540 644174 682698 724906 751734 812268
2134 812268 858806 870454 926377 968504 1006273 1076253 1174824 1244068 1349932 1451683 1587910
2123 1587910 1766313 1904682 2003553 2196651 2399247 2638446 2940697 3316037 3683324 4168380
2113 4168380 4743934 5454601 6237716 7311951 8833843 10534682 10597342 9126317 8075343
2104 8075343 6856318 5581301 4549445 3743461 3151403 2690003 2354197 2091087 1866731
2095 1866731 1721602 1645985 1590225 1507796 1382901 1294073 1192805 1082699 1021792 964569 887977
2084H87977p4866l6308m7577n7980m8942K429m1117m8556k2895j979N737l0125
2072D85798j1127n1070J682j7587N363p613m0289j0252k278J043q07L68l703j4900
2058C34628j4668l1443J4214o195l3800o526j8164K944r833k0150j7293J3802
2046B07516N323j9968j0670l2813j1528J8294m787j9879J1829J2909k8180q019
2034A20027R465n025j1401R843m557R477m775j8294J653O52k339m760j3487L236
2020H9715k6618P930L545J937P966J5696n496m0479r772j0135K2654l556K387
2007E5774K4117j2387j5685J838r544Q344J3349k2977l1983l266Q446P685l353
1994B0358J1841O12j9523l222K759J317j3957Q131k7543O985K6620j1431M609
$$ plain form
2084 887977 813111 776803 729226 671246 622304 624733 583616 535060 512165 510186 515923 485798
2072 485798 474671 423601 425283 407696 413059 405446 365157 354905 352627 353670 352863 353231 349528 334628
2058 334628 319960 288517 302731 296536 262736 256210 238046 240990 231157 211007 193714 207516
2046 207516 212839 192871 182201 149388 137860 156154 151367 131488 143317 156226 128046 120027
2034 120027 129492 124467 113066 122909 118352 127829 123054 104760 106413 107065 104726 99966 86479 89715
2020 89715 63097 71027 74572 76509 84475 100171 94675 54196 44424 34289 56943 53387 55774
2007 55774 79891 67504 51819 53657 44113 52457 65806 42829 10846 7580 16026 23711 20358
1994 20358 32199 32811 13288 10066 12825 14142 185 8316 -19227 -12242 14378 2947 7556
1981G556j3603l160J9217j0385q772M669R033m30o773P275K0072j0751j2749P719
1967H918P941j1629n989P901m07J222J8411P283k8328L8863r556j7740n538J4001
1953B5353k3386j3830J3449j1027L2689n758j2108n222L1019k0632J5724R178
1941C5449j4877J66j8688l466Q119p548q202J3889K438j0201p161N515q017J1825
1927g59K77Q095K4042K892l2543r274J4954n096J009j2017j349M652K0700r79
1913A4604p833J48l657m254l1441Q225P038P698j0967j6610K7159J5989j4816
1900h717l266j0674n503K3846K438j3254j1299n06M800L108J4620J0749j3945
1887g603j5466k6049n8059L1898J9520p73L4623r221l211j0367J0261J083r8m180
$$ plain form
1981 7556 -6047 -9207 10010 -375 -9147 -4478 4555 4125 -2648 4627 24699 13948 1199 8918
1967 8918 16859 5230 -759 7142 6735 7957 26368 33651 5323 44186 34630 16890 11352 25353
1953 25353 1967 -11863 1586 -9441 23248 17490 5382 160 31179 10547 26271 35449
1941 35449 20572 20738 2050 -1416 6703 -845 -9047 4842 7280 -2921 -10082 -4567 -12584 -759
1927 -759 -482 7613 31655 34547 2004 -7270 7684 2588 3597 -8420 -9769 -5117 15583 14604
1913 14604 6771 6919 3262 -992 -32433 -24208 -17170 -9472 -20439 -37049 -9890 6099 -8717
1900 -8717 -11983 -22657 -28160 -4314 -1876 -15130 -26429 -26935 -22135 -19027 -4407 6342 -7603
1887 -7603 -23069 -49118 -107177 -75279 -55759 -56532 -21909 -31130 -34341 -44708 -34447 -33364 -33462 -37642
1873c7642Q414M012r939m373L7217J0723k954m988P792j8817j2528J7795j9273
1860b4561P134j3828J0632k2742J9024N597M542J4528o781j6877q72L656J5856
1847d692j1471n483J3075K3992p466j8119j2895L7983J0215Q341J1952m1523R253
1834A3162J0613q406J627p812j4302p674M55j1201L397J568j281J5387j2620R53
1820a6134N53j1611j7056K1664K4578K878k1385R964k804j137J4220k0963j3043
1807c0276K213J0174J7375o233j9411j5833J8766N271j616M062j5001q655J4521
1794b4643o91J6548r613R721r472p844J4854o242J9995l0816p887J7844L864K5603
1780A1221m001j8279j4950r767J6860L698j4870J1888j857J2299K3907j2355j7338
$$ plain form
1873 -37642 -29228 -25216 -35155 -39528 -2311 8412 5458 470 8262 -10555 -23083 -5288 -24561
1860 -24561 -17427 -31255 -20623 -43365 -24341 -18744 -14202 326 -6455 -23332 -24204 -20548 -4692
1847 -4692 -16163 -21646 -8571 15421 7955 -10164 -23059 14924 25139 33480 45432 3909 13162
1834 13162 23775 15369 16996 9184 -5118 -12792 -12337 -23538 -20141 -18573 -19854 -4467 -17087 -16134
1820 -16134 -15581 -27192 -44248 -22584 1994 4872 -16513 -6549 -9353 -10490 3730 -17233 -30276
1807 -30276 -28063 -17889 -514 -6747 -26158 -41991 -23225 -17954 -19570 -15508 -30509 -39164 -24643
1794 -24643 -25334 -8786 -18399 -8678 -18150 -25994 -11140 -17382 2613 -28203 -36090 -18246 -14382 11221
1780 11221 7220 -11059 -26009 -35776 -18916 -15218 -30088 -18200 -20057 -7758 16149 3794 -13544
1767a3544k1067J168J2039P582Q634M937j3896n593O743Q967l125j6608J838K034
1753a9891K5614l249L483l0524o417J1300K019J9244n312r157l749M08j6888j1304
1739d4423J0101k837K1694J411J1252j4019j1827P230K1016j7600Q7o503k985
1726b7403J7780j6916q015J3209J6667q199R259J0849L895n309j1194j3702O050
1713a3029j0353J2980p483J9985j2158M560J5347j129k3242L272j5629r564P445
1700b8998K2091J2373J4426M524k824j3827k1120j5736k244M0038N943l02o496
1687G848j0853j052q128j0337l43N256J954k2504J5034j1692L7160M027j6165
1674i795m249j2128l847j0592J821k103R137J5917K3617k0719k6043P94J7390
$$ plain form
1767 -13544 -34611 -33443 -21404 -13822 -5188 -251 -14147 -19740 -12997 -4030 -7155 -23763 -21925 -19891
1753 -19891 5723 2474 5957 -24567 -30984 -19684 -17665 1579 -3733 -12890 -16639 -16231 -33119 -44423
1739 -44423 -34322 -37159 -15465 -14054 -2802 -16821 -28648 -21418 -402 -18002 -17915 -24418 -27403
1726 -27403 -9623 -26539 -34554 -21345 -4678 -12877 -3618 7231 11126 5817 -5377 -19079 -13029
1713 -13029 -23382 -10402 -17885 2100 -10058 -5498 9849 8720 -14522 -11250 -26879 -36443 -28998
1700 -28998 -6907 5466 19892 24416 21592 7765 -13355 -29091 -31335 8703 14646 14344 7848
1687 7848 -3005 -4057 -12185 -22522 -22865 -17609 -15655 -38159 -23125 -34817 2343 6370 -9795
1674 -9795 -14044 -26172 -30019 -40611 -38790 -40893 -31756 -15839 7778 -12941 -38984 -38190 -20800
1661b0800k087l257J994j2009J390K3616l20n92k1291j0703L9507N330J084k347
1647d85Q264J4233j6623k1269r675J9792K6230R898k4067j3726m882Q396m74J5519
1633A1131J0218j6953k6971J0159K730O129q442j053j6890K2676J1765j143k6587
1620b3231P75k887M326K3520p421J5373j6842k704p885J2282q266r637p338K3401
1606f534J1353l215k0678k041J0275J2377J354p991o227R816p765j7450r47M960
1592b2713O146J1716j054j6743K0108n677L617Q414j0261j8486J1062r641J07
1579b3405P456J5491k106j4442J6163J6409j5993j4906K2275R117j6396j6121
1567a6458M461n748O054N0J3727k0656m66J2541j5406J1057L0271l2411p580n776
$$ plain form
1661 -20800 -22887 -26144 -24150 -36159 -34769 -11153 -11473 -12065 -33356 -44059 -4552 778 1862 -485
1647 -485 7779 22012 5389 -15880 -25555 -5763 20467 30365 6298 -7428 -12310 -3914 -4388 11131
1633 11131 21349 4396 -22575 -12416 -9686 -3557 -11999 -13052 -29942 -7266 4499 3356 -23231
1620 -23231 -22456 -25343 -21017 2503 -4918 10455 -6387 -9091 -16976 -4694 -12960 -22597 -29935 -6534
1606 -6534 4819 1604 -19074 -21115 -10840 1537 2891 -5100 -11327 -1511 -9276 -26726 -27673 -22713
1592 -22713 -16567 -4851 -5905 -22648 -2540 -8217 -4600 3814 -6447 -24933 -13871 -23512 -23405
1579 -23405 -15949 -458 -2564 -17006 -843 15566 -427 -15333 6942 16059 -337 -16458
1567 -16458 -11997 -17745 -11691 -11641 2086 -18570 -19036 -6495 -21901 -10844 19427 -12984 -20564 -26340
1553b6340Q430L0402n426k9275K1671q919j0334J9294L856j25p593o086O658l5137
1539c8924p880K2835J1769J5022R355M918k8488k029J7752j5926j0616L323J289
1526a7600M183L35L102K6191j0489K200M735J1917k3837j8858Q993M079N884N313
1512F148j2899j2809K77j4772N958J2705J2418j6344j0406k0812J4798O420K2475
1499f843L453J4186k1371K44N8111k6538m3272o636K1120q04l976K3363o036j34
1485D867n021J2240J9493k1640k6121L6474m960q593m772j1319J3203j4316Q305
1472b160p781j677j687M543K62k634r100J1286P448K819K0679k8879Q511K749
1458D379N741L470K728j4028L926N276o428m162K29K0867j890p90j3408r45J3447
$$ plain form
1553 -26340 -17910 12492 7066 -22209 -538 -9457 -19791 -497 3359 3234 -4359 -10445 -3787 -38924
1539 -38924 -46804 -23969 -12200 2822 12177 17095 -11393 -13422 4330 -11596 -22212 -18889 -17600
1526 -17600 -13417 -13082 -9980 16211 5722 7922 12657 24574 737 -18121 -9128 -5049 835 6148
1512 6148 -6751 -19560 -19283 -34055 -28097 -15392 -2974 -19318 -29724 -50536 -35738 -29318 -6843
1499 -6843 -3390 10796 -10575 -10331 47780 21242 -22030 -28666 -7546 -8350 -12326 11037 5001 4867
1485 4867 -154 12086 31579 9939 -16182 20292 15332 6739 1967 -9352 3851 -10465 -2160
1472 -2160 -9941 -11618 -13305 -8762 -8500 -11134 -20234 -8948 -1500 1319 21998 -6881 1630 4379
1458 4379 10120 13590 16318 2290 6216 11492 5064 902 1131 21998 20108 19318 5910 4965 18412
1443A8412k4476l590Q649j943l890j809j753k2728j5067K5892N809n977j5152
1430c7623L1812l893J9855J1149n672J0329K307j1247k0128k859J7494L110n904
1417H730n847o73k0248O242O101k8618R101M781K4603p726O674j2723R162j3475
1403a3916K508J8227l3211m990M2126l047N154j499m76r384P202L193j1249K853
1389C491k8071J5445L760p919P135J1491N607j3890o686K0483R189m0840J6343
1376d462o876l455K8997j2551l986J9146m091k1601k1325K6712q302M201M64j1616
1362a8745M053J0152K4947k2500q344Q883j6364l608J3431P414j7335J3138j1589
1349a6467m891l272Q264J0204j2619o701J7699J7690J85K1948k2927j9962L534
$$ plain form
1443 18412 -6064 -9654 -1005 -2948 -6838 -8647 -10400 -33128 -48195 -22303 -16494 -22471 -37623
1430 -37623 -5811 -9704 10151 21300 15628 25957 28264 17017 -3111 -5970 11524 14634 8730
1417 8730 2883 2210 -18038 -11796 -5695 -34313 -25212 -20431 4172 -3554 3120 -9603 -441 -13916
1403 -13916 -11408 6819 -26392 -31382 10744 7697 12851 11352 10876 1492 8694 11887 638 3491
1389 3491 -24580 -9135 -5375 -13294 -6159 5332 10939 -2951 -9637 10846 20035 -20805 -4462
1376 -4462 -11338 -14793 14204 1653 -2333 16813 12722 -8879 -30204 -3492 -11794 -7593 -7129 -18745
1362 -18745 -14692 -4540 20407 -2093 -10437 -1554 -17918 -21526 -8095 -681 -18016 -4878 -16467
1349 -16467 -21358 -24630 -16366 -6162 -18781 -25482 -7783 9907 10092 32040 9113 -10849 -7315
1336g315l517j1690J7621M254M431k891M307R488p286l3479O802M409J9099p580
1322c347o192J5139k0997O241O857J3230o890l409k4616l6942L1373L464o72L517
1308b3244M980O604K777M137J0330Q932j7911k4632P041J630j2705J5043K0950
1295C932R618j4955j434J6078L483q604j4822j6949K1580m69p533J3269j1275
1282h081J2255j0130K114k151r375L627N459K8069r259o401m212M935M726j0202
1268A374J9634j6349r945K2379k95j1426n610k6089P320J2338K803O382J4437
1255A6953l538j099Q917l755j1459K057Q512l9095J2692L0333J9504j7196j4198
1242H628J209l588J1196k4957J7818P556q701Q662m1869L8203R245k3253j3232
$$ plain form
1336 -7315 -10832 -22522 -4901 -647 3784 893 5200 14688 7402 -26077 -19275 -14866 4233 -3347
1322 -3347 -9539 5600 -15397 -9156 -2299 10931 4041 632 -23984 -60926 -29553 -26089 -26761 -23244
1308 -23244 -18264 -11660 -8883 -4746 5584 14516 -3395 -28027 -20986 -19356 -32061 -17018 3932
1295 3932 13550 -1405 -2839 13239 16722 8118 -6704 -23653 -2073 -2542 -10075 3194 -8081
1282 -8081 4174 -5956 -3842 -5993 -15368 -11741 -6282 21787 12528 6127 1915 6850 11576 1374
1268 1374 21008 4659 -5286 17093 16798 5372 -238 -26327 -19007 -6669 -3866 2516 16953
1255 16953 13415 12316 21233 17478 6019 8076 16588 -22507 -9815 20518 40022 22826 8628
1242 8628 9837 6249 17445 -7512 10306 17862 9161 17823 -24046 14157 23402 149 -13083
1229a3083R224L254j6702J9761K466p557o355J066Q010q059R598Q257j4038j0098
1215a4256J4660J4964J0352j2345J997j3488K168J4004r560M307Q353o325K036
1202A6867k0212M574K3361j923k3383O281O850P073N307k477J2721Qq513l2447
1188e913j1713L033K1584k5874R116L176R17M909n732K675J1334j1893J2702j8877
1174a0556J1893J7064k3361p729K2117j6763r566M239J0506K3133k2224k6812
1162b8059K8017J8245j9967K509j6046O709K4903j1053k4008r385O932M452K7682
1149A0931J3120j9984l178J1571j0484J6759l415q292r157k5262L853Q346J6770
1136A578l121o741R82K2090n88J3415k5721Q054J4280m794J1935q566n131q300
$$ plain form
1229 -13083 -3859 -605 -17307 2454 4920 -2637 -8992 -7926 84 -7975 1623 9880 -4158 -14256
1215 -14256 404 15368 25720 13375 15372 1884 4052 18056 8496 12803 21156 14831 16867
1202 16867 -3345 1229 24590 22667 -716 5565 12415 19488 24795 22318 35039 35047 26534 -5913
1188 -5913 -17626 -14593 6991 -18883 -9767 -6591 -5674 -765 -6497 -3822 7512 -4381 8321 -10556
1174 -10556 1337 18401 -4960 -12689 9428 -7335 -16901 -12662 -2156 20977 -1247 -28059
1162 -28059 -42 18203 -1764 745 -15301 -8592 16311 5258 -18750 -28135 -21203 -16751 10931
1149 10931 24051 4067 889 12460 1976 18735 15320 7028 -2129 -27391 -23538 -15192 1578
1136 1578 -1543 -8284 -7302 14788 14200 27615 1894 9948 24228 19434 31369 22803 17672 9372
1122I372K211o31Q936r552J0626j7110O755O708o053K731j6275K078N792J657
1108G245J337J6061j8823n534j705K4879Q586K129p201r573R12j622j2683Q964
1094A2972K039j5719j0556J4980K3017k1363j4344k2105J9240J9924l6862J7078
1082a1699q894n853L0025L104k6951J5761j331O427Q010j7148K0310Q971j5683
1069E049J5253J2511k7657J274J1201k8281r296J3390N266O616p423o607O848
1056a856q1r927p652K1837o431J7775K428j4296K5030q066j7365K943l652q121
1042g434K1532J6557k228j6598J8664K7007r463k9745N638j8897j0119K0309k808
1029A2415r688L445P156M762J196J4333k7688q552J2117M57j410J987j8072M485
$$ plain form
1122 9372 11583 10952 19888 10336 20962 3852 10607 17315 11262 13993 -2282 -204 5588 7245
1108 7245 8582 24643 5820 286 -1419 23460 32046 34175 26974 17401 18313 16691 4008 12972
1094 12972 15011 -708 -11264 3716 26733 5370 -8974 -31079 -11839 8085 -28777 -11699
1082 -11699 -20593 -26446 3579 6683 -20268 -4507 -5838 589 8599 -8549 11761 20732 5049
1069 5049 20302 32813 5156 6430 17631 -10650 -19946 -6556 -1290 5326 -2097 -8704 -1856
1056 -1856 -1937 -11864 -19516 2321 -4110 13665 16093 1797 26827 18761 1396 4339 687 -7434
1042 -7434 14098 30655 28427 11829 30493 57500 48037 18292 23930 5033 -5086 15223 12415
1029 12415 2727 6172 13328 18090 19286 33619 5931 -2621 9496 9953 8543 10530 -7542 -3057
1015c057P992j5200L5752r577o281M998r811K0507j6780J0262K770O095l2093
1002d423l699J0952O0J73l0105J0109K8364P195j2606J1118k0132j859J6829L079
988A5055J2318M556J6451j5954k5444J9597j1505j4617N683j6227K786O716j6887
975a7472k138N86m890J5538L037L0731J299o743o705l6086J7547K3939L343N451
961B7437k9575k9478L6284M408p275k3981Q274J849J8313N054k4305L439K1376
948A1820j3519j0612l841J5131R670l108J1176j4225J1572J6927l2174j3993K2473
935G297j8638M180R724P613O83j7080J1977o638M048q013j3277r964K1421K1898
921A5231J0996k000k8969O877o786j39j6462Q066J7629k572r115J4818j999J9722
$$ plain form
1015 -3057 4935 -10265 25487 15910 9629 14627 4816 25323 8543 18805 21575 27670 -4423
1002 -4423 -8122 2830 2890 3063 -27042 -16933 11431 18626 6020 17138 -2994 -4853 11976 15055
988 15055 27373 31929 48380 32426 6982 26579 15074 457 6140 -10087 -7301 -585 -17472
975 -17472 -19610 -19024 -23914 -8376 -5339 25392 26691 19948 13243 -22843 -5296 18643 21986 27437
961 27437 -2138 -31616 4668 9076 1801 -22180 -13906 -12057 6256 11310 -12995 -9556 11820
948 11820 -1699 -12311 -16152 -1021 8649 5541 16717 2492 14064 30991 -1183 -15176 7297
935 7297 -11341 -7161 2563 10176 10859 -6221 5756 -882 3166 -4847 -18124 -28088 -6667 15231
921 15231 26227 24227 -4742 2135 -4651 -4790 -21252 -13186 4443 1871 -7244 7574 5575 25297
907B5297O170m11J009k0915k482Q148m5405P017K6558M069j5914M035J7554J550
893A6280k469J866N571l220j8394J3481l965j1484L052K2471K461l4127K1490
880A3013J2088N748o505j6288q547O341j2811q470J8814l89M838Q227j644k077
866A2338p5R101k6886l220R205R457J0646N712k0693k432q459j516K081n048j648
851a1437J3777N646q583K852j2352j7005L028J6973K3741j1860k3494J5242L615
838A43q89k727k0636K1510j7990L1059J1867j1358p262M888J0532j3328j3977
825h168J0335J8839m624m579K949m895J358j764k2919Q369J0724K320M407j2131
811B21J616J1598L404j7574R075P680j9294P767n901J438K8590Q40j6209M215
$$ plain form
907 25297 31467 31056 32065 11150 8668 16816 -28589 -21572 4986 9055 -6859 -2824 14730 16280
893 16280 13811 15677 21248 18028 -366 13115 9150 -2334 718 23189 25650 -8477 13013
880 13013 25101 30849 24344 8056 -491 5850 -6961 -15431 3383 2994 7832 16059 14415 12338
866 12338 12263 21364 -5522 -8742 463 9920 20566 26278 5585 3153 -5306 -6822 -4741 -9789 -11437
851 -11437 2340 7986 -597 2255 -10097 -27102 -24074 -7101 16640 4780 -18714 -3472 143
838 143 -746 -3473 -24109 -2599 -20589 10470 22337 10979 3717 8605 19137 5809 -8168
825 -8168 2167 21006 16382 11803 14752 9857 11215 9451 -13468 -5099 5625 7945 12352 221
811 221 1837 13435 16839 -735 8340 16020 -3274 4493 -1408 30 28620 29460 13251 17466
797A7466M155r113l00L422l1998j8774Q32J4746M872P980J3359k410n099j4703
783a5565J7056Q983j773P111J0648j9241j1383J7744J141j0711J9975J3489j4331
770B3143m599M382k238k4549j2747J6453K366M515j1643j1133J9699p897L4039
757B9791k363O987l387k9594L677J1319n089J3667l1375J8082j9653J603J571
744d764N306N994o125K1730K274K618J2583j8279j4406p78j0561K2891L427k6215
730d305k65J3580R587k318p971j6416R606r392R581J4435J252k2870J3270K791
716A0565k980J8095k8480P718J7228J0203j5131j8616j65L492P483j4113L32r990
702a4359J854M5269O357l3151j0768L3036n75j3619L114j9730P432J834N305j7662
$$ plain form
797 17466 21621 12508 12208 15630 -16368 -35142 -34310 -19564 -14692 -6712 6647 4237 -862 -15565
783 -15565 1491 10474 8701 15812 26460 7219 -4164 13580 14721 4010 23985 37474 23143
770 23143 18544 22926 20688 -3861 -16608 -155 2211 6726 -4917 -16050 3649 -4248 29791
757 29791 27428 34415 31028 1434 5111 16430 11341 25008 -6367 11715 -7938 -6335 -4764
744 -4764 542 6536 411 22141 24415 27033 39616 21337 6931 6153 -4408 18483 21910 -4305
730 -4305 -4570 9010 18597 16279 8308 -8108 1498 -7894 1687 16122 17374 -5496 7774 10565
716 10565 7585 25680 -2800 4918 22146 32349 17218 -1398 -1563 1929 9412 -4701 -4369 -14359
702 -14359 -12505 32764 39121 5970 -4798 28238 27663 14044 17158 -2572 4860 6694 11999 -5663
688e663L841J9583j9720L401j4139J0019k2915J8959O232K9622j5634K798j0519
675E865j9100J1214J0999j387l737O313n786r816J2127p356J0739m132J5250j4882
661F311r67j3444K041K3245r653K0179Q465Q870l5676r709j3528N191J4871j6995
647a0799R99P385K3317M957M764L145j3004l7023M539K9235P631j1704j4219j2160
633a2937K6480J5684o711k2949j4815J6036R355q472j0478l18J1313j2005J4212
620D395O634J4981l316j0257L778n819N017j8774K9621j570m474q079q172M674
606H639K0551l2051q995J3306n938R3M580n641J8666K7693l1325m0190K6540k398
592f470J4119l769J874j9514J8689L951j7098j7565M639J6650O266J6117j5947
$$ plain form
688 -5663 -1822 17761 -1959 1442 -12697 -2678 -25593 -6634 -402 29220 13586 16384 5865
675 5865 -13235 -2021 8978 7591 3854 10167 4381 -5435 6692 -664 10075 5943 21193 6311
661 6311 5344 -8100 -6059 17186 7533 27712 36177 45047 9371 -338 -13866 -8675 6196 -10799
647 -10799 -9800 -2415 20902 25859 30623 33768 20764 -16259 -11720 17515 25146 13442 -777 -12937
633 -12937 13543 29227 22516 -433 -15248 788 10143 1671 -8807 -9125 2188 -9817 4395
620 4395 11029 26010 22694 12437 16215 10396 15413 -3361 26260 24690 20216 12137 3965 8639
606 8639 29190 -2861 -11856 1450 -4488 -4395 185 -5456 13210 40903 9578 -30612 -4072 -6470
592 -6470 7649 3880 5754 -13760 4929 8880 -8218 -25783 -21144 -4494 1772 17889 1942
579A942k253o562p41J5493N172L166N160O948K55r513J3125J2597m6180j1038
565a2429J1351j125K961K381K0602J3792j1247m19j8627j0788R411j024O921k2589
551a0829P260J5658K4107k3059N114j2499Q216j645j9282K2142J396J032lj0798
537F810k1408k1441J5811R878L9816K1275k0229m306r225p15P565J9827j9335
524B4323j7639j2280M940l124J3762l950L936q365k5604K5127L320q331j6297
511b0182P113N907L427L785M021j4338p25J6848p042R85P145j1787P371J369J0421
$$ plain form
579 1942 -311 -6873 -7614 7879 13051 16217 21377 28325 28580 19067 32192 44789 -1391 -12429
565 -12429 -1078 -2203 758 3139 23741 37533 26286 25867 7240 -3548 5863 4839 11760 -10829
551 -10829 -3569 12089 36196 13137 18251 5752 13968 12323 -6959 15183 16579 17611 17608 6810
537 6810 -14598 -36039 -20228 -10350 29466 50741 30512 26206 16981 16266 23831 43658 24323
524 24323 6684 -5596 -656 -3780 9982 6032 9968 1603 -24001 1126 4446 -3885 -20182
511 -20182 -13069 -7162 -3735 50 4071 -10267 -10992 5856 -1186 -201 6944 -4843 2528 3897 14318
$$ [...]
##END NTUPLES=NMR SPECTRUM
##END=
