##TITLE=1H_TG-2340-4
 CDCl3
 8 sc, 
 7.12.2021
##JCAMPDX= 6.0         $$ Bruker NMR JCAMP-DX V2.0
##DATA TYPE= NMR SPECTRUM
##DATA CLASS= NTUPLES
##ORIGIN= UXNMR, Bruker Analytische Messtechnik GmbH
##OWNER= root
$$ XWIN-NMR		Version 3.5
$$ Tue Dec  7 11:04:27 2021 Russian Standard Time (UT+4h)  she@DPX200
##.OBSERVE FREQUENCY= 200.131346
##.OBSERVE NUCLEUS= ^1H
##.ACQUISITION MODE= SIMULTANEOUS
##.ACQUISITION SCHEME= undefined
##.AVERAGES= 8
##.DIGITISER RES= 18
##SPECTROMETER/DATA SYSTEM= spect
##.PULSE SEQUENCE= zg30
##.SOLVENT NAME= CDCl3
##.SHIFT REFERENCE= (INTERNAL, CDCl3, 0, 15.7171)
##AUDIT TRAIL= $$ (NUMBER, WHEN, WHO, WHERE, WHAT)
$$ ##TITLE= Audit trail, XWIN-NMR		Version 3.5
$$ ##JCAMPDX= 5.01
$$ ##ORIGIN= Bruker BioSpin GmbH
$$ ##OWNER= she
$$ F:/spectra/data/she/nmr/H-F/1/pdata/1/auditp.txt
$$ ##AUDIT TRAIL=  $$ (NUMBER, WHEN, WHO, WHERE, WHAT)
(   1,<2021-12-07 11:03:09.90 +0400>,<she>,<DPX200>,
      <created by zg, POWCHK disabled, PULCHK disabled
       configuration hash MD5:
       00 E9 B6 7A A2 85 ED C7 34 08 36 98 17 FE 4E 26
       data hash MD5: 16K
       C1 05 93 4F C0 44 42 EE EE 75 8D DC FD C2 B4 23>)
(   2,<2021-12-07 11:03:12.46 +0400>,<she>,<DPX200>,
      <Start of raw data processing
       efp BC_mod = 2 LB = 0.24 FT_mod = 6 PKNL = 1 PHC0 = -15510.23 PHC1 = 8.2008 SI = 16K 
       data hash MD5: 16K
       64 49 06 25 51 49 3A FB BA 91 F4 42 3C E4 A0 A8>)
(   3,<2021-12-07 11:03:28.71 +0400>,<she>,<DPX200>,
      <pk PHC0 = -4.683282 PHC1 = 8.599999 
       data hash MD5: 16K
       2A 70 92 80 B9 65 BF 57 F1 4D DD 31 BD 4B 89 79>)
(   4,<2021-12-07 11:03:31.60 +0400>,<she>,<DPX200>,
      <abs ABSG = 5 
       data hash MD5: 16K
       0B A7 9E 8F 82 EF DF 68 4A C1 49 74 7D A3 0E 35>)
$$ ##END=
$$ 
$$ hash MD5
$$ 26 8B 90 91 E2 BA 7A 77 33 CF 1C FC 76 74 CD F2
##$RELAX= 
##$RELAX= 
##$RELAX= 
##$RELAX= 
##$RELAX= 
##$RELAX= 
$$ Bruker specific parameters
$$ --------------------------
##$DU= <F:/spectra>
##$EXPNO= 1
##$NAME= <H-F>
##$PROCNO= 1
##$TYPE= <nmr>
##$USER= <she>
##$AMP= (0..31)
100 100 100 100 100 100 100 100 100 100 100 100 100 100 100 100 100 100 
100 100 100 100 100 100 100 100 100 100 100 100 100 100 
##$AQSEQ= 0
##$AQ_mod= 1
##$AUNM= <au_zg>
##$AUTOPOS= <>
##$BF1= 200.13
##$BF2= 200.13
##$BF3= 200.13
##$BF4= 200.13
##$BF5= 200.13
##$BF6= 200.13
##$BF7= 200.13
##$BF8= 200.13
##$BYTORDA= 1
##$CFDGTYP= 0
##$CFRGTYP= 5
##$CHEMSTR= <none>
##$CNST= (0..31)
1 1 145 1 1 1 1 1 1 1 1 1 1 1 1 1 1 1 1 1 1 1 1 1 1 1 1 1 1 1 1 1 
##$CPDPRG= <>
##$CPDPRG1= <>
##$CPDPRG2= <>
##$CPDPRG3= <>
##$CPDPRG4= <mlev>
##$CPDPRG5= <mlev>
##$CPDPRG6= <mlev>
##$CPDPRG7= <mlev>
##$CPDPRG8= <mlev>
##$CPDPRGB= <>
##$CPDPRGT= <>
##$D= (0..31)
0 1.2 0 0 0 0 0 0 0 0.06 0 0.03 0 0 0 0 0.0002 0 0 0 0 0 0 0 0 0 0 0 0 
0 0 0 
##$DATE= 1638860589
##$DBL= (0..7)
120 120 120 120 120 120 120 120 
##$DBP= (0..7)
150 150 150 150 150 150 150 150 
##$DBP07= 0
##$DBPNAM0= <>
##$DBPNAM1= <>
##$DBPNAM2= <>
##$DBPNAM3= <>
##$DBPNAM4= <>
$$ [...]
##$SUBNAM2= <"">
##$SUBNAM3= <"">
##$SUBNAM4= <"">
##$SUBNAM5= <"">
##$SUBNAM6= <"">
##$SUBNAM7= <"">
##$SUBNAM8= <"">
##$SUBNAM9= <"">
##$SW= 18.0517287032376
##$SWIBOX= (0..15)
0 0 2 0 0 0 0 0 0 0 0 0 0 0 0 0 
##$SW_h= 3612.71676300578
##$TD= 16384
##$TD0= 1
##$TE= 0
##$TE2= 300
##$TE3= 300
##$TEG= 300
##$TL= (0..7)
0 120 120 120 120 120 120 120 
##$TP= (0..7)
150 150 150 150 150 150 150 150 
##$TP07= 0
##$TPNAME0= <>
##$TPNAME1= <>
##$TPNAME2= <>
##$TPNAME3= <>
##$TPNAME4= <>
##$TPNAME5= <>
##$TPNAME6= <>
##$TPNAME7= <>
##$TPOAL= (0..7)
0.5 0.5 0.5 0.5 0.5 0.5 0.5 0.5 
##$TPOFFS= (0..7)
0 0 0 0 0 0 0 0 
##$TUNHIN= 0
##$TUNHOUT= 0
##$TUNXOUT= 0
##$USERA1= <user>
##$USERA2= <user>
##$USERA3= <user>
##$USERA4= <user>
##$USERA5= <user>
##$V9= 5
##$VALIST= <valist>
##$VCLIST= <CCCCCCCCCCCCCCC>
##$VD= 0
##$VDLIST= <DDDDDDDDDDDDDDD>
##$VPLIST= <PPPPPPPPPPPPPPP>
##$VTLIST= <TTTTTTTTTTTTTTT>
##$WBST= 1024
##$WBSW= 4
##$XGAIN= (0..3)
0 0 0 0 
##$XL= 0
##$YL= 0
##$YMAX_a= 101996
##$YMIN_a= -188125
##$ZGOPTNS= <>
##$ZL1= 120
##$ZL2= 120
##$ZL3= 120
##$ZL4= 120
##$ABSF1= 16.07192
##$ABSF2= -1.979935
##$ABSG= 5
##$ABSL= 3
##$ALPHA= 0
##$AQORDER= 0
##$ASSFAC= 0
##$ASSFACI= 0
##$ASSFACX= 0
##$ASSWID= 0
##$AUNMP= <proc_1d>
##$AZFE= 0.1
##$AZFW= 0.1
##$BCFW= 0
##$BC_mod= 2
##$BYTORDP= 0
##$COROFFS= 0
##$CY= -3
##$DATMOD= 1
##$DC= 0
##$DFILT= <>
##$DTYPP= 0
##$F1P= 0
##$F2P= 0
##$FCOR= 1
##$FTSIZE= 16384
##$FT_mod= 6
##$GAMMA= 0
##$GB= 0
##$INTBC= 1
##$INTSCL= 0
##$ISEN= 128
##$LB= 0.24
##$LEV0= 0
##$LPBIN= 0
##$MAXI= 10000
##$MC2= 0
##$MEAN= 0
##$ME_mod= 0
##$MI= 1.114404
##$NCOEF= 0
##$NC_proc= -7
##$NLEV= 6
##$NOISF1= 3.799351
##$NOISF2= 2.8
##$NSP= 0
##$NTH_PI= 0
##$NZP= 0
##$OFFSET= 15.71714
##$PC= 1
##$PHC0= -15514.91
##$PHC1= 16.8008
##$PH_mod= 1
##$PKNL= yes
##$PPARMOD= 0
##$PSCAL= 0
##$PSIGN= 0
##$REVERSE= no
##$SF= 200.130006886991
##$SI= 16384
##$SIGF1= 3
##$SIGF2= 2
##$SINO= 5.538805
##$SIOLD= 16384
##$SREGLST= <1H.CDCl3>
##$SSB= 0
##$STSI= 16384
##$STSR= 0
##$SW_p= 3612.71676300578
##$SYMM= 0
##$S_DEV= 0
##$TDeff= 16384
##$TDoff= 0
##$TI= <>
##$TILT= no
##$TM1= 0
##$TM2= 0
##$TOPLEV= 0
##$USERP1= <user>
##$USERP2= <user>
##$USERP3= <user>
##$USERP4= <user>
##$USERP5= <user>
##$WDW= 1
##$XDIM= 16384
##$YMAX_p= 373528818
##$YMIN_p= -3689497
$$ End of Bruker specific parameters
$$ ---------------------------------
##NTUPLES= NMR SPECTRUM
##VAR_NAME=  FREQUENCY,     SPECTRUM/REAL,   SPECTRUM/IMAG
##SYMBOL=    X,             R,               I
##VAR_TYPE=  INDEPENDENT,   DEPENDENT,       DEPENDENT
##VAR_FORM=  AFFN,          ASDF,            ASDF
##VAR_DIM=   16384,         16384,           16384
##UNITS=     HZ,            ARBITRARY UNITS, ARBITRARY UNITS
##FACTOR=    0.220516191357247, 1,           1
##FIRST=     3145.47137602029, 0,            0
##LAST=      -467.245386985488, 0,           0
##MIN=       -467.245386985488, -3689497,    0
##MAX=       3145.47137602029, 373528818,    0
$$ Real data points
##PAGE= N=1
##DATA TABLE= (X++(R..R)), XYDATA
$$ [...]
7073C976215P8771q3216j24623k69190k99579l02361k94771j09358J9100n0646
7063B540342P245M5638l05014j67989k32321R9551J14086k18358j40683J20508
7053A863005O2805j13210j02658J03842J3340Q7446k31976o1627J63540J2055
7043A796562N0934J11572k07314j55563j7536k36916j62547j74080R5704m4635
7033A056181O2415k1576p918r3136L1217J53499k33650J07227j59199J073N0953
7022I47086J00891J16076q4139k67783l1520K53571K46213r9352L8205j68034
7012A051214j83929J59596L5645Q1935k06668j5152P3261k04652J51875j4034
7002I29091j32103P9407l654J08474k1359j21828M5467j74401M9970l3393q638
$$ plain form
7073 3976215 4054986 3971770 3847147 3577957 3278378 2976017 2681246 2571888 2590988 2540342
7063 2540342 2547587 2593225 2288211 2120222 1887901 1987452 2101538 1883180 1742497 1863005
7053 1863005 1925810 1812600 1709942 1813784 1827124 1914570 1682594 1620967 1784507 1796562
7043 1796562 1847496 1959068 1751754 1596191 1578655 1341739 1179192 1005112 1100816 1056181
7033 1056181 1118596 1097020 1089102 995966 1027183 1180682 947032 1054259 895060 896133 947086
7022 947086 1047977 1164053 1079914 812131 780611 1034182 1280395 1181043 1219248 1051214
7012 1051214 867285 1026881 1062526 1144461 937793 922641 995902 791250 943125 929091
7002 929091 796988 876395 872741 981215 959856 838028 883495 709094 759064 725671 717033
6991G17033k7665k26327l3890k674K56628O9713p6497Q0744k19636q7483J86697
6980F36643K0386j8736j90876L38379L1163j25613j26161R7396J59275N3663j63931
6969G11588M3080l8802j04618J99430o4319q1832J5064o10q5247m5712O0169m7896
6957E60295P1n2325n4841o2074O4894j1659P2740m4059q5708K01073J19762j9255
6945F88914k33511j05158N9863P525J10413j5673j02089j43400j25180n3216J15151
6934B03639J96749Q281N0901n3408l8572K54965r7062q6575J139j55799M8812
6923C33070K33362k69829k23677P7866L23103j81663j10586J19977N8811j05355
6913B55079M1308l6073l1085M6183N3839R3600m1330J73110M3366j43931j98737
$$ plain form
6991 717033 689368 463041 429151 426477 683105 752818 676321 757065 537429 449946 636643
6980 636643 657029 638293 447417 785796 816959 691346 565185 662581 821856 875519 711588
6969 711588 754668 715866 611248 810678 746359 664527 679591 678981 593734 548022 608191 560295
6957 560295 560366 508041 453200 391126 456020 444361 517101 473042 387334 588407 708169 688914
6945 688914 455403 350245 410108 417633 528046 512373 410284 266884 141704 88488 203639
6934 203639 400388 408669 459570 406162 367590 622555 525493 438918 440057 284258 333070
6923 333070 566432 296603 72926 150792 473895 292232 181646 301623 360434 255079
6913 255079 296387 260314 229229 275412 329251 422851 381521 554631 597997 454066 255329
6902B55329J0453R0406M3309j08619j3625L7255J41361Q8797M1198j17052l4771
6891D34041J78989J283j27586j96241o6318J20598j30336K7838J86969J85702
6881F14939j67785O8435j49645m4650N9675J59505J09966o3276n3563N5241Q2543
6870F71385j26202K0740K9128j56640K12399j1959o9324j33555K6339n6433j6832
6859C89046k3390j3560N4711p8325J16627p1591o3557M8834m8975L0422Q81j36556
6847B04567k06123K0675J41515K44477n9168m7596M3394j20068R06N3850K0533
6836B96962L9012o4107M990k5804N3328M922M3906N0546m7842J74253j27482J128
6824D03812k22631j5304m9856J27951K8306L527K06637N3659j45263j71479k6578
$$ plain form
6902 255329 265782 356188 399497 290878 277253 314508 455869 544666 585864 468812 434041
6891 434041 613030 614313 486727 290486 224168 344766 214430 242268 429237 614939
6881 614939 447154 515589 365944 321294 380969 540474 650440 587164 533601 588842 671385
6870 671385 545183 565923 595051 438411 650810 638851 569527 435972 462311 405878 389046
6859 389046 365656 352096 406807 328482 445109 373518 309961 358795 309820 340242 341123 204567
6847 204567 -1556 19119 160634 405111 345943 298347 341741 221673 222579 276429 296962
6836 296962 335974 271867 276857 251053 304381 309303 353209 403755 355913 530166 402684 403812
6824 403812 181181 165877 116021 243972 272278 275805 482442 536101 390838 219359 192781
6813A92781P0945J62680N0069j47273p3687j24384J6901n6207r7247J44410O747
6802A45735l6558J22430j23931Q522n4676K40534o6769j94891O865L7473M599
6791H9333p4112J35746r8335k8938J62316j41971L8456l4752n4808P0485j73273
6780a09853J55090O2901k12920J70544k6544j44867N6919o531K76796p9628k27524
6769h5617K5413R4431o528m6457m5130J53078r63m4302O6374n4254p2949J18093
6757A01189P6405M2861M1639K26301j2566j99698n7557j07433J10808P6026r443
6746B88532J31883j23266o105J06262J32824p5118m8646M8330k8532J84280Q1529
6735F91973J11002l57452k00334O6547J33837r3010j96568J20715J30540j9756
$$ plain form
6813 192781 263726 426406 476475 329202 255515 131131 148032 91825 -5422 138988 145735
6802 145735 109177 231607 107676 116198 61522 302056 235287 40396 47261 84734 89333
6791 89333 15221 150967 52632 23694 186010 44039 82495 47743 -7065 63420 -109853
6780 -109853 45237 108138 -104782 65762 39218 -105649 -48730 -55261 221535 141907 -85617
6769 -85617 -60204 34227 27699 -18758 -63888 89190 88227 43925 110299 56045 -16904 101189
6757 101189 177594 220455 262094 488395 475829 276131 218574 111141 221949 297975 288532
6746 288532 420415 297149 291044 397306 530130 455012 406366 454696 426164 610444 691973
6735 691973 802975 445523 245189 311736 445573 352563 155995 276710 407250 387494
6725C87494k267J7293j73321L7922p2945m6133l0440j82029N9266L8331J30062
6714A63233m8014J48225P4384j24609J37223l09469n6875O0503K65761k8142p8541
6703B03679j6015j73401K475Q1074N0826m3564q679P1886J40942r5411l70367
6692a56555k2713K00294J37076j46659K86686P0394k87029J03262J8112j08666
6682I4202j38090J58579J5975l5315k9612L2780L4036K4415O5714l3485k67678
6671g8479r2787J18291K72072l7586r0916K99080p5898j34045k15569r7374K71543
6660A38332O2190R7389j10085L0443l521O3111j68301M4927q3079q880j48377
6649h5851P958O9240J385K17262J2738j89661R4611N0913K0917m7019o2927N0728
$$ plain form
6725 387494 385227 402520 229199 267121 194176 148043 117603 -64426 -5160 33171 163233
6714 163233 115219 263444 337828 213219 350442 40973 -15902 44601 310362 282220 203679
6703 203679 187664 14263 16738 97812 148638 105074 96395 168281 309223 213812 -156555
6692 -156555 -179268 21026 158102 11443 298129 368523 81494 184756 202868 94202
6682 94202 -43888 114691 130666 95351 65739 98519 132555 156970 222684 189199 -78479
6671 -78479 -171266 -52975 219097 181511 90595 389675 313777 179732 -35837 -133211 138332
6660 138332 200522 297911 187826 218269 214748 277859 109558 154485 71406 62526 -85851
6649 -85851 -77893 -8653 -7268 209994 222732 33071 127682 178595 199512 152493 89566 140294
6637A40294L8149R430l16837J17534M2315J50247j35931n0424j34132O5752K01167
6626A27564m9596p5894j7974J6169J07891R8374N7458K6461Q6523j39712O1930
6615B99194m447k01784J66399M0955j13845K6528m6767p4373M5396j40107N4327
6604E1476J85486J02479p1345q2341o8947K41188J10894p2692j97066R1512n2313
6593B38331J86J44391K1843J27389j42891p1424j41814P5618j28771J13413J16641
6582C52912m0497o5348J61914j78580J36079J76428J06729m1958J2444L24352
6572I44475P1509O7983K02242q6659o8796l51046j81144q871N0595Q9875j83436
6561E46727P677J65728J07899k79910P0556n8410J16924o7128j41464O7072j27412
$$ plain form
6637 140294 178443 187873 -128964 -11430 30885 181132 45201 -5223 -139355 -73603 127564
6626 127564 77968 2074 -15900 269 108160 206534 263992 290453 376976 237264 299194
6615 299194 294747 92963 259362 300317 186472 213000 166233 91860 137256 -2851 51476
6604 51476 236962 339441 268096 185755 116808 357996 468890 396198 199132 290644 238331
6593 238331 238517 382908 404751 532140 389249 317825 176011 251629 122858 236271 352912
6582 352912 312415 247067 408981 230401 366480 542908 649637 607679 620123 944475
6572 944475 1015984 1083967 1286209 1199550 1130754 779708 598564 589693 640288 730163 546727
6561 546727 554404 720132 828031 548121 618677 560267 677191 610063 468599 535671 408259
6550D08259n1908m7202n469m4959N2643r6491j62468J3770R5809R2835j56625
6539I8194R0995Q2092j3184j59491J69544P7943J30159L4977j08943j00743j58779
6528A42764r5616j29827l3491J65415P8279J97816j70781k02031p6117Q7541R827
6517b6221J45075n9888j13259O3525J6009Q0792J8472o7165m6383J92327o0342
6506A42942P7077j18420J1369K882r4085J103Q0907P4123r0769N0312l8017q1292
6494A8132K83760O2484k45469P6606O2439J60263N279k2329j4090j08568k6362
6483B52145R5000K14292j60565j33586k4803R275j26252o132K24568K2653j08218
6472B58377o0169m7296J39000R0660l3550J64316j68982j51100J12369k8078J51893
$$ plain form
6550 408259 356351 309149 303680 258721 311364 214873 52405 66175 161984 254819 98194
6539 98194 189189 271281 258097 98606 268150 346093 476252 511229 402286 301543 142764
6528 142764 47148 -82679 -116170 49245 127524 325340 154559 -47472 -123589 -36048 -26221
6517 -26221 118854 58966 -54293 9232 25241 106033 124505 57340 10957 203284 142942
6506 142942 220019 101599 112968 115850 21765 22868 103775 177898 87129 137441 99424 18132
6494 18132 301892 364376 118907 195513 257952 418215 423494 401165 387075 278507 252145
6483 252145 347145 561437 400872 267286 242483 251758 125506 119374 343942 366595 258377
6472 258377 198208 150912 289912 380572 347022 511338 342356 191256 303625 275547 427440
6461D27440L7903j72966p3086P111j20667K4326N5767J8411L6127m5620O2821
6450B57567r1066m890o1843P5519L0393j10895J25430J20873P3091K9268j38652
6439C04795j36657K10982o2700k145J24338K10550K2340k71087j69218J51500
6429C82698P569J9759J90726Q8332j66174O1145K2021P774P615J04928n089o4456
6417F56848p820K3308J12876m5609n9922p5700k17530N985L9362j14498P8894
6406C96194m7378o4941L9366K02501J35472j5459j03339q1907K44029Q5146j03308
6395F86376J15650j16442j11545j73702K49810J24605n1104R8933N1841l2506
6385H41916n2319P7494J2043j4582m1448j82373l9688L10064J91700k25008J56544
$$ plain form
6461 427440 465343 292377 219291 226402 105735 130061 185828 204239 240366 194746 257567
6450 257567 166501 161611 99768 175287 205680 94785 220215 341088 414179 443447 304795
6439 304795 168138 379120 316420 314275 438613 649163 671503 400416 231198 382698
6429 382698 390267 410026 600752 689084 522910 584055 606076 613850 621465 726393 721304 656848
6417 656848 649028 672336 785212 739603 679681 603981 386451 392436 431798 317300 396194
6406 396194 348816 283875 323241 525742 661214 645755 542416 460509 704538 789684 686376
6395 686376 802026 685584 574039 400337 650147 774752 723648 822581 874422 841916
6385 841916 789597 867091 879134 864552 823104 640731 601043 911107 1102807 877799 1034343
6374A034343m6814j45307N6388L7117P7173r3435m2573P2338l501j07026O925
6363H45628N2791J51871k5890n9056j24555P7910j26108J42988J04425M2145k9406
6352A052743J79754J98679j88874p541j7784J39798j11618n3392K39677O6360
6342A497802K6381r5998P7811M42849J95494L29083J38638L74396l9044K90817
6332C238229K67096p8969k64538o02613m17791l55807L1263j22551j71366j02104
6322A420849k4335j4498j39816O3034j68230j03367M4779J22422k4933j4231N9029
6311A220703q5662j09356q5897K2296n3317l2333K1381l6088p2387R9887R0801
6300I80028l7304k0371J1838P0743j55088m9838J85848j18199m5421N9904R9520
$$ plain form
6374 1034343 987529 842222 898610 935727 1012900 919465 876892 949230 945729 838703 845628
6363 845628 898419 1050290 1024400 965344 840789 918699 792591 935579 1040004 1082149 1052743
6352 1052743 1232497 1431176 1242302 1234761 1216977 1356775 1245157 1191765 1431442 1497802
6342 1497802 1524183 1428185 1505996 1948845 2144339 2473422 2612060 2986456 2947412 3238229
6332 3238229 3505325 3426356 3161818 2559205 2141414 1785607 1816870 1694319 1522953 1420849
6322 1420849 1396514 1382016 1242200 1305234 1137004 1033637 1078416 1200838 1175905 1161674 1220703
6311 1220703 1135041 1025685 939788 962084 908767 876434 897815 861727 789340 889227 980028
6300 980028 942724 922353 934191 1004934 849846 800008 985856 867657 822236 882140 981660
6289I81660o031K6230m9010J55244l00987P4157K11997J3824k14189o3566K23246
6278A052575j03269q8618N3329P7713J42371J11692j27607n2139N3434K6241J08181
6267A253903J93407r1783l11607k25889J40383M5566K80644Q6889l5849k4317
6257A311347O3430l574L0761R6001L1965L68536O4277l94617j10217K23119k6267
6246A654761L2842J53470j50554M4325M4478J41995K08111p7508j4518K27581
6236B264983J572K53291J536O746N4514N4061J54684J65485L05891J78317L99929
6225C841009L95756L68963L92703O98529M59529O75369N03250J1046l58012m90142
6215F498000n41140n71059j88004O0668O8791K32765M55626M05547K82114L11687
$$ plain form
6289 981660 975629 1001859 952849 1108093 807106 881263 1093260 1107084 892895 829329 1052575
6278 1052575 949306 860688 914017 991730 1134101 1245793 1118186 1066047 1119481 1145722 1253903
6267 1253903 1447310 1355527 1043920 818031 958414 1003980 1284624 1371513 1335664 1311347
6257 1311347 1374777 1371203 1401964 1497965 1529930 1898466 1962743 1568126 1457909 1681028 1654761
6246 1654761 1687603 1841073 1690519 1734844 1779322 1921317 2129428 2051920 2037402 2264983
6236 2264983 2266555 2519846 2521382 2528128 2582642 2636703 2791387 2956872 3262763 3441080 3841009
6225 3841009 4236765 4605728 4998431 5696960 6156489 6831858 7335108 7346154 6988142 6498000
6215 6498000 5956860 5385801 5197797 5258465 5327256 5560021 6015647 6421194 6703308 7014995
6205G014995M24654K22962n36659p82541q80663o28341k55837j70922m08451j58877
6195C840320k2779L3882J11196M3027j22681n991m6360j02437m7145j8113j0956
6184C651963K81570J80960N7143K16917J58420K07947K89911K87021K41946N21290
6174F095088L53077N74584P64337N76843Q62370R42620O41377N66356l18273q82659
6164A0175720p33190n33063k92716j95054L68570K27285L96340N18002M52798
6155A0384692N32884Q41948P15321l44104j144418r40597o92098n29364j20509
6146H703755m16930l83903m20728k41982j96165m77836j66807K62497j9416J20439
6136F762924N5537K73615L99421R3709n4108R2912j1446m5073j57478j676j11424
$$ plain form
6205 7014995 7439649 7662611 7125952 6343411 5462748 4834407 4578570 4407648 3999197 3840320
6195 3840320 3817541 3851423 3962619 4005646 3882965 3876974 3830614 3728177 3681032 3662919 3651963
6184 3651963 3933533 4114493 4171636 4388553 4546973 4754920 5044831 5331852 5573798 6095088
6174 6095088 6448165 7022749 7787086 8363929 9226299 10168919 10810296 11376652 11058379 10175720
6164 10175720 9442530 8909467 8616751 8421697 8790267 9017552 9413892 9931894 10384692
6155 10384692 10917576 11759524 12474845 12130741 10986323 10045726 9353628 8824264 8703755
6146 8703755 8286825 7902922 7482194 7240212 7044047 6566211 6399404 6661901 6642485 6762924
6136 6762924 6818461 7092076 7491497 7585206 7531098 7624010 7612564 7567491 7410013 7408337 7296913
6125G296913K61889o1008J08380J96490K12057J59291J12940M60269N57494P55571
6115A0060286P91635O70335O53613J100816J229476J402203J856888J802656K044895
6106B1612803K470328K672861K124454J042358q58182k209528j985492j164371
6098B3705231l28433M14224R78551J349535J766944J894271J718758P65148j293524
6089C0970705l240634l782316l400692k424011j384571j190208q20425m71501
6081A4256347m34195m7176k26565j01211k08171R6986k41564n44847l39710r4935
6071A2114959K0051P2781J04035L21216O14825N27522P48541O95272Q81424J317001
6061A7417627J521259J912536J877853K123226K083286K480364K712041L078850
$$ plain form
6125 7296913 7558802 7497794 7606174 7802664 8014721 8174012 8286952 8747221 9304715 10060286
6115 10060286 10851921 11522256 12175869 13276685 14506161 15908364 17765252 19567908 21612803
6106 21612803 24083131 26755992 28880446 29922804 29064622 26855094 24869602 23705231
6098 23705231 23376798 23791022 24769573 26119108 27886052 29780323 31499081 32264229 30970705
6089 30970705 27730071 23947755 20547063 18123052 16738481 15548273 14727848 14256347
6081 14256347 13822152 13774976 13548411 13447200 13239029 13336015 13094451 12549604 12209894 12114959
6071 12114959 12135010 12207791 12311826 12633042 13247867 13775389 14523930 15219202 16100626 17417627
6061 17417627 18938886 20851422 22729275 24852501 26935787 29416151 32128192 35207042
6053C5207042L189644K355521j92599k717479l397869k461909j086500j92893
6045C0702958O75502J305972J826883J769053J566466J464358l03725l173284
6037C5834183m824278m629019l884842k737686j778011j419520j312681j111501
6029A4136645q67113p31291p83471n53781o45912k28860j62513k79537p9957M3432
6019I847642j87491M9842L00104K92682J34867K16654K63524k7901J13637K00435
6009A1203995N55243L25096j27654n44486j77880m62833q1790L21543K23061L24783
5999A1559078K46585R5672k55551m04014j19930o6216J51359p6138n78782n45280
5989A0006783m30145j49853o5970N6249L28849J4550P5076M5817K9410p5824L3983
$$ plain form
6053 35207042 38396686 40752207 40559608 37842129 34444260 31982351 30895851 30702958
6045 30702958 31378460 32684432 34511315 36280368 37846834 39311192 39007467 35834183
6037 35834183 31009905 26380886 22496044 19758358 17980347 16560827 15248146 14136645
6029 14136645 13269532 12538241 11754770 11200989 10555077 10326217 10163704 9884167 9804210 9847642
6019 9847642 9660151 9709993 10010097 10302779 10437646 10654300 10917824 10889923 11003560 11203995
6009 11203995 11759238 12084334 11956680 11412194 11234314 10771481 10689691 11011234 11234295 11559078
5999 11559078 11805663 11901335 11645784 11241770 11121840 11055624 11206983 11130845 10552063 10006783
5989 10006783 9576638 9426785 9360815 9417064 9745913 9760463 9835539 9881356 9910766 9834942 9868925
5978I868925q1197j70471J36835K09596M14821J67974L29054K65810O80579N58413
5968A2380339N81561P75794M23456p74657j345916j122838r57065j99958m71778
5959I288938n14230j22274Q1995k49878M9606K73586J28031K36184K50392J0435
5949I432785K67444o52m1097j20497J32740j5403K08575J98634J94171L98794
5939A0655494K63410M91779O40435N29269N67302P74537j86505j319052j141296
5930A1275373n36678m99269m70918k80273P857r97J28849K42790K87680L14849
5920A0469263L70381N65272M35941P907n5298J08278L56886N31575M97169N69853
5910A3857227O69742K97659n87099r60532q54818o63294m08785j98358N2509k321
$$ plain form
5978 9868925 9787728 9617257 9754092 9963688 10378509 10546483 10875537 11141347 11821926 12380339
5968 12380339 12961900 13737694 14161150 13386493 12040577 10917739 9960674 9760716 9288938
5959 9288938 8774708 8652434 8734429 8484551 8534157 8807743 8935774 9171958 9422350 9432785
5949 9432785 9700229 9699577 9658480 9537983 9670723 9655320 9863895 10062529 10256700 10655494
5939 10655494 10918904 11410683 12051118 12580387 13147689 13922226 13735721 12416669 11275373
5930 11275373 10738695 10239426 9768508 9488235 9496092 9495095 9623944 9866734 10154414 10469263
5920 10469263 10839644 11404916 11840857 11848764 11793466 11901744 12258630 12790205 13287374 13857227
5910 13857227 14526969 14824628 14237529 13276997 12422179 11758885 11350100 11151742 11204251 11201930
5900A1201930k53293m60804k52023m2558J6918K16823M78148N57316N03248O35172
5890A2600877R53309R62223R34124J090761K28050p5898k69477j11023K27229
5881A6540175r2854o62595j153148j030690p52066l46693l96356n0720J60591
5872A2215644K77250L85301N46099O06796P93472R86710J090998L85704j9850
5863A7268124P1384N4575M08135P68975Q54623P94566M46363J37073m88730j007274
5853A9307814j631498j414866r37571o21004m70407k52127M0476K75077M60704
5844A4756598M56875N35194Q83406J150013J287159J320401J396643J017913L29041
5835B3133243m94046q84590n35117l02142p0957K27553R8990n05583p69059p89615
$$ plain form
5900 11201930 10948637 10487833 10235810 10193252 10210170 10426993 10905141 11462457 11965705 12600877
5890 12600877 13554186 14516409 15450533 16541294 16769344 16693446 16423969 16312946 16540175
5881 16540175 16447321 15784726 14631578 13600888 12848822 12502129 12105773 12055053 12215644
5872 12215644 12492894 12878195 13424294 14031090 14824562 15811272 16902270 17287974 17268124
5863 17268124 17339508 17394083 17802218 18571193 19425816 20220382 20666745 20803818 20315088 19307814
5853 19307814 17676316 16261450 15323879 14702875 14232468 13980341 14020817 14295894 14756598
5844 14756598 15213473 15748667 16632073 17782086 19069245 20389646 21786289 22804202 23133243
5835 23133243 22639197 21754607 21219490 20917348 20846391 21073944 21172934 20667351 19898292 19108677
5825A9108677p18857k50319l04372n73272n13751m66000o06216l92403k21562
5816A5061925p7554N09710N88482K92930N00994P25355M26858M82490O8867J32341
5806A8712398k05806j29154J42146J80777m2992k972L36754M88525P36888J140010
5796B1356574J450402J704013J870151J717343K055375K247867K188978K053033
5788C6643736N37759k151765l913574m012332k702475k027136j521491r03377
5780A9949345m89710l61178j65581J64319J57800J66293j50506J64391M94663
5771A9929836P80416J347311J621849J751089K027315K325508K617605K450807
5763C4851736K548184J839406q43964l750346m426638l934228k649889j913868
$$ plain form
5825 19108677 18389820 18139501 17835129 17261857 16748106 16282106 15675890 15283487 15061925
5816 15061925 14984371 15494081 16082563 16375493 16876487 17601842 18028700 18511190 18580057 18712398
5806 18712398 18506592 18377438 18519584 18700361 18657369 18654397 18991151 19479676 20216564 21356574
5796 21356574 22806976 24510989 26381140 28098483 30153858 32401725 34590703 36643736
5788 36643736 37181495 35029730 31116156 27103824 24401349 22374213 20852722 19949345
5780 19949345 19459635 19098457 18932876 19097195 19254995 19421288 19270782 19435173 19929836
5771 19929836 20710252 22057563 23679412 25430501 27457816 29783324 32400929 34851736
5763 34851736 37399920 39239326 38395362 34645016 30218378 26284150 23634261 21720393
5755B1720393j468137r21155q74224q90349p18942o07124l67263j19688M08676
5746A6162187M93794N58505J033749J249949J522584J582422J701714J759973
5738B6064877J656782R04693q07149k590905k950535k545651j937761j289342
5730A6505009j138180o52139k45910k13098l5312l74680j06524k12723j18869
5721A3407574J36187M02277O11133Q14345J298356J212803J457909J752616J888757
5712B2981957J887274J796749L85817j982382l469599l398401k499033j846201
5704A3856181j673876j329551q28096q39665q59657o44474l27405n84651k77818
5695F490988m09726l67195j70980j95624j13841l38663k39666k7228J6631j9791
$$ plain form
5755 21720393 20252256 19331101 18456877 17566528 16847586 16240462 15873199 15753511 16162187
5746 16162187 16655981 17214486 18248235 19498184 21020768 22603190 24304904 26064877
5738 26064877 27721659 28626352 27819203 25228298 22277763 19732112 17794351 16505009
5730 16505009 15366829 14714690 14468780 14255682 14220370 13845690 13739166 13526443 13407574
5721 13407574 13543761 13946038 14557171 15371516 16669872 17882675 19340584 21093200 22981957
5712 22981957 24869231 26665980 27051797 25069415 21599816 18201415 15702382 13856181
5704 13856181 12182305 10852754 10024658 9184993 8325336 7680862 7353457 6768806 6490988
5695 6490988 6081262 5714067 5543087 5347463 5233622 4894959 4655293 4628065 4644696 4624905
5685D624905k3801j07844q6215m5719j21932j2858L2846q0497k72793n0058R606
5674C865640K27095o1899k68292n9118j77523J19605j52875j41489L2464j06604
5664C277004j17653p2530j02365L1594J74817M5761J6688o0508j2040j27015j01232
5653B952521J47277J42824j03522k20641Q9932N8169q0942k6351N1629k36185
5643B774711r0359J18825R5937j87452J7854p3334R1602J90646n439j85041j74892
5632B573058J96965m6402M2614L6055k0696j5920p233Q4967o6086P9781N3770
5621B910873p3698j31544k10391J01704l9711Q143M3014O375l1386o8253k3714
5610B491412O4177K14517k5366m8418P7974p2351M5273j22970O3346J33734P6776
$$ plain form
5685 4624905 4601104 4493260 4407045 4361326 4239394 4226536 4259382 4178885 3906092 3856034 3865640
5674 3865640 4092735 4030836 3762544 3703426 3525903 3645508 3492633 3351144 3383608 3277004
5664 3277004 3159351 3086821 2984456 3016050 3190867 3236628 3253316 3192808 3180768 3053753 2952521
5653 2952521 3099798 3242622 3139100 2918459 3008391 3066560 2985618 2959267 3010896 2774711
5643 2774711 2684352 2803177 2899114 2711662 2729516 2656182 2747784 2938430 2932991 2747950 2573058
5632 2573058 2770023 2723621 2766235 2802290 2781594 2765674 2758441 2843408 2777322 2857103 2910873
5621 2910873 2837175 2705631 2495240 2596944 2557233 2565376 2608390 2614765 2583379 2515126 2491412
5610 2491412 2555589 2770106 2744740 2696322 2774296 2701945 2747218 2624248 2687594 2821328 2898104
5599B898104p0975J05944j2296l9837J10209J41889r4460n459j5303k2710q1757
5588B913349L8000K41624J06589P3044n3781o8588j5691L63302J30037L24417
5578D052302K67027R8450K89619L14826J89817K38748J58227q2681j54061k48084
5568E124190l99901k2705j20209j41051m4530k2737M7853J41038J00647K65579
5558D928174Q8316J40970L97145J88349K14725K45346k02380k46078O1645K15156
5548F031368J52292k96304k6440J61588k81708k79286k87862p0812J53504l41042
5538D915298r0644j1202l32393j04625J36061q5327l7250L05712J71951O5382
5528D932963L41980K46019K04339K64818J83265L17522K81599j61153l89954Q068
$$ plain form
5599 2898104 2827129 2933073 2920777 2880940 2991149 3133038 3038578 3033119 3017816 2995106 2913349
5588 2913349 2951349 3192973 3299562 3372606 3318825 3250237 3234546 3597848 3727885 4052302
5578 4052302 4319329 4417779 4707398 5022224 5212041 5450789 5609016 5526335 5372274 5124190
5568 5124190 4724289 4701584 4581375 4440324 4395794 4373057 4420910 4561948 4662595 4928174
5558 4928174 5016490 5157460 5554605 5742954 5957679 6203025 6000645 5754567 5816212 6031368
5548 6031368 6183660 5887356 5860916 6022504 5740796 5461510 5173648 5102836 5256340 4915298
5538 4915298 4824654 4813452 4481059 4376434 4512495 4427168 4389918 4695630 4867581 4932963
5528 4932963 5274943 5520962 5725301 5990119 6173384 6490906 6772505 6611352 6221398 6229466
5518F229466L7538l13754j79241k94848j89949k4205n6052j23196L9638j41980
5508D983417L1205J50242m5329r0491J29715L20727L19723L78867K03513j2391
5498F369198R9940J49877R1080J29253k64512k73294o8767N6449j11614k31596
5488E946014k21982j97031r1900R49R3466K8782m3014L4819R7831J10918j55926
5477E602926j8823J32058O311k08940Q4851j76826j4366N0690N9558O6823N2610
5466E636872J71014Q7834R2732L47677K92929r7341L35340M22141P5256j43092
5456G221362j07947R8448M33479K27091Q7968L98490L80397N42538O62125P33987
5446A0677938N88603O43324O96779Q07943R02246M65018K37111j84137m03480
$$ plain form
5518 6229466 6267004 5953250 5774009 5479161 5289212 5265007 5208955 5085759 5125397 4983417
5508 4983417 5014622 5164864 5119535 5029044 5158759 5479486 5799209 6178076 6381589 6369198
5498 6369198 6469138 6619015 6710095 6839348 6574836 6301542 6232775 6289224 6177610 5946014
5488 5946014 5724032 5527001 5435101 5436050 5529516 5558298 5515284 5550103 5647934 5758852 5602926
5477 5602926 5584103 5716161 5722472 5513532 5598383 5421557 5407191 5457881 5517439 5584262 5636872
5466 5636872 5807886 5895720 5988452 6336129 6629058 6531717 6867057 7289198 7364454 7221362
5456 7221362 7113415 7211863 7645342 7872433 7960401 8358891 8739288 9281826 9943951 10677938
5446 10677938 11266541 11909865 12606644 13414587 14316833 14781851 15018962 14834825 14431345
5437A4431345m08487n0932R5304j09368n35848p81088p35037l68528l42980l38096
5427A0856285k55832q6508j5224j00539j34865J5324L40250J60776l46530o20985
5417I812152k77887k92743k32897J38058j35858k3646L0410O0645k05466k28604
5407H644164m71276p41454m53627k26170n05942m17410k24163k87902r2901j60795
5397E062524j3946K8571M8384j67615j3788j16199j55818n0151j0821K5155J60327
5386D796623J59672j54895K28677J52790k90710k30338j7824J5029k73923j02258
5376D282843O7586K16021Q1725K6403p4619j90408n8696n4303q958j2366J71538
5365D446766N4583L36144K6557O537k09685r8884n3446k9786K71118l2288k10798
$$ plain form
5437 14431345 14022858 13971926 14067230 13957862 13422014 12640926 11905889 11537361 11194381 10856285
5427 10856285 10600453 10513945 10498721 10398182 10263317 10278641 10618891 10779667 10433137 9812152
5417 9812152 9534265 9241522 9008625 9146683 9010825 8987179 9017589 9078234 8872768 8644164
5407 8644164 8172888 7431434 6977807 6751637 6245695 5828285 5604122 5316220 5223319 5062524
5397 5062524 5048578 5077149 5125533 4957918 4944130 4827931 4672113 4621962 4611141 4636296 4796623
5386 4796623 4956295 4801400 5030077 5182867 4892157 4661819 4643995 4659024 4385101 4282843
5376 4282843 4350429 4566450 4648175 4674578 4599959 4409551 4350855 4296552 4287594 4275228 4446766
5365 4446766 4501349 4837493 4864050 4870587 4660902 4562018 4508572 4478786 4749904 4717616 4506818
5354D506818J01804J26059j79367J13794N3303P4738J54228L82431J20214k9276
5344E424746Q9459L5570L5427j2075J28909J68805J87465K10083J92017J56998
5334F617404r9889j60114m6352N130k05847j04324n2404q503j81568M3188J14403
5323E921124J23851J15588K81084L07767R1822M68107J89218J35652K89701L30085
5313H253999J40443P8934j86165k40157Q6762k62276k80532j40626l7724p7127
5303G335531j50823k7530M5394j26022O1065P5546j27700K35653K01713J25759
5293G648586K82535L34475Q9845L04018O11102J32563K00520J73692J77799j81611
5283I773524k63388j77065q3920J9906N7941N297r2683J24118L46743L56785O22188
$$ plain form
5354 4506818 4608622 4734681 4555314 4669108 4722411 4797149 4951377 5333808 5454022 5424746
5344 5424746 5514205 5549775 5585202 5573127 5702036 5870841 6058306 6268389 6460406 6617404
5334 6617404 6517515 6357401 6311049 6316179 6110332 6006008 5953604 5945101 5763533 5806721 5921124
5323 5921124 6044975 6160563 6441647 6749414 6841236 7309343 7498561 7634213 7923914 8253999
5313 8253999 8394442 8473376 8287211 8047054 8133816 7871540 7591008 7450382 7412658 7335531
5303 7335531 7184708 7157178 7202572 7076550 7137615 7213161 7085461 7321114 7522827 7648586
5293 7648586 7931121 8265596 8355441 8659459 9270561 9403124 9603644 9777336 9955135 9773524
5283 9773524 9510136 9333071 9249151 9269057 9326998 9332295 9239612 9363730 9710473 10067258 10689446
5272A0689446Q50817N06813N74271P54774P04157L27941k21503l37584l07623
5263A3541509o54924l94386k34538j11271j41507j59044m14652l32567r1950k10196
5253A0796474p1501K44294K29694J98480M43783N10947O43324O50053J049352
5244A4694900P53193J073753J285916J096695J270927P02913j35521j264405j674010
5235A7804361j673609j532199j095839o01827n47490l37550j91249N519k23805
5226A1606312l13501J30634P8606L0657J91203L33193L05892K08352J80441L86092
5216A3137881N74352M68359M82619N08192P39692Q64863Q73048N90332o2476m90636
5206A7686226m46589n02366k30989l5103L41327L49794N61665O40749M94882P64258
$$ plain form
5272 10689446 11540263 12047076 12621347 13376121 14080278 14408219 14186716 13849132 13541509
5263 13541509 12886585 12492199 12257661 12146390 12004883 11845839 11431187 11098620 11006670 10796474
5253 10796474 10724973 10969267 11198961 11397441 11841224 12352171 12995495 13645548 14694900
5244 14694900 15448093 16521846 17807762 18904457 20175384 20878297 20742776 19478371 17804361
5235 17804361 16130752 14598553 13502714 12900887 12353397 12015847 11824598 11830117 11606312
5226 11606312 11292811 11423445 11502051 11532708 11723911 12057104 12362996 12571348 12751789 13137881
5216 13137881 13712233 14180592 14663211 15171403 15911095 16775958 17649006 18239338 18176862 17686226
5206 17686226 17239637 16737271 16506282 16471179 16812506 17162300 17723965 18364714 18859596 19623854
5196A9623854R49456J372769J251598J108293Q69383P47387L32929N72188J245995
5187B8073852J618699K178402K892505L319455M034736M414793N067481M897805
5179E6497728L753865K621881K380756K982968K320713M72674k246761l758662
5171F5025162l965760l366800k233522q41713n06609l21329l63810j63294L14748
5162E3577073Q85081J077671n6947p26249j16759J149252J826736K279085K422171
5153F2317114J682413k54256j273117j737832j506738k001325k827363l202183
5145E1196713l597436l048535k190092j574759j362228j350170j001704p54351
5137C6317438r06856o98676p56711j651641k456898k742652k447537j610602j141991
$$ plain form
5196 19623854 20573310 21946079 23197677 24305970 25175353 25922740 26255669 26827857 28073852
5187 28073852 29692551 31870953 34763458 38082913 42117649 46532442 51599923 56497728
5179 56497728 60251593 62873474 65254230 68237198 70557911 71030585 68783824 65025162
5171 65025162 61059402 57692602 55459080 54617367 54110758 53789429 53425619 53262325 53577073
5162 53577073 54462154 55539825 55482878 54756629 54639870 55789122 57615858 59894943 62317114
5153 62317114 63999527 63745271 62472154 60734322 59227584 57226259 54398896 51196713
5145 51196713 47599277 44550742 42360650 40785891 39423663 38073493 37071789 36317438
5137 36317438 35410582 34711906 33955195 32303554 29846656 27104004 24656467 23045865 21903874
5128B1903874q19001o22728k62279J1736j86979j41817l20998p86611j300933
5119A7474264j217751r90295n41942l90204m57811n49429m89331k82257m33251
5110A2121993m15286m70618k18805j12660j53835k62863j71303j15139K26931
5101A0428415k7445k60597J70927J81713J85485j08043J90795J81953J43080K31064
5091A1317347j26511j23748j985J45061j25136K17197L26497K19551K13419L98658
5081A2460350K07768J0285n1186m8341J5422J41053L56259L00024N1434J01967
5071A3545035L74369L40486L73489N89062N01527K13040L5010j22086r8669k26606
5061A5524657o6107j11542n05906k55842K6702J59395R6543K17974J78295p6936
$$ plain form
5128 21903874 21084873 20462145 20199866 20211602 20024623 19882806 19561808 18775197 17474264
5119 17474264 16256513 15266218 14724276 14334072 13876261 13326832 12837501 12555244 12121993
5110 12121993 11706707 11236089 11017284 10904624 10750789 10487926 10316623 10201484 10428415
5101 10428415 10400970 10140373 10311300 10493013 10678498 10570455 10761250 10943203 11086283 11317347
5091 11317347 11190836 11067088 11065103 11210164 11085028 11302225 11628722 11848273 12061692 12460350
5081 12460350 12668118 12678403 12627217 12578876 12594298 12735351 13091610 13391634 13443068 13545035
5071 13545035 13919404 14259890 14633379 15222441 15723968 15937008 15972018 15849932 15751263 15524657
5061 15524657 15458550 15347008 14841102 14585260 14611962 14771357 14867900 15085874 15264169 15187233
5051A5187233k4150j5486j66316j85865k34361l04147l56074l70280J4966j32076
5041A3413444K68879L87422L39342J56078n9411Q222K38486j03386k27116n71714
5031A3850246r44987r64854p11027m06236j63680k06387l05794j23889j76748
5022I846644J50967j20327l05663l93188n84349m15711m33668k49961J12102j01092
5012G505754m44815K7995L4673j6224J51075n7231N781j76048o6436j33869j71524
5001F659131k45476m11561l22399l85722k66729l730j17277m7735k20753j57086
4991D480663L5390n2741j86632p5053j9962p9619j10914q2870N9010l9562J7187
4980C944897J03800j26847k89823r0939k70567j43594O7919K30881J81387j73735
$$ plain form
5051 15187233 15163083 15147597 14981281 14795416 14561055 14256908 13900834 13530554 13545520 13413444
5041 13413444 13682323 14069745 14409087 14565165 14505754 14513976 14752462 14649076 14421960 13850246
5031 13850246 12905259 11940405 11229378 10823142 10659462 10453075 10147281 10023392 9846644
5022 9846644 9997611 9877284 9571621 9178433 8594084 8178373 7744705 7494744 7606846 7505754
5012 7505754 7060939 7088934 7123607 7107383 7258458 7201227 7207008 7030960 6964524 6830655 6659131
5001 6659131 6413655 6002094 5679695 5293973 5027244 5023514 4906237 4858502 4637749 4480663
4991 4480663 4516053 4463312 4276680 4201627 4181665 4102046 3991132 3908262 3967272 3927710 3944897
4980 3944897 4048697 3921850 3632027 3541088 3270521 3126927 3194846 3425727 3607114 3433379
4970C433379j59640q0284l62O3428M109l76116J29446m3554J9455J92830j48858
4959C033833j4972O0404N4888j75682p7771N3131n2623J56113J05744j30948j33617
4948B878500R8548p459J0364N1114j304j12548Q4067J5836P7048J57695J25747
4937C377608j11685o6299j1855k04379n9195J93396O1792j9377L8841j25139J88220
4926C261928K45247J38781J05404K21814j25182k37904j12753K2386j60885N3634
4916C412470q1760j58352j13397P1204k1824L4304l8981J65204n5741q9539k2340
4905C101248K11314J15124Q4690J12791K42455J91843k4423K24572Q5570J17393
4895D462577O3277j43162l51051j16036l1148p1185p338J32952j7140m2321K40440
$$ plain form
4970 3433379 3273739 3193455 3193093 3256521 3260630 2884514 3013960 2970406 2989861 3182691 3033833
4959 3033833 3018861 3079265 3134153 2958471 2880700 2933831 2881208 3037321 3143065 3012117 2878500
4948 2878500 2977048 2969589 2979953 3031067 3029763 2917215 3001282 3017118 3094166 3251861 3377608
4937 3377608 3265923 3199624 3187769 2983390 2924195 3117591 3179383 3160006 3198847 3073708 3261928
4926 3261928 3507175 3645956 3751360 3973174 3847992 3610088 3497335 3519721 3358836 3412470
4916 3412470 3330710 3172358 3058961 3130165 3108341 3142645 3103664 3268868 3213127 3123588 3101248
4905 3101248 3312562 3427686 3512376 3625167 3867622 4059465 4035042 4259614 4345184 4462577
4895 4462577 4525854 4382692 4031641 3915605 3884457 3813272 3805934 3938886 3921746 3879425 4119865
4884D119865P3024J62328Q7739J83609K03024j45786J91937K23590o4704K38901
4874E273527J52579J94019o6007K37108N84742n1291m1540m8902j22204j73494
4864E938537j90992j12164j37417k30950L65901L4250Q1378J33474O5648J68928
4854F116593L27214J79767N0718M8553J18994L7077J82207R3250J13568K65192
4844G533133J88766M67726O41231J85160l971J04488K5128j56814j41579K855
4834H846123P039N4214K95694M20728K3623m4141j9586k23449j86466J1379j43435
4823I041723l12771l8563J28213n3136p2291K0531Q415Q5589K15316o6256J40268
4812I097038J12240K35337J39976J22220J24308K5699K65340N8864R6921J32699
$$ plain form
4884 4119865 4192889 4355217 4442956 4626565 4829589 4683803 4875740 5099330 5034626 5273527
4874 5273527 5426106 5620125 5554118 5791226 6375968 6324677 6283137 6234235 6112031 5938537
4864 5938537 5747545 5635381 5497964 5267014 5632915 5667165 5748543 5882017 5947665 6116593
4854 6116593 6443807 6623574 6674292 6722845 6841839 6878916 7061123 7154373 7267941 7533133
4844 7533133 7721899 8189625 8830856 9016016 9012045 9116533 9141661 8984847 8843268 8846123
4834 8846123 8853162 8907376 9203070 9623798 9647421 9603280 9583694 9360245 9173779 9185158 9041723
4823 9041723 8728952 8690389 8818602 8765466 8693175 8713706 8722121 8807710 9023026 8956770 9097038
4812 9097038 9209278 9444615 9584591 9706811 9831119 9856818 10122158 10181022 10277943 10410642
4802A0410642J30397j06540k32031j39013k76814k98761j01853Q9340j87032J70502
4792I458837J07418k59737O5855J03278L04648K20367M42224L06857P5366K83884
4782A1108997M25651N27953M12281L82711P12881Q11027J262697J227177J502846
4773A8374221J675117K102082K331745K409249K474390K597737J645733j424833
4765C2185441l308867l060163k302984j486970o59368l22074K52740N12931J260316
4756B3071002J654114J816721K490322L221563L792650L967670M089991M627574
4748D8731607L629715J009308n31828j441434m484552o267298n741666m000021
4740C0903831k830480j999591j133349p02715m0997O022L60490J085195J393425
$$ plain form
4802 10410642 10541039 10434499 10202468 10063455 9786641 9487880 9386027 9475367 9288335 9458837
4792 9458837 9566255 9306518 9372373 9475651 9780299 10000666 10442890 10749747 10825113 11108997
4782 11108997 11534648 12062601 12474882 12857593 13570474 14381501 15644198 16871375 18374221
4773 18374221 20049338 22151420 24483165 26892414 29366804 31964541 33610274 32185441
4765 32185441 28876574 25816411 23513427 22026457 21367089 21045015 21297755 21810686 23071002
4756 23071002 24725116 26541837 29032159 32253722 36046372 40014042 44104033 48731607
4748 48731607 52361322 53370630 52838802 51397368 46912816 40645518 34903852 30903831
4740 30903831 28073351 26073760 24940411 24237696 24196699 24202721 24563211 25648406 27041831
4731B7041831K131143K087903K476541J883372K021151L02433l104476m540940
4723C0298958m367697l394832k583354j676597j281618r26332r07941l10427k16171
4714A4633989k23927j70945j23791J42302j86221m29931l65231m28919p36006
4705A2111320o19109j97624l59584k30614l16023N3317O7408k36260r2131o330
4695A0174370o471O27646K42006L30176N45758M60043N55860L27831M6668j5535
4685A3288352K38582M85862M36216k95356o29968r87135o79994o05589o76312
4676A0574658j24674j23836J28471M05748K64640M35497P01101P34705Q33501
4667A3829811R99743J258332J110121J259239O14573Q4150r3542p04237j365367
$$ plain form
4731 27041831 29172974 31260877 33737418 35620790 37641941 37944374 34839898 30298958
4723 30298958 25931261 22536429 19953075 18276478 16994860 16068528 15160587 14850160 14633989
4714 14633989 14410062 14239117 14115326 14257628 14071407 13641476 13276245 12847326 12111320
4705 12111320 11492211 11294587 10935003 10704389 10388366 10441683 10509091 10272831 10180700 10174370
4695 10174370 10167899 10795545 11037551 11367727 11913485 12373528 12929388 13257219 13303887 13288352
4685 13288352 13526934 14012796 14449012 14153656 13523688 12536553 11856559 11250970 10574658
4676 10574658 10449984 10326148 10454619 10860367 11125007 11560504 12261605 12996310 13829811
4667 13829811 14829554 16087886 17198007 18457246 19071819 19155969 19062427 18358190 16992823
4658A6992823j312740p10827p37660n38656m60219m95357l78453j47674j85086
4649A2026151K55285L37303M28293Q14752O08721Q26273J049279P87078k70587
4640A6862548p30172m52776k09456j24607l47316j94705k62215n96478k69689
4631A3675134n17382n97225k18709j40358j08629J34852J07599P1853K71647N01900
4621A3180682P06679P32537P55463R76809J065744J335666J432793J298455J278717
4612B2763545J635511K265516K464295K807161K977191L159837L046380J555368
4604D2674804j387264l027342k704119j775716l83985M40893J241266J880481
4596C6959018K246492K662094K260909N30123k167671l291882k675877j597879
$$ plain form
4658 16992823 15680083 14969256 14231596 13692940 13232721 12737364 12358911 12211237 12026151
4649 12026151 12281436 12618739 13047032 13861784 14470505 15296778 16346057 17133135 16862548
4640 16862548 16132376 15679600 15470144 15345537 14998221 14803516 14541301 13944823 13675134
4631 13675134 13157752 12560527 12341818 12201460 12092831 12227683 12335282 12407135 12678782 13180682
4621 13180682 13887361 14619898 15375361 16352170 17417914 18753580 20186373 21484828 22763545
4612 22763545 24399056 26664572 29128867 31936028 34913219 38073056 41119436 42674804
4604 42674804 41287540 38260198 35556079 33780363 33396378 33837271 35078537 36959018
4596 36959018 39205510 41867604 44128513 44658636 42490965 39199083 36523206 34925327
4588C4925327n56557M37887P93944J064155J092875Q1936j750450l021244k837331
4579C0230542j574497r68661j70790N21301J140324J271455J175070R83846o46172
4570C1962418k358529l232348l089349k575172k028465j288733q53201o17353
4562A5919268o23615l68794o26469j061622o44967n12463k70190k96684J06032
4553A1620496J38991k66082o2103K247k49998j87193m57983n02844j93318J75330
4543A0017543l4053j06410J72394J100j45959k25167l97678k06474q3674k61795
4533H729827k22157K17693P9205K029J73589j22705l3583k96880l13463m04389
4523G809166l56171q144l8634j00204Q4383q6496p1581q2069o9181J58958J02072
$$ plain form
4588 34925327 34368770 34806657 35600601 36664756 37757631 37839567 36089117 33067873 30230542
4579 30230542 28656045 27687384 27516594 28037895 29178219 30449674 31624744 32608590 31962418
4570 31962418 29603889 26371541 23282192 20707020 18678555 17389822 16536621 15919268
4562 15919268 15295653 14926859 14300390 13238768 12593801 12081338 11811148 11514464 11620496
4553 11620496 11759487 11493405 11431302 11433549 11183551 10996358 10538375 10035531 9842213 10017543
4543 10017543 9983490 9877080 10049474 10050574 9904615 9679448 9281770 9075296 8991622 8729827
4533 8729827 8507670 8725363 8804568 8806597 8980186 8857481 8823898 8527018 8213555 7809166
4523 7809166 7452995 7444851 7406217 7306013 7390396 7303900 7232319 7150250 7081069 7240027 7342099
4512G342099Q4590J04383k9158K98903L73841N43744K66099K51929Q65521P91417
4502A0893368N34332O51674P20427O22058M73717k89061q19669o92423n22520
4493A1571903p7408J21276K36694L86588N70779R52698O28757J7027n49972o74446
4483A3183896n34824k66779J21317K63762L65189N09901L62963J68539L9909l49185
4473A3864688n90775l25678K65612L64373M78186M18350L90575J94052j62868
4464A4896515k69075p63583p87543q74609l47752n10106p93923n44621o35817
4455I369486m84447l62884l4128j53332M9038Q8106J50747K19224j58324n04015
4445H179471l39293k02720l32656J8006j2255R9602L16340P6988k05736n2530
$$ plain form
4512 7342099 7426689 7531072 7501914 7800817 8174658 8718402 8984501 9236430 10101951 10893368
4502 10893368 11427700 12079374 12799801 13421859 13895576 13606515 12786846 12094423 11571903
4493 11571903 11494495 11615771 11852465 12239053 12809832 13762530 14391287 14408314 13858342 13183896
4483 13183896 12649072 12382293 12503610 12767372 13132561 13642462 14005425 14173964 14213873 13864688
4473 13864688 13273913 12948235 13213847 13578220 14056406 14474756 14865331 15059383 14896515
4464 14896515 14627440 13863857 13076314 12201705 11853953 11343847 10549924 10005303 9369486
4455 9369486 8885039 8522155 8488027 8334695 8383733 8471839 8622586 8841810 8683486 8179471
4445 8179471 7840178 7637458 7304802 7322808 7310553 7410155 7726495 7803483 7597747 7545217
4435G545217m18567l12345j80871j60125Q3616p0396j07830K15648J53441J03196
4425F850984j53569k60061m72601n17473l99230k79464q3220j24806k02990L6412
4415D393982k22417p6846J24671p7746j96085l2642R9937j03326r2262n9714N4172
4404C811724Q4700M5268r2095l7540l094n7122J9913m9468Q247N3252n861P4176
4392C852100O0748j91945J08183K07534j06330K6283M9851j01933j70667q2500
4382C651324j15657J37308J65536L9189P9258j33045n8720o1189R5462j3093o7949
4371C718424J74960j80640P593M2937O0163j736J58058n2611k19396K3854J26857
4360C858463O3665k6697N2102k53039j17399j0314n3415q4355j36089K29390J07942
$$ plain form
4435 7545217 7126650 6814305 6633434 6473309 6556925 6486529 6378699 6594347 6747788 6850984
4425 6850984 6697415 6437354 5964753 5447280 5048050 4768586 4685366 4560560 4357570 4393982
4415 4393982 4171565 4094719 4219390 4141644 3945559 3912917 4012854 3909528 3817266 3757552 3811724
4404 3811724 3896424 3941692 3849597 3812057 3808963 3751841 3771754 3722286 3730533 3783785 3777924 3852100
4392 3852100 3912848 3720903 3829086 4036620 3930290 3956573 4006424 3904491 3733824 3651324
4382 3651324 3535667 3672975 3838511 3877700 3956958 3823913 3765193 3704004 3799466 3786373 3718424
4371 3718424 3893384 3712744 3720337 3763274 3823437 3821701 3979759 3927148 3707752 3731606 3858463
4360 3858463 3922128 3895431 3947533 3694494 3577095 3566781 3513366 3429011 3292922 3522312 3630254
4349C630254J0725K11727m2604j53035J31087l2394k6743N2592M524j21052l0060
4338C635021J46908K57939M3418k7547l6420J04706J46319K25776j58141j05382
4328D232597J7863J42957q8138J24176J12793M5101J81339O9347n2020L0606J9483
4317D836104m4671K86615L5391p6976K90817K6643K21513J56059k0277K64604
4307E975822k797K02640K99293K82203J89657J51575K60220K74952j24450K2609
4297G531724j41951j53603j2515J72630R5892J32764j1038J89908J64333M4329
4287H012473J17169p4392K7408j74106j07182P1771K85676j7781J63031J43670
4277H447737K62391J9484o8987J36668R014O0490m4996L0993K70065R1612K38987
$$ plain form
4349 3630254 3640979 3852706 3810102 3657067 3788154 3755760 3729017 3781609 3786133 3665081 3635021
4338 3635021 3781929 4039868 4083286 4055739 4019319 4124025 4270344 4496120 4337979 4232597
4328 4232597 4250460 4393417 4305279 4429455 4542248 4587349 4768688 4838035 4786015 4816621 4836104
4317 4836104 4791433 5078048 5113439 5036463 5327280 5353923 5575436 5731495 5711218 5975822
4307 5975822 5973025 6175665 6474958 6757161 6946818 7098393 7358613 7633565 7509115 7531724
4297 7531724 7389773 7236170 7223655 7396285 7492177 7624941 7613903 7803811 7968144 8012473
4287 8012473 8129642 8055250 8082658 7908552 7801370 7873141 8158817 8141036 8304067 8447737
4277 8447737 8710128 8729612 8660625 8797293 8806307 8866797 8821801 8852794 9122859 9214471 9453458
4266I453458k30164j9190K57939K59731K27081J9661K46605J34652L49954K00364
4256A0900091J23603K99186J19753P6935L49079J20348K44081N4877Q2232J51618
4246A2521803O10J9349J16677L2460J95229P7531N17858K91921R6217j0824J59367
4235A4018198P9180L37628K07705N58455L01402M89189O24608K39756L29737N35310
4225A7721168O97076M09503O09633O45227Q27211J043338Q28463R76529P96657
4216B4554805Q86940J263383J310330J292009J650098J588856J593376K004796
4208C6144593J851411J951849K112230J838745K473001K649741K676370K916793
4200E4614733L754970M139458M434927N331398O409052P660048R208155J1242414
$$ plain form
4266 9453458 9223294 9204104 9462043 9721774 9948855 9968516 10215121 10349773 10699727 10900091
4256 10900091 11023694 11322880 11442633 11519568 11868647 11988995 12233076 12287953 12370185 12521803
4246 12521803 12522413 12541762 12658439 12690899 12886128 12963659 13481517 13773438 13869655 13858831 14018198
4235 14018198 14097378 14435006 14642711 15201166 15502568 15991757 16616365 16856121 17185858 17721168
4225 17721168 18418244 18827747 19437380 20082607 20909818 21953156 22781619 23758148 24554805
4216 24554805 25441745 26705128 28015458 29307467 30957565 32546421 34139797 36144593
4208 36144593 37996004 39947853 42060083 43898828 46371829 49021570 51697940 54614733
4200 54614733 58369703 62509161 66944088 72275486 78684538 86344586 95552741 106795155
4192A06795155J3787538J6640233J9762007K2774592K6956195L1095729L5374802
4185B73186251L5305799L3155024K6521234N360510k0409898m1834712m3629416
4178B67654792l3052025k1182858j2348117r972480j8067040k3850314k1777046
4171A27404912j7556315j3532816j0571876q327741o811326n824906n207446m639366
4163E4933120m090778l287934k896420k538934k415817k032715j760377j463163
4155C4446982j416503j070645q01081j023186j049835r13886p57907o63931o24590
4146B6125418p48776q25292q31172q33933p58406p73391p48831p68607n36214
4137A9300796o67299m60983m57453m56287l19707m10402p21567n77608n99503
$$ plain form
4192 106795155 120582693 137222926 156984933 179759525 206715720 237811449 273186251
4185 273186251 308492050 341647074 368168308 373528818 353118920 311284208 267654792
4178 267654792 234602767 213419909 201071792 191099312 173032272 149181958 127404912
4171 127404912 109848597 96315781 85743905 77416164 70604838 64779932 59572486 54933120
4163 54933120 50842342 47554408 44657988 42119054 39703237 37670522 35910145 34446982
4155 34446982 33030479 31959834 31158753 30135567 29085732 28171846 27413939 26750008 26125418
4146 26125418 25376642 24551350 23720178 22886245 22127839 21354448 20605617 19837010 19300796
4137 19300796 18633497 18172514 17715061 17258774 16939067 16528665 15807098 15229490 14629987
4128A4629987m74244o32415k52569m17800k47768l10738m31573j37807j63668
4119A1561405l16320o2035m8038j88538k41713j98940j43498j71545j57723n8689
4109I974366k10263k34060M9688k68021j09100l7916j74811J48039j54248K5466
4099I009140n0527k81069j41450m01473j68043l117k33591k85095n4085k93850
4089G096840j7556j19301j91249j2068L2688Q6948j62952j61831R780j88058M9839
4078F423080j61552J439k5684p6772k8344r1727k2956k42054j2059n6933q696
4067E697742Q0926K15737k31467L3465j2525j27975K82149P5196j42309p0403
4057E800536j31191J43090K3642K18166o3363r7588K5056L0957p1212j33213l05256
$$ plain form
4128 14629987 14155743 13523328 13270759 12852959 12605191 12294453 11862880 11725073 11561405
4119 11561405 11245085 11183050 11135012 10946474 10704761 10505821 10362323 10190778 10033055 9974366
4109 9974366 9764103 9530043 9579731 9311710 9202610 9164694 8989883 9137922 8983674 9009140
4099 9009140 8958613 8677544 8536094 8134621 7966578 7963461 7729870 7444775 7390690 7096840
4089 7096840 7079284 6959983 6768734 6756666 6789354 6876302 6713350 6551519 6561299 6373241 6423080
4078 6423080 6261528 6262967 6237283 6160511 6132167 6040440 6017484 5775430 5763371 5706438 5697742
4067 5697742 5778668 5994405 5762938 5796403 5783878 5655903 5938052 6013248 5870939 5800536
4057 5800536 5669345 5812435 5836077 6054243 5990880 5893292 5918348 5949305 5878093 5744880 5439624
4046E439624L2815K4891j88773j0587p7544q2401N8712k3720j10447j12023L342
4035D953889j16283l0326J47106J0101O362j28037J59926j27313j86514Q4629
4025D773540K5685O6272J35699n355P8130J96510J83696j05845K23670J83826
4015E755828q5417L2577M34259J78182J16626K85868N28772J67243J14673L22479
4005G851090L24517K32381P1998O80138N84854M89697O33079O19897N26921R97240
3995A3011812J382140J503129K008049K138057K892706L338318M054724M387450
3987C4716385N074564N584118N436928L697375k333323p856127q614594o733262
3979B8972064m653633l115684k534738k199418j590398j328466r96354q57282
$$ plain form
4046 5439624 5472439 5497330 5308557 5297970 5220426 5138025 5196737 5173017 5062570 4950547 4953889
4035 4953889 4837606 4807280 4954386 4964487 4970849 4842812 5002738 4875425 4688911 4773540
4025 4773540 4799225 4865497 5001196 4995841 5073971 5270481 5454177 5348332 5572002 5755828
4015 5755828 5670411 5702988 6137247 6315429 6432055 6717923 7246695 7413938 7528611 7851090
4005 7851090 8175607 8407988 8479986 9160124 9744978 10234675 10867754 11487651 12014572 13011812
3995 13011812 14393952 15897081 17905130 20043187 22935893 26274211 30328935 34716385
3987 34716385 39790949 45375067 50811995 54509370 52176047 44319920 35705326 28972064
3979 28972064 24318431 21202747 18668009 16468591 14878193 13549727 12553373 11696091
3971A1696091p06018p82241n63243k87802r26983m97691k58240l42998j78412
3962G152463j08976j62269k88215m01510J7292J39699j00099m7112j71148J05326
3952F135451l31618J73133K39843j5258r7064j35909k45447k04037J46879J4835
3942E680808k1534j06373j81393j03302q932j4424R0665k19201O1205o9401J77897
3931E286015K38168J05146q3024K02544J15259k4312L91961K60632L25392L75452
3921G193233J27220o8437l443K93949k85896M0351o4343O5355O9393j04774k40526
3910G022082j35905j37882o1501L2328q9436O333j302J12745K80212M94672N8233
3899G580579J856L75152M78220K72272L44731K77348L46786K05828K77924N4020
$$ plain form
3971 11696091 10990073 10207832 9644589 9356787 8429804 7932113 7673873 7330875 7152463
3962 7152463 7043487 6881218 6593003 6191493 6208785 6348484 6248385 6201273 6030125 6135451
3952 6135451 5803833 5976966 6216809 6201551 6104487 5968578 5723131 5519094 5665973 5680808
3942 5680808 5659274 5552901 5371508 5268206 5259274 5244850 5335515 5116314 5177519 5108118 5286015
3931 5286015 5524183 5629329 5546305 5748849 5864108 5839796 6231757 6492389 6817781 7193233
3921 7193233 7320453 7252016 7248573 7542522 7256626 7296977 7232634 7297989 7367382 7262608 7022082
3910 7022082 6886177 6748295 6686794 6719122 6629686 6636019 6634717 6747462 7027674 7522346 7580579
3899 7580579 7582435 7957587 8435807 8708079 9052810 9330158 9676944 9882772 10160696 10214716
3889A0214716j81069j13841n4295k09182J18661Q8373L73300O0258j04399l40166
3879I852356m62402m68816l50736q8993l00450k17154J09729J22569j34275O0379
3869H122207j16390k65793k8063k83837j33164j312j2307J41798K31904J8673
3859G673716J64709K42048K51865J89242L84747M45077L91281K02011k26070l01725
3849I416901j55856Q885m3278k61087l91226j22793j80671k76572l00076k02862
3839G491365l72755j83049j12518m1240j24857q6766K5328n2560J20697p0058
3829F593587M7825K70043L92169M47448O5502J96857L62700M1367m06948l809
3819H006741j99825P912j2786l84012P858L015q2702P9432M6377o6548P6905J51477
$$ plain form
3889 10214716 10033647 9919806 9865511 9656329 9774990 9863363 10236663 10296921 10192522 9852356
3879 9852356 9389954 8921138 8570402 8481409 8180959 7963805 8073534 8196103 8061828 8122207
3869 8122207 8005817 7740024 7711961 7428124 7294960 7293648 7281341 7423139 7655043 7673716
3859 7673716 7838425 8080473 8332338 8521580 8906327 9351404 9742685 9944696 9718626 9416901
3849 9416901 9261045 9269930 9226652 8965565 8574339 8451546 8270875 7994303 7694227 7491365
3839 7491365 7118610 6935561 6823043 6781803 6656946 6570180 6595508 6542948 6663645 6593587
3829 6593587 6641412 6911455 7303624 7751072 7816574 8013431 8376131 8417498 8010550 8006741
3819 8006741 7806916 7814828 7802042 7418030 7425888 7428903 7346201 7425633 7472010 7405462 7482367 7633844
3807G633844j60345J4924L5205J48101N3917j6091j36625k29362r0619j0650j38657
3796G103642K03874J39418m9363P157J06667J42429K00874J07738N9973K39773
3786H262182J25859L14077K59305J83188M4509L02741J97267J28095J57896Q4276
3776A0059395K52084J65612j83503l58408m52085j74257p8110j31508j7331K85858
3766I367747L32863k7652J43849J49667K33981L75825J49072K17849L67783N27468
3756A1838452N49933M67632K13790O23062J035587J053709J302644J431585J684633
3747B0201027J701954J684910J770033J905732K679306K388974n82938k439526
3739B9309472j940078j169168n31279p25262j232324j788083j481941j474809
$$ plain form
3807 7633844 7473499 7488423 7523628 7671729 7725646 7709555 7572930 7343568 7252949 7242299 7103642
3796 7103642 7307516 7446934 7397571 7404728 7511395 7653824 7854698 7962436 8022409 8262182
3786 8262182 8388041 8702118 8961423 9144611 9189120 9491861 9689128 9817223 9975119 10059395
3776 10059395 10311479 10477091 10293588 9935180 9483095 9308838 9230728 9099220 9081889 9367747
3766 9367747 9700610 9672958 9816807 9966474 10200455 10576280 10725352 10943201 11310984 11838452
3756 11838452 12388385 12856017 13069807 13692869 14728456 15782165 17084809 18516394 20201027
3747 20201027 21902981 23587891 25357924 27263656 29942962 32331936 31748998 29309472
3739 29309472 27369394 26200226 25668947 24943685 23711361 21923278 20441337 18966528
3731A8966528j354228j090135j090061j083852j034924q43109o44039q48762n02991
3722A0474427l12751q9274j22881j25206J22293o6171J05316j6321k26743k37176
3712I505513j43668p0186j48975k9615M2206j73869l04387r8909k61720m73722
3702G842668l22650l56956j38641l12058k02273j30920j58356k3598j06000p2333
3692F018883p2956r2266p1465O5447j46142p1515r5234J12224K22337m65208r1265
3681E312840J44793Q8230J37050o5837N6076j31736k26301j83696p4177k15469
3671D841773j80870J29197r1335J6306K0184q1486j38920l2400k00438L0461P1056
3660D383528J8510j92322k31699p1338N3116J20639n3409j07560j53501j17410
$$ plain form
3731 18966528 17612300 16522165 15432104 14348252 13313328 12470219 11826180 10977418 10474427
3722 10474427 10161676 10072402 9949521 9824315 9946608 9880437 9985753 9969432 9742689 9505513
3712 9505513 9361845 9291659 9142684 9113069 9155275 8981406 8677019 8578110 8316390 7842668
3702 7842668 7520018 7163062 7024421 6712363 6510090 6379170 6220814 6197216 6091216 6018883
3692 6018883 5945927 5853661 5782196 5847643 5701501 5629986 5534752 5646976 5869313 5404105 5312840
3681 5312840 5457633 5545863 5682913 5617076 5673152 5541416 5315115 5131419 5057242 4841773
3671 4841773 4660903 4790100 4698765 4715071 4735255 4653769 4514849 4482449 4282011 4312472 4383528
3660 4383528 4402038 4209716 3978017 3906679 3959795 4080434 4027025 3919465 3765964 3648554
3650C648554J59766R7427l6750M9145L8032K7873J07345M9845j20846j28007j5496
3639C876888P9207j00391L07730j07717k46602L1297M1225O2633P5805j18632
3629C901443N6202O3333j61499J07745k42q4874O6817k4307k1879l6411m1488
3618C824840J52650O0159q7812Q4898k1699K4208J50874j12332l8351n1216J09000
3607D095219j00877k96893L3065J66532p5191k85393j86440O1200k31603M1326
3597C220945J46483P7290p2125j39292j34547P8793K12161r9416j80558J51689
3587C261423M2693j32531K3456L6144K61559M9333j91087K21074J19604J179k223
3576C690624k46213o0408p1814l9896p843J36449O9333l5547J09098r5247m657
$$ plain form
3650 3648554 3808320 3905747 3868997 3918142 3956174 3984047 4091392 4141237 4020391 3892384 3876888
3639 3876888 3956095 3855704 4163434 4055717 3809115 3840412 3881637 3944270 4020075 3901443
3629 3901443 3957645 4020978 3859479 3967224 3966982 3882108 3948925 3924618 3902739 3866328 3824840
3618 3824840 3977490 4037649 3949837 4034735 4013036 4037244 4188118 4075786 4037435 3986219 4095219
3607 4095219 3994342 3697449 3730514 3897046 3821855 3536462 3350022 3411222 3179619 3220945
3597 3220945 3367428 3444718 3372593 3233301 3098754 3177547 3389708 3290292 3109734 3261423
3587 3261423 3304116 3171585 3195041 3231185 3492744 3542077 3350990 3572064 3691668 3692847 3690624
3576 3690624 3444411 3384003 3312189 3272293 3264450 3400899 3470232 3434685 3543783 3448536 3443879
3565C443879j08412R4119j22742p3684J44607j21493p9254j99961K1267K15946
3555C214272N0626K0989j63146j78584J60636j09883j66100K01130J29364L2248
3545C191552Q9560k11170N8837J01750L9876m8018M5940P2470L2952k88224l7921
3534C047604P066J65195L535j41500K59169N4811j0684p2924r5065L9034J3839
3523C270080M7909K78035o9983P1194K10541K04630J72532K02080j66463k56604
3513C963951o324j71232j41921j26797j96398k1731J55023L4088J57525M3437
3503C689621j50167j83344j87723P5019J15332M1952j75349L0777J9470j38175
3493C137413J90120r3266J27555m57l4661K56553Q0052j92022J36468J67823k2866
$$ plain form
3565 3443879 3335467 3429586 3306844 3233160 3377767 3256274 3177020 2977059 2998326 3214272
3555 3214272 3264898 3285887 3122741 2944157 3104793 2994910 2828810 3029940 3159304 3191552
3545 3191552 3281112 3069942 3128779 3230529 3270405 3222387 3268327 3340797 3373749 3085525 3047604
3534 3047604 3054670 3219865 3223400 3081900 3341069 3395880 3385196 3312272 3217207 3256241 3270080
3523 3270080 3317989 3596024 3526041 3597235 3807776 4012406 4184938 4387018 4220555 3963951
3513 3963951 3957627 3786395 3644474 3517677 3321279 3299548 3454571 3488659 3646184 3689621
3503 3689621 3539454 3356110 3168387 3243406 3358738 3400690 3225341 3256118 3275588 3137413
3493 3137413 3327533 3234267 3361822 3361365 3326704 3583257 3663309 3471287 3607755 3775578 3752712
3482C752712J1363K26248K2977l0605K35590l082n7482m2491J66257K827O7569
3471D351883K68187R8384J10420k141Q3281N975P7663L16956M73911M96143O06459
3460F887121O71847N50555N79524O82631N73854O47188L08506r65523r82869o14770
3450H338064n51646n46219m53452j03499j28828r9048j88821j06135J3615P9012
3440F253043j2327J33474J66802R7071J42374J02237N00178N99233M47178O02870
3430I032133J014928Q73895R79347R56869J081139J529133J390883J502863M45235
3421A8806425j527470k052642j847987j358654q91699q10602n58461l69322p0356
3412I319232l98302l80318k69843p9934k74758j90695L9580k3891K64776l47N1348
$$ plain form
3482 3752712 3764075 3990323 4013300 3982695 4218285 4215203 4157721 4115230 4281487 4284314 4351883
3471 4351883 4620070 4718454 4828874 4826733 4910014 4915989 4993652 5310608 5784519 6280662 6887121
3460 6887121 7558968 8109523 8689047 9371678 9945532 10592720 10901226 9935703 8952834 8338064
3450 8338064 7786418 7240199 6786747 6683248 6554420 6455372 6266551 6160416 6174031 6253043
3440 6253043 6240716 6374190 6540992 6638063 6780437 6882674 7382852 7982085 8429263 9032133
3430 9032133 10047061 10920956 11900303 12857172 13938311 15467444 16858327 18361190 18806425
3421 18806425 17278955 15226313 13378326 12019672 11127973 10317371 9758910 9389588 9319232
3412 9319232 8920930 8540612 8270769 8190835 7916077 7725382 7764962 7741071 8005847 8005500 8056848
3401H056848J49350L51282L11970M57293L91740Q51387R00572Q93113P35213R75793
3391A4074561Q03494K56345n84187j324177j382880j032772r06074n04664l28711
3382I070935l90894k36599q1136K8837j30062j85156O4965j40668j5168Q9523
3372H074577o931M0091L9446J73106J14827P9066J93380K38705L56335K18768
3362I521370L83873J46673L81171N80416M54455N55426L72158N61893N35446O71110
3352A4163991R28888P70142Q07212M60994n69339j038227r26325m12383l10703
3343A3874250j42766m21358O9881r6557M0764N1855n9816K35861K5197J38127
3333A3715438K75172R5492K84823p145J42638O58496M84020M77564P48721R40613
$$ plain form
3401 8056848 8206198 8557480 8869450 9326743 9718483 10569870 11470442 12363555 13098768 14074561
3391 14074561 14878055 15134400 14550213 13226036 11843156 10810384 9904310 9399646 9070935
3382 9070935 8680041 8443442 8362306 8391143 8261081 8075925 8140890 8000222 7985054 8074577
3372 8074577 8067646 8107737 8147183 8320289 8435116 8514182 8707562 8946267 9302602 9521370
3362 9521370 9905243 10051916 10433087 11013503 11467958 12023384 12395542 12957435 13492881 14163991
3352 14163991 15092879 15863021 16670233 17131227 16561888 15523661 14597336 14184953 13874250
3343 13874250 13731484 13310126 13380007 13283450 13324214 13376069 13316253 13552114 13577311 13715438
3333 13715438 13990610 14086102 14370925 14363780 14506418 15164914 15648934 16126498 16875219 17815832
3323A7815832R66472J430677J587622J899802J839580J955792J707372o22767
3315B8580382j945432k056076j645741j269920r02254l93030J37058J0197l9372
3306B0475812J28586J53853M1902m2765j87793l7910L42996K23341k74416l7238
3296B0786368J64693K99428L28878K31333M27248L75731N33603R37540J026134
3287B5110956R80883J147304J194858L68743n66473r11147p26700n83327k26318
3278B5788779P4950L50520M90438N66147N58181N35583P95316O11193O04715J064156
3268C1439978J344975J323878J350704J213617J279613J560919J167842M52112
3260D1133638L6741n46713r88133j661178k112195k304488k155736k318988j969714
$$ plain form
3323 17815832 18782304 20212981 21800603 23700405 25539985 27495777 29203149 28580382
3315 28580382 26634950 24578874 22933133 21663213 20760959 20367929 20504987 20515184 20475812
3306 20475812 20604398 20758251 20800153 20757388 20569595 20531685 20874681 21098022 20823606 20786368
3296 20786368 20951061 21250489 21579367 21810700 22237948 22613679 23147282 24084822 25110956
3287 25110956 26091839 27239143 28434001 28802744 28236271 27325124 26598424 26015097 25788779
3278 25788779 25863729 26214249 26704687 27270834 27829015 28364598 29159914 29771107 30375822 31439978
3268 31439978 32784953 34108831 35459535 36673152 37952765 39513684 40681526 41133638
3260 41133638 41170379 40623666 39635533 37974355 35862160 33557672 31401936 29082948 27113234
3251B7113234j258797j601375j396710j266796q84543o76413p43605p58768m74106
3242A8052121l20441n47584n53682n05314m42098m50817l99934j99314j43161
3233A4489776k67470k72983j29252j16443m45437l98436m77498j57851n49089
3224A1675317l53413m32693j28503J63j40718j13862k5821n1624l4704j294P088
3213A0399936k54891j17638o2639r7436k29899l57066j42421k83588k34379o2152
3203H557827k22696j96931k39255k20572j69512k7135M2067j28667l06823K8287
3193G116590q3140k10028r2471p161n556j55216O932M9697J43768j62042j6641
3182F584732O9767Q4643J14917J84158k01496m714l12957m16015k43078j83134
$$ plain form
3251 27113234 25854437 24253062 22856352 21589556 20705013 20028600 19284995 18526227 18052121
3242 18052121 17731680 17184096 16630414 16125100 15683002 15232185 14832251 14632937 14489776
3233 14489776 14222306 13949323 13820071 13703628 13258191 12859755 12382257 12224406 11675317
3224 11675317 11321904 10889211 10760708 10760871 10620153 10506291 10480470 10428846 10394142 10392848 10399936
3213 10399936 10145045 10027407 9964768 9867332 9637433 9280367 9137946 8854358 8619979 8557827
3203 8557827 8335131 8138200 7898945 7678373 7508861 7481726 7523793 7395126 7088303 7116590
3193 7116590 7033450 6823422 6730951 6723790 6718234 6563018 6569950 6619647 6763415 6601373 6584732
3182 6584732 6654499 6739142 6854059 7038217 6836721 6832007 6519050 6103035 5859957 5676823
3172E676823j27294l49994j16031M6581P3871k02431j02472r4043j3716k05928
3162D585366j42090m3544M0897J54530J5182k33915o6283J42417o8640j8843j4887
3151D350190j15612J7604L6349m6493j48483J16416k0394p4515j62049j77507
3141C775506K56437j13430j09920l4464Q1687N0325j99901j44080l5587Q3951
3131C610524R8345j36044j55373l17295j11315R2428q396j94376K5398j3398K95510
3120C186008O0264j55499j05412j5838Q8158r7093j75224r0801L26152j84179
3110B836536k14861J35653O3571L026j34706Q3840k03669k7409Q2503J62758J9846
3099B807088j62115M4174n4198r9034M9601Q3197q3991k5735J60824r3056p8935
$$ plain form
3172 5676823 5549529 5199535 5083504 5130085 5203956 5001525 4899053 4805010 4791294 4585366
3162 4585366 4443276 4399732 4440629 4595159 4610341 4376426 4310143 4452560 4383920 4365077 4350190
3151 4350190 4234578 4252182 4288531 4242038 4093555 4209971 4189577 4115062 3953013 3775506
3141 3775506 4031943 3918513 3808593 3774129 3855816 3906141 3706240 3562160 3526573 3610524
3131 3610524 3708869 3572825 3417452 3100157 2988842 3081270 3072874 2878498 2903896 2890498 3186008
3120 3186008 3246272 3090773 2985361 2969523 3057681 2960588 2785364 2694563 3020715 2836536
3110 2836536 2621675 2757328 2820899 2823925 2689219 2773059 2569390 2541981 2624484 2787242 2807088
3099 2807088 2644973 2689147 2634949 2535915 2585516 2668713 2584722 2558987 2719811 2626755 2547820
3088B547820L07451m7913k87927k448j27015J05310N1890O8299K2100p4745K7525
3077B590347n375j3006J75048k4172j20751j35601J2758j67045J47919J03424
3067B563546J41209o75l3774K1787L9981J23094q6192J05455q434k44404j0391
3056B611202L578o2051J03871o6453M1891K7392J36178j43499N4143j76511k35970
3045B293771O7580J94205Q3167J05581q1641n8435j43070J26942P7187K6094O8159
3034B759540r9064j35666J33141J04489j298j01057J1318K21515J01566J45683
3024C140167J68682j82239m5726l3125J5725L5697j62701P4199R1216p049N409
3013C100255k24015R6772K55827J34452n9675j03223o832o4415J37854j51695
$$ plain form
3088 2547820 2855271 2807358 2519431 2516983 2389968 2495278 2547168 2615467 2637567 2562822 2590347
3077 2590347 2584972 2571966 2747014 2722842 2602091 2466490 2479248 2312203 2460122 2563546
3067 2563546 2704755 2704080 2670306 2692093 2732074 2855168 2768976 2874431 2865997 2621593 2611202
3056 2611202 2614780 2552729 2656600 2590147 2632038 2659430 2795608 2652109 2706252 2529741 2293771
3045 2293771 2361351 2555556 2638723 2744304 2662663 2604228 2461158 2588100 2665287 2691381 2759540
3034 2759540 2660476 2524810 2657951 2762440 2761142 2660085 2671403 2892918 2994484 3140167
3024 3140167 3308849 3126610 3080884 3047759 3063484 3099181 2936480 3010679 3101895 3094846 3100255
3013 3100255 2876240 2973012 3228839 3363291 3303616 3200393 3193561 3129146 3267000 3115305
3003C115305j4076o1598L02787J50578o374Q4667K7266J78103K76390K5504j67503
2992C911049J46558j04391K77403J27357j07548k05741M9148M6148j73500p9924
2982C886559R3075m4512J09440o6594k29312J62157K14826r7735p9009J25505
2972D074400Q5532p4574Q5310p8956J14209J02601J03065J67279k5490N6226R3159
2961D702761J71814p0649O7614K32322J50132J64657J0516J78109J44907j5315
2951E736868O8812L1735j05330K70484J27933j18245K4491j14431M8574L9999
2941F010890L29881o7236l1515L0877K959O1798O2072L7976K40144J398m598J74341
2929F848987J66981L34849L57902K53888n6277R9563L34705K54993K37640J43855
$$ plain form
3003 3115305 3101229 3039631 3342418 3492996 3486622 3571289 3598555 3776658 4053048 4078552 3911049
2992 3911049 4057607 3953216 4230619 4357976 4250428 4044687 4093835 4139983 3966483 3886559
2982 3886559 3979634 3935122 4044562 3977968 3748656 3910813 4125639 4027904 3948895 4074400
2972 4074400 4159932 4085358 4170668 4091712 4205921 4308522 4411587 4578866 4553376 4609602 4702761
2961 4702761 4874575 4803926 4871540 5103862 5253994 5418651 5429167 5607276 5752183 5736868
2951 5736868 5805680 5837415 5732085 6002569 6130502 6012257 6036748 5922317 5970891 6010890
2941 6010890 6340771 6273535 6242020 6272897 6275856 6337654 6399726 6437702 6677846 6679244 6674646 6848987
2929 6848987 7015968 7350817 7708719 7962607 7906330 8005893 8340598 8595591 8833231 8977086
2919H977086j44078n2264j20209l28290j83710m48838k44146k32623k62009k46281
2909F714638M6243p8203j63670k5485P1744R6833J05310J64292k32933j36305
2899F562464N8722j63311q3182J52922J98605R7583N2463K4378J90774j47602
2889F943816j55672k72876l83354j19692Q7387l13607k29883l04218j5095q4669
2879E152137k21741j12801q0982p0587M36k34182j97602n5190O6616j39926p888
2868D098290j79275k6371P9557m2361j20692j91434J0939q8704l30446j04414
2858C105089p6037o2535q2035k54511J42556K2365J58140j66127r8969j91975
2848B495961J48264k95463P3867J63348j69683j68966k2870j11564K3141J72638
$$ plain form
2919 8977086 8833008 8780744 8660535 8332245 8148535 7699697 7455551 7222928 6960919 6714638
2909 6714638 6760881 6682678 6519008 6493523 6565267 6662100 6767410 6931702 6698769 6562464
2899 6562464 6621186 6457875 6374693 6527615 6726220 6823803 6876266 6900644 7091418 6943816
2889 6943816 6788144 6515268 6131914 6012222 6099609 5786002 5556119 5251901 5236806 5152137
2879 5152137 4930396 4817595 4736613 4666026 4666462 4432280 4234678 4179488 4246104 4106178 4098290
2868 4098290 3919015 3892644 3972201 3929840 3809148 3617714 3628653 3539949 3209503 3105089
2858 3105089 3029052 2966517 2884482 2629971 2772527 2794892 2953032 2786905 2687936 2495961
2848 2495961 2644225 2348762 2422629 2585977 2416294 2247328 2224458 2112894 2136035 2308673
2838B308673K1513L8531j87788j74006n2947J31284j54771p2707K9207L720R9126
2827A989835j27578J10256n7723r7076q7895O1198j52194j69554l2068K14226
2817A651427j76940Q679O0925r8439K0494n4370J096J2271j32051J98684k5648
2806A466128J826j73714m8056M1640k4431j96434O1363R1099j60672K5227J6060
2795A100036r8263M967k5291J0726l1419l4082J41909j4911j08909m6313p6790
2784H21660J72342J08141j19880q3127K68131j99443k28462J94791q9429M2518
2774H87242j2895J28674j27214P826n8821n1161J8163r7688q0521J40890j03990
2763F50505o7184K3462j06532Q2619J36571j27294M3940j46980K07492m8966L6168
$$ plain form
2838 2308673 2330186 2368717 2180929 2006923 1953976 2085260 1930489 1857782 1886989 1890709 1989835
2827 1989835 1862257 1972513 1914790 1817714 1729819 1791017 1638823 1469269 1437201 1651427
2817 1651427 1474487 1483166 1544091 1445652 1466146 1411776 1412872 1425143 1293092 1491776 1466128
2806 1466128 1467954 1294240 1246184 1287824 1263393 1066959 1128322 1219421 1058749 1083976 1100036
2795 1100036 1001773 1006740 981449 992175 960756 926674 1068583 1053672 944763 898450 821660
2784 821660 994002 1102143 982263 899136 1167267 967824 739362 934153 844724 887242
2774 887242 874347 1003021 875807 883633 824812 773651 791814 694126 613605 754495 650505
2763 650505 583321 606783 500251 582870 719441 592147 636087 489107 696599 647633 683801
2752F83801P5601j07922o5386j5645J93786O0898j79252J14648j09323J18888
2742G70094l9039j12450O3004Q8624j23082n4721j73766K08215O2145q4652q3753
2731E20619N1004l2432M406j75752j64341L20201m3293M7678j02520J22815q8421
2720D59964m3759Q1712J39277k4699k19827r8749J67472R8725j21023k1938l810
2709D13345j6849l0811j28582p7714J4369P1495N8653J0505j37893o6834N9663
2698A69347L03812j01779k7226J89568j39635P8787J1611Q111N3670p1514j58588
2687C16164r891O6268J5873n7807j91492K9173l1806J07238k3874J25710R4340
2676D39896n4507r5739j64283L7360J01029o7282l0598J91481j3296j37064K12313
$$ plain form
2752 683801 759402 651480 586094 570449 764235 825133 645881 760529 651206 770094
2742 770094 731055 618605 681609 770233 647151 592430 418664 626879 689024 604372 520619
2731 520619 571623 539191 543597 367845 203504 523705 480412 528090 425570 548385 459964
2720 459964 416205 497917 637194 612495 392668 293919 461391 560116 439093 417155 413345
2709 413345 396496 365685 237103 159389 173758 245253 303906 314411 176518 109684 169347
2698 169347 473159 371380 344154 533722 394087 472874 484485 492596 546266 474752 316164
2687 316164 306273 372541 388414 330607 139115 168288 136482 243720 219846 345556 439896
2676 439896 385389 289650 125367 162727 263756 196474 165876 357357 344061 206997 419310
2665D19310j02950N1505L2325J35316j04084k51019R2333o3735l0683k8221L6962
2654A87059o1763p3824j18146P7341J82374O4064O7155p6106j46987N5817L6515
2643A93499N7101M636k26370l2042K57140K38438p7499j95030J00210k8324j23665
2632A68094M2825N5303q8463j0550L5116N8618R2636J23310q0268l62382M6795
2621H1034K58913p3182o8188M3981N9475n5076J5512P132J65880l6226k22644
2610A76611n0615J7221R4772j91693q6169J65924l9526K21854r1351l6434R7852
2599B78446p7699Q426k68220J48653J35162Q6324j02912M9067l4306j32781J10311
2588B00471P7564J57979j28765j58648m2384l9748K5299j0215o64J23137P9827
$$ plain form
2665 419310 316360 367865 400190 535506 431422 180403 272736 209001 178318 150097 187059
2654 187059 125296 51472 -66674 10667 193041 257105 324260 248154 101167 156984 193499
2643 193499 250600 255236 28866 -3176 253964 492402 414903 219873 320083 291759 168094
2632 168094 210919 266222 177759 167209 202325 260943 353579 476889 396621 34239 81034
2621 81034 339947 266765 198577 242558 302033 246957 262469 269601 435481 399255 176611
2610 176611 125996 143217 237989 46296 -39873 126051 86525 308379 217028 180594 278446
2599 278446 200747 209173 -59047 89606 224768 311092 208180 257247 222941 90160 200471
2588 200471 278035 436014 307249 148601 106217 66469 91768 81553 80889 204026 283853
2577B83853j36568j38372m0616p1275J31453Q9060K35090l33046j12916J70671
2567G7334j5918K18145N4826j38220o5787K9598q7712o8578r0710J84022J2865
2556A09865j50765j7431Q0360J58668n5016j7670j55874j6067J82835M5641j77552
2545a3006m9951K48260M7591P2845j45554j2133j01243N00j16857J06172J21377
2534A58001k889o8162j05908o967J93612K1405j31113J3264j3536j7183j19035
2523g8511K38961j3383J20701J6334j09364j02641j01499M9262p4987J29768R5236
2512A69877K9124q5651K1800J24670j99355n8742K6727M9789r1245L7223K3693
2501D7910o6674K80016m2819N0807P7051k81604M9160k337k6255N412j02408J02399
$$ plain form
2577 283853 147285 8913 -31703 -102978 28475 117535 352625 19579 -93337 77334
2567 77334 61416 279561 334387 196167 130380 159978 72266 3688 -87022 97000 109865
2556 109865 -40900 -58331 22029 180697 125681 108011 -47863 -63930 118905 164546 -13006
2545 -13006 -62957 185303 232894 305739 160185 148052 46809 47309 -69548 36624 158001
2534 158001 155112 86950 -18958 -25925 167687 189092 57979 71243 57707 40524 -78511
2523 -78511 160450 147067 267768 284102 174738 72097 -29402 19860 -55127 74641 169877
2512 169877 199001 113350 135150 259820 60465 1723 28450 78239 -13006 24217 47910
2501 47910 -18764 261252 218433 269240 346291 64687 113847 111510 85255 90667 -11741 90658
2489I0658m4958j30063l7389K62606n314p7933l7378j39535m0746N9093J69814
2478F8855P3911k09231P796P0298R9231o6469J57616k0647r0448J15412O2392
2467B68716j86182j49178J28484P8467r4840k0286M4733J08410J66475k03309
2457A41490p4080n086l9129R7047j2546J41510o4423k32390j5564r6910J90554
2446C0473r1666J03268k06627K08889r7642p2774O7161j22707K50051K2372p3818
2435A6980P7083q5075n7211n4820K17417r7330K24479K146k1406J26716J3579
2424C62558R6959j99425r2630j17667J52510N5407p9170k17514o3683J35083R227
2413D1655L4723o0322k4777P5029j22348R8621o5465o7827P0635K635M03503j86470
$$ plain form
2489 90658 45700 -84363 -121752 140854 135540 57607 20229 -119306 -160052 -100959 68855
2478 68855 142766 -66465 -58669 11629 110860 44391 202007 181360 90912 206324 268716
2467 268716 82534 -66644 61840 140307 45467 25181 69914 178324 344799 141490
2457 141490 67410 62324 23195 120242 107696 249206 184783 -47607 -63171 -160081 30473
2446 30473 -61193 42075 -164552 44337 -53305 -126079 -58918 -181625 68426 90798 16980
2435 16980 94063 8988 -48223 -103043 114374 17044 241523 243669 222263 348979 362558
2424 362558 459517 260092 167462 49795 202305 257712 178542 -38972 -102655 32428 41655
2413 41655 76378 16056 -8721 66308 -56040 42581 -22884 -90711 -20076 -17441 386062 199592
2401A99592J18642o0731j51643K6564K04683R3303k4127j68125M1680J08830P2263
2390D60931K37773k10392O2539Q6684j598j90267O1758k50516J322j8912J73999
2379D13321j37809R7111o0854j38382R7797J4498j73008q2006K22751J4549n5392
2368B12576N1448j9593j58581p2737J23069k2453J61720K9773J06609l1822O427
2357C86436j90693j3319J90425o7557j43384k09402P3248N0787J4195o9693J53339
2346A74382j9264o0502j70526Q0814J07265J18106j34929j00256j19114K58924
2336A34900O6591k06956J45140J13385j97233J0234P6528r6127K0477L1108J01082
2325A99129j61401J77185K81596k43612k25408J48035p1092j2749N9061J88497
$$ plain form
2401 199592 318234 257503 105860 132424 337107 430410 406283 238158 279838 388668 460931
2390 460931 698704 488312 550851 637535 635937 445670 507428 256912 258234 239322 413321
2379 413321 275512 372623 311769 173387 271184 285682 112674 30668 253419 267968 212576
2368 212576 264024 244431 85850 13113 136182 113729 275449 305222 411831 380009 386436
2357 386436 195743 182424 372849 305292 161908 -47494 25754 76541 90736 21043 174382
2346 174382 155118 94616 -75910 4904 112169 230275 95346 -4910 -124024 134900
2336 134900 201491 -5465 139675 253060 55827 66061 142589 46462 66939 98047 199129
2325 199129 37728 214913 496509 252897 27489 175524 104432 91683 150744 339241
2315C39241q2289L7797J11022j87056j60430M6106r9282K66423K21n9378j38896
2304G3479J1013L6914r4592J26663m5427o6616j1411J25359r7281J7349Q3975
2293A59425n3177M9496M3030n9069J79022p1308m5418K7412J8291L8947k32510
2282E4141K01035L01631P934r1204j06258M3190p8463J70649m9416j01118J79634
2271E31755j97804L1303r9146j64001m2272K4833M5845K95116k654o1759L9562
2260D00778r9673O8207r882J47893l39057o0945J06422L0068J15509j8866O7145
2249D07599J6092n1250J98339J30576j07992J6383q7685J6808O8472k70106J52041
2238D89277k0627M2720o5780n3000n5474J76802J53134M1459J61391J86424r5020
$$ plain form
2315 339241 256952 294749 405771 218715 58285 104391 5109 271532 271753 212375 73479
2304 73479 84492 121406 26814 153477 108050 41434 30023 155382 58101 75450 159425
2293 159425 106248 155744 198774 139705 318727 247419 202001 229413 247704 286651 54141
2282 54141 255176 556807 564741 473537 367279 410469 332006 502655 453239 352121 531755
2271 531755 333951 365254 266108 102107 59835 84668 130513 425629 422975 361216 400778
2260 400778 301105 369312 359430 507323 168266 107321 213743 243811 359320 340454 407599
2249 407599 423691 372441 570780 701356 593364 609747 522062 538870 607342 337236 489277
2238 489277 468650 511370 445590 392590 337116 513918 667052 708511 869902 1056326 961306
2227I61306j3178q3102J44837Q3831m169P5407o1492p888j85178k612J60895M4377
2215A113034k23517l2627o205P8928L0113R6911J55741q0085M9572j7480K49074
2204A413459l6284j53219L3315Q9471J41714J56717j45496j31960J92653k8474
2194A531896L9968K60830R4425R2172j41644j05601j9182p4790R5341Q6765K08475
2183B068655q7231Q3932K03176q2277j14193j71107J77330J81868j85857L9773
2173B114069p6251M0248J24143m2912K39041K01855J12398K18570j23772J73552
2163B980941K40499J52278J09804j0211J40889J16801L33692L2463K81122K45583
2153D623861N8639K85512K21742M41027N25765N26929M75606M73274M76466N89521
$$ plain form
2227 961306 948128 865026 1009863 1093694 1089525 1164932 1103440 1095552 910374 907762 1068657 1113034
2215 1113034 889517 856890 850685 929613 959726 1056637 1212378 1132293 1181865 1164385 1413459
2204 1413459 1377175 1223956 1257271 1346742 1488456 1645173 1499677 1367717 1560370 1531896
2194 1531896 1571864 1832694 1927119 2019291 1877647 1772046 1752864 1678074 1773415 1860180 2068655
2183 2068655 1981424 2065356 2268532 2186255 2072062 1900955 2078285 2260153 2074296 2114069
2173 2114069 2037818 2078066 2202209 2159297 2398338 2600193 2712591 2931161 2807389 2980941
2163 2980941 3221440 3373718 3483522 3473311 3614200 3731001 4064693 4097156 4378278 4623861
2153 4623861 4682500 4968012 5189754 5630781 6156546 6683475 7159081 7632355 8108821 8698342
2143H698342M30805L89586N78211O58458Q41737R06954Q82164J383219J547848
2134A6317324J300727J032135J470313K088206K634947L537729M461954N466612
2126C8309947N855716P160999R316809R705136J0591937J1423357J1122340n680719
2118I7805522j9324372j7432326j2382795q006779o081802m608597l607364k780610
2110B3580877k334088j893717j567298j229706j155153p11866q79977r72547j321367
2101A1515158r16515r08925o78929n89739j89468m86286n44530k97347k45704
2092F657715j52680k05682j64150l1283m00918q0342q8391l25271q8478j74496
2082D946024j88373k18529j78428J6433l89479J1515m1064l33736K9701Q0949
$$ plain form
2143 8698342 9129147 9518733 10096944 10755402 11597139 12504093 13386257 14769476 16317324
2134 16317324 17618051 18650186 20120499 22208705 24843652 28381381 32843335 38309947
2126 38309947 44165663 51326662 60643471 70348607 80940544 92363901 103486241 97805522
2118 97805522 78481150 61048824 48666029 40659250 34577448 29968851 26361487 23580877
2110 23580877 21246789 19353072 17785774 16556068 15400915 14689049 13809072 12836525 11515158
2101 11515158 10598643 9689718 9010789 8421050 8231582 7745296 7200766 6903419 6657715
2092 6657715 6505035 6299353 6135203 6103920 5703002 5622660 5534269 5208998 5120520 4946024
2082 4946024 4757651 4539122 4360694 4377127 3987648 3999163 3958099 3624363 3654064 3735013
2072C735013k86726n9830j92953q5131K0914k44533J01808k23616q6928j08529
2062B569489k01578N0136J5707j05531j83830K9582n8282J1457q5069m8373k5008
2051A968700Q94j59172K5823k1641j09373j3926L5899O1641o2972M4345j80399
2040A589819N743P55J7574K9213r3580j0259P8689k6037j91870j26153Q9220J49881
2028A512995Q5184r4253l18909J5279k17516n2652N5562J74812J8758k01141j13414
2017H64705j780n4726j10800K03518Q5647j7481K3564P1020N0420m051k7712j04444
2005I77880q7867q532j51350L3503k4093N4789J77793r7797k04223k28450J33541
1994E75194J74643r4605J04177j8118K04608m8232k06807J02487q2867k9437K5722
$$ plain form
2072 3735013 3448287 3388457 3195504 3110373 3131287 2886754 2988562 2764946 2678018 2569489
2062 2569489 2367911 2418047 2433754 2328223 2144393 2173975 2115693 2127150 2042081 1993708 1968700
2051 1968700 1969594 1810422 1836245 1814604 1705231 1691305 1727204 1788845 1725873 1770218 1589819
2040 1589819 1595562 1596317 1613891 1643104 1549524 1539265 1617954 1591917 1400047 1273894 1363114 1512995
2028 1512995 1598179 1503926 1185017 1200296 982780 930128 985690 1160502 1179260 978119 864705
2017 864705 862925 808199 697399 900917 986564 969083 992647 1063667 1114087 1110036 1082324 977880
2005 977880 890013 881481 730131 763634 739541 794330 972123 874326 670103 441653 575194
1994 575194 749837 655232 759409 741291 945899 897667 690860 793347 710480 681043 706765
1983G06765j46527Q694N0751K399J54747j41187r7401k4228q4537J94003O693
1972F30172j19317J4200p0485m8961j92279q3602K27972r5536p5910j5230J37753
1961C08777K7077m4971l3883m2969J32433P9473J87667k29498m844L5181l7962
1950C76481J3329k68948o5809J69468J63200j15230j42996J01124k29175J62613
1940A64057N1151L3832J14830o1917J82049j96852K4828J9320O3686j6458n0812
1929C27714j35450j27399K16143O0208j26579J1500k6988J38964q8555N2839O7593
1918C69990j53760r5985j5780j25906K8434O5947J81245J0005Q8205m1039p5874
1907B35482k24209L59616O7778k10776P0533j62271J4087O4533l8428O8086J42138
$$ plain form
1983 706765 560238 568932 619683 622082 776829 635642 538241 514013 429476 623479 630172
1972 630172 510855 525055 454570 405609 213330 129728 357700 262164 186254 171024 308777
1961 308777 335854 290883 257000 214031 346464 425937 613604 384106 379262 414443 376481
1950 376481 389810 120862 55053 224521 387721 272491 129495 230619 1444 164057
1940 164057 215208 249040 363870 301953 484002 287150 311978 331298 394984 378526 327714
1929 327714 192264 64865 281008 341216 214637 226137 199149 338113 249558 302397 369990
1918 369990 216230 120245 104465 -21441 6993 72940 254185 264190 352395 311356 235482
1907 235482 11273 370889 438667 227891 298424 136153 150240 214773 176345 244431 386569
1896C86569j58382P9937M4583Q5345k56522j82378M1719J94265j04266j38641
1886g771J36785O8307j7549k45466Q3307J6188R11O4067K1250r7302K7629J31438
1874A81794j45987K0578k5985K08947K8148p5127P6218R261l2887l6886j42553
1863F5521J32939J11474J30864k8412k33263K6233J04662J50761J2484J74709
1853F47972l8977r6246J01437j90883N5802j1524n55j2293j39286j00515m2723
1842A72209k1833J14245P0801j1109K8692n7275j49536n8927K16929p4604j42
1831B29450M6488j37419o5955M2275p8913j36407j67754J72794k7020j5297J21286
1820a6472K06363L3870j31998J31071L028j7601J8946j02975J21035j27178k60064
$$ plain form
1896 386569 228187 308124 352707 438052 181530 -848 40871 235136 130870 -7771
1886 -7771 129014 197321 179772 -65694 17613 33801 34712 98779 120029 22727 50356 181794
1874 181794 35807 56385 30400 239347 267495 192368 268586 277847 244960 208074 65521
1863 65521 198460 309934 440798 412386 179123 205356 310018 460779 473263 647972
1853 647972 608995 512749 614186 423303 479105 467581 467026 454733 315447 214932 172209
1842 172209 150376 264621 335422 324313 353005 295730 146194 87267 304196 229592 229450
1831 229450 275938 138519 72564 114839 35926 -100481 -268235 -95441 -122461 -137758 -16472
1820 -16472 189891 223761 91763 222834 225862 208261 227207 124232 245267 118089 -141975
1809a41975J54432k1986J97768r1403k32160p9553J40234o592K9539j08941J98459
1798C7822P4211J27048q2200j26221R1260j36201j47868J04953j67770q8835L40229
1787B6428K73265j21493j83311j22797n7700L04746J28438l0115k5724J8321j61010
1776D9048q3508J9295J78102J3081r0297j58953P5486J67914j26757J0592N5734
1765A09737o8989k03903k9197N0751M1888k0608M7853K6200J06081j7175m9000
1754f362l4305j04642O9965K38491j42850j04482J55890r6685J32434J4673K829
1743A24956R9415Q0876k62844o4144P126N7112p740l5972J30185Q0533j36191
1732G3312m2668l6374L9491R3101p1956j16211j9297J37300O2075q5048j6655
$$ plain form
1809 -141975 12457 -9529 188239 96836 -135324 -214877 -74643 -81235 -51696 -160637 37822
1798 37822 112033 239081 156881 30660 121920 -14281 -162149 -57196 -224966 -313801 26428
1787 26428 299693 178200 -5111 -127908 -185608 119138 247576 217461 191737 210058 49048
1776 49048 -34460 -15165 162937 176018 85721 -73232 2254 170168 43411 54003 109737
1765 109737 40748 -163155 -192352 -141601 -99713 -120321 -72468 -46268 59813 42638 -6362
1754 -6362 -40667 -145309 -75344 163147 20297 -84185 71705 -24980 107454 122127 124956
1743 124956 224371 305247 42403 -21741 -14615 42497 34757 -1215 128970 209503 73312
1732 73312 30644 -5730 33761 126862 54906 -61305 -80602 56698 118773 33725 17070
1721A7070k36995m71n1869P6049n4333K94053J20952j96470J59239j29653j65189
1710a67617O5267R4943j88225K28866p604j30647J27440M0548o1786M6743J3892
1699F1820k9778o8443J761K8540q2198J51704j74188J06343K59499l7069k18091
1688a00R1093K38731j28832j24366K5896n9047M3866o686o1662m0223J03875O4043
1676A46588P8375r5638j37540Q5322j09254q149P0258K4241n5996j9285l437l3375
1664e7890J00881p3907j47848J33857Q645m4408q5046N627N0262J21902P8620
1653I0695O4303k45272j77215J31349o7724K3132L17194j96222j10699r712K37420
1642E7249j22811k96091N7264R9067J03P9148L8131J319l7031n4716O0796k6578
$$ plain form
1721 17070 -219925 -220396 -272265 -196216 -250549 43504 164456 -32014 127225 -2428 -167617
1710 -167617 -102350 -7407 -195632 33234 25630 -105017 22423 62971 1185 47928 61820
1699 61820 32042 -36401 -34640 -6100 -88298 63406 -110782 -4439 255060 217991 -100
1688 -100 90993 329724 200892 76526 102422 43375 87241 80555 18893 -21330 82545 146588
1676 146588 224963 129325 -8215 77107 -32147 -40296 29962 54203 -1793 -21078 -24515 -57890
1664 -57890 42991 -30916 -178764 -44907 -36262 -80670 -165716 -160089 -109827 12075 90695
1653 90695 154998 -90274 -267489 -136140 -203864 -180732 136462 -59760 -170459 -180171 57249
1642 57249 -65562 -361653 -304389 -205322 -205219 -126071 -87940 -86621 -123652 -178368 -117572 -144150
1630a44150L3573p5511Q499j73211J66917J76936o5377j53269L2304J97194p8058
1619g4153q5951J6880k57265J00690J79720O6324J3390r4266j8447k6172p195
1608a86445o4327m676J70604R2649o6507l442n76O7166J87441Q5755j27j08187
1596A69328j92013p5240L03725J43564l27050J00440J12309n8667j29483J56885
1586B03798r0283j24238j29M0776J04366n3943p1696J64656N5268j60924j12050
1575d4399O7434O0312j28160k07333j584J71728K7093n4582K385J01579M320r6912
1563i8119K2440n7636L2867r2128l9717P8261J43260j62111J92995K15831l10331
1552g4388P6191p5296j10048l6092L5557K61465J11398j87749k50039Q2577Q3050
$$ plain form
1630 -144150 -110577 -186088 -177589 -350800 -183883 -6947 -72324 -225593 -193289 3905 -74153
1619 -74153 -160104 -143224 -400489 -299799 -120079 -53755 -40365 -134631 -153078 -179250 -186445
1608 -186445 -250772 -255448 -84844 7805 -58702 -62144 -62720 4446 191887 277642 277515 169328
1596 169328 -22685 -97925 205800 349364 22314 122754 235063 176396 46913 203798
1586 203798 113515 -10723 -10852 29924 134290 80347 8651 173307 228575 67651 -44399
1575 -44399 23035 83347 -44813 -252146 -253730 -82002 -54909 -109491 -107106 -5527 -1207 -98119
1563 -98119 -75679 -133315 -100448 -192576 -232293 -154032 -10772 -172883 20112 235943 -74388
1552 -74388 1803 -73493 -183541 -219633 -184076 77389 188787 1038 -249001 -166424 -83374
1541h3374j94028K50361O1608n4536K7181n5790J01662q7748J68224O052R852
1530A49464o9017M2130m6798k22752J44257M940k5367k36374J10586j72372K50208
1519g1095J71846N7198j20091q4776R662N1728K7829P5317j00583o5150J96374
1508A48259P3332r3920k19902N955J635m5178R3629o192j28796L0753K09982r2838
1496b3281o1898n7342O0431P6154m2199O4606j05431L03233m58j71326Q7542M4429
1484A74460j53927r6023q8899M4164M8254r1999j4381J06823j53802m6622L6117
1473b35835J41261L7211Q6257n8580o3040N5152L5063j61484r6514K29912p5278
1462a05875J75859r1304l49561J18353K26917j28129J41463n2081j25355J33453
$$ plain form
1541 -83374 -277402 -27041 34567 -19969 7212 -48578 53084 -34664 133560 139612 149464
1530 149464 80447 122577 75779 -146973 -2716 2224 -23143 -259517 -148931 -321303 -71095
1519 -71095 100751 157949 37858 -46918 -37256 14472 42301 117618 17035 -48115 148259
1508 148259 221591 127671 -92231 -86276 -84641 -129819 -36190 -42382 -171178 -140425 69557 -23281
1496 -23281 -85179 -142521 -82090 -5936 -48135 16471 -88960 214273 213815 42489 130031 174460
1484 174460 20533 -75490 -164389 -120225 -71971 -163970 -178351 -71528 -225330 -271952 -235835
1473 -235835 -94574 -57363 28894 -29686 -92726 -37574 -2511 -163995 -260509 -30597 -105875
1462 -105875 69984 -21320 -370881 -252528 -25611 -153740 -12277 -64358 -189713 -56260
1452e6260l1159L3036q7081j10271k5122J05122P2340q856L5884J12843J6833
1441E7309M211P5345k83471k7370K80611J5815j36285j55707J09745P5239J28319
1430A43761l4920j04844R1175P7344j45108P5653J22728j07094J040p4563m7360
1419b188n744K46336J1319k41233J08253o7591K8225j12763j21092j28205N8029
1408b26654J45191p5889J41520M7661j15936l8472K02364R3174K5040m1114Q1144
1397B38029j8706p0495n2255k18864L6726J4975p4970K02198Q1060p011l4137
1386I6550q3826O9571j16313k23094M3488J07579K5986K3256q3239r5571J93197
1375d2416J80514j88626O9169k2199m1363l0720j57084J86020J48946o9743k3323
$$ plain form
1452 -56260 -87419 -54383 -141464 -251735 -276857 -171735 -99395 -108251 -72367 40476 57309
1441 57309 61520 136865 -146606 -173976 106635 122450 -13835 -169542 -59797 15442 143761
1430 143761 108841 3997 95172 172516 27408 103061 225789 118695 119735 45172 -2188
1419 -2188 -7932 238404 249723 8490 116743 49152 77377 -35386 -156478 -284683 -226654
1408 -226654 -81463 -157352 -15832 31829 -84107 -122579 79785 172959 197999 156885 238029
1397 238029 219323 148828 96573 -122291 -85565 -70590 -145560 56638 137698 130687 96550
1386 96550 12724 82295 -34018 -257112 -213624 -106045 -80059 -56803 -140042 -235613 -42416
1375 -42416 138098 -50528 18641 -3558 -44921 -75641 -232725 -46705 102241 32498 9175
1364I175J24830k11939L2719J518J14357N5801r4187j08816m2866J42665J65434
1353A88691k11050k9794J67317j5311j02836j18618J49515K8552k2196j0528j3447
1342A0295M660J9412r3481J3841J83376k28185n3858K19137k05950L4915N758
1331i0080q9194O5267J58536k9930j1942j48068j303r719m1536O9146m0297P3136
1319i5984O7193q8461R2597n1573q3129o488j83103J38005J77877K234j14545
1308a45377o4468J86969m8936j35284N3917l2825J17751R2732m0174r8446M1194
1297g2947L16621r1000j89397j40244q8864j3682K98754J24399j10805l9393q8202
1286i4760m1136R8059J40136j45791O5057O7463m6026J2173N2525M6261j316k6546
$$ plain form
1364 9175 134005 -77934 -45215 -43697 70660 126461 32274 -76542 -119408 23257 188691
1353 188691 -22359 -52153 115164 99853 -2983 -121601 27914 56466 34270 23742 10295
1342 10295 14955 34367 -59114 -45273 138103 -90082 -143940 75197 -130753 -95838 -90080
1331 -90080 -179274 -114007 44529 14599 2657 -145411 -146714 -156433 -197969 -128823 -169120 -95984
1319 -95984 -28791 -117252 -24655 -76228 -159357 -165845 -348948 -210943 -33066 -30832 -145377
1308 -145377 -209845 -22876 -71812 -207096 -153179 -186004 -68253 24479 -15695 -114141 -72947
1297 -72947 243674 152674 -36723 -176967 -265831 -279513 19241 143640 32835 -6558 -94760
1286 -94760 -135896 -37837 102299 -43492 21565 89028 43002 55175 107700 153961 152645 126099
1274A26099p5091p9692P8532m9858J4170m3423j6360j7783j04374n1567L11317
1263I1970Q7800M006j98686j472l3375q1628Q6346j75571J24443j1512P6684j90769
1251b21764k8563J36246L02574j77472k15753J92242R3046j29614o3352Q4650
1241b7760p9696j10820J75326L7328R9707J9325j80220Q763L8079J93937j22165
1230E1804j59095j564J30476K9735M2235k9127R3456p2190K433m8037j59315r8942
1218b18131j45562Q6884J81566K1836J31385m3583j48363j61564R1189J74960
1208b9383j04384Q5213j50049J30646J19864n9357Q9168L4771j8676k5730m172
1197F7911L3173O203m5383j16804m3839J96135o6371l7240k373O8375j54906L979
$$ plain form
1274 126099 51008 -28684 49848 -10 14160 -29263 -45623 -63406 -167780 -219347 91970
1263 91970 179770 183776 -14910 -16382 -49757 -131385 -45039 -220610 -96167 -107679 -30995 -221764
1251 -221764 -250327 -114081 188493 11021 -204732 -12490 80556 -49058 -112410 -27760
1241 -27760 -107456 -218276 -42950 -5622 94085 113410 -66810 -58047 -19968 173969 51804
1230 51804 -107291 -108855 21621 51356 93591 64464 157920 85730 88163 40126 -119189 -218131
1218 -218131 -363693 -276809 -95243 -73407 57978 14395 -133968 -295532 -204343 -29383
1208 -29383 -133767 -48554 -198603 -67957 51907 -7450 81718 116489 97813 72083 67911
1197 67911 101084 107287 61904 -54900 -98739 97396 31025 -6215 -8588 59787 -95119 -91140
1185i1140o4608J91234O4380n9000J9695n4263J6292R7531J2481M8508J85902
1174C67012j89683r3115r3988J18946K27j69431j6693j84808J18942J67834M6670
1163G1913K7471j65950m9380n5225J26225j0229K3832J6176N5535L4640m5623
$$ plain form
1185 -91140 -155748 35486 99866 40866 60561 6298 22590 120121 132602 181110 367012
1174 367012 177329 84214 -9774 109172 109399 -60032 -76725 -261533 -142591 25243 71913
1163 71913 99384 -66566 -115946 -171171 -44946 -55175 -31343 -15167 40368 75008 29385
$$ [...]
##END NTUPLES=NMR SPECTRUM
##END=
