##TITLE=1H_TG-2334
 CDCl3
 8 sc, 
 19.11.2021
##JCAMPDX= 6.0         $$ Bruker NMR JCAMP-DX V2.0
##DATA TYPE= NMR SPECTRUM
##DATA CLASS= NTUPLES
##ORIGIN= UXNMR, Bruker Analytische Messtechnik GmbH
##OWNER= root
$$ XWIN-NMR		Version 3.5
$$ Fri Nov 19 12:25:46 2021 Russian Standard Time (UT+4h)  she@DPX200
##.OBSERVE FREQUENCY= 200.131346
##.OBSERVE NUCLEUS= ^1H
##.ACQUISITION MODE= SIMULTANEOUS
##.ACQUISITION SCHEME= undefined
##.AVERAGES= 8
##.DIGITISER RES= 18
##SPECTROMETER/DATA SYSTEM= spect
##.PULSE SEQUENCE= zg30
##.SOLVENT NAME= D2O
##.SHIFT REFERENCE= (INTERNAL, D2O, 0, 15.7568)
##AUDIT TRAIL= $$ (NUMBER, WHEN, WHO, WHERE, WHAT)
$$ ##TITLE= Audit trail, XWIN-NMR		Version 3.5
$$ ##JCAMPDX= 5.01
$$ ##ORIGIN= Bruker BioSpin GmbH
$$ ##OWNER= she
$$ F:/spectra/data/she/nmr/H-F/1/pdata/1/auditp.txt
$$ ##AUDIT TRAIL=  $$ (NUMBER, WHEN, WHO, WHERE, WHAT)
(   1,<2021-11-19 12:24:30.14 +0400>,<she>,<DPX200>,
      <created by zg, POWCHK disabled, PULCHK disabled
       configuration hash MD5:
       00 E9 B6 7A A2 85 ED C7 34 08 36 98 17 FE 4E 26
       data hash MD5: 16K
       FA FB 71 F3 02 8A 5F 4C A5 70 72 AC 77 68 B2 43>)
(   2,<2021-11-19 12:24:33.51 +0400>,<she>,<DPX200>,
      <Start of raw data processing
       efp BC_mod = 2 LB = 0.24 FT_mod = 6 PKNL = 1 PHC0 = -15509.36 PHC1 = 6.600809 SI = 16K 
       data hash MD5: 16K
       37 90 BB 64 30 EF C2 49 6F DB 52 0D 34 37 58 FD>)
(   3,<2021-11-19 12:24:51.23 +0400>,<she>,<DPX200>,
      <pk PHC0 = -2.355127 PHC1 = 5.4 
       data hash MD5: 16K
       90 1B 40 C2 4E B5 24 2F FF 7C 41 E5 21 A4 AF 89>)
(   4,<2021-11-19 12:24:54.39 +0400>,<she>,<DPX200>,
      <abs ABSG = 5 
       data hash MD5: 16K
       B9 9B BB F1 5C 7E 22 22 26 2B 7B F6 5E 3A 90 20>)
(   5,<2021-11-19 12:25:23.40 +0400>,<she>,<DPX200>,
      <abs ABSG = 5 
       data hash MD5: 16K
       CE 96 15 9D 30 76 51 5D 13 F5 9F 9D 21 7D 65 B6>)
$$ ##END=
$$ 
$$ hash MD5
$$ 93 1C 2D 3F BB 44 60 D6 5F CC ED CB 45 DD B1 10
##$RELAX= 
##$RELAX= 
##$RELAX= 
##$RELAX= 
##$RELAX= 
##$RELAX= 
$$ Bruker specific parameters
$$ --------------------------
##$DU= <F:/spectra>
##$EXPNO= 1
##$NAME= <H-F>
##$PROCNO= 1
##$TYPE= <nmr>
##$USER= <she>
##$AMP= (0..31)
100 100 100 100 100 100 100 100 100 100 100 100 100 100 100 100 100 100 
100 100 100 100 100 100 100 100 100 100 100 100 100 100 
##$AQSEQ= 0
##$AQ_mod= 1
##$AUNM= <au_zg>
##$AUTOPOS= <>
##$BF1= 200.13
##$BF2= 200.13
##$BF3= 200.13
##$BF4= 200.13
##$BF5= 200.13
##$BF6= 200.13
##$BF7= 200.13
##$BF8= 200.13
##$BYTORDA= 1
##$CFDGTYP= 0
##$CFRGTYP= 5
##$CHEMSTR= <none>
##$CNST= (0..31)
1 1 145 1 1 1 1 1 1 1 1 1 1 1 1 1 1 1 1 1 1 1 1 1 1 1 1 1 1 1 1 1 
##$CPDPRG= <>
##$CPDPRG1= <>
##$CPDPRG2= <>
##$CPDPRG3= <>
##$CPDPRG4= <mlev>
##$CPDPRG5= <mlev>
##$CPDPRG6= <mlev>
##$CPDPRG7= <mlev>
##$CPDPRG8= <mlev>
##$CPDPRGB= <>
##$CPDPRGT= <>
##$D= (0..31)
0 1.2 0 0 0 0 0 0 0 0.06 0 0.03 0 0 0 0 0.0002 0 0 0 0 0 0 0 0 0 0 0 0 
0 0 0 
##$DATE= 1637310269
##$DBL= (0..7)
$$ [...]
##$SUBNAM2= <"">
##$SUBNAM3= <"">
##$SUBNAM4= <"">
##$SUBNAM5= <"">
##$SUBNAM6= <"">
##$SUBNAM7= <"">
##$SUBNAM8= <"">
##$SUBNAM9= <"">
##$SW= 18.0517287032376
##$SWIBOX= (0..15)
0 0 2 0 0 0 0 0 0 0 0 0 0 0 0 0 
##$SW_h= 3612.71676300578
##$TD= 16384
##$TD0= 1
##$TE= 0
##$TE2= 300
##$TE3= 300
##$TEG= 300
##$TL= (0..7)
0 120 120 120 120 120 120 120 
##$TP= (0..7)
150 150 150 150 150 150 150 150 
##$TP07= 0
##$TPNAME0= <>
##$TPNAME1= <>
##$TPNAME2= <>
##$TPNAME3= <>
##$TPNAME4= <>
##$TPNAME5= <>
##$TPNAME6= <>
##$TPNAME7= <>
##$TPOAL= (0..7)
0.5 0.5 0.5 0.5 0.5 0.5 0.5 0.5 
##$TPOFFS= (0..7)
0 0 0 0 0 0 0 0 
##$TUNHIN= 0
##$TUNHOUT= 0
##$TUNXOUT= 0
##$USERA1= <user>
##$USERA2= <user>
##$USERA3= <user>
##$USERA4= <user>
##$USERA5= <user>
##$V9= 5
##$VALIST= <valist>
##$VCLIST= <CCCCCCCCCCCCCCC>
##$VD= 0
##$VDLIST= <DDDDDDDDDDDDDDD>
##$VPLIST= <PPPPPPPPPPPPPPP>
##$VTLIST= <TTTTTTTTTTTTTTT>
##$WBST= 1024
##$WBSW= 4
##$XGAIN= (0..3)
0 0 0 0 
##$XL= 0
##$YL= 0
##$YMAX_a= 410618
##$YMIN_a= -566052
##$ZGOPTNS= <>
##$ZL1= 120
##$ZL2= 120
##$ZL3= 120
##$ZL4= 120
##$ABSF1= 15.75681
##$ABSF2= -2.295039
##$ABSG= 5
##$ABSL= 3
##$ALPHA= 0
##$AQORDER= 0
##$ASSFAC= 0
##$ASSFACI= 0
##$ASSFACX= 0
##$ASSWID= 0
##$AUNMP= <proc_1d>
##$AZFE= 0.1
##$AZFW= 0.1
##$BCFW= 0
##$BC_mod= 2
##$BYTORDP= 0
##$COROFFS= 0
##$CY= -3
##$DATMOD= 1
##$DC= 0
##$DFILT= <>
##$DTYPP= 0
##$F1P= 0
##$F2P= 0
##$FCOR= 1
##$FTSIZE= 16384
##$FT_mod= 6
##$GAMMA= 0
##$GB= 0
##$INTBC= 1
##$INTSCL= 0
##$ISEN= 128
##$LB= 0.24
##$LEV0= 0
##$LPBIN= 0
##$MAXI= 10000
##$MC2= 0
##$MEAN= 0
##$ME_mod= 0
##$MI= 1.114404
##$NCOEF= 0
##$NC_proc= -6
##$NLEV= 6
##$NOISF1= 3.799351
##$NOISF2= 2.8
##$NSP= 0
##$NTH_PI= 0
##$NZP= 0
##$OFFSET= 15.75681
##$PC= 1
##$PHC0= -15511.72
##$PHC1= 12.00081
##$PH_mod= 1
##$PKNL= yes
##$PPARMOD= 0
##$PSCAL= 0
##$PSIGN= 0
##$REVERSE= no
##$SF= 200.129998949302
##$SI= 16384
##$SIGF1= 3
##$SIGF2= 2
##$SINO= 5.538805
##$SIOLD= 16384
##$SREGLST= <1H.CDCl3>
##$SSB= 0
##$STSI= 16384
##$STSR= 0
##$SW_p= 3612.71676300578
##$SYMM= 0
##$S_DEV= 0
##$TDeff= 16384
##$TDoff= 0
##$TI= <>
##$TILT= no
##$TM1= 0
##$TM2= 0
##$TOPLEV= 0
##$USERP1= <user>
##$USERP2= <user>
##$USERP3= <user>
##$USERP4= <user>
##$USERP5= <user>
##$WDW= 1
##$XDIM= 16384
##$YMAX_p= 428682194
##$YMIN_p= -389856
$$ End of Bruker specific parameters
$$ ---------------------------------
##NTUPLES= NMR SPECTRUM
##VAR_NAME=  FREQUENCY,     SPECTRUM/REAL,   SPECTRUM/IMAG
##SYMBOL=    X,             R,               I
##VAR_TYPE=  INDEPENDENT,   DEPENDENT,       DEPENDENT
##VAR_FORM=  AFFN,          ASDF,            ASDF
##VAR_DIM=   16384,         16384,           16384
##UNITS=     HZ,            ARBITRARY UNITS, ARBITRARY UNITS
##FACTOR=    0.220516191357247, 1,           1
##FIRST=     3153.41040642752, 0,            0
##LAST=      -459.30635657826, 0,            0
##MIN=       -459.30635657826, -389856,      0
##MAX=       3153.41040642752, 428682194,    0
$$ Real data points
##PAGE= N=1
##DATA TABLE= (X++(R..R)), XYDATA
$$ [...]
7078B03513m0277r0714n8141J640J4426J20574m8191o9894Q6017k0355k2619J3308
$$ 203513 163236 72522 14381 16021 30447 151021 102830 32936 118953 98598 75979 89287
7066H9287Q002J02850o3237k5655L547M5047l9799J0989j28931p072K7224k7389
$$ 89287 97289 200139 136902 111247 114794 159841 120042 131031 2100 -4972 22252 -5137
7054e137m5287P2251O9349O8706n6783m8990N3120j1752N5738Q3086j17132j76096
$$ -5137 -50424 21827 91176 159882 103099 54109 107229 95477 151215 234301 117169 -58927
7042e8927P7140P6948j3742J09407O5781j55174j112l5142L1927o8742j1520K3930
$$ -58927 18213 95161 81419 190826 256607 101433 100321 65179 97106 28364 16844 40774
7030D0774J04555K6000o1500K3820p3510K8109M3241k7062p6021N0592Q9711k1646
$$ 40774 145329 171329 109829 133649 60139 88248 131489 104427 28406 78998 168709 147063
7018A47063q3775m6998J32897R333m9675M9360j2144o6267j33520j6808M3880
$$ 147063 63288 16290 149187 158520 108845 158205 146061 79794 -53726 -70534 -26654
7007b6654P1899O6490p777P9730m3432r383n1096L0361M8947l5912j37506Q8153
$$ -26654 45245 111735 103958 183688 140256 130873 79777 110138 159085 123173 -14333 73820
6995G3820P7507p2404l3016K9705j2318O7652j926j03121O1423k5906m0950j5676
$$ 73820 151327 78923 45907 75612 63294 130946 129020 25899 87322 61416 20466 4790
6983D790J41677n768J4573o5425q6802k5161O3570O5105K129O6698n0384m6577
$$ 4790 146467 140699 155272 89847 3045 -22116 41454 106559 108688 175386 125002 78425
6971G8425M8809l1068M4610N7546j44393n6076R9185J693q7078l437O4289J27299
$$ 78425 127234 96166 140776 198322 53929 -2147 97038 98731 11653 8216 72505 199804
6959A99804k4379n8043L3371j5305O3295N8368K5005n5097K9565K3842k2900o2658
$$ 199804 175425 117382 150753 135448 198743 257111 282116 227019 256584 280426 257526 194868
6947A94868R846m2627M7694L7074p299o2351K0934L2354j30349K8736P7235J3365
$$ 194868 204714 162087 209781 246855 239556 177205 198139 230493 100144 128880 206115 219480
6935B19480l5413j0392n8756n1500K4812N6738M2360M7418j6215L9170n7131N937
$$ 219480 184067 173675 114919 63419 88231 144969 187329 234747 218532 257702 200571 206508
6923B06508o447K2404l8072J41542J3609o9456Q8877j06183q0521J15601N7679
$$ 206508 200061 222465 184393 325935 339544 270088 358965 252782 172261 287862 345541
6912C45541n5962k1551J5977r9724O0956p328m2695Q5370N6287M4076K8077M0729
$$ 345541 289579 268028 284005 184281 245237 237909 195214 280584 336871 380947 409024 449753
6900D49753K3091k9544k5366N418J425j1612m8358n3452K9582R962O5473L4231
$$ 449753 472844 443300 417934 423352 424777 413165 364807 311355 340937 350899 416372 450603
6888D50603j38019K9119k56o6838K8446J44630m5714J6440j2994p9004n1995M6403
$$ 450603 312584 341703 341447 274609 303055 447685 401971 418411 405417 326413 274418 320821
6876C20821R8576j4776m7539N2992q383P0730j08411j2711P7229j5789k3346K9820
$$ 320821 419397 404621 357082 410074 401691 472421 364010 351299 428528 412739 389393 419213
6864D19213n9093k8270o2221l5511J9116L1582P4850j23147O9169K9366J78M0472
$$ 419213 360120 331850 269629 234118 253234 284816 359666 236519 305688 335054 335232 375704
6852C75704r7155L7583M3985m4167J9574K9594o1013N8928j15032Q689P1186K9016
$$ 375704 278549 316132 360117 315950 335524 365118 304105 363033 248001 256690 327876 356892
6840C56892M7037o5002J2366j00275m3812M7131o381K6380l9488j9030J91074
$$ 356892 403929 338927 351293 251018 207206 254337 247956 274336 234848 215818 406892
6829D06892k6327k8713r605K3621K3337p330M197j5896j75471P1J16393J5458
$$ 406892 380565 351852 342247 365868 389205 381875 386072 370176 194705 194776 311169 326627
6817C26627M2930N4435R853k6623N0637j47823j4273P1371j19438M3136J4287
$$ 326627 369557 423992 433845 407222 457859 310036 295763 367134 247696 290832 305119
6806C05119L2261k0764p433j7426l0232q0348j7644K2259O6274o442J33791k3650
$$ 305119 337380 316616 309183 291757 261525 181177 163533 185792 252066 245624 379415 355765
6794C55765r2606J41587p7050J4959J0188m6272M4551l1185J16391l3503l2391
$$ 355765 263159 404746 327696 342655 352843 306571 351122 319937 436328 402825 370434
6783C70434n919j00070L2909M9842J25220k6754k2071m4472P9043N9835q5262
$$ 370434 364515 264445 297354 347196 472416 445662 423591 379119 458162 517997 432735
6772D32735r8945L7469O380K581P5462r7587P5047J2360m4784J2110q5825P9500
$$ 432735 333790 371259 377639 380220 455682 358095 433142 445502 400718 412828 327003 406503
6760D06503M9595m9519J4999n1610m0368O2333O9076j02350o8069J24039j3102
$$ 406503 456098 406579 421578 369968 329600 391933 461009 358659 290590 414629 401527
6749D01527k1446N7384m676k8157j28177N427N3214k5942j0887J09660q78m5004
$$ 401527 380081 437465 432789 404632 276455 281882 335096 309154 298267 407927 407049 362045
6737C62045J8264P3625j65224n8036N4386J9886J60746p7295m3393j7651l7520
$$ 362045 380309 453934 288710 230674 285060 304946 465692 388397 345004 327353 289833
6726B89833r4030L1132P6321M6233m1763M5696m1917n6005M8833L7194R085r8456
$$ 289833 195803 226935 303256 349489 307726 353422 311505 255500 304333 341527 350612 252156
6714B52156K6720n1554j5436j2324p1031K6258l4196k90L6313J33884r602J2012
$$ 252156 278876 227322 211886 199562 128531 154789 120593 120303 156616 290500 280898 292910
6702B92910M2397k9230j05892p0422L4851Q6294m7475n8079J10147m0374Q283
$$ 292910 335307 306077 200185 129763 164614 250908 203433 145354 255501 215127 223410
6691B23410N2322p3421k9080P2500O4572J4106q6L1481l8934j07906l7642R3637
$$ 223410 275732 202311 173231 245731 310303 324409 324323 355804 316870 208964 171322 264959
6679B64959L5265K9938k7492m4534K0017l1591N3903J0913j35084K3751N3347
$$ 264959 300224 330162 302670 258136 278153 246562 300465 311378 176294 200045 253392
6668B53392q2291O9612M322R306J3176n4643P4074O8203j32975j5846P0749j8013
$$ 253392 171101 240713 245035 254341 267517 212874 286948 355151 222176 206330 277079 259066
6656B59066j06978j4414N3312m4893R762Q4279R5906n3188j17970M0248J5889
$$ 259066 152088 137674 190986 146093 155855 240134 336040 282852 164882 205130 221019
6645B21019O6890O8125l1404K0069l48n7146P2133n4940j31801k0834k3022L4731
$$ 221019 287909 356034 324630 344699 344351 287205 359338 304398 172597 151763 128741 163472
6633A63472l0337o677L3589J0670J0546L4877J483m3063J9473j9246J919N3550
$$ 163472 133135 126458 160047 170717 181263 216140 217623 174560 194033 174787 176706 230256
6621B30256K6023m5703p2729P030k9150Q4929J21552k1558l8323m418k6926r1226
$$ 230256 256279 210576 137847 144877 115727 200656 322208 300650 262327 257909 230983 139757
6609A39757K8359j1186J01225j5641j3360K2966n4274m098p0652J3885R261J11253
$$ 139757 168116 156930 258155 242514 229154 252120 197846 193748 123096 136981 146242 257495
6597B57495m7691q2585r5417J27536R4274J16722j35350j20521P8717O8987k5002
$$ 257495 209804 127219 31802 159338 253612 370334 234984 114463 193180 262167 237165
6586B37165k8879K2308j2505K9057O2882n5723K4511k0923J4078N6022o015m4906
$$ 237165 208286 230594 218089 247146 310028 254305 278816 257893 271971 327993 321978 277072
6574B77072J4480L2827k4183m9055N7828o8983p4732J12581L6725J2043l8771
$$ 277072 291552 324379 300196 251141 308969 239986 165254 277835 314560 326603 287832
6563B87832M1065Q1242M80j1459J8251k5427N9276o4137o401r941K6263M9485
$$ 287832 328897 410139 410619 399160 417411 391984 451260 387123 380722 370781 397044 446529
6551D46529O761J565L0803n6810j2674m1881K1152Q0994J9617k5349k9314M6696
$$ 446529 453290 454855 485658 428848 416174 374293 395445 476439 496056 470707 441393 488089
6539D88089l2041j9093K8933k2265O8552j557q9099K5939J12252P9407j26155
$$ 488089 456048 436955 465888 443623 512175 510618 421519 447458 559710 639117 512962
6528E12962Q0857M8156l1654K0820L3946K1090l9981N668k0530O3397K4615L6429
$$ 512962 593819 641975 610321 631141 665087 686177 646196 651864 631334 694731 719346 755775
6516G55775q5200r6197P8638Q8923O3548J17077q9007r209O194M3400Q2469o4037
$$ 755775 670575 574378 653016 741939 805487 922564 833557 824348 830542 873942 956411 892374
6504H92374k7899P4028O871j7617J0222Q6839N921O4597J09151j2877R080j644
$$ 892374 864475 938503 945374 927757 937979 1024818 1030739 1095336 1204487 1191610 1200690 1199046
6492A199046m6922L9514k6601M5877R9067K1573o401J6489J3345J07185N928K8485
$$ 1199046 1152124 1191638 1165037 1210914 1309981 1331554 1325153 1341642 1354987 1462172 1468100 1496585
6480A496585j7956L1438N6131j356J25448Q0726N7028l2270J1023o4659J31539
$$ 1496585 1478629 1510067 1566198 1564842 1690290 1771016 1828044 1795774 1806797 1742138 1873677
6469A873677P1713P7723J9042J16642R2545O2619J8082M108K13151N3610O724
$$ 1873677 1945390 2023113 2042155 2158797 2251342 2313961 2332043 2336151 2549302 2602912 2609636
6458B609636J4028k096R2371j6797K43817J58465J75051O5414K2533Q1163k4717
$$ 2609636 2623664 2621568 2713939 2697142 2940959 3099424 3274475 3339889 3362422 3443585 3418868
6447C418868J59715J15106R2017J2138P6553J88746J23960J10145J50270J13372
$$ 3418868 3578583 3693689 3785706 3797844 3874397 4063143 4187103 4297248 4447518 4560890
6437D560890J03358J19355K04993P2524J25894K14094R5931P6915J49478J06413
$$ 4560890 4664248 4783603 4988596 5061120 5187014 5401108 5497039 5573954 5723432 5829845
6427E829845Q5908J87942K22911J62481J95063J98401Q1923J72711J20610K50380
$$ 5829845 5915753 6103695 6326606 6489087 6684150 6882551 6964474 7137185 7257795 7508175
6417G508175K27511Q9687P6866J99301J93563P2225K89692K02659J19320K56702
$$ 7508175 7735686 7825373 7902239 8101540 8295103 8367328 8657020 8859679 8978999 9235701
6407I235701J63789J74695J92569K22311K08252J75647J90650J59669J94663J68066
$$ 9235701 9399490 9574185 9766754 9989065 10197317 10372964 10563614 10723283 10917946 11086012
6397A1086012J84202K92106K74996J83315K27967K18243J18837J98616J58608
$$ 11086012 11270214 11562320 11837316 12020631 12248598 12466841 12585678 12784294 12942902
6388A2942902J386J85216K26107P6025n7388J62916N8545j02944L8882J7278j24018
$$ 12942902 12944288 13129504 13355611 13431636 13374248 13537164 13595709 13492765 13531647 13548925 13424907
6377A3424907N4879m1636k7704l1318j80875j15816n8031K1007J6690O858m0720
$$ 13424907 13479786 13438150 13410446 13379128 13198253 13082437 13024406 13045413 13062103 13068961 13028241
6366A3028241r1665j40400j54200N145p0990r6625r2076p0279j46243j22750l6674
$$ 13028241 12936576 12796176 12641976 12647121 12576131 12479506 12387430 12317151 12170908 12048158 12011484
6355A2011484j71323m9817j61504j44960n3623j63048p2746j16775j47942j35391
$$ 12011484 11840161 11790344 11628840 11483880 11430257 11267209 11194463 11077688 10929746 10794355
6345A0794355j76206j20567q2120j94607k34690j42426j45233j52012j93704j72329
$$ 10794355 10618149 10497582 10415462 10220855 9986165 9843739 9698506 9546494 9352790 9180461
6335I180461j29807j29598j28945j88210k00934k13552j30798j20396k52804j14466
$$ 9180461 9050654 8921056 8792111 8603901 8402967 8189415 8058617 7938221 7685417 7570951
6325G570951j75673j04222j81753k57679k23439l1540n1867m7162j66272k33203
$$ 7570951 7395278 7291056 7109303 6851624 6628185 6596645 6544778 6497616 6331344 6098141
6315F098141k04653j54055j05251k32737j60094p1425j40516j33887j09594p8167
$$ 6098141 5893488 5739433 5634182 5401445 5241351 5169926 5029410 4895523 4785929 4707762
6305D707762j04821p5054o4508m6476k09034j33013j26363k04571l6197M2625
$$ 4707762 4602941 4527887 4463379 4416903 4207869 4074856 3948493 3743922 3707725 3750350
6295C750350o8655r8789j61028o1614j02705l6589j6993p7207l0461r8471p1767
$$ 3750350 3681695 3582906 3421878 3360264 3257559 3220970 3203977 3126770 3096309 2997838 2926071
6284B926071j36420n4170p7496j9533K196j26090j903L0236k19705j35295O2517
$$ 2926071 2789651 2735481 2657985 2638452 2640648 2514558 2512655 2542891 2323186 2187891 2250408
6273B250408P7002O1619k9869n3668n728o1059k8488m296K8730m9818k8745M9485
$$ 2250408 2327410 2389029 2359160 2305492 2299764 2238705 2210217 2205921 2234651 2184833 2156088 2205573
6261B205573J02391j11299k1965l437j0904l9915k9744j2251n9531j5195l3852
$$ 2205573 2307964 2196665 2174700 2171263 2160359 2120444 2090700 2078449 2018918 2003723 1969871
6250A969871n1255Q1563k0221m3143R3082O4606p6700k295m4221n5079r478k0334
$$ 1969871 1918616 2000179 1979958 1936815 2029897 2094503 2017803 2015508 1971287 1916208 1906730 1886396
6238A886396L2050M6030m0541p2530L7419j1880J4510j7251r9605r9591m4986
$$ 1886396 1918446 1964476 1923935 1851405 1888824 1876944 1891454 1874203 1774598 1675007 1630021
6227A630021L6399Q680l6960o694K6205n2398o0071Q804j511j32004K4252P1271
$$ 1630021 1666420 1675100 1638140 1631446 1657651 1605253 1545182 1553986 1552475 1420471 1444723 1515994
6215A515994q3851K5760l9588R786J42545r3526k5222J5655k0898J9010k7549
$$ 1515994 1432143 1457903 1418315 1428101 1570646 1477120 1451898 1467553 1446655 1465665 1438116
6204A438116o6357L7135O0924J1983M4584p6277r2681n8240O363L9942J6874O9310
$$ 1438116 1371759 1408894 1469818 1481801 1526385 1450108 1357427 1299187 1305550 1345492 1362366 1431676
6192A431676J0604o3746j7339k2085K626K2062M3004n1724j4065K9344Q1125k1652
$$ 1431676 1442280 1378534 1361195 1339110 1341736 1363798 1406802 1355078 1341013 1370357 1451482 1429830
6180A429830q237M1147k1193J11552l4907l5674q8808R7013Q7233k8527P789j104
$$ 1429830 1421593 1462740 1441547 1553099 1518192 1482518 1393710 1490723 1577956 1549429 1557218 1556114
6168A556114N3862M880K3843J08028L5806M9097J64j6441Q6455k1736J08180P918
$$ 1556114 1609976 1614856 1638699 1746727 1782533 1831630 1831794 1815353 1901808 1880072 1988252 1996170
6156A996170N369J17105j2275l0804J46593Q270P557R2344J41324L293J27475
$$ 1996170 2001539 2118644 2106369 2075565 2222158 2230428 2237985 2330329 2471653 2474946 2602421
6145B602421M7309N1895L5624L6961L5499k9521n6473K2870O8035L1986m8707
$$ 2602421 2649730 2701625 2737249 2774210 2809709 2780188 2723715 2746585 2814620 2846606 2797899
6134B797899L5304P5436O6179O7560k0623J208K8158l391P2178m313j0164N1856
$$ 2797899 2833203 2908639 2974818 3042378 3021755 3022963 3051121 3047730 3119908 3115595 3105431 3157287
6122C157287j26325o6704p983J8276Q33k0495p6167M5453J22677O8081j5094j01546
$$ 3157287 3030962 2964258 2956275 2974551 2975384 2954889 2878722 2924175 3046852 3114933 3099839 2998293
6110B998293j07158q054O3715M415o2084o0034L7671J3669k7405m8448l6820J5275
$$ 2998293 2891135 2883081 2946796 2951211 2889127 2829093 2866764 2880433 2853028 2804580 2767760 2783035
6098B783035n7123o3706k542k5476r7237p3178M0311p060m9529n2487l2286n7600
$$ 2783035 2725912 2662206 2659664 2634188 2536951 2463773 2504084 2497024 2447495 2395008 2362722 2305122
6086B305122j78939K2429L1071K3886k4118p609q9851r2196j0168n08j6970M729
$$ 2305122 2126183 2148612 2179683 2203569 2179451 2171842 2081991 1989795 1979627 1979119 1962149 1966878
6074A966878L3903l1342m3299R7748l8705l1858r6507l5603J2749n8232J10888
$$ 1966878 2000781 1969439 1926140 2023888 1985183 1953325 1856818 1821215 1833964 1775732 1886620
6063A886620l2710l3431q3552p6930M539Q8631L9798O6446P1360o9338O8029m3867
$$ 1886620 1853910 1820479 1736927 1659997 1664536 1753167 1792965 1859411 1930771 1861433 1929462 1885595
6051A885595m1883Q8379q3517m056r852O783J04843J05198Q1253Q7607J14906
$$ 1885595 1843712 1932091 1848574 1844518 1834666 1841449 1946292 2051490 2132743 2220350 2335256
6040B335256L4793O5155J51017J80191J32334M0040J33974M5942J427K6702N9055
$$ 2335256 2370049 2435204 2586221 2766412 2898746 2938786 3072760 3118702 3120129 3146831 3205886
6029C205886J84629J20448m1161r1298P5836j18571j61249j36437k08360n9623
$$ 3205886 3390515 3510963 3469802 3378504 3454340 3335769 3174520 3038083 2829723 2770100
6019B770100k8728j64328r4346m2682l0214k2592q3652m4120L7539j9918J2415
$$ 2770100 2741372 2577044 2482698 2440016 2409802 2387210 2303558 2259438 2296977 2277059 2289474
6008B289474r7531o2385N561J2275p8730j0517J6965N6554J6885p8020K3673L223
$$ 2289474 2191943 2129558 2135119 2147394 2068664 2058147 2075112 2131666 2148551 2070531 2094204 2097427
5996B097427m9252l8507J7241m1818p2991j3716m0026K5862J26490N501q9242
$$ 2097427 2048175 2009668 2026909 1985091 1912100 1898384 1858358 1884220 2010710 2016211 1926969
5985A926969m1167K7021O6797P8961n4232p0944m9262l3982m3873R0499J2763
$$ 1926969 1885802 1912823 1979620 2058581 2004349 1933405 1884143 1850161 1806288 1896787 1909550
5974A909550L4957o465k4815N478l8707L1647N9778p284j30585l4941Q0525o3723
$$ 1909550 1944507 1938042 1913227 1918705 1879998 1911645 1971423 1964139 1833554 1798613 1879138 1815415
5962A815415R6219K9795K9520O2888J7252k3275N7453L606q7907r2849N0052J37713
$$ 1815415 1911634 1941429 1970949 2033837 2051089 2027814 2085267 2088873 2000966 1908117 1958169 2095882
5950B095882L2021K8001q1119J13646l8476m6883M9486J1306M4159l4813J7153
$$ 2095882 2127903 2155904 2074785 2188431 2149955 2103072 2152558 2163864 2208023 2173210 2190363
5939B190363O7704K7455n4114r2083o4226J25425O1103L7384P4814K1149Q9841
$$ 2190363 2258067 2285522 2231408 2139325 2075099 2200524 2261627 2299011 2373825 2394974 2484815
5928B484815j15434N702J16741L998l880P2860P7347M1690k4940M8276K6086N955
$$ 2484815 2369381 2375083 2491824 2495822 2491942 2564802 2642149 2683839 2658899 2707175 2733261 2739216
5916B739216l8404M8417J35419o9281L9678J5293l3962L6220L5239J6669l8728
$$ 2739216 2700812 2749229 2884648 2815367 2855045 2870338 2836376 2872596 2907835 2924504 2885776
5905B885776L8546L0305Q0497J16386L7598m9745k0601P8394Q3878J7163Q8831
$$ 2885776 2924322 2954627 3035124 3151510 3189108 3139363 3118762 3197156 3281034 3298197 3387028
5894C387028J16961M2147R5053o5177L4313Q7284L6891L9954n6038K7994J79147
$$ 3387028 3503989 3546136 3641189 3576012 3610325 3697609 3734500 3774454 3718416 3746410 3925557
5883C925557Q4634o8942j5700K2200O6507L7040O8846q775Q8798q572j4327N9868
$$ 3925557 4010191 3941249 3925549 3947749 4014256 4051296 4120142 4111367 4200165 4191593 4177266 4237134
5871D237134P8277k9766k6957O5054o1605J04361K651J32260n0695M3170K12068
$$ 4237134 4315411 4285645 4258688 4323742 4262137 4366498 4369149 4501409 4450714 4493884 4705952
5860D705952l087O2234n674M5351O0356P1407R1137j1992J04189O1600N3423O8442
$$ 4705952 4702865 4765099 4759425 4804776 4865132 4936539 5027676 5015684 5119873 5181473 5234896 5303338
5848E303338N2831J10730Q9615P3467Q5950R9347J87707k9578J07954J22013J45275
$$ 5303338 5356169 5466899 5556514 5629981 5715931 5815278 6002985 5973407 6081361 6203374 6348649
5837F348649j555J67617J07282Q4690J44318Q0590J54704J83991J75352J07202
$$ 6348649 6347094 6514711 6621993 6706683 6851001 6931591 7086295 7270286 7445638 7552840
5827G552840J64051J41118J35896Q1164K38936J75553K07504J75256K13911K07582
$$ 7552840 7716891 7858009 7993905 8075069 8314005 8489558 8697062 8872318 9086229 9293811
5817I293811J70362L07660J11081Q4996K01275P0687K96956K31963K06349K20581
$$ 9293811 9464173 9771833 9882914 9967910 10169185 10239872 10536828 10768791 10975140 11195721
5807A1195721K58713L18876K81897J60056K94893L36638K67764K18273L14484
$$ 11195721 11454434 11773310 12055207 12215263 12510156 12846794 13114558 13332831 13647315
5798A3647315L07713K61117L72520L26671K82231K73127L01284L58920L56442
$$ 13647315 13955028 14216145 14588665 14915336 15197567 15470694 15771978 16130898 16487340
5789A6487340K70166K23260L74376K93372L25980L19548K73568K60260L61430
$$ 16487340 16757506 16980766 17355142 17648514 17974494 18294042 18567610 18827870 19189300
5780A9189300M29141K02702K02214L11602L68935L34416L31115K92880K02659
$$ 19189300 19618441 19821143 20023357 20334959 20703894 21038310 21369425 21662305 21864964
5771B1864964L10629K37813L58163L57577K42358K33402K86698L54644K27956
$$ 21864964 22175593 22413406 22771569 23129146 23371504 23604906 23891604 24246248 24474204
5762B4474204K70409K86283J57451L34209K70926J49273K93579J82227L8004K07845
$$ 24474204 24744613 25030896 25188347 25522556 25793482 25942755 26236334 26418561 26456565 26664410
5752B6664410K59159J58744J27813P6962P0604J49368M346k8065L1511R665Q8471
$$ 26664410 26923569 27082313 27210126 27287088 27357692 27507060 27511406 27483341 27514852 27524517 27612988
5741B7612988M0911j61453j81436o6179Q838j09866k27267j39393k35932k26097
$$ 27612988 27653899 27492446 27311010 27244831 27253669 27143803 26916536 26777143 26541211 26315114
5731B6315114j14848k00098k29150j57142k26559k12583k63444k55733k81298
$$ 26315114 26200266 26000168 25771018 25613876 25387317 25174734 24911290 24655557 24374259
5722B4374259k29348k59564k24956l06005k43969k38103l27419l35206j99901
$$ 24374259 24144911 23885347 23660391 23354386 23110417 22872314 22544895 22209689 22009788
5713B2009788k82033k93828l45702l57623k60596k97983k61034l07519l32850
$$ 22009788 21727755 21433927 21088225 20730602 20470006 20172023 19910989 19603470 19270620
5704A9270620k74382l04536l41575k99576k61360k25396l43787m05078j95634
$$ 19270620 18996238 18691702 18350127 18050551 17789191 17563795 17220008 16814930 16619296
5695A6619296m02354l64794j90924k60016k23307k36116k09909k59411j82387
$$ 16619296 16216942 15852148 15661224 15401208 15177901 14941785 14731876 14472465 14290078
5686A4290078j72678k96365k33260j08594j05114k27602j74944j44212j57503
$$ 14290078 14117400 13821035 13587775 13479181 13374067 13146465 12971521 12827309 12669806
5677A2669806j60948j16306j70818r4931j68115o2899P7464j64447k17949q2952
$$ 12669806 12508858 12392552 12221734 12126803 11958688 11895789 11973253 11808806 11590857 11507905
5667A1507905O522M7012n9961j894K5315M593O7407M3829R9933Q9193n9629L4386
$$ 11507905 11514427 11561439 11501478 11499584 11524899 11529492 11596899 11640728 11740661 11829854 11770225 11804611
5655A1804611J82837J28516J79823P1261M9973J07246J72822J83007J85842K13679
$$ 11804611 11987448 12115964 12295787 12367048 12417021 12524267 12697089 12880096 13065938 13279617
5645A3279617J85867K82727K81245J69034K45060K36100L82415K16319K78270
$$ 13279617 13465484 13748211 14029456 14198490 14443550 14679650 15062065 15278384 15556654
5636A5556654K80523L39447L48812M12680L20492M44254K18506K86903M74386
$$ 15556654 15837177 16176624 16525436 16938116 17258608 17702862 17921368 18208271 18682657
5627A8682657K47282M46303M33954L42103K39567L56561L61816K79053M34557
$$ 18682657 18929939 19376242 19810196 20152299 20391866 20748427 21110243 21389296 21823853
5618B1823853M37408K68338L39676K03363L20163K83775L78507L37470L00352
$$ 21823853 22261261 22529599 22869275 23072638 23392801 23676576 24055083 24392553 24692905
5609B4692905K64864J26160J46268J93531K46357L15211J87359J81750J57206
$$ 24692905 24957769 25083929 25230197 25423728 25670085 25985296 26172655 26354405 26511611
5600B6511611J88847J20252K25364K06580J27816J20083R2853K86821J8691P8938
$$ 26511611 26700458 26820710 27046074 27252654 27380470 27500553 27593406 27880227 27898918 27977856
5590B7977856J87467J58937p0444N5303J44729O6142n7942L859O8851n0139r3127
$$ 27977856 28165323 28324260 28253816 28309119 28453848 28519990 28462048 28465907 28534758 28484619 28391492
5579B8391492j9494N302j54750q9194j13107j29235j46073k02389k9665o4547
$$ 28391492 28371998 28377300 28222550 28133356 28020249 27891014 27744941 27542552 27512887 27448340
5569B7448340j95185m8356j88200k12125j20300j29957j80094k32996j98301l09148
$$ 27448340 27253155 27204799 27016599 26804474 26684174 26554217 26374123 26141127 25942826 25633678
5559B5633678k12247j68428k48784j80028l03351m14064k46711k05143j98479
$$ 25633678 25421431 25253003 25004219 24824191 24520840 24106776 23860065 23654922 23456443
5550B3456443k49351k39623l07004k37472l40706j52612k41110l38479k17627
$$ 23456443 23207092 22967469 22660465 22422993 22082287 21929675 21688565 21350086 21132459
5541B1132459k99372l38834m00893k88091k89227l46478k97302l81467m07602
$$ 21132459 20833087 20494253 20093360 19805269 19516042 19169564 18872262 18490795 18083193
5532A8083193l64469l68561l71873l03347k55417k72990k38587l02966k32608
$$ 18083193 17718724 17350163 16978290 16674943 16419526 16146536 15907949 15604983 15372375
5523A5372375j81529k57987k08167j90145k49373j35170k02401j43807p8102j68398
$$ 15372375 15190846 14932859 14724692 14534547 14285174 14150004 13947603 13803796 13725694 13557296
5513A3557296r2099j0081j82940k17595l1604j20467p4728N0695j00358J1800
$$ 13557296 13465197 13455116 13272176 13054581 13022977 12902510 12827782 12878477 12778119 12789919
5503A2789919j47465n1873J4046J8970R2107o9724n0831K3380J11930o2501m2359
$$ 12789919 12642454 12590581 12604627 12623597 12715704 12645980 12595149 12618529 12730459 12667958 12625599
5492A2625599K2520P2620J06555k6097j223M7540J33037J14308N6029M8267M7160
$$ 12625599 12648119 12720739 12827294 12801197 12799974 12847514 12980551 13094859 13150888 13199155 13246315
5481A3246315J06131M2283J12708N4465Q8155K46979J14935J61508J88837J22072
$$ 13246315 13352446 13394729 13507437 13561902 13650057 13897036 14011971 14173479 14362316 14484388
5471A4484388K70122K87631J52092J31415J90401K07238K83765J91107J42925
$$ 14484388 14754510 15042141 15194233 15325648 15516049 15723287 16007052 16198159 16341084
5462A6341084J01229J24347J21875J55344J50925J04920Q7781J14480L34694M14661
$$ 16341084 16442313 16566660 16688535 16843879 16994804 17099724 17187505 17301985 17636679 18051340
5452A8051340L11150L11498L88100M74459N94206P81066Q12092Q91144J086348
$$ 18051340 18362490 18673988 19062088 19536547 20130753 20911819 21723911 22615055 23701403
5443B3701403J249051J733639K053605K539574L187445L578535M148948N106366
$$ 23701403 24950454 26684093 28737698 31277272 34464717 38043252 42192200 47298566
5435D7298566N390198N711556N904969L093096L88117J699428K731910M044149
$$ 47298566 52688764 58400320 64305289 67398385 67786502 69485930 72217840 76261989
5427G6261989M892920L601917k671023l679456m275882r277189q926818p604092
$$ 76261989 81154909 84756826 82085803 78406347 74130465 64853276 55926458 48322366
5419D8322366o098939m527125l332511k816308k221531j888649j474975j279631
$$ 48322366 42223427 37696302 34363791 31547483 29325952 27437303 25962328 24682697
5411B4682697j093092q51570p76645p43464o00206o10518m26604n75885m44329
$$ 24682697 23589605 22738035 21961390 21217926 20617720 20007202 19580598 19004713 18560384
5402A8560384m11200l53983k83022l08366m57433l27640j47868k93317l55987
$$ 18560384 18149184 17795201 17512179 17203813 16746380 16418740 16270872 15977555 15621568
5393A5621568l48562l17932l62775j60143k78479k49961j64194l42956k16739
$$ 15621568 15273006 14955074 14592299 14432156 14153677 13903716 13739522 13396566 13179827
5384A3179827j92576k20298o4078k28972k57970k36612j73044j49717r7206j37707
$$ 13179827 12987251 12766953 12702875 12473903 12215933 11979321 11806277 11656560 11559354 11421647
5374A1421647j66213j24566j60265q2090p9270j24810j27077j40551j51048n7722
$$ 11421647 11255434 11130868 10970603 10888513 10809243 10684433 10557356 10416805 10265757 10208035
5364A0208035j19482j97261k05928p1059q2161p4767o7299j29116p1845j53828
$$ 10208035 10088553 9891292 9685364 9614305 9532144 9457377 9390078 9260962 9189117 9035289
5354I035289j57786p8073j30753j24908j48926K5436K097m7519r3444j46711j48716
$$ 9035289 8877503 8799430 8668677 8543769 8394843 8420279 8422376 8374857 8281413 8134702 7985986
5343G985986k0697O3723J8485p1587O6200J4114j26253q5479n8708l7772M8283
$$ 7985986 7965289 8029012 8047497 7975910 8042110 8056224 7929971 7844492 7785784 7748012 7796295
5332G796295Q2472l6377n6927l8685M7294J08776J8135Q0492n583m1653K4611
$$ 7796295 7878767 7842390 7785463 7746778 7794072 7902848 7920983 8001475 7995892 7954239 7978850
5321G978850J4296L7218O588m5377p0923N1550K5314k1520K2912J7793j4617j6509
$$ 7978850 7993146 8030364 8036952 7991575 7920652 7972202 7997516 7975996 7998908 8016701 8002084 7985575
5309G985575K5864j0757K291m6495m5058L4445J42546L9844l9l216o122J37312
$$ 7985575 8011439 8000682 8002973 7956478 7911420 7945865 8088411 8128255 8128216 8125000 8118878 8256190
5297H256190Q364J519J52428J06270k3714J61923J08201L3347J30471j391Q4473
$$ 8256190 8264554 8266073 8418501 8524771 8501057 8662980 8771181 8804528 8934999 8933608 9018081
5286I018081P0324J17866J81575P4613J14282J34492P8198N9334K35424Q9942
$$ 9018081 9088405 9206271 9387846 9462459 9576741 9711233 9789431 9848765 10084189 10174131
5276A0174131R7181O3485J36939M7405K74526K06190J71601K63685K30254J35610
$$ 10174131 10271312 10334797 10471736 10519141 10793667 10999857 11171458 11435143 11665397 11801007
5266A1801007J35860J76472J54431J87469K07669J75409K82482K57388J59765
$$ 11801007 11936867 12113339 12267770 12455239 12662908 12838317 13120799 13378187 13537952
5257A3537952J78364L13092L00921K44543K80372L27336L79983K99967L63056
$$ 13537952 13716316 14029408 14330329 14574872 14855244 15182580 15562563 15862530 16225586
5248A6225586K32528L16991L22517L59854L99478M26359L59599L48167O27586
$$ 16225586 16458114 16775105 17097622 17457476 17856954 18283313 18642912 18991079 19618665
5239A9618665L98252M37755N40089L21734M07211N96939M89343N52084N61749
$$ 19618665 20016917 20454672 20994761 21316495 21723706 22320645 22809988 23362072 23923821
5230B3923821O02601O98845O48924O87873O95322P43618P76766P49927P46408
$$ 23923821 24526422 25225267 25874191 26562064 27257386 28001004 28777770 29527697 30274105
5221C0274105Q09868Q35395Q74526R35058Q80388J089763J087412R90590J128123
$$ 30274105 31083973 31919368 32793894 33728952 34609340 35699103 36786515 37777105 38905228
5212C8905228J225994J317313J239475J307781J439619J360795J414467J514911
$$ 38905228 40131222 41448535 42688010 43995791 45435410 46796205 48210672 49725583
5204D9725583J542480J687210J817251J792939J678259J745138J997739J977603
$$ 49725583 51268063 52955273 54772524 56565463 58243722 59988860 61986599 63964202
5196F3964202J820137J929036J962281J963288J886125J952355J800852J726959
$$ 63964202 65784339 67713375 69675656 71638944 73525069 75477424 77278276 79005235
5188G9005235J745920J677158J503902J326127J310235J096399Q35552P48598
$$ 79005235 80751155 82428313 83932215 85258342 86568577 87664976 88500528 89249126
5180H9249126N29953L78790Q0044j47339k97493m09080o25167q53746j109021
$$ 89249126 89779079 90157869 90237913 90090574 89793081 89384001 88758834 87905088 86796067
5171H6796067j180911j248384j336326j672283j718564j787817j791235j942795
$$ 86796067 85615156 84366772 83030446 81358163 79639599 77851782 76060547 74117752
5163G4117752j960020j933442j969388j950476j908991j958818j949755j806894
$$ 74117752 72157732 70224290 68254902 66304426 64395435 62436617 60486862 58679968
5155E8679968j869404j894423j772671j707764j696562j408979j616259j557746
$$ 58679968 56810564 54916141 53143470 51435706 49739144 48330165 46713906 45156160
5147D5156160j460464j343149j293058j307460j270557j229273j143630r89364
$$ 45156160 43695696 42352547 41059489 39752029 38481472 37252199 36108569 35119205
5139C5119205j031270r52653r58917j036385r39566q96988p78208q45102p90305
$$ 35119205 34087935 33135282 32176365 31139980 30200414 29303426 28525218 27680116 26889811
5130B6889811o42082n88401o64766p23378o92171o55807o49485n44595n92450
$$ 26889811 26247729 25659328 24994562 24271184 23579013 22923206 22273721 21729126 21136676
5121B1136676m63931l98578n28204n06926m72011m93059l65971m34014m79250
$$ 21136676 20672745 20274167 19745963 19239037 18767026 18273967 17907996 17473982 16994732
5112A6994732l31635m40217l29155l97676l21818l26066k26603k88670l73418
$$ 16994732 16663097 16222880 15893725 15496049 15174231 14848165 14621562 14332892 13959474
5103A3959474l20492k60313k97475k74052k45278k53034j89663k33978k73892
$$ 13959474 13638982 13378669 13081194 12807142 12561864 12308830 12119167 11885189 11611297
5094A1611297l01712j91643j28633k31817j73958j35751k40824j75138j14086
$$ 11611297 11309585 11117942 10989309 10757492 10583534 10447783 10206959 10031821 9917735
5085I917735j94219k27040j04229j49085j38394k55050j09735p1334k18054j23870
$$ 9917735 9723516 9496476 9392247 9243162 9104768 8849718 8739983 8668649 8450595 8326725
5075H326725j57668j58055j03801j01229j33817k06494p3655j943r4444r1948
$$ 8326725 8169057 8011002 7907201 7805972 7672155 7465661 7392006 7390063 7295619 7203671
5065G203671r1712j85450j76364J52247j38419m1405o412p3267j25327j43456
$$ 7203671 7111959 6926509 6750145 6902392 6763973 6722568 6716156 6642889 6517562 6374106
5055F374106n3354l0065n7012q5972K6701p292p3594j03191o0983L8026l671j56018
$$ 6374106 6320752 6290687 6233675 6147703 6174404 6167112 6093518 5990327 5929344 5967370 5963699 5807681
5043E807681J6374m7213j47288J765k838R4782K029j73998p9834n0488k3391n1440
$$ 5807681 5824055 5776842 5629554 5631319 5628481 5723263 5725292 5551294 5471460 5420972 5397581 5346141
5031E346141P0981o2182M9376j48650K2128l9317m4142J03530p1359j08774r116
$$ 5346141 5417122 5354940 5404316 5255666 5277794 5238477 5194335 5297865 5226506 5117732 5108616
5020E108616m8510k3956k5840M3785k1745j29096Q4034j10469j10107r1531Q6725
$$ 5108616 5060106 5036150 5010310 5054095 5032350 4903254 4987288 4876819 4766712 4675181 4761906
5009D761906L6047q064n0813j41685p0817k7877j15151K7346O6139j15472p8930
$$ 4761906 4797953 4789889 4739076 4597391 4526574 4498697 4383546 4410892 4477031 4361559 4282629
4998D282629k4915J8949n4280j5656n850j22279j249k1146P6161m1507r2609n0300
$$ 4282629 4257714 4276663 4222383 4206727 4200877 4078598 4077349 4056203 4132364 4090857 3998248 3947948
4986C947948P9104M4286r8417O2549Q4495j09667m5612J07813n2782r6651n046
$$ 3947948 4027052 4071338 3972921 4035470 4119965 4010298 3964686 4072499 4019717 3923066 3918020
4975C918020P9132M2028J49625Q2366j20578P3980j2517j3520P4011k1883n0673
$$ 3918020 3997152 4039180 4188805 4271171 4150593 4224573 4212056 4198536 4272547 4250664 4199991
4964D199991n7479j1516K8606M188p7552n1011p4607o1534K0898O2526j03268
$$ 4199991 4142512 4130996 4159602 4163790 4086238 4035227 3960620 3899086 3919984 3982510 3879242
4953C879242j22129p9792l2707j71046k5090j460K8422o6600p8716j19555m8617
$$ 3879242 3757113 3677321 3644614 3473568 3448478 3447018 3475440 3408840 3330124 3210569 3161952
4942C161952J22828j87128m0233J40784l3645j08343o9237r0137n1500k5511O4232
$$ 3161952 3284780 3097652 3057419 3198203 3164558 3056215 2986978 2896841 2845341 2819830 2884062
4931B884062j3252N3393q9714l4792m8076p7950k9227o3421L7778k8818p4971
$$ 2884062 2870810 2924203 2834489 2799697 2751621 2673671 2644444 2581023 2618801 2589983 2515012
4920B515012m1410o9544q274j9206L5950n6413r0711Q6154n5700n5859N9364p3350
$$ 2515012 2473602 2404058 2395784 2376578 2412528 2356115 2265404 2351558 2295858 2239999 2299363 2226013
4908B226013o7982l2578O5294p461o0746J560M0515K4732J7339J02098q7951o1364
$$ 2226013 2158031 2125453 2190747 2183286 2122540 2124100 2164615 2189347 2206686 2308784 2220833 2159469
4896B159469J0628j0096m7249N4540L2319K1663J5789R522j43515Q9717J45263
$$ 2159469 2170097 2160001 2112752 2167292 2199611 2221274 2237063 2246585 2103070 2192787 2338050
4885B338050K8675l5831m7633Q9087L7132o0586L2035J13708n3871n6829O6285
$$ 2338050 2366725 2330894 2283261 2372348 2409480 2348894 2380929 2494637 2440766 2383937 2450222
4874B450222p738L7426n1723L5612O7046L8041o3088O1696R2058j19116n2820
$$ 2450222 2442484 2479910 2428187 2463799 2530845 2568886 2505798 2567494 2659552 2540436 2487616
4863B487616L9914l116m060J18018M647P10j0498J744J461j0057r736J72979N7505
$$ 2487616 2527530 2524414 2520354 2638372 2643019 2643729 2633231 2634975 2636436 2626379 2616643 2789622 2847127
4850B847127j6931k8044p504o0194Q013n842m1476L934k6209p448L2318j7610
$$ 2847127 2830196 2802152 2794648 2734454 2742467 2736625 2695149 2699083 2672874 2665426 2697744 2680134
4838B680134k6073O9181j8638k2457q3253P95N471p4415n85k8634l7018J32732
$$ 2680134 2654061 2723242 2704604 2682147 2598894 2599689 2605160 2530745 2530160 2501526 2464508 2597240
4826B597240K7391k8633J3553j49951J19209J44395o841k6175p5858N6371Q620
$$ 2597240 2624631 2595998 2609551 2459600 2578809 2723204 2716363 2690188 2614330 2670701 2679321
4815B679321K8757j6789L624k7475J28729N0990j9725k280k5582J41673M6725
$$ 2679321 2708078 2691289 2694913 2667438 2796167 2847157 2827432 2825152 2799570 2941243 2987968
4804B987968r4444j26233Q2221j1445P8187K2219j15273p113k471q7665n7045
$$ 2987968 2893524 2767291 2849512 2838067 2916254 2938473 2823200 2816087 2813616 2725951 2668906
4793B668906N5802m3156n1140m2480L5997l4718p913J2047q1484j49424q2079
$$ 2668906 2724708 2681552 2630412 2587932 2623929 2589211 2581298 2593345 2511861 2362437 2280358
4782B280358J6698m9743r8036j60493N2665J01907q8070q4778N354p617N78l3848
$$ 2280358 2297056 2247313 2149277 1988784 2041449 2143356 2055286 1970508 1975862 1968245 1968823 1934975
4770A934975P2342k9410p7833K7593l0762J5013j0742j09071J02331j0297n3389
$$ 1934975 2007317 1977907 1900074 1927667 1896905 1911918 1901176 1792105 1894436 1884139 1830750
4759A830750m5579J02485O9806k4644p4817j4147l9532J13275M1777k4863j8818
$$ 1830750 1785171 1887656 1957462 1932818 1858001 1843854 1804322 1917597 1959374 1934511 1915693
4748A915693q8724o764R384o7122k4895O5725n1599n0583k6562j03476O7747N0091
$$ 1915693 1826969 1820205 1829589 1762467 1737572 1803297 1751698 1701115 1674553 1571077 1638824 1688915
4736A688915o8335M2265m4027Q149j15368R0286j1328k3558J8498P6600j3628
$$ 1688915 1620580 1662845 1618818 1626967 1511599 1601885 1590557 1566999 1585497 1662097 1648469
4725A648469J2290N6735q8252J4353Q633J5486P9874r0741r1519j22137N0333
$$ 1648469 1660759 1717494 1629242 1643595 1652228 1667714 1747588 1656847 1565328 1443191 1493524
4714A493524J7906n2935o8165j46614l9096Q9918k4890r3299j9823M0115p6894
$$ 1493524 1511430 1458495 1390330 1243716 1204620 1294538 1269648 1176349 1156526 1196641 1119747
4703A119747q4064L3487q586m6558J2601N6284q4212q0157M7245M2283r4322p7525
$$ 1119747 1035683 1069170 1060584 1014026 1026627 1082911 998699 918542 965787 1008070 913748 836223
4691H36223p8115N4642k2661K3846J20293k1186K8937o2194j17011J0459M5454
$$ 836223 758108 812750 790089 813935 934228 913042 941979 879785 762774 773233 818687
4680H18687Q3805p1233o7443m4026r5353k0130K4937M5815p490L8146J7712l6725
$$ 818687 902492 831259 763816 719790 624437 604307 629244 675059 667569 705715 723427 686702
4668F86702n7020K0676O0503p4487m1895p14p3908j8659o991j269m3443N9444
$$ 686702 629682 650358 710861 636374 594479 593765 519857 501198 494207 492938 449495 508939
4656E08939J9944K6515r0115n2605L6205M1938k955j7955o0616k386R9901o3003
$$ 508939 528883 555398 465283 412678 448883 490821 487866 469911 409295 406909 506810 443807
4644D43807k2848M059J4149K4274J5875p9217K8100j15699J01749Q6793n1540
$$ 443807 420959 425018 439167 463441 479316 400099 428199 312500 414249 501042 449502
4633D49502R3199K6522r1590P0559L3672n5373m0153k8550K3868n1331o2211M5528
$$ 449502 542701 569223 477633 548192 581864 526491 486338 457788 481656 430325 368114 413642
4621D13642P104j8849p6991M2767m060O533N8862o61p378n4614Q5088L8228j06261
$$ 413642 420746 401897 324906 367673 363613 370146 429008 428347 420969 366355 451443 489671 383410
4608C83410q0600K9242J7143k8849j5272M7482R0069L1460r1380N2284k3894r338
$$ 383410 302810 332052 349195 320346 305074 352556 442625 474085 382705 434989 411095 401757
4596D01757l2285P2425k8887m0010K5470p406M093O0010j5240j25535N672J15356
$$ 401757 369472 441897 413010 373000 398470 391064 395157 455167 439927 314392 320064 435420
4584D35420O2023N4525l2638L3256k5127p7825l5729L4242j3132L0362J18848
$$ 435420 497443 551968 519330 552586 527459 449634 413905 448147 435015 465377 584225
4573E84225L7210j48815l4104N3704o3089L1100J8052j8445J6608N6705j1848
$$ 584225 621435 472620 438516 492220 429131 460231 478283 459838 476446 533151 521303
4562E21303K0094o0818l9890j2935K9059L5900l7119l5382R7904q8726K6233o2369
$$ 521303 541397 480579 440689 427754 456813 492713 455594 420212 518116 429390 455623 393254
4550C93254M1103K2879m0761L6504k0011L0462J4192K1725n680J5750k7820m2586
$$ 393254 434357 457236 416475 452979 432968 463430 477622 499347 493667 509417 481597 439011
4538D39011Q072J2835r8588Q6070J31652k9815j3890N3902l8687r0615K7008J9186
$$ 439011 447083 459918 361330 447400 579052 549237 535347 589249 550562 459947 486955 506141
4526E06141K3783n5908j9254l8947M6400j9420N3295p0430r0827Q0076J74628
$$ 506141 529924 474016 454762 415815 462215 442795 496090 425660 334833 414909 589537
4515E89537n6409m8368K9971k7491M4750Q8389m9843J9850n5424p899J16054N643
$$ 589537 533128 484760 514731 487240 531990 620379 570536 590386 534962 527063 643117 648760
4503F48760k3719j04664N0790j7924o7497j25444J15742N8574N3949Q669j11344
$$ 648760 625041 520377 571167 553243 485746 360302 476044 534618 588567 597236 485892
4492D85892p3696K1459P5284j8736M4791j41614l5218N5607N2828n8718N3008
$$ 485892 412196 433655 508939 490203 534994 393380 358162 413769 466597 407879 460887
4481D60887k2036m3943J2095O6103J6355R078P0691j280J1765k0282J14911M1704
$$ 460887 438851 394908 407003 473106 489461 498539 569230 567950 579715 559433 674344 716048
4469G16048M0108j77427m3192p2176P1493q2977J10371R1283L3471l532O7966
$$ 716048 756156 578729 535537 463361 534854 451877 562248 653531 687002 683470 751436
4458G51436L9139r3481j05623N2897O3711j07337o1381Q3739k5423m8025K2770
$$ 751436 790575 697094 591471 644368 708079 600742 539361 623100 597677 549652 572422
4447E72422P5339J19744q9014l3006R6720O9311N1842l7958L660P5717q275m2539
$$ 572422 647761 767505 678491 645485 742205 811516 863358 825400 829060 904777 896502 853963
4435H53963Q5592J36468n6088k1649O3581J21995o8437r2764n0966k4293K8950
$$ 853963 939555 1076023 1019935 998286 1061867 1183862 1115425 1022661 971695 947402 976352
4424I76352p1498l2923l4070r218R2651l1972k7133q701J3107j0312p444o6594
$$ 976352 904854 871931 837861 828643 921294 889322 862189 853488 866595 856283 848839 782245
4412G82245M4254R2155k0998M9052J7937J9595J4584K9768m2293J6089j952k4163
$$ 782245 826499 918654 897656 946708 964645 984240 998824 1028592 986299 1002388 1000436 976273
4400I76273J3554k648r4499M6022Q4626R548P1957N210K7481R3122n3027M207
$$ 976273 989827 987179 892680 938702 1023328 1032876 1104833 1110043 1137524 1230646 1177619 1181826
4388A181826N4719j366N2128P4126J5349k945m1191L8277l5053m2371N8941N826
$$ 1181826 1236545 1235179 1287307 1361433 1376782 1373837 1332646 1370923 1335870 1293499 1352440 1358266
4376A358266L7846M5734Q5475m276J16914r1693J11386j2383J8140o1983Q5698
$$ 1358266 1396112 1441846 1527321 1523045 1639959 1548266 1659652 1647269 1665409 1603426 1689124
4365A689124R3322l0633L0458o9061M7462Q6678P2957P6337k0841K4942P9258
$$ 1689124 1782446 1751813 1782271 1713210 1760672 1847350 1920307 1996644 1975803 2000745 2080003
4354B080003J09881J06903K06552J44829J22500M6353J52069J69288J7829J49524
$$ 2080003 2189884 2296787 2503339 2648168 2770668 2817021 2969090 3138378 3156207 3305731
4344C305731J40113m6488m2934P1100K8932k0178o369o6438j43952p5600r5932
$$ 3305731 3445844 3399356 3356422 3427522 3456454 3436276 3429907 3363469 3219517 3143917 3047985
4333C047985n1377j43723k08678o2455j18446L7760j28615j46607R000J8852k204
$$ 3047985 2996608 2852885 2644207 2581752 2463306 2501066 2372451 2225844 2234844 2253696 2251492
4322B251492j10968L3371P699r3372j01023n895O5817O9373n3328J0741J3226
$$ 2251492 2140524 2173895 2181594 2088222 1987199 1981304 2047121 2116494 2063166 2073907 2087133
4311B087133N9124M0946o9536n1326J13285R0534K7734k2633J19710n0257P065
$$ 2087133 2146257 2187203 2117667 2066341 2179626 2270160 2297894 2275261 2394971 2344714 2351779
4300B351779J13657j996L5530k829K9863j902P2037l9377P9715O6236Q5230J12311
$$ 2351779 2465436 2463440 2498970 2496141 2526004 2524102 2596139 2556762 2636477 2702713 2787943 2900254
4288B900254K3230O6618N6201Q6306O6605R9497j1243J46371O2521L6864J19804
$$ 2900254 2923484 2990102 3046303 3132609 3199214 3298711 3287468 3433839 3496360 3533224 3653028
4277C653028Q4923J4775J70511K1953O343j7503K6543N1863K2249K7959j0798
$$ 3653028 3737951 3752726 3923237 3945190 3951533 3934030 3960573 4012436 4034685 4062644 4051846
4266D051846K6555R6427M5237N1108k5820L4742J70704O7951J61496J9555P8256
$$ 4051846 4078401 4174828 4220065 4271173 4245353 4280095 4450799 4518750 4680246 4699801 4778057
4255D778057N2698R0403J73484j244N4595O6815J18940J81568P5522L1309J95360
$$ 4778057 4830755 4921158 5094642 5093398 5147993 5214808 5333748 5515316 5590838 5622147 5817507
4244E817507Q4849P0995J31575q115J47889K06859J73586J62642J97075J73539
$$ 5817507 5902356 5973351 6104926 6096811 6244700 6451559 6625145 6787787 6984862 7158401
4234G158401L06055L92639L37045L74684M53510O13830O60105P84499Q81127J037414
$$ 7158401 7464456 7857095 8194140 8568824 9022334 9636164 10296269 11080768 11961895 12999309
4224A2999309J180821J300222J207151R85856M62038L41579L59172M41788O17021
$$ 12999309 14180130 15480352 16687503 17673359 18135397 18476976 18836148 19277936 19894957
4215A9894957P25468O03051L55986r0438m96806m38073q26175j265887j358616
$$ 19894957 20620425 21223476 21579462 21489024 20992218 20554145 19727970 18462083 17103467
4206A7103467j283700j115659q94764p52414n18246m36425k81069k86106k23047
$$ 17103467 15819767 14704108 13809344 13056930 12538684 12102259 11821190 11535084 11312037
4197A1312037k35810j22138m9367j82476J5955j232j44993k4960j67003j9560
$$ 11312037 11076227 10954089 10904722 10722246 10738201 10736969 10591976 10567016 10400013 10380453
4187A0380453k1360K7293j0973j8225Q2596L0603L6468K1146R1733O3867L3624
$$ 10380453 10359093 10386386 10375413 10357188 10439784 10470387 10506855 10528001 10619734 10683601 10717225
4176A0717225M089k4709K23936K00193M1678J20849J75837K08310J07344K03535
$$ 10717225 10721314 10696605 10920541 11120734 11162412 11283261 11459098 11667408 11774752 11978287
4166A1978287J11408J40133L19562K65883K35672L48931K28453O1387K31922K92293
$$ 11978287 12089695 12229828 12549390 12815273 13050945 13399876 13628329 13689716 13921638 14213931
4156A4213931L51914L04295L63319L85278L92420L37668N04482M51141M35767
$$ 14213931 14565845 14870140 15233459 15618737 16011157 16348825 16853307 17304448 17740215
4147A7740215N54989M99858M83915M85980M81309N31352N84791N97030M67732
$$ 17740215 18295204 18795062 19278977 19764957 20246266 20777618 21362409 21959439 22427171
4138B2427171N26738O34942M95891N10598N41310O41099O62592N63056O67320
$$ 22427171 22953909 23588851 24084742 24595340 25136650 25777749 26440341 27003397 27670717
4129B7670717N88541P21612P71913P85241P99501R20721R52747Q71909R37503
$$ 27670717 28259258 28980870 29752783 30538024 31337525 32258246 33210993 34082902 35020405
4120C5020405J004879R78005R00413R07543J023033J225734J118496J150635J200041
$$ 35020405 36025284 37003289 37903702 38811245 39834278 41060012 42178508 43329143 44529184
4111D4529184J099671J080546J149939J321378J307961J399396J611391J578606
$$ 44529184 45628855 46709401 47859340 49180718 50488679 51888075 53499466 55078072
4103E5078072J717429J594781J855343J880461J923409K004568K253700K381729
$$ 55078072 56795501 58390282 60245625 62126086 64049495 66054063 68307763 70689492
4095G0689492K395717K389271K438108K671204K651013K655924K755815K901161
$$ 70689492 73085209 75474480 77912588 80583792 83234805 85890729 88646544 91547705
4087I1547705K904669K765393K816457K871477K950980L068549L215024L159611
$$ 91547705 94452374 97217767 100034224 102905701 105856681 108925230 112140254 115299865
4079A15299865L170469L274927L588492L783892L897870M275245M598363M924502
$$ 115299865 118470334 121745261 125333753 129117645 133015515 137290760 141889123 146813625
4071A46813625N193036N795744O403139P173259Q238157R236586J0901079J2528350
$$ 146813625 152006661 157802405 164205544 171378803 179616960 188853546 199754625 212282975
4063B12282975J4548178J6786472J8889874K0943734K2668214K3310812K1677162
$$ 212282975 226831153 243617625 262507499 283451233 306119447 329430259 351107421
4056C51107421J7695925J2894449R691472Q519983Q361085Q160755P245174M640024
$$ 351107421 368803346 381697795 391389267 399909250 408270335 416431090 423676264 428316288
4048D28316288L65906n379889j1089514j6030402k0937597k5150561k7132423
$$ 428316288 428682194 423302305 412212791 396182389 375244792 350094231 322961808
4041C22961808k7257598k5709989k3125493k0589309j8112010j5850973j4024914
$$ 322961808 295704210 269994221 246868728 226279419 208167409 192316436 178291522
4034A78291522j2254010j0703012r523081q608720p570164o928094o240824n664324
$$ 178291522 166037512 155334500 145811419 137202699 129632535 122704441 116463617 110799293
4026A10799293n327208m977977m524223m106720l929418l534915l233958l162845
$$ 110799293 105472085 100494108 95969885 91863165 87933747 84398832 81164874 78002029
4018G8002029k930094k761181k553565k539930k400854k108507k083187j942200
$$ 78002029 75071935 72310754 69757189 67217259 64816405 62707898 60624711 58682511
4010E8682511j923262j698251j597067j475061j458314j298558j194518j302311
$$ 58682511 56759249 55060998 53463931 51988870 50530556 49231998 48037480 46735169
4002D6735169j152929j042728j116145r65351r92384r10651p90196q89502p92727
$$ 46735169 45582240 44539512 43423367 42458016 41465632 40554981 39764785 38875283 38082556
3993C8082556o87802o87288n73994o08339n50295n29315m99605o65892m22502
$$ 38082556 37394754 36707466 36133472 35525133 34974838 34445523 33945918 33280026 32857524
3984C2857524m13737l71847l70047m49570l56521l04215k93010l29085m48530
$$ 32857524 32443787 32071940 31701893 31252323 30895802 30591587 30298577 29969492 29520962
3975B9520962l72430k07062m64402k91540j92552k64367j45049k50667k89429
$$ 29520962 29148532 28941470 28477068 28185528 27992976 27728609 27583560 27332893 27043464
3966B7043464k13662k00194j19001k5278j21160j19327j3333k5528M6356P2205
$$ 27043464 26829802 26629608 26510607 26485329 26364169 26244842 26231509 26205981 26252337 26324542
3956B6324542J26902O1479J50542P7800J26502K06982J24238J00833R4791J22788
$$ 26324542 26451444 26512923 26663465 26741265 26867767 27074749 27198987 27299820 27394611 27517399
3946B7517399K29062J3148K8978Q096N6083R5543K31009J43627J6415p1516j2000
$$ 27517399 27746461 27759609 27788587 27796683 27852766 27948309 28179318 28322945 28339360 28267844 28255844
3935B8255844J07152J7655m6085r8757K2619O2739j1675J6291j17381j1297n6392
$$ 28255844 28362996 28380651 28334566 28235809 28258428 28321167 28309492 28325783 28208402 28197105 28140713
3924B8140713K8419q5447p4335j25537j22099j15440j61363j42820j58172j48095
$$ 28140713 28169132 28083685 28009350 27883813 27761714 27646274 27484911 27342091 27183919 27035824
3914B7035824k83675j63384k52177k84311l09528k16071k50805l25379k97784
$$ 27035824 26752149 26588765 26336588 26052277 25742749 25526678 25275873 24950494 24652710
3905B4652710l39904k52699j65453k99544k78835k68561k37407l32457m28042
$$ 24652710 24312806 24060107 23894654 23595110 23316275 23047714 22810307 22477850 22049808
3896B2049808k78817l12454l50540k62773l37284k79386l94207l38628k82539
$$ 22049808 21770991 21458537 21107997 20845224 20507940 20228554 19834347 19495719 19213180
3887A9213180k51509j44614k31058l43871j50898p0347k87897j85408j31283k74304
$$ 19213180 18961671 18817057 18585999 18242128 18091230 18020883 17732986 17547578 17416295 17141991
3877A7141991o0942j92976k08580j08479j06466k37592q1171J9539n0059j10299
$$ 17141991 17081049 16888073 16679493 16571014 16464548 16226956 16145785 16165324 16115265 16004966
3867A6004966j69872j01309r1047k9378m7619j37441j04346j29348o4645p2595
$$ 16004966 15835094 15733785 15642738 15613360 15565741 15428300 15323954 15194606 15129961 15057366
3857A5057366r0923n4167j01852j3388j32079r6227o9476k4962l955o7398j43867
$$ 15057366 14966443 14912276 14810424 14797036 14664957 14568730 14499254 14474292 14470337 14402939 14259072
3846A4259072o4252l2367p0298q1097j32056o0428p0767j75971J41158n5572Q9320
$$ 14259072 14194820 14162453 14092155 14011058 13879002 13818574 13747807 13571836 13712994 13657422 13746742
3835A3746742l7580j17980J0824n2325q9479n4290N2287M0495R5737K3830n7970
$$ 13746742 13709162 13591182 13602006 13549681 13460202 13405912 13458199 13498694 13594431 13618261 13560291
3824A3560291K2064R2133l2337M5941k013J32148J25406J89987J043J02640l7626
$$ 13560291 13582355 13674488 13642151 13688092 13686079 13818227 13943633 14133620 14134663 14237303 14199677
3813A4199677P9049J18788J34010R6057J25579J75664Q5546O28J65947J83333
$$ 14199677 14278726 14397514 14531524 14627581 14753160 14928824 15014370 15014998 15180945 15364278
3803A5364278M6571K37522J31863K47438J73065J81556K30778J60418K71403J83386
$$ 15364278 15410849 15648371 15780234 16027672 16200737 16382293 16613071 16773489 17044892 17228278
3793A7228278J62759K43044K15064K31814L09395K31776K86776L52935L06955
$$ 17228278 17391037 17634081 17849145 18080959 18390354 18622130 18908906 19261841 19568796
3784A9568796L83576J86649L46148L63434L07846L20174M24534N07602M97000
$$ 19568796 19952372 20139021 20485169 20848603 21156449 21476623 21901157 22408759 22905759
3775B2905759L58169M68080L90179N55641L94582N63141O77726N76939O44455
$$ 22905759 23263928 23732008 24122187 24677828 25072410 25635551 26313277 26890216 27534671
3766B7534671O67246P82304P11632Q75767P29649Q01060O60411P43044Q03505
$$ 27534671 28201917 28984221 29695853 30571620 31301269 32102329 32762740 33505784 34309289
3757C4309289Q75957Q67144R53918Q59343R01877R52197R81344R74054J045895
$$ 34309289 35185246 36052390 37006308 37865651 38767528 39719725 40701069 41675123 42721018
3748D2721018J056366J036503J095358J163255J258188J354425J463073J573565
$$ 42721018 43777384 44813887 45909245 47072500 48330688 49685113 51148186 52721751
3740E2721751J638305J689859J927711J912312K002991K139856K303400K399806
$$ 52721751 54360056 56049915 57977626 59889938 61892929 64032785 66336185 68735991
3732F8735991K524224K591243K751884K781613K915964L029617L135872L077360
$$ 68735991 71260215 73851458 76603342 79384955 82300919 85330536 88466408 91543768
3724I1543768L217120L265539L241188L240145L263419L176516L035415K983454
$$ 91543768 94760888 98026427 101267615 104507760 107771179 110947695 113983110 116966564
3716A16966564K907014K672284K576923K345983K158177J904007J623212J411062
$$ 116966564 119873578 122545862 125122785 127468768 129626945 131530952 133154164 134565226
3708A34565226J144009Q27296N18287J90232l598l23557o21982q93230j127133
$$ 134565226 135709235 136536531 137054818 137245050 137241452 136917895 136295913 135402683 134275550
3699A34275550j385504j614309j953109k053270k150493k310072k520396k684265
$$ 134275550 132890046 131275737 129322628 127269358 125118865 122808793 120288397 117604132
3691A17604132k540741k679698k680741k751247k691124k679551k578698k486842
$$ 117604132 115063391 112383693 109702952 106951705 104260581 101581030 99002332 96515490
3683I6515490k452000k422657k190531k124374k104039j875507j678170j728929
$$ 96515490 94063490 91640833 89450302 87325928 85221889 83346382 81668212 79939283
3675G9939283j515796j396395j287078j247890j017686j012827q78378r48959
$$ 79939283 78423487 77027092 75740014 74492124 73474438 72461611 71583233 70634274
3667G0634274q20987o96363o76561n23981n96943o62516n26410n43130n02202
$$ 70634274 69813287 69116924 68440363 67916382 67319439 66656923 66130513 65587383 65085181
3658F5085181m74724n13491m49330l91892l36091l83249l83714m91023m39058
$$ 65085181 64610457 64096966 63647636 63255744 62919653 62536404 62152690 61661667 61222609
3649F1222609k96857l63656m09899l04932k41219k01755k54890k49068k14685
$$ 61222609 60925752 60562096 60152197 59847265 59606046 59404291 59149401 58900333 58685648
3640E8685648n9233j29589q2926J7223K85740J76730K40978K56551M94307L89553
$$ 58685648 58626415 58496826 58413900 58431123 58716863 58893593 59134571 59391122 59885429 60274982
3630F0274982O80225P27210P58309Q61477R67872J246647J167060J404764J304932
$$ 60274982 60955207 61682417 62440726 63302203 64270075 65516722 66683782 68088546 69393478
3621F9393478J423220J573630J696233J653028J759326J892919J888676J829635
$$ 69393478 70816698 72390328 74086561 75739589 77498915 79391834 81280510 83110145
3613H3110145J911289J795469J805004J993286J843750J743811J671843J732480
$$ 83110145 85021434 86816903 88621907 90615193 92458943 94202754 95874597 97607077
3605I7607077J613842J583130J242926J248001J185797J055426J019432P88301
$$ 97607077 99220919 100804049 102046975 103294976 104480773 105536199 106555631 107343932
3597A07343932O52279M76673M21921L13644M98652j5012O6102n771k12407k29147
$$ 107343932 107996211 108472884 108894805 109208449 109707101 109692089 109758191 109752420 109540013 109310866
3587A09310866l00434m21464l51835l32731n23132m92737n19594n72592n48514
$$ 109310866 109010432 108588968 108237133 107904402 107381270 106888533 106368939 105796347 105247833
3578A05247833n92723n91333o13614o76701n99870n92773o64696o52403o40817
$$ 105247833 104655110 104063777 103450163 102773462 102173592 101580819 100916123 100263720 99622903
3569I9622903o38086o73556p98715p78074q07263r07253p80098r99957j014886
$$ 99622903 98984817 98311261 97512546 96734472 95927209 95019956 94239858 93239901 92225015
3560I2225015j125289j141052j154331j330882j385893j414675j583885j544884
$$ 92225015 91099726 89958674 88804343 87473461 86087568 84672893 83089008 81544124
3552H1544124j573860j658090j704961j746250j796315j798768j695819j799459
$$ 81544124 79970264 78312174 76607213 74860963 73064648 71265880 69570061 67770602
3544F7770602j683672j717466j770022j820888j602299j604895j527417j559284
$$ 67770602 66086930 64369464 62599442 60778554 59176255 57571360 56043943 54484659
3536E4484659j420109j422962j264673j215044j171771j060155r29304r04968
$$ 54484659 53064550 51641588 50376915 49161871 47990100 46929945 46000641 45095673
3528D5095673q09469p55944p34773n91357n64680n00643l87067m62403n69674
$$ 45095673 44286204 43530260 42795487 42204130 41639450 41138807 40751740 40289337 39719663
3519C9719663l99519m44018l73551k99960k72051k37146l74784l24737m32925
$$ 39719663 39320144 38876126 38502575 38202615 37930564 37693418 37318634 36993897 36560972
3510C6560972l62722l99850l84824m97395l96405m55751m63441m51262n43249
$$ 36560972 36198250 35798400 35413576 34916181 34519776 34064025 33600584 33149322 32606073
3501C2606073m73149o58343n77739n55307o28383o07629o77202n91253n78708
$$ 32606073 32132924 31474581 30896842 30341535 29713152 29105523 28428321 27837068 27258360
3492B7258360p73716o50775n81669o02456p02561n96127n89847o17735n88319
$$ 27258360 26484644 25833869 25252200 24649744 23947183 23351056 22761209 22143474 21555155
3483B1555155n33269n06492m89683m54821n44837m86361n13078m48476l79198
$$ 21555155 21021886 20515394 20025711 19570890 19026053 18539692 18026614 17578138 17198940
3474A7198940m39583l26064m71138m69128j68829l57331l49357k54453k91173
$$ 17198940 16759357 16433293 15962155 15493027 15324198 14966867 14617510 14363057 14071884
3465A4071884k64573l61836k33382k78477k30238j95923k60207k12333j74034
$$ 14071884 13807311 13445475 13212093 12933616 12703378 12507455 12247248 12034915 11860881
3456A1860881j53869k17948j23035j63492k62694j79643j12414q1838j59210j77378
$$ 11860881 11707012 11489064 11366029 11202537 10939843 10760200 10647786 10565948 10406738 10229360
3446A0229360k48330l7592j15039j77976j57414j26686o7154j59689j85760l1674
$$ 10229360 9981030 9943438 9828399 9650423 9493009 9366323 9299169 9139480 8953720 8922046
3436H922046j23372q8680j10752j2157k4827j64229j60283p9878m5685j00180
$$ 8922046 8798674 8709994 8599242 8587085 8562258 8398029 8237746 8157868 8112183 8012003
3426H012003j05268J5553j11644k15245q1030j60292m7524J2405l1748j29746
$$ 8012003 7906735 7922288 7810644 7595399 7514369 7354077 7306553 7318958 7287210 7157464
3416G157464N3171j04881j17247k9066m3423o8387m7223j53074j16880n1377O8628
$$ 7157464 7210635 7105754 6988507 6959441 6916018 6847631 6800408 6647334 6530454 6479077 6547705
3405F547705j7738j29670p8568n2898j57151j19516m1347k8771m2304m8893q3639
$$ 6547705 6529967 6400297 6321729 6268831 6111680 5992164 5950817 5922046 5879742 5830849 5747210
3394E747210k4958o2869q4348j28135L0700J5251j38361j27622n9565j9737j16265
$$ 5747210 5722252 5659383 5575035 5446900 5477600 5492851 5354490 5226868 5167303 5147566 5031301
3383E031301J0274j15130o7599O6580m1757j6296o0719l4119N5994j13473p9320
$$ 5031301 5041575 4926445 4858846 4925426 4883669 4867373 4806654 4772535 4828529 4715056 4635736
3372D635736k5563N4019j00734l1058j33481p3584K338J9809o5460o7282q3992
$$ 4635736 4610173 4664192 4563458 4532400 4398919 4325335 4327673 4347482 4282022 4214740 4130748
3361D130748N0084j03425o1161L6467o3466j141L7214n8543J0678j17283L096
$$ 4130748 4180832 4077407 4016246 4052713 3989247 3988106 4025320 3966777 3977455 3860172 3863268
3350C863268M200r7626o4619m3978j2834j7882m1803O5443l01m3732n325l9671
$$ 3863268 3867468 3769842 3705223 3661245 3648411 3630529 3588726 3654169 3653868 3610136 3604811 3565140
3338C565140K64k5253O5083L601j22014q3765O4838l5719P40l5903R0819k2990
$$ 3565140 3565404 3540151 3605234 3608835 3486821 3403056 3467894 3432175 3432915 3397012 3487831 3464841
3326C464841r9364j23600J01271K4879l5816O3229k0711p1795j770k5903j9809
$$ 3464841 3365477 3241877 3343148 3368027 3332211 3395440 3374729 3302934 3301164 3275261 3255452
3315C255452J03026m8986K1443J24580J9267l5277j836J4736r0680K8394j808
$$ 3255452 3358478 3309492 3330935 3455515 3474782 3439505 3437669 3452405 3361725 3390119 3388311
3304C388311j2223p1040K4409k7936n4381K3057O6135q5313j1426L1421k1655
$$ 3388311 3376088 3305048 3329457 3301521 3247140 3270197 3336332 3251019 3239593 3271014 3249359
3293C249359M2350n6839m3126J4912j246r5590l573O7249o9183J9400m5405k6501
$$ 3249359 3291709 3234870 3191744 3206656 3205410 3109820 3106247 3173496 3104313 3123713 3078308 3051807
3281C051807K0448L8151J36766l0908j31747N6273J03430k5266n3480k7815l4146
$$ 3051807 3072255 3110406 3247172 3216264 3084517 3140790 3244220 3218954 3165474 3137659 3103513
3270C103513j3548k0846r7496j149L4708n8069O3844j0092p7206p7196J3273O9835
$$ 3103513 3089965 3069119 2971623 2970474 3005182 2947113 3010957 3000865 2923659 2846463 2859736 2929571
3258B929571j07155j03921M4847J59841n4132r2011J16746O4161l0103M5410M3984
$$ 2929571 2822416 2718495 2763342 2923183 2869051 2777040 2893786 2957947 2927844 2973254 3017238
3247C017238o1571P3121O5602m7375P9459m3906Q7201O0993K4188J03473J3945
$$ 3017238 2955667 3028788 3094390 3047015 3126474 3082568 3169769 3230762 3254950 3358423 3372368
3236C372368l1807K5195l9588o2270o1624J0242J23379j3016O0313O8575N8184
$$ 3372368 3340561 3365756 3326168 3263898 3202274 3212516 3335895 3322879 3383192 3451767 3509951
3225C509951m2272K377J58863M4103k4615M505N0779r2720l8796m609l7214j53549
$$ 3509951 3467679 3470056 3628919 3673022 3648407 3652912 3703691 3610971 3572175 3567566 3530352 3376803
3213C376803n4481l8826k8066q0712k25773l528n609o6642j76008r1409l4764
$$ 3376803 3322322 3283496 3255430 3174718 2948945 2945417 2939808 2873166 2697158 2605749 2570985
3202B570985n3781n252j17102p2197m2952N363r5668Q0038M1628M0403N8991q7823
$$ 2570985 2517204 2511952 2394850 2322653 2279701 2285064 2189396 2269434 2311062 2351465 2410456 2322633
3190B322633k3634N9578M6487j7887k9928k2847J16580n3346Q8624K2835q1270
$$ 2322633 2298999 2358577 2405064 2387177 2357249 2334402 2450982 2397636 2486260 2509095 2427825
3179B427825M8913r4796m6569p9908j46485n1110K2844j24040P080j28766l5062
$$ 2427825 2476738 2381942 2335373 2255465 2108980 2057870 2080714 1956674 1963754 1834988 1799926
3168A799926J39266j68202j85107R8530l7130M1722m8151K1705p1787j4743J26620
$$ 1799926 1939192 1770990 1585883 1684413 1647283 1689005 1640854 1662559 1590772 1576029 1702649
3157A702649j5380k7319p5983K7841L8938l5791J6793L5671Q5799j5665J1114
$$ 1702649 1687269 1659950 1583967 1611808 1650746 1614955 1631748 1667419 1753218 1737553 1748667
3146A748667O6572q5054o2712j01236j10882j16251m9405j6196O8033p8974l7208
$$ 1748667 1815239 1730185 1667473 1566237 1455355 1339104 1289699 1273503 1341536 1262562 1225354
3135A225354m8902J18658p3608R7012j8663j39145N4697L2159n8716o4249M8948
$$ 1225354 1176452 1295110 1221502 1318514 1299851 1160706 1215403 1247562 1188846 1124597 1173545
3124A173545n4341R960k1906J0306m7939j01273K5732j0514R4672o2518k2830
$$ 1173545 1119204 1129164 1107258 1117564 1069625 968352 994084 983570 1078242 1015724 992894
3113I92894J07513j13998N045M6483n0583m9169n6413J63511O4289p5515n8630
$$ 992894 1100407 986409 991454 1037937 987354 938185 881772 1045283 1109572 1034057 975427
3102I75427J5343J16315q0941n1209L0589m6335l5509n4699J3888j1741j0921
$$ 975427 990770 1107085 1026144 974935 1005524 959189 923680 868981 882869 871128 860207
3091H60207L0348o2034L5928J5530O2428l909m5158R668O1828o6376J7800l6983
$$ 860207 890555 828521 864449 879979 942407 938498 893340 903008 964836 898460 916260 879277
3079H79277o7287R5651n7153m6519j84485M3912L7747j7234o1626J50512J19309
$$ 879277 811990 907641 850488 803969 619484 663396 701143 683909 622283 772795 892104
3068H92104m9515k8909j18189N4122K7146n0715j25520K9554M4198K5120M5973
$$ 892104 842589 813680 695491 749613 776759 726044 600524 630078 674276 699396 745369
3057G45369P4460L1848j51426q5790L7681J22335k4724m8531j02491k2020K0591
$$ 745369 819829 851677 700251 614461 652142 774477 749753 701222 598731 576711 597302
3046E97302l886K7314j11590J12095O0982q5031M3879L9750l8077l187M0400k5147
$$ 597302 593416 620730 509140 621235 682217 597186 641065 680815 642738 639551 679951 654804
3034F54804r5443K9299r026m6262J08628K565J1667k0956P9154n1383m7723o8697
$$ 654804 559361 588660 579634 533372 642000 644565 656232 635276 714430 663047 615324 546627
3022E46627L3142J04945n6647N1046k9983j13148r3627L1971M5997m8237j2379
$$ 546627 579769 684714 628067 679113 649130 535982 442355 474326 520323 472086 459707
3011D59707J13542R7156j8574j68611q7722j0892R5580N7340K1405J5826J47263
$$ 459707 573249 670405 651831 483220 395498 384606 480186 537526 558931 574757 722020
3000G22020p5404k01296M5964P6251N640L1928k1509m6183m7509n5041L3138L8474
$$ 722020 646616 445320 491284 567535 573175 605103 583594 537411 489902 434861 467999 506473
2988E06473j6390O6077o1031N0596K0171k6494n8431N083J2493N1910K3496k0831
$$ 506473 490083 556160 495129 545725 565896 539402 480971 486054 498547 550457 573953 553122
2976E53122K5409p0907j12495O4810R6083n8263R7239M2703k2252m5518n7365
$$ 553122 578531 507624 395129 459939 556022 497759 594998 637701 615449 569931 512566
2965E12566p0444Q0263k8549j9086Q058J5025L4122m2937P0731Q4690l2228M5124
$$ 512566 442122 522385 493836 474750 482808 497833 531955 489018 559749 644439 612211 657335
2953F57335N6789j10181m2668p7528J5273Q5062L1985n1709L7599O1050p5762
$$ 657335 714124 603943 561275 483747 499020 584082 616067 564358 601957 663007 587245
2942E87245P935m0810r0785K3169O5564N4519M7778m3806m8220p6547P6947m4163
$$ 587245 595180 554370 463585 486754 552318 606837 654615 610809 562589 486042 562989 518826
2930E18826r6182O0003L8821m4396P8809p6118m0641N2506k2584r259n854J17614
$$ 518826 422644 482647 521468 477072 555881 479763 439122 491628 469044 459785 453931 571545
2918E71545M6782l0263n269M6093p7125J1136j0376k9672L0950l4656j7084N2788
$$ 571545 618327 588064 582795 628888 551763 562899 552523 522851 553801 519145 502061 554849
2906E54849k8121J5980k639M0039j17558K3641J01895L7757K7501m4524l3874
$$ 554849 526728 542708 540069 580108 462550 486191 588086 625843 653344 608820 574946
2895E74946J9721P0948j0278m6640J9105O2902n8548L9118l0383K4778P583q4642
$$ 574946 594667 665615 655337 608697 627802 690704 632156 671274 640891 665669 673252 588610
2883E88610K5896Q4257K2208p6428l0442R5123K8520n5879m8433o8486o3123K8995
$$ 588610 614506 698763 720971 644543 614101 709224 737744 681865 633432 564946 501823 530818
2871E30818K2637M4034l4995r6700L8411J09277n8262n6062J0738R3380L1140
$$ 530818 553455 597489 562494 465794 504205 613482 555220 499158 509896 603276 634416
2860F34416K6297L8107L9798n2795j11925J1192L8060k4355J6850m043j35658
$$ 634416 660713 698820 738618 685823 573898 585090 623150 598795 615645 611602 475944
2849D75944O3682R5437k528p541K802n4636l0292N1717k6984m3205n7892J8572
$$ 475944 539626 635063 632535 624994 627796 573160 542868 594585 567601 524396 466504 485076
2837D85076O294J24003L249p4259j45424P0129L8230J9895k3382k8704k2422o225
$$ 485076 491370 615373 618622 544363 398939 469068 507298 527193 503811 475107 452685 446460
2825D46460K5301P0627n5692P6845L2204j59978J8422r5038m7850o620J15311
$$ 446460 471761 542388 486696 563541 595745 435767 454189 359151 311301 304681 419992
2814D19992k8230j12584L2952L9617O2160o8744p9111N8610k463J13234l4920
$$ 419992 391762 279178 312130 351747 413907 345163 266052 324662 322199 435433 400513
2803D00513o0178L9945k5178o1031P568k9159Q6758m0144J2385J7591r0504Q11
$$ 400513 340335 380280 355102 294071 301639 272480 359238 319094 331479 349070 258566 259377
2791B59377j270J9768j8217q9197N6366P246Q1832K2666j62861J4852R1069j68988
$$ 259377 258107 277875 259658 170461 226827 234073 315905 338571 175710 190562 281631 112643
2779A12643M0392J33871p9855l3642N9482J14697N0211m6819p5955k7823r635
$$ 112643 153035 286906 207051 173409 232891 347588 397799 350980 275025 247202 237567
2768B37567J8524K61n0788J2051j50067R7018M4171R8373l0002p2436M3595m5050
$$ 237567 256091 256352 205564 217615 67548 164566 208737 307110 277108 204672 248267 203217
2756B03217l3677J27579Q4102q4222p6820n8579m4269o2246J02470K0776K5875
$$ 203217 169540 297119 381221 296999 220179 161600 117331 55085 157555 178331 204206
2745B04206O7774m3159n8464j5203R3721J0941q3476o075p7844L9508k9719j7269
$$ 204206 271980 228821 170357 155154 248875 259816 176340 170265 92421 131929 102210 84941
2733H4941J3796K7502j1649k3780N3138J9245M8637n6998L0200M0273o4267p951
$$ 84941 98737 126239 114590 90810 143948 163193 211830 154832 185032 225305 161038 153087
2721A53087J26726n8195J6360L7161m1602j03928j15812Q529M4176K4891j4338
$$ 153087 279813 221618 237978 275139 233537 129609 13797 22326 66502 91393 77055
2710G7055N0071O503J27676O285K1988n5928j36214O9855L5357j12394O5601l729
$$ 77055 127126 133629 261305 267590 289578 233650 97436 167291 202648 90254 155855 152126
2698A52126K3419q8231J22001m1757L2868m5905n3973N7487o1376J07027r1232
$$ 152126 175545 87314 209315 167558 200426 154521 100548 158035 96659 203686 112454
2687A12454l298M3553M065P752n54j4292j8033j3178m5461K5933n0676q607Q4276
$$ 112454 109156 152709 156774 164526 163972 149680 131647 118469 73008 98941 48265 39658 123934
2674A23934J01249j27707O676L8370j3910M5797k7864l0801N2334J4782j07940
$$ 123934 225183 97476 104152 142522 128612 174409 146545 115744 168078 182860 74920
2663G4920l0730Q0008J7904M2971k0241l0821L4585n6801k6004m5659o5986K0979
$$ 74920 44190 124198 142102 185073 164832 134011 168596 111795 85791 40132 -25854 -4875
2651d875l296J7676k4225M8063O0403j03651M9768N2541k3234o0821J3233l635
$$ -4875 -8171 9505 -14720 33343 93746 -9905 39863 92404 69170 8349 21582 17947
2639A7947M5635m8016K4646J69p2595L8747j9986m943K7579k3747J1637O8886
$$ 17947 63582 15566 40212 40381 -32214 6533 -13453 -18396 9183 -14564 -2927 65959
2627F5959j1082n2834O644R2962J0316N5498O7373m2188P5156j27626q1953M1631
$$ 65959 54877 2043 8687 101649 111965 167463 234836 192648 267804 140178 58225 99856
2615I9856K8279N103q0997J3067L5637M7881m6827j10937K0304J958O5271Q2245
$$ 99856 128135 133238 52241 65308 100945 148826 101999 -8938 11366 13324 78595 160840
2603A60840M8934p9366l7023j9701j0617m437M1381L7652j7033M3288k4492l3754
$$ 160840 209774 130408 93385 73684 63067 58630 100011 137663 120630 163918 139426 105672
2591A05672q8125P734O4783O4373L5434j20560L7021o5008l7004K8609J02925
$$ 105672 17547 25281 90064 154437 189871 69311 106332 41324 4320 32929 135854
2580A35854n1567Q244K0254P508j33746N1354M9459k428J1710j42701L1937O1210
$$ 135854 84287 92531 112785 120293 -13453 37901 87360 84932 96642 -46059 -14122 47088
2568D7088R5235p2276m3016R398o535k5131J5887O6596k5624N2513l4469P141
$$ 47088 142323 70047 27031 36429 29894 4763 20650 87246 61622 114135 79666 86807
2556H6807J1023j7112K3794j8376j1877q1941r797M0816N5311l1116j5591m0558
$$ 86807 97830 80718 104512 86136 74259 -7682 -17479 23337 78648 47532 31941 -8617
2544h617M2601K3774k7031k9905M1006K99l379r9626J451j2907Q3548j1318m2377
$$ -8617 33984 57758 30727 822 41828 42127 38748 -60878 -59427 -72334 11214 -104 -42481
2531d2481K7151o080p1416R8545M9379L5554J6141q3034m1111j8283M6661O6775
$$ -42481 -15330 -21410 -92826 5719 55098 90652 106793 23759 -17352 -35635 11026 77801
2519G7801n9116o9488N8952P3339l1456q6530j7069J52130l1240j5805M5481l6475
$$ 77801 18685 -50803 8149 81488 50032 -36498 -53567 98563 67323 51518 96999 60524
2507F0524P9024l8936j5365l0644J15238j40166r6890N9052P774m7079P7910O0682
$$ 60524 139548 100612 85247 54603 169841 29675 -67215 -8163 -389 -47468 30442 91124
2495I1124l5416K0482r0062p2376R002L0049q6711j5324J03020J02728O3047J0416
$$ 91124 55708 76190 -13872 -86248 -77246 -47197 -133908 -149232 -46212 56516 119563 129979
2483A29979q4281j0952j0851M7870J5782k353O1676k2000k4907n6169k1436o2405
$$ 129979 45698 34746 23895 71765 87547 85194 146870 124870 99963 43794 22358 -40047
2471d0047N8816n1638r0944o1627L5322J19263m0843N2880L436o7314M9584m059
$$ -40047 18769 -32869 -123813 -185440 -150118 -30855 -71698 -18818 -15382 -82696 -33112 -37171
2459c7171M1157n009m3093m804L9916O62J0430o8953N4601K2918q3788P2614J6476
$$ -37171 3986 -1023 -44116 -48920 -9004 -8342 2088 -66865 -12264 10654 -73134 -520 15956
2446A5956m1835M6658M2696n2999r4940k8902L9031N0059n588N18R797l6464L3799
$$ 15956 -25879 20779 63475 10476 -84464 -113366 -74335 -24276 -29864 -29346 -19549 -56013 -22214
2433b2214K970J0107L3156L8140n9414R662P057l1020r4620l9052M4530J19602
$$ -22214 -19244 -9137 24019 62159 2745 12407 19464 -11556 -106176 -145228 -100698 18904
2421A8904N603m111L5172k9011k4300r4176N2227k1634l880K5452k5507J44875
$$ 18904 24507 20396 55568 26557 2257 -91919 -39692 -61326 -65206 -39754 -65261 79614
2409G9614K3671r3747j8534L2892K5553p4657k8648J15518k9515o8219J622j0783
$$ 79614 103285 9538 -8996 23896 49449 -25208 -53856 61662 32147 -36072 -34450 -45233
2397d5233J2445n1340l4509Q361J5182M9879J9650j7904l5748J02689m431l2366
$$ -45233 -32788 -84128 -118637 -110276 -95094 -45215 -25565 -43469 -79217 23472 19041 -13325
2385a3325O0958k9087q7962n7449J28651j9862o5326l1153O4081j0642J00491
$$ -13325 47633 18546 -69416 -126865 1786 -18076 -83402 -114555 -50474 -61116 39375
2374C9375M9225j45626o5147Q4189k9366l3257Q9041J6764R0807j30063k215K3531
$$ 39375 88600 -57026 -122173 -37984 -67350 -100607 -11566 5198 96005 -34058 -36273 -12742
2362a2742m966O1537m1637M4787o3389m6178J2260J39570Q1206J12425j8230j51364
$$ -12742 -17708 43829 2192 46979 -16410 -62588 -50328 89242 170448 282873 264643 113279
2350A13279l1731L7087j7284N274K5792l8425L5162p0653l7220j1736k2794L0006
$$ 113279 81548 118635 101351 106625 132417 93992 129154 58501 21281 9545 -13249 16757
2338A6757n770K9530r057n5583L0001J12547M793j05964J81490l8281j2045L7399
$$ 16757 10987 40517 31460 -24123 5878 118425 123218 17254 198744 160463 148418 185817
2326A85817p0617n8410j12682K0857L5203j01029R697L7198Q6048l5123N4426
$$ 185817 115200 56790 -55892 -35035 168 -100861 -91164 -53966 32082 -3041 51385
2315E1385j231k2524o2945M118Q3544n615r7037O2465J0038l5236L0969m4552
$$ 51385 50154 27630 -35315 -31197 52347 46732 -50305 12160 22198 -13038 17931 -26621
2303b6621j5784j8574O9529J52353j0317j20975k1647j7138k3480n523J51589
$$ -26621 -42405 -60979 8550 160903 150586 29611 7964 -9174 -32654 -38177 113412
2292A13412r1918r7819N8699O9241m5267O5317J07450p9064j53586J2444L0477
$$ 113412 21494 -76325 -17626 51615 6348 71665 179115 100051 -53535 -41091 -10614
2281a0614M8117j15980k1659J42326q8154l8701Q1118p7734L9299Q4535p686K2392
$$ -10614 37503 -78477 -100136 42190 -45964 -84665 -3547 -81281 -41982 42553 34867 57259
2269E7259m700m7136R17m4622K0141k1414m5016K3429J50388j0908p2904p7421
$$ 57259 52559 5423 6340 -38282 -18141 -39555 -84571 -61142 89246 78338 5434 -71987
2257g1987J9125L9825L2767J07677l5899k8223p2793n5491n8822p0950N5503m825
$$ -71987 -52862 -13037 19730 127407 91508 63285 -9508 -64999 -123821 -194771 -139268 -144093
2245a44093J35998j5086p988J15031k5721q5560l6063J6096K12138M9504j70874
$$ -144093 -8095 -23181 -31169 83862 58141 -27419 -63482 -47386 164752 214256 43382
2234D3382P556k5527Q6476M0277q7415K7387M4155n7168j11138K3065J7708J09179
$$ 43382 50938 25411 111887 152164 64749 92136 136291 79123 -32015 -8950 8758 117937
2222A17937J04683q1545l7388q5702K3425Q0261L8538l6614L2219m3444J3556
$$ 117937 222620 141075 103687 17985 41410 121671 160209 123595 155814 112370 125926
2211A25926j26934R4751Q8589M2919J4708p3214q4287M884J13698l0696j22750
$$ 125926 -1008 93743 182332 225251 239959 166745 82458 87342 201040 170344 47594
2200D7594k508M6742r3k2378J5839j0648J0525l6266J04158o6490k9931J5J2386
$$ 47594 45086 91828 91735 69357 85196 74548 85073 48807 152965 86475 56544 56559 68945
2187F8945q8797J19324K3340J6754K2784o7108J02542L567J30418j40538j7456
$$ 68945 -19852 99472 122812 139566 162350 95242 197784 201351 331769 191231 173775
2176A73775O4490L6636j9956O3564L0304k3776m412j5600O7110R745j022k7424
$$ 173775 238265 274901 254945 318509 348813 325037 320625 305025 372135 381880 380858 353434
2164C53434P0070l88J4882J6560l749P290L3006J5699l2610J6178J045J3487j7696
$$ 353434 423504 423116 437998 454558 450809 458099 491105 506804 474194 490372 491417 504904 487208
2151D87208J08401O0634J03961j48746Q730J53963j11472j4017R1296o2870J57942
$$ 487208 595609 656243 760204 611458 620188 774151 662679 648662 739958 677088 835030
2140H35030J0009j1844K2705l7872P3858l2194n9401M2971J25156L3535Q0758
$$ 835030 845039 833195 855900 818028 891886 859692 800291 843262 968418 1001953 1082711
2129A082711J07313o3767L9278L7010Q0714L5831L5025J27075J2195J10807J02427
$$ 1082711 1190024 1126257 1165535 1202545 1283259 1319090 1354115 1481190 1493385 1604192 1706619
2118A706619P5569N328J44446R6950J275J05756Q7310J28453J12996J97391J28552
$$ 1706619 1782188 1787516 1931962 2028912 2030187 2135943 2223253 2351706 2464702 2662093 2790645
2107B790645J65890J94288L31009K17740K41868L90186L15817L98792M20897N04881
$$ 2790645 2956535 3150823 3481832 3699572 3941440 4331626 4647443 5046235 5467132 5972013
2097E972013P05992O34994Q79184J025008J169401J388537J723347J871231J981828
$$ 5972013 6678005 7312999 8192183 9217191 10386592 11775129 13498476 15369707 17351535
2088A7351535K234813K606561J606370Q52546J301318K586538J473514j823393
$$ 17351535 19586348 22192909 23799279 24651825 25953143 28539681 30013195 28189802
2080B8189802l345400m532353l778809k797556j942394j529012j072483j106605
$$ 28189802 24844402 20312049 16533240 13735684 11793290 10264278 9191795 8085190
2072H085190p55657m91313n41175l65491l55563k90021l80820m25366l00381l44242
$$ 8085190 7329533 6838220 6297045 5931554 5575991 5285970 4905150 4479784 4179403 3835161
2062C835161l31014j84393j93310j66862j33810m4732k11081j04839m9803m6087
$$ 3835161 3504147 3319754 3126444 2959582 2825772 2781040 2569959 2465120 2415317 2369230
2052B369230j48795l6025j7071l5244j32231k85796j9063m4408l3343k6810p9842
$$ 2369230 2220435 2184410 2167339 2132095 1999864 1714068 1695005 1650597 1617254 1590444 1510602
2041A510602n2420o7816M020r912q8671r662q9839n1415j6050n0672l5969Q966
$$ 1510602 1458182 1390366 1394386 1384474 1295803 1286141 1196302 1144887 1128837 1078165 1042196 1051162
2029A051162j07452o335m994q5963p3604M8400J7295p5342M2902N6659P625p3061
$$ 1051162 943710 937375 932381 846418 772814 821214 838509 763167 806069 862728 870353 797292
2017G97292k2941n3237J5600l0999j9555J586n5597l0545n591M1383j057j13571
$$ 797292 774351 721114 736714 705715 686160 687746 632149 601604 596013 637396 636339 522768
2005E22768j5196m405k7762n9174M0895L4984M715j45901N9215K5392m2311k3880
$$ 522768 507572 503167 475405 416231 457126 492110 496825 350924 410139 435531 393220 369340
1993C69340k2212o2918R677M5414n2442K5589N0928M3689n5761k2527N1534M1192
$$ 369340 347128 284210 293887 339301 286859 312448 363376 407065 351304 328777 380311 421503
1981D21503l9863q5925m2386M4587P177O7725m1458j6298N1567p9781k8987j123
$$ 421503 381640 295715 253329 297916 305093 372818 331360 315062 366629 286848 257861 256738
1969B56738L55j9006l4130r870j2267m397K8844J7272j6113n6071M1919J03908
$$ 256738 257093 238087 203957 194087 181820 177423 206267 223539 207426 151355 193274 297182
1957B97182K9331l0449k9640m1270o1038j6526j3418J10076j2211j19206J60412
$$ 297182 326513 296064 266424 225154 164116 147590 134172 244248 232037 112831 273243
1946B73243k4167J7503j401q0155n1750k3670j9638o612O5261r038p5768R2234
$$ 273243 249076 266579 265178 185023 133273 109603 89965 83353 148614 139576 63808 156042
1934A56042l6255j01739O6582M5466o568p3188l1190k8619J44793n9480K2815
$$ 156042 119787 18048 84630 130096 123528 50340 19150 -9469 135324 75844 98659
1923I8659N7687M6859J919j33203l9037N5279Q273j10275n253P6517L9448J3224
$$ 98659 156346 203205 205124 71921 32884 88163 96436 -13839 -19092 57425 96873 110097
1911A10097n9423L5113l693r1735M6525o0212L5564K4362M2262M2253j4321l7631
$$ 110097 50674 85787 82094 -9641 36884 -23328 12236 36598 78860 121113 106792 69161
1899F9161j9744N9183m3241o767M9649K8971j8226K3380j78264m8880J28878O5003
$$ 69161 49417 108600 65359 58592 108241 137212 118986 142366 -35898 -84778 44100 109103
1887A09103k2890k163p753q552j0995L4588j39646o8751J54570J0784k7326J3746
$$ 109103 86213 84050 76297 67745 56750 91338 -48308 -117059 37511 48295 20969 34715
1875C4715l3904K7596P2413l6024j24462M2265N4517L3523q9745L1423N6995q482
$$ 34715 811 28407 100820 64796 -59666 -17401 37116 70639 -19106 12317 69312 60830
1863F0830o889K421n9266K2603l166k7562L9094j5404l8708J6306J20726j1348
$$ 60830 53941 56362 -2904 19699 16533 -11029 28065 12661 -26047 -9741 110985 99637
1851I9637Q2361r9355n9765J9441n7132K5538P5231K3460j6865o4210J9134q0390
$$ 99637 181998 82643 22878 42319 -14813 10725 85956 109416 92551 28341 47475 -32915
1839c2915k8288L1673n7675M7334M5029L2221R2384j0791J1310r6737p4005L3953
$$ -32915 -61203 -29530 -87205 -39871 5158 37379 129763 118972 130282 33545 -40460 -6507
1827f507l1504l540J46289J9145l9783p7800O4578M3851P165R9731j6320k2898
$$ -6507 -38011 -41551 104738 123883 84100 6300 70878 114729 121894 221625 205305 182407
1815A82407n4960j06373J6205K6918j2552r6228J9783r342K2537K2912m3393J42379
$$ 182407 127447 21074 37279 64197 51645 -44583 -24800 -34142 -11605 11307 -32086 110293
1803A10293J2687j25952j33311N2824J5525j009J15094k3440o8784J3939M8386
$$ 110293 122980 -2972 -136283 -83459 -67934 -68943 46151 22711 -46073 -32134 16252
1792A6252l8110O2902K8988j02730J037P359R9835n2414j2156k8606m4308J5332
$$ 16252 -21858 41044 70032 -32698 -31661 -24302 75533 23119 10963 -17643 -61951 -46619
1780d6619M568o8649n1763J13391J6214M4428q800j79787J22250R3276m7999J7565
$$ -46619 -42051 -110700 -162463 -49072 -32858 11570 2770 -177017 -54767 38509 -9490 8075
1768H075n361j4615j074o5122N7499M6509j9912j1731q9866K4078l896j3356K4723
$$ 8075 2714 -11901 -12975 -78097 -20598 25911 5999 -5732 -95598 -71520 -75416 -88772 -64049
1755f4049M989j1385N0681k4584J35211l2740n5168j6969k9262M8891M2696q8497
$$ -64049 -59060 -70445 -19764 -44348 90863 58123 2955 -14014 -43276 5615 48311 -40186
1743d0186n0092O4927L2247n7327K483M049k0144J3425J0600J663m9984P4157
$$ -40186 -90278 -25351 6896 -50431 -47948 -43899 -64043 -50618 -40018 -38355 -88339 -14182
1731a4182Q7132o2652j19182J7798K5662O992J632k7966m5606Q4174O8332M883
$$ -14182 72950 10298 -108884 -91086 -65424 -58432 -56800 -84766 -130372 -46198 22134 27017
1719B7017n0367r6476K1701o2504L1508J3918o8245L1449j9421M0854N2083P7737
$$ 27017 -23350 -119826 -98125 -160629 -129121 -115203 -183448 -151999 -171420 -130566 -78483 -746
1707g46J4378K8016l8297P4858Q072q9450j29180R1698n6024k4596J04878J9729
$$ -746 13632 41648 3351 78209 86281 -3169 -132349 -40651 -96675 -121271 -16393 3336
1695C336q5518R536J9704o7964k4202K5660O3439J1045L9296k5020K4230J2060
$$ 3336 -82182 -72646 -52942 -120906 -145108 -119448 -56009 -44964 -5668 -30688 -6458 5602
1683E602m6236j1086n942L6763J04029n0742j7059O0353J9829m5547j317K8450
$$ 5602 -40634 -51720 -57662 -20899 83130 32388 15329 75682 95511 49964 48647 77097
1671G7097l582k382p2333k9560K6632K9031p892n3974l0006R8800K534m8116L7784
$$ 77097 73515 71133 -1200 -30760 -4128 24903 17011 -36963 -66969 31831 34365 -13751 24033
1658B4033k1527l0255l0976L7150L2234q9161j3742K4535N287P6081l8177j25136
$$ 24033 2506 -27749 -58725 -21575 10659 -78502 -92244 -67709 -62422 13659 -24518 -149654
1646a49654M2621L8291p112O8989o0966R7163l0038q6832l6543o1K2431O0073
$$ -149654 -107033 -68742 -75854 -6865 -67831 29332 -706 -87538 -124081 -124142 -101711 -41638
1634d1638j1805o5258R4678J691j2447n4946m1497L2019O926M547m5808O3791
$$ -41638 -53443 -118701 -24023 -22332 -34779 -89725 -131222 -99203 -92277 -87730 -133538 -69747
1622f9747j5717l0986P7950K9332j2024j11429L1478J17744O2937K3016j05118
$$ -69747 -85464 -116450 -38500 -9168 -21192 -132621 -101143 16601 79538 102554 -2564
1611b564j8596l2263O7661l395n0986n713N866k1228r8180M6072L4461R1651m9208
$$ -2564 -21160 -53423 14238 10843 -40143 -45856 -39990 -61218 -159398 -113326 -78865 12786 -36422
1598c6422o056K9719m6043P6464p1267q4502L9879M9722q000p0286K9436P5364
$$ -36422 -42478 -12759 -58802 17662 -53605 -138107 -98228 -48506 -56506 -126792 -97356 -21992
1586b1992N5769R3182j02975K4763n0703n6775j0221m1266M1484k1257K8441M4757
$$ -21992 33777 126959 23984 48747 -1956 -58731 -68952 -110218 -68734 -89991 -61550 -16793
1574a6793N4670n9223k6607N7666K5256j12746k627L6491L7128J9288R895o1018
$$ -16793 37877 -21346 -47953 9713 34969 -77777 -80404 -43913 -6785 12503 22398 -38620
1562c8620p9331l0826P4090J00816l2174j5572k1045K6157O4347P6316j04716
$$ -38620 -117951 -148777 -74687 26129 -6045 -21617 -42662 -16505 47842 124158 19442
1551A9442j4125M7581J6665O149p9840N555L1095k2995J9660O4619l5567j17125
$$ 19442 5317 52898 69563 75712 -4128 1427 32522 9527 29187 93806 58239 -58886
1539e8886L7756L0884P2631m0884j54744k7013j5310K0214J18848l0437l6775
$$ -58886 -21130 9754 82385 41501 -113243 -140256 -155566 -135352 -16504 -46941 -83716
1528h3716j1756P3508J1358k18883P4232J19447Q5349j34442k9252J09052K3500
$$ -83716 -95472 -21964 -10606 -229489 -155257 -35810 49539 -84903 -114155 -5103 18397
1517A8397l7211n4517J01807q2183N8954k5077n0340l4996R4656O8810j7184m3986
$$ 18397 -18814 -73331 28476 -53707 5247 -19830 -70170 -105166 -10510 58300 41116 -2870
1505b870j84225O9405j0123n8211N3955P986m3646N2885j5217Q3201N8356j4279
$$ -2870 -187095 -117690 -127813 -186024 -132069 -124083 -167729 -114844 -130061 -46860 11496 -2783
1493b783j7819N031j3517j3585q4638N7379j5260M2230l0285J4876L8551m4513
$$ -2783 -20602 -15571 -29088 -42673 -127311 -69932 -85192 -42962 -73247 -58371 -19820 -64333
1481f4333k3004L4929n0263J64142r2948p1511J83931j18263n8395k2304O5683
$$ -64333 -87337 -52408 -102671 61471 -31477 -102988 80943 -37320 -95715 -118019 -52336
1470e2336J2152m5858m5327K2793O9064L7936r9201j8591J19408K3609j69388
$$ -52336 -40184 -86042 -131369 -108576 -39512 -1576 -100777 -119368 40 23649 -145739
1459a45739R1068K3484j5726P0040j09774r695J31746M9532q9781N7228k0118
$$ -145739 -54671 -31187 -46913 23127 -86647 -96342 35404 84936 -4845 52383 32265
1448C2265K8693k5r2615P4127M1486q4003L1832k1037j08374L0417o639J7456
$$ 32265 60958 60933 -31682 42445 83931 -72 31760 10723 -97651 -67234 -73873 -56417
1436e6417l4270L1784L3875O7509n1822J6516j0999J5057K1444o0534j9046J5162
$$ -56417 -90687 -58903 -25028 42481 -9341 7175 -3824 11233 32677 -27857 -46903 -31741
1424c1741J8147J2220O5321l1856K3973O4838j65316n6526P042O465K0355k0360
$$ -31741 -13594 -1374 63947 32091 56064 120902 -44414 -100940 -93898 -87433 -67078 -87438
1412h7438M7243m881j0344j32171J9453J21856J5460n7211L4365J0339j8554l1633
$$ -87438 -40195 -45076 -55420 -187591 -168138 -46282 -30822 -88033 -53668 -43329 -61883 -93516
1400i3516r085J9324R3591K256j1088j0656m8635L157K2851o9849q3816Q4014
$$ -93516 -102601 -83277 10314 12570 1482 -9174 -57809 -54652 -31801 -101650 -185466 -101452
1388a01452O6431N1989n9644k309j1394R4769k0969L5197N6470k8961q3279M6822
$$ -101452 -35021 16968 -42676 -44985 -56379 38390 17421 52618 109088 80127 -3152 43670
1376D3670j15895o3065k6078P9051J8908l8818M7972k2327J35385m2419n3714
$$ 43670 -72225 -135290 -161368 -82317 -63409 -102227 -54255 -76582 58803 16384 -37330
1365c7330K4084k630p701N4171n0145L2400K2680p7908q6943k0654R866l1549
$$ -37330 -13246 -15876 -23577 30594 -19551 12849 35529 -42379 -129322 -149976 -140110 -171659
1353a71659L9968K0257j3422M7107M4282n7111O365R956n4156m3421Q8928K5631
$$ -171659 -131691 -111434 -124856 -77749 -33467 -90578 -84213 -74257 -128413 -171834 -82906 -57275
1341e7275J14058p39j01129L130P192j2372K5627P2345K1797j17712p4098P7238
$$ -57275 56783 56044 -45085 -41955 -34763 -47135 -21508 50837 72634 -45078 -119176 -41938
1329d1938J9093L9682J05887k371o955m0915q166m1509l5540L5461p0932J7425
$$ -41938 -22845 16837 122724 120353 113398 72483 64317 22808 -12732 22729 -48203 -30778
1317c0778q7575J35059j13003l9040J29693k9927J2292n6700M2561J00438o5579
$$ -30778 -118353 16706 -96297 -135337 -5644 -35571 -23279 -79979 -37418 63020 -2559
1306b559j2834n6463o1552K9774M4030O058J0798J25285k6813l8121l9070q3803
$$ -2559 -15393 -71856 -133408 -103634 -59604 -53546 -42748 82537 55724 17603 -21467 -105270
1294a05270O8517n0843j6055N689l5802o759J21540M1537k3120l1597j5361k4558
$$ -105270 -36753 -87596 -103651 -97962 -133764 -140523 -18983 22554 -566 -32163 -47524 -72082
1282g2082R173K5622L3893K8255k8260k3516N9671q4280Q9241l5966m6163N806
$$ -72082 -62909 -37287 -3394 24861 -3399 -26915 32756 -51524 37717 1751 -44412 -38606
1270c8606k9685L399K0121l4023M6792M7664k6883k6192L4146J15326o0973j40845
$$ -38606 -68291 -64892 -44771 -78794 -32002 15662 -11221 -37413 -3267 112059 51086 -89759
1258h9759o186O970K6371L1807K6134O8532n6790Q5362j08207j16039J6543P0415
$$ -89759 -95945 -88975 -62604 -30797 -4663 63869 7079 92441 -15766 -131805 -115262 -44847
1246d4847L3754M3159l3842o1178k933m8583O507L3613l0289M768R3882L0140
$$ -44847 -11093 32066 -1776 -62954 -65887 -114470 -107963 -74350 -104639 -99871 -5989 24151
1234B4151p0808J16957o5154k1358M3513m9337k5323L7713J0883N0357j08864
$$ 24151 -46657 70300 5146 -16212 27301 -22036 -47359 -9646 1237 51594 -57270
1223e7270m1402L907J9833L5924N2180N8784K2925j6603q6668n1467k4288J3968
$$ -57270 -98672 -94765 -74932 -39008 13172 71956 94881 78278 -8390 -59857 -84145 -70177
1211g0177K1485j33776N3221n9411q952J03593l2684J5212P5916J4596L6123l9495
$$ -70177 -48692 -182468 -129247 -188658 -197610 -94017 -126701 -111489 -35573 -20977 15146 -24349
1199b4349j4485R6486L0850m0014q9859L0502Q0690r1589n1935l9947N5258J5326
$$ -24349 -38834 57652 88502 48488 -41371 -10869 69821 -21768 -73703 -113650 -58392 -43066
1187d3066L1701l593J3673O0171n8817N5172N0146p9853n8297r745k4398L6817
$$ -43066 -11365 -14958 -1285 58886 69 55241 105387 25534 -32763 -42508 -66906 -30089
1175c0089N4444M8625r0767K7203m1233O7552k7819K405q8752r120K6845O4793
$$ -30089 24355 72980 -17787 9416 -31817 35735 7916 10321 -78431 -87551 -60706 4087
1163D087M0806K6897o245o1876m9160k7545k373m455L4822M4282n5170J859K0838
$$ 4087 44893 71790 65545 3669 -45491 -73036 -75409 -79864 -45042 -760 -55930 -54071 -33233
1150c3233K1425j2687p3277j3160K6891Q0891J12792K5676r9415n3219k5546m0182
$$ -33233 -11808 -24495 -97772 -110932 -84041 -3150 109642 135318 35903 -17316 -42862 -83044
1138h3044K5451O48R1487K6309o4697p4094L8723k0091m7106J55386j2454n2532
$$ -83044 -57593 -56945 34542 60851 -3846 -77940 -39217 -59308 -106414 48972 36518 -16014
1126a6014j2546O3484j3544q0503o8754J15085R2178l9673o747n4188J4281N0829
$$ -16014 -28560 34924 21380 -59123 -127877 -12792 79386 39713 32966 -21222 -6941 43888
1114D3888J18713r1982m1670k849o4485L0963k273j7436l0530n753k1805m17L7760
$$ 43888 162601 70619 28949 26100 -38385 -7422 -9695 -27131 -57661 -63414 -85219 -85636 -47876
1101d7876o026L416K1216q6310K6960l4953J2224L2421k6037j602K6856j8901
$$ -47876 -53902 -50486 -29270 -115580 -88620 -123573 -111349 -78928 -104965 -106567 -79711 -98612
1089i8612J174O1749m7975J7271K8860J9674K5091Q2750J24722j08309r721k9672
$$ -98612 -97438 -35689 -83664 -66393 -37533 -17859 7232 89982 214704 106395 96674 67002
1077F7002p5729K190L2815N8231q0750p3508L2553m302j267p5123Q1082k0646
$$ 67002 -8727 -6537 26278 84509 3759 -69749 -37196 -41498 -42765 -117888 -36806 -57452
1065e7452L246O207o2591J9991L9755K9011N185K7912p7304K1167J5703k0492
$$ -57452 -54206 -47999 -110590 -90599 -50844 -21833 -16648 11264 -66040 -44873 -29170 -49662
1053d9662j7033Q5533Q439L548m4214R6677k3220j23193N708P5008L684l318l0940
$$ -49662 -66695 18838 27277 30825 -13389 83288 60068 -63125 -57417 17591 21275 17957 -12983
1040a2983m5930k6670o3342L2315M9876M8096r9011J15501R41o8965M1006N251
$$ -12983 -58913 -85583 -148925 -116610 -66734 -18638 -117649 -2148 -1207 -70172 -29166 -23915
1028b3915j13499L7679k0967n1006l3323P7670L7224J9603R1046j47648N2724
$$ -23915 -137414 -99735 -120702 -171708 -205031 -127361 -90137 -70534 20512 -127136 -74412
1017g4412M5528L796K971j1776r387r6214N9729Q8921J1331N4150k0336m5683
$$ -74412 -28884 -25088 -22117 -33893 -43280 -139494 -79765 9156 20487 74637 54301 8618
1005H618m2029j6842m3252m9763J08872M6443j04065N0405P6565J6373j06202
$$ 8618 -33411 -50253 -93505 -143268 -34396 12047 -92018 -41613 34952 51325 -54877
994e4877o339J1065J5309K442j6560P6783n917l6759l4050Q5829j0884o7237P6997
$$ -54877 -61216 -50151 -34842 -32400 -48960 27823 21906 -14853 -48903 36926 26042 -41195 35802
981C5802j0623k8213n5460J6742K2573K1807l0125k3565L5091k2349J1553l6556
$$ 35802 25179 -3034 -58494 -41752 -19179 2628 -27497 -51062 -15971 -38320 -26767 -63323
969f3323J9030L187M684L8159M0593j496m7902K2624m7978k9201j3966P1128K5959
$$ -63323 -44293 -41106 -36422 1737 42330 40834 -7068 15556 -32422 -61623 -75589 -4461 21498
956B1498j13658k8591M3825n4428n2603J54295N1213j12960J1197M9139k7640
$$ 21498 -92160 -120751 -76926 -131354 -183957 -29662 21551 -91409 -80212 -31073 -58713
945e8713j8922O6042o9019M4763n0022L8462R2066k6793l3204j7490R8683o8287
$$ -58713 -77635 -11593 -80612 -35849 -85871 -47409 44657 17864 -15340 -32830 65853 -2434
933b434j37817p046Q2308J95143R5276j18718o7202n0140J0123p431N4410P5669
$$ -2434 -140251 -147297 -64989 130154 225430 106712 39510 -10630 -507 -7938 46472 122141
921A22141m9560j6942P2388o0208O5228j11157m6753r595k9881Q1662m0338o6994
$$ 122141 72581 55639 128027 67819 133047 21890 -24863 -34458 -64339 17323 -23015 -90009
909i0009M7188M8254k9548K959L9311o913l163n2270j8501r9265O5362N8698r9990
$$ -90009 -42821 5433 -24115 -21156 18155 11242 8079 -44191 -62692 -161957 -96595 -37897 -137887
$$ [...]
##END NTUPLES=NMR SPECTRUM
##END=
