##TITLE=1H_TG-2333
 CDCl3
 8 sc, 
 17.11.2021
##JCAMPDX= 6.0         $$ Bruker NMR JCAMP-DX V2.0
##DATA TYPE= NMR SPECTRUM
##DATA CLASS= NTUPLES
##ORIGIN= UXNMR, Bruker Analytische Messtechnik GmbH
##OWNER= root
$$ XWIN-NMR		Version 3.5
$$ Wed Nov 17 12:29:01 2021 Russian Standard Time (UT+4h)  she@DPX200
##.OBSERVE FREQUENCY= 200.131346
##.OBSERVE NUCLEUS= ^1H
##.ACQUISITION MODE= SIMULTANEOUS
##.ACQUISITION SCHEME= undefined
##.AVERAGES= 8
##.DIGITISER RES= 18
##SPECTROMETER/DATA SYSTEM= spect
##.PULSE SEQUENCE= zg30
##.SOLVENT NAME= DMSO
##.SHIFT REFERENCE= (INTERNAL, DMSO, 0, 15.7579)
##AUDIT TRAIL= $$ (NUMBER, WHEN, WHO, WHERE, WHAT)
$$ ##TITLE= Audit trail, XWIN-NMR		Version 3.5
$$ ##JCAMPDX= 5.01
$$ ##ORIGIN= Bruker BioSpin GmbH
$$ ##OWNER= she
$$ F:/spectra/data/she/nmr/H-F/1/pdata/1/auditp.txt
$$ ##AUDIT TRAIL=  $$ (NUMBER, WHEN, WHO, WHERE, WHAT)
(   1,<2021-11-17 12:26:37.62 +0400>,<she>,<DPX200>,
      <created by zg, POWCHK disabled, PULCHK disabled
       configuration hash MD5:
       00 E9 B6 7A A2 85 ED C7 34 08 36 98 17 FE 4E 26
       data hash MD5: 16K
       81 3B 88 BB 0D D9 3C E8 4B EB AA 13 22 89 89 DA>)
(   2,<2021-11-17 12:26:40.00 +0400>,<she>,<DPX200>,
      <Start of raw data processing
       efp BC_mod = 2 LB = 0.24 FT_mod = 6 PKNL = 1 PHC0 = -15514.06 PHC1 = 9.20081 SI = 16K 
       data hash MD5: 16K
       62 54 24 CB B2 BF 6E 73 D8 7F A8 90 23 EA 96 D9>)
(   3,<2021-11-17 12:27:22.53 +0400>,<she>,<DPX200>,
      <pk PHC0 = 4.409474 PHC1 = -4.400001 
       data hash MD5: 16K
       4C B0 C2 A8 8A 77 BD C7 5B 01 04 4A 7E 62 5C CE>)
(   4,<2021-11-17 12:27:26.09 +0400>,<she>,<DPX200>,
      <abs ABSG = 5 
       data hash MD5: 16K
       02 20 11 50 B4 28 43 9E 8C 84 08 E9 AC A9 D9 D2>)
$$ ##END=
$$ 
$$ hash MD5
$$ 90 1D D4 0F F5 31 C0 79 C6 7F 36 67 8C AA 80 F9
##$RELAX= 
##$RELAX= 
##$RELAX= 
##$RELAX= 
##$RELAX= 
##$RELAX= 
$$ Bruker specific parameters
$$ --------------------------
##$DU= <F:/spectra>
##$EXPNO= 1
##$NAME= <H-F>
##$PROCNO= 1
##$TYPE= <nmr>
##$USER= <she>
##$AMP= (0..31)
100 100 100 100 100 100 100 100 100 100 100 100 100 100 100 100 100 100 
100 100 100 100 100 100 100 100 100 100 100 100 100 100 
##$AQSEQ= 0
##$AQ_mod= 1
##$AUNM= <au_zg>
##$AUTOPOS= <>
##$BF1= 200.13
##$BF2= 200.13
##$BF3= 200.13
##$BF4= 200.13
##$BF5= 200.13
##$BF6= 200.13
##$BF7= 200.13
##$BF8= 200.13
##$BYTORDA= 1
##$CFDGTYP= 0
##$CFRGTYP= 5
##$CHEMSTR= <none>
##$CNST= (0..31)
1 1 145 1 1 1 1 1 1 1 1 1 1 1 1 1 1 1 1 1 1 1 1 1 1 1 1 1 1 1 1 1 
##$CPDPRG= <>
##$CPDPRG1= <>
##$CPDPRG2= <>
##$CPDPRG3= <>
##$CPDPRG4= <mlev>
##$CPDPRG5= <mlev>
##$CPDPRG6= <mlev>
##$CPDPRG7= <mlev>
##$CPDPRG8= <mlev>
##$CPDPRGB= <>
##$CPDPRGT= <>
##$D= (0..31)
0 1.2 0 0 0 0 0 0 0 0.06 0 0.03 0 0 0 0 0.0002 0 0 0 0 0 0 0 0 0 0 0 0 
0 0 0 
##$DATE= 1637137597
##$DBL= (0..7)
120 120 120 120 120 120 120 120 
##$DBP= (0..7)
150 150 150 150 150 150 150 150 
##$DBP07= 0
##$DBPNAM0= <>
##$DBPNAM1= <>
##$DBPNAM2= <>
##$DBPNAM3= <>
##$DBPNAM4= <>
$$ [...]
##$SUBNAM2= <"">
##$SUBNAM3= <"">
##$SUBNAM4= <"">
##$SUBNAM5= <"">
##$SUBNAM6= <"">
##$SUBNAM7= <"">
##$SUBNAM8= <"">
##$SUBNAM9= <"">
##$SW= 18.0517287032376
##$SWIBOX= (0..15)
0 0 2 0 0 0 0 0 0 0 0 0 0 0 0 0 
##$SW_h= 3612.71676300578
##$TD= 16384
##$TD0= 1
##$TE= 0
##$TE2= 300
##$TE3= 300
##$TEG= 300
##$TL= (0..7)
0 120 120 120 120 120 120 120 
##$TP= (0..7)
150 150 150 150 150 150 150 150 
##$TP07= 0
##$TPNAME0= <>
##$TPNAME1= <>
##$TPNAME2= <>
##$TPNAME3= <>
##$TPNAME4= <>
##$TPNAME5= <>
##$TPNAME6= <>
##$TPNAME7= <>
##$TPOAL= (0..7)
0.5 0.5 0.5 0.5 0.5 0.5 0.5 0.5 
##$TPOFFS= (0..7)
0 0 0 0 0 0 0 0 
##$TUNHIN= 0
##$TUNHOUT= 0
##$TUNXOUT= 0
##$USERA1= <user>
##$USERA2= <user>
##$USERA3= <user>
##$USERA4= <user>
##$USERA5= <user>
##$V9= 5
##$VALIST= <valist>
##$VCLIST= <CCCCCCCCCCCCCCC>
##$VD= 0
##$VDLIST= <DDDDDDDDDDDDDDD>
##$VPLIST= <PPPPPPPPPPPPPPP>
##$VTLIST= <TTTTTTTTTTTTTTT>
##$WBST= 1024
##$WBSW= 4
##$XGAIN= (0..3)
0 0 0 0 
##$XL= 0
##$YL= 0
##$YMAX_a= 376865
##$YMIN_a= -395049
##$ZGOPTNS= <>
##$ZL1= 120
##$ZL2= 120
##$ZL3= 120
##$ZL4= 120
##$ABSF1= 15.71604
##$ABSF2= -2.33581
##$ABSG= 5
##$ABSL= 3
##$ALPHA= 0
##$AQORDER= 0
##$ASSFAC= 0
##$ASSFACI= 0
##$ASSFACX= 0
##$ASSWID= 0
##$AUNMP= <proc_1d>
##$AZFE= 0.1
##$AZFW= 0.1
##$BCFW= 0
##$BC_mod= 2
##$BYTORDP= 0
##$COROFFS= 0
##$CY= -3
##$DATMOD= 1
##$DC= 0
##$DFILT= <>
##$DTYPP= 0
##$F1P= 0
##$F2P= 0
##$FCOR= 1
##$FTSIZE= 16384
##$FT_mod= 6
##$GAMMA= 0
##$GB= 0
##$INTBC= 1
##$INTSCL= 0
##$ISEN= 128
##$LB= 0.24
##$LEV0= 0
##$LPBIN= 0
##$MAXI= 10000
##$MC2= 0
##$MEAN= 0
##$ME_mod= 0
##$MI= 1.114404
##$NCOEF= 0
##$NC_proc= -6
##$NLEV= 6
##$NOISF1= 3.799351
##$NOISF2= 2.8
##$NSP= 0
##$NTH_PI= 0
##$NZP= 0
##$OFFSET= 15.75791
##$PC= 1
##$PHC0= -15509.65
##$PHC1= 4.800809
##$PH_mod= 1
##$PKNL= yes
##$PPARMOD= 0
##$PSCAL= 0
##$PSIGN= 0
##$REVERSE= no
##$SF= 200.129998727994
##$SI= 16384
##$SIGF1= 3
##$SIGF2= 2
##$SINO= 5.538805
##$SIOLD= 16384
##$SREGLST= <1H.CDCl3>
##$SSB= 0
##$STSI= 16384
##$STSR= 0
##$SW_p= 3612.71676300578
##$SYMM= 0
##$S_DEV= 0
##$TDeff= 16384
##$TDoff= 0
##$TI= <>
##$TILT= no
##$TM1= 0
##$TM2= 0
##$TOPLEV= 0
##$USERP1= <user>
##$USERP2= <user>
##$USERP3= <user>
##$USERP4= <user>
##$USERP5= <user>
##$WDW= 1
##$XDIM= 16384
##$YMAX_p= 477872632
##$YMIN_p= -469639
$$ End of Bruker specific parameters
$$ ---------------------------------
##NTUPLES= NMR SPECTRUM
##VAR_NAME=  FREQUENCY,     SPECTRUM/REAL,   SPECTRUM/IMAG
##SYMBOL=    X,             R,               I
##VAR_TYPE=  INDEPENDENT,   DEPENDENT,       DEPENDENT
##VAR_FORM=  AFFN,          ASDF,            ASDF
##VAR_DIM=   16384,         16384,           16384
##UNITS=     HZ,            ARBITRARY UNITS, ARBITRARY UNITS
##FACTOR=    0.220516191357247, 1,           1
##FIRST=     3153.63046318262, 0,            0
##LAST=      -459.08629982316, 0,            0
##MIN=       -459.08629982316, -469639,      0
##MAX=       3153.63046318262, 477872632,    0
$$ Real data points
##PAGE= N=1
##DATA TABLE= (X++(R..R)), XYDATA
$$ [...]
$$ plain form
7110 -112748 -127304 -92178 -65069 73283 47708 -50029 -62974 -177121 -185274 -113645 -99413
7099 -99413 -90708 29171 41110 -79393 -117633 -36175 -20360 -12858 -4701 -63195 -74893 -23324
7087 -23324 -25089 22736 -18169 33137 90561 69466 29130 -6903 1042 -48825 -27930 45613
7075 45613 33602 -68412 -28547 -31156 -30095 37479 104194 103100 47270 108042 165289 102720
7063 102720 36830 136443 243390 354432 341238 339088 393221 421275 437347 380995 444124
7052 444124 400397 345431 406797 361596 353723 375935 332262 228540 276292 411830 421852
7041 421852 328174 397878 414792 395391 347356 417727 466436 437494 439898 301334 344454 304655
7029 304655 411395 414676 461876 442309 445880 501099 496887 434344 492061 522967 610806 621142
$$ packed form
7110a12748j4556L5126K7109J38352k5575r7737j2945j14147q153P1629J4232
7099i9413Q705J19879J1939j20503l8240Q1458J5815P502Q157n8494j1698N1569
7087b3324j765M7825m0905N1306N7424k1095m0336l6033P945m9867K0895P3543
7075D5613j2011j02014L9865k609J061O7574O6715j094n5830O0772N7247o2569
7063A02720o5890R9613J06947J11042j3194k150N4133K8054J6072n6352O3129
7052D44124m3727n4966O1366m5201p873K2212m3673j03722M7752J35538J0022
7041D21852r3678O9704J6914j9401m8035P0371M8709k8942K404j38564M3120l9799
7029C04655J06740L281M7200j9567L571N5219m212o2543N7717L0906Q7839J0336
$$ plain form
7017 621142 508428 553501 675249 719108 705462 820586 757506 755474 823491 895991 934119
7006 934119 960244 939721 905812 910140 926141 974013 944341 1042604 1058692 1081401 1180484 1142237
6994 1142237 1118409 1127626 1113781 1135113 1072308 980501 1064186 1176848 1162266 1147017 1176422
6983 1176422 1254604 1225729 1327936 1401649 1378828 1463963 1592608 1626624 1621555 1565988 1723386
6972 1723386 1825106 1829163 1923594 1886949 1912930 1976233 2084154 2187638 2238291 2224971 2410363
6961 2410363 2581373 2549545 2653946 2736301 2936040 3081012 3190286 3336478 3441312 3507433
6951 3507433 3657418 3776544 3877343 4008223 4177630 4387676 4480427 4642320 4799337 4991030
6941 4991030 5177266 5321192 5389596 5635313 5861586 6053725 6241376 6434216 6674192 6891152
$$ packed form
7017F21142j12714M5073J21748M3859j3646J15124o3080k032O8017P2500L8128
7006I34119K6125k0523l3909M328J6001M7872k9672R8263J6088K2709R9083l8247
6994A142237k3828R217j3845K1332o2805r1807Q3685J12662j4582j5249K9405
6983A176422P8182k8875J02207P3713k2821Q5135J28645L4016n069n5567J57398
6972A723386J01720M057R4431l6645K5981O3303J07921J03484N0653j3320J85392
6961B410363J71010l1828J04401Q2355J99739J44972J09274J46192J04834O6121
6951C507433J49985J19126J00799J30880J69407K10046R2751J61893J57017J91693
6941D991030J86236J43926O8404K45717K26273J92139J87651J92840K39976K16960
$$ plain form
6931 6891152 7203075 7477668 7728392 8082030 8405605 8956505 9359264 9796788 10330102 10956043
6921 10956043 11542301 12066692 12737369 13555495 14540998 15605764 16761292 17954134 19379881
6912 19379881 21145312 23089883 25130970 27423447 29928599 32763987 36080621 39631156
6904 39631156 43493224 47708506 52335171 57142864 61932753 66518655 70238550 72775300
6896 72775300 73783419 73173875 70911097 67053453 62353558 57127945 51822986 46802979
6888 46802979 42208583 38235988 34787807 31695269 29002622 26675116 24578215 22735029
6880 22735029 21058289 19583043 18313006 17163415 16101129 15186305 14303900 13581186 12849784
6871 12849784 12163560 11643517 10944532 10388625 9941198 9455073 9122597 8668670 8417663
$$ packed form
6931F891152L11923K74593K50724L53638L23575N50900M02759M37524N33314O25941
6921A0956043N86258N24391O70677Q18126R85503J064766J155528J192842J425747
6912A9379881J765431J944571K041087K292477K505152K835388L316634L550535
6904C9631156L862068M215282M626665M807693M789889M585902L719895K536750
6896G2775300J008119o09544k262778l857644m699895n225613n304959n020007
6888D6802979m594396l972595l448181l092538k692647k327506k096901j843186
6880B2735029j676740j475246j270037j149591j062286r14824q82405p22714p31402
6871A2849784o86224n20043o98985n55907m47427m86125l32476m53927k51007
$$ plain form
6862 8417663 8099964 7686995 7332800 7076729 6739886 6440837 6132561 5825920 5674525 5512326
6852 5512326 5263389 5022532 4949527 4799220 4750179 4488602 4246038 4033986 3962861 3873533
6842 3873533 3807504 3704913 3706055 3682393 3448993 3318223 3193649 3174740 3035447 2992098 2976866
6831 2976866 2930613 2784017 2724698 2603669 2612338 2568830 2468406 2465805 2300414 2246256 2166402
6820 2166402 2140324 2168372 2146195 2098690 1976968 1854996 1849501 1796694 1798276 1745482 1694380
6809 1694380 1739087 1647090 1532103 1511780 1368922 1305203 1248032 1096665 1163867 1106015 965979
6798 965979 980180 913949 913974 882967 866687 817437 782154 797729 737783 622244 583645 610718
6786 610718 637559 656948 570424 614954 716017 613577 604504 735331 625762 581999 578628
$$ packed form
6862H417663l17699m12969l54195k56071l36843k99049l08276l06641j51395j62199
6852E512326k48937k40857p3005j50307m9041k61577k42564k12052p1125q9328
6842C873533o6029j02591J142k3662k33400j30770j24574j8909j39293m3349j5232
6831B976866m6253j46596n9319j21029Q669m3508j00424k601j65391n4158p9854
6820B166402k6078K8048k2177m7505j21722j21972n495n2807J582n2794n1102
6809A694380M4707r1997j14987k0323j42858o3719n7171j51367O7202n7852j40036
6798I65979J4201o6231K5l1007j6280m9250l5283J5575n9946j15539l8599K7073
6786F10718K6841J9389q6524M4530J01063j02440r073J30827j09569m3763l371
$$ plain form
6775 578628 547568 519871 474371 568745 614745 568404 591560 650208 526602 444615 532618
6764 532618 467452 480762 436814 380015 315372 300383 351461 416600 351103 305347 409022
6753 409022 404083 401092 378948 312577 381820 429240 430105 502243 408834 472608 409414 389418
6741 389418 382231 337183 280517 333953 261575 214582 315123 300288 319686 355691 312415 294150
6729 294150 370553 343070 376654 452540 352147 209536 296542 289557 381152 326970 314720
6718 314720 310610 327372 255685 221986 125916 142807 117797 166186 202408 105513 140939 251217
6706 251217 219987 196811 241300 171137 141226 134659 180962 219188 170592 131860 116361 100538
6694 100538 61234 29132 77989 164009 200495 139497 120099 155684 155119 114695 110706 61872
$$ packed form
6775E78628l1060k7697m5500R4374M6000m6341K3156N8648j23606q1987Q8003
6764E32618o5166J3310m3948n6799o4643j4989N1078O5139o5497m5756J03675
6753D09022m939k991k2144o6371O9243M7420Q65P2138r3409O3774o3194j9996
6741C89418p187m5048n6666N3436p2378m6993J00541j4835J9398L6005m3276j8265
6729B94150P6403k7483L3584P5886j00393j42611Q7006o985R1595n4182j2250
6718C14720m110J6762p1687l3699r6070J6891k5010M8389L6222r6895L5426J10278
6706B51217l1230k3176M4489p0163k9911o567M6303L8226m8596l8732j5499j5823
6694A00538l9304l2102M8857Q6020L6486o0998j9398L5585n65m0424l989m8834
$$ plain form
6682 61872 91578 83698 36258 15180 4257 29243 -14934 4304 51080 131070 98922 48737
6670 48737 -443 -99892 -60579 -80044 -61301 -52018 50037 9475 43783 1874 -39155 18578
6658 18578 -57342 28672 62692 -126617 -172556 -12456 14910 -40016 -61592 -93676 3591
6647 3591 -37276 -67598 -145287 -158011 -167791 -148638 -194072 -97505 -57965 -35290 -13313 -70077
6635 -70077 -6699 -81429 -145646 -119955 -36938 25922 -85339 -98073 -78252 -42000 -62560 -77096
6623 -77096 -104824 -93381 -68790 -49421 43423 -929 -106830 -1805 -23180 -59638 -40551
6612 -40551 -140086 -125170 -22935 39110 43436 -44584 -70136 -74191 -105578 -107186 -99981 -142325
6600 -142325 -146070 -113852 -148542 -80399 31211 39395 -19125 -16939 -136114 -214502 -103380 -2228
$$ packed form
6682F1872K9706p880m7440k1078j0923K4986m4177J9238M6776P9990l2148n0185
6670D8737m9180r9449L9313j9465J8743R283J02055m0562L4308m1909m1029N7733
6658A8578p5920Q6014L4020j89309m5939J60100K7366n4926k1576l2084R7267
6647C591m0867l0322p7689j2724r780J9153m5434R6567L9540K2675K1977n6764
6635g0077O3378p4730o4217K5691Q3017O2860j11261j2734J9821L6252k0560j4536
6623g7096k7728J1443K4591J9369R2844m4352j05901J05025k1375l6458J9087
6612d0551r9535J4916J02235O2045M326q8020k5552m055l1387j608P205m2344
6600a42325l745L2218l4690O8143J11610Q184n8520K186j19175p8388J11122J01152
$$ plain form
6588 -2228 -25585 -7538 -29993 -62095 -118239 -3974 47493 -25866 -48322 -65530 -142422 -101428
6576 -101428 -141267 -86387 -38985 -34484 -111307 -181244 -258321 -231393 -116542 -26203 -32177 -105565
6564 -105565 -168807 -91392 -52653 -5723 -35397 -54615 -116741 -199049 -191508 -236569 -153377 -128302
6552 -128302 -107519 -162699 -173536 -42089 -100108 -169666 -149472 -222466 -90738 3343 48314
6541 48314 60715 -82787 -126451 -34162 -116366 -193108 -123742 -91294 -34130 -16835 -53613 -10965
6529 -10965 51330 29745 38522 -3645 -129561 -160331 -84562 -62886 -56167 -133849 -34051 68636
6517 68636 50863 48121 56529 -28712 -89807 -103900 -104128 -33569 -2869 24830 53309 149790 158902
6504 158902 117992 124256 198014 211029 236589 325907 387199 319954 240578 354030 311939 287888
$$ packed form
6588b228k3357J8047k2455l2102n6144J14265N1467p3359k2456j7208p6892M0994
6576a01428l9839N4880M7402M501p6823o9937p7077K6928J14851R0339n974p3388
6564a05565o3242P7415L8739M6930k9674j9218o2126q2308P541m5061Q3192K5075
6552a28302K0783n5180j0837J31447n8019o9558K0194p2994J31728R4081M4971
6541D8314J2401j43502m3664R2289q2204p6742O9366L2448N7164J7295l6778M2648
6529a0965O2295k1585Q777m2167j25916l0770P5769K1676O719p7682R9798J02687
6517F8636j7773k742Q408q5241o1095j4093k28P0559L0700K7699K8479R6481R112
6504A58902m0910O264P3758J3015K5560Q9318O1292o7245p9376J13452m2091k4051
$$ plain form
6492 287888 341461 386908 312623 311738 252685 137935 91136 16415 52919 73391 44242 129791
6480 129791 116604 122917 164727 126987 132354 26633 6189 -27011 -6577 -71843 -45713 28642
6468 28642 -5748 50640 24157 7525 18176 2667 58103 -29739 76786 7020 -54372 -107466
6456 -107466 -59308 -105924 -29740 49716 97889 136503 90337 59496 -8674 -10770 29747 40063
6444 40063 36523 -14311 -20247 43514 -63096 -13410 -45040 -94525 -47182 -83542 -50496 -25147
6432 -25147 2227 34532 -517 -24663 -43483 -35545 -7794 -109947 -141820 -152749 -168670 -143295
6420 -143295 -205758 -218799 -226101 -144947 -38531 -29356 -97483 -42697 37670 -45455 -30666 7045
6408 7045 -16024 -15131 3150 22509 -6035 24473 24591 -70607 -124334 -78280 -72469 -13184 13413
$$ packed form
6492B87888N3573M5447p4285q85n9053j14750m6799p4721L6504K0472k9149Q5549
6480A29791j3187O313M1810l7740N367j05721k0444l3200K0434o5266K6130P4355
6468B8642l4390N6388k6483j6632J0651j5509N5436q7842J06525o9766o1392n3094
6456a07466M8158m6616P6184P9456M8173L8614m6166l0841o8170k096M0517J0316
6444D0063l540n0834n936O3761j06610M9686l1630m9485M7343l6360L3046K5349
6432b5147K7374L2305l5049k4146j8820P938K7751j02153l1873j0929j5921K5375
6420a43295o2463j3041p302Q1154J06416R175o8127N4786Q0367q3125J4789L7711
6408G045k3069Q93J8281J9359k8544L0508J18r5198n3727M6054N811N9285K6597
$$ plain form
6395 13413 -47211 -77538 56452 -14158 -36571 35816 23420 13008 33687 14781 -3408 100195
6383 100195 65535 14142 -63751 -5814 -37525 -103295 79029 165221 103977 59605 79189
6372 79189 142560 166403 59576 80213 151124 194284 134523 101950 135562 145693 154821 42567
6360 42567 57648 160074 195539 155346 131078 149538 166199 258689 259301 294193 263742 320412
6348 320412 385951 414564 404398 386505 369426 367053 327342 371284 334850 310348 427004 497083
6336 497083 551128 440374 385147 493013 483713 474850 447634 418890 538390 647088 725938
6325 725938 652653 586236 586548 601188 725130 761892 820927 880861 1003150 981687 931153 1006278
6313 1006278 1034108 1059886 1112020 1105867 1047418 1101168 1096600 1081724 1208669 1204846 1140009 1080723
$$ packed form
6395A3413o0624l0327J33990p0610k2413P2387j2396j0412K0679j8906j8189J03603
6383A00195l4660n1393p7893N7937l1711o5770J82324Q6192o1244m4372J9584
6372G9189O3371K3843j06827K0637P0911M3160n9761l2573L3612J0131R128j12254
6360D2567J5081J02426L5465m0193k4268J8460J6661R2490O12L4892l0451N6670
6348C20412O5539K8613j0166j7893j7079k373l9711M3942l6434k4502J16656P0079
6336D97083N4045j10754n5227J07866r300q863k7216k8744J19500J08698P8850
6325G25938p3285o6417L12J4640J23942L6762N9035N9934J22289k1463n0534P5125
6313A006278K7830K5778N2134o153n8449N3750m568j4876J26945l823o4837n9286
$$ plain form
6301 1080723 1025260 1072483 1145219 1211548 1149238 1169071 1171941 1243806 1215141 1274765 1297767 1395133
6289 1395133 1433838 1419686 1387191 1550451 1498617 1455188 1579545 1600983 1569382 1586621 1612032
6278 1612032 1617976 1603077 1549684 1438629 1276594 1326740 1437332 1310627 1159750 1211353 1286814
6267 1286814 1246969 1174906 1188500 1180943 1243913 1238954 1240654 1248084 1239257 1220494 1188512 1203586
6255 1203586 1201064 1239517 1470329 1356259 1261547 1295775 1291759 1248344 1217866 1189566 1111476
6244 1111476 1129484 1143874 986447 946359 949334 916387 920592 921788 921799 780059 884350 809315
6232 809315 632466 733112 792746 773250 763760 718323 766072 725138 651502 635420 652172
6221 652172 716898 777463 786566 580360 564038 514142 575905 613347 573079 596153 643507 639878
$$ packed form
6301A080723n5463M7223P2736O6329o2310J9833K870P1865k8665N9624K3002R7366
6289A395133L8705j4152l2495J63260n1834m3429J24357K1438l1601J7239K5411
6278A612032N944j4899n3393j11055j62035N0146J10592j26705j50877N1603P5461
6267A286814l9845p2063J3594p557O2970m959J700P430q827j8763l1982J5074
6255A203586k522L8453K30812j14070r4712L4228m016m3415l0478k8300p8090
6244A111476J8008J4390j57427m0088K975l2947M205J196J1j41740J04291p5035
6232H09315j76849J00646N9634j9496r490m5437M7749m0934p3636j6082J6752
6221F52172O4726O0565R103k06206j6322m9896O1763L7442m0268K3074M7354l629
$$ plain form
6209 639878 594172 521581 588673 571576 555281 618649 541484 545321 462508 486186 487047 505052
6197 505052 467213 459239 494184 452622 486035 427345 392933 372587 426563 452228 412368 353341
6185 353341 409107 425916 428877 451735 449873 502444 474985 445419 406460 396000 400398 455932
6173 455932 499052 462023 442643 471980 462416 488767 499123 502064 466255 464936 444162 358514
6161 358514 370887 399845 404734 506583 533711 538069 485705 512470 559450 567358 475257 451002
6149 451002 385912 394528 440127 503029 501037 536891 517147 502926 546837 578467 557644 494293
6137 494293 460312 516490 513365 471703 490893 439222 472357 571414 599920 506582 529778 494167
6125 494167 574154 539402 587150 547575 512921 594464 571835 480451 509909 631995 593527
$$ packed form
6209F39878m5706p2591O7092j7097j6295O3368p7165L837q2813K3678Q61J8005
6197E05052l7839p974L4945m1562L3413n8690l4412k0346N3976K5665l9860n9027
6185C53341N5766J6809K961K2858j862N2571k7459k9566l8959j0460M398N5534
6173D55932M3120l7029j9380K9337r564K6351J0356K941l5809j319k0774q5648
6161C58514J2373K8958M889J01849K7128M358n2364K6765M6980P908r2101k4255
6149D51002o5090Q616M5599O2902j992L5854j9744j4221M3911L1630k0823o3351
6137D94293l3981N6178l125m1662J9190n1671L3135R9057K8506r3338K3196l5611
6125D94167P9987l4752M7748l9575l4654Q1543k2629r1384K9458J22086l8468
$$ plain form
6114 593527 575602 556628 528224 639746 710820 667314 580276 637811 636726 596151 567384 590940
6102 590940 556515 508012 578345 603103 576994 596821 528193 544346 639386 628977 638172 713322
6090 713322 711743 663837 595801 518649 602645 645961 713796 631118 566195 645228 622494 515419
6078 515419 622585 701855 767539 711057 678260 714598 580662 596793 661108 726977 787955
6067 787955 794070 803128 871515 925731 944625 899391 798343 845261 927889 937271 1008531 1039144
6055 1039144 1068662 1048905 1049694 1164006 1232081 1298942 1416787 1351048 1435394 1485398 1445123
6044 1445123 1429432 1556065 1650013 1581373 1591874 1544379 1584070 1676988 1718078 1756740 1743291
6033 1743291 1787069 1802542 1851134 1853857 1896335 2009376 2041391 2012782 2021816 2077492 2118926 2249156
$$ packed form
6114E93527j7925j8974k8404J11522P1074m3506q7038N7535j085m0575k8767K3556
6102E90940l4425m8503P0333K4758k6109J9827o8628J6153R5040j0409R195P5150
6090G13322j579m7906o8036p7152Q3996M3316O7835q2678o4923P9033k2734j07075
6078E15419J07166P9270O5684n6482l2797L6338j33936J6131O4315O5869O0978
6067G87955O115R058O8387N4216J8894m5234j01048M6918Q2628R382P1260L0613
6055A039144K9518j9757P89J14312O8075O6861J17845o5739Q4346N0004m0275
6044A445123j5691J26633R3948o8640J0501m7495L9691R2918M1090L8662j3449
6033A743291M3778J5473M8592K723M2478J13041L2015k8609R034N5676M1434J30230
$$ plain form
6021 2249156 2253062 2373818 2479535 2565063 2574325 2526810 2488939 2641492 2692420 2673569 2700750
6010 2700750 2660234 2705551 2722374 2780421 2821269 2781554 2823064 2803411 2727700 2779641 2723195
5999 2723195 2674928 2767648 2722302 2693207 2768640 2765767 2794401 2740097 2706422 2693222 2675235 2729703
5987 2729703 2855674 2838056 2730405 2737847 2748178 2765105 2769699 2746060 2721464 2753929 2706142
5976 2706142 2706862 2719682 2726946 2547120 2545996 2547466 2547371 2431030 2355245 2423406 2437724 2410093 2350047
5963 2350047 2260584 2136441 2066128 1962856 2024238 2012120 2029525 1994897 1958882 1915374 1835031
5952 1835031 1736145 1660755 1633906 1599831 1597870 1596305 1488500 1483027 1511097 1525571 1529330 1478030
5940 1478030 1381493 1307176 1307674 1312501 1263185 1201988 1251901 1138669 1056238 1092793 1184937 1108053
$$ packed form
6021B249156L906J20756J05717Q5528R262m7515l7871J52553N0928j8851K7181
6010B700750m0516M5317J6823N8047M0848l9715M1510j9653p5711N1941n6446
5999B723195m8267R2720m5346k9095P5433k873K8634n4304l3675j3200j7987N4468
5987B729703J25971j7618j07651P442J0331J6927M594k3639k4596L2465m7787
5976B706142P20J2820P264j79826j124J470r5j16341p5785O8161J4318k7631o0046
5963B350047q9463j24143p0313j03272O1382j2118J7405l4628l6015m3508q0343
5952A835031r8886p5390k6849l4075j961j565j07805n473K8070J4474L759n1300
5940A478030r6537p4317M98M827m9316o1197M9913j13232q2431L6555R2144p6884
$$ plain form
5928 1108053 950650 876551 804984 811730 907201 976757 927242 941890 846309 818078 777917
5917 777917 744951 851128 824892 725346 744552 754709 792943 923384 839079 713967 816316
5906 816316 733106 714778 663829 638117 752476 725429 697527 665825 608028 612907 757869
5895 757869 843007 809267 667899 621519 677097 679290 714336 690765 730049 623409 571078
5884 571078 550992 605089 704288 669720 668045 645089 613243 566835 655201 606966 607769 672182
5872 672182 783279 790896 777237 759693 832581 903464 824734 831089 901219 979393 937205 790443
5860 790443 727422 727256 742501 812917 840493 839156 834748 885868 858144 900957 847913 910129
5848 910129 869080 823130 908898 954056 980758 1005847 1058880 1082897 1087673 1117759 1169386 1172813
$$ packed form
5928A108053j57403p4099p1567O746R5471O9556m9515J4648r5581k8231m0161
5917G77917l2966J06177k6236r9546J9206J0157L8234J30441q4305j25112J02349
5906H16316q3210j8328n0949k5712J14359k7047k7902l1702n7797M879J44962
5895G57869Q5138l3740j41368m6380N5578K193L5046k3571L9284j06640n2331
5884E71078k0086N4097R9199l4568j675k2956l1846m6408Q8366m8235Q03O4413
5872F72182J11097P617j3659j7544P2888P0883p8730O355P0130P8174m2188j46762
5860G90443o3021j66J5245P0416K7576j337m408N1120k7724M2813n3044O2216
5848I10129m1049m5950Q5768M5158K6702K5089N3033K4017M776L0086N1627L427
$$ plain form
5836 1172813 1137584 1102167 1101981 1090111 987465 961106 1082607 1184817 1238260 1253075 1289183
5825 1289183 1337098 1373573 1327059 1300947 1271631 1308667 1265775 1336036 1374140 1467646 1547218
5814 1547218 1563604 1631701 1737677 1875245 2016004 1998084 2120142 2295866 2496075 2755158
5804 2755158 3112125 3355506 3711826 4139460 4574374 5054218 5868348 6855674 7852644 8487430
5794 8487430 8300302 7431429 6352498 5318762 4395634 3895191 3420467 3104646 2800377
5785 2800377 2560340 2535875 2497110 2337556 2384124 2278350 2260294 2138242 2085744 2026279 1971209
5774 1971209 1940849 1960330 1907799 1802531 1819325 1803115 1822513 1685919 1691231 1776780 1727004
5763 1727004 1699478 1753091 1834464 1914854 2024048 2055947 2108364 2210676 2320340 2376532 2530468
$$ packed form
5836A172813l5229l5417j86j1870j02646k6359J21501J02210N3443J4815L6108
5825A289183M7915L6475m6514k6112k9316L7036m2892P0261L8104R3506P9572
5814A547218J6386O8097J05976J37568J40759j7920J22058J75724K00209K59083
5804B755158L56967K43381L56320M27634M34914M79844Q14130R87326R96970O34786
5794H487430j87128q68873j078931j033736r23128n00443m74724l15821l04269
5785B800377k40037k4465l8765j59554M6568j05774j8056j22052n2498n9465n5070
5774A971209l0360J9481n2531j05268J6794j6210J9398j36594N312Q5549m9776
5763A727004k7526N3613Q1373Q0390J09194L1899N2417J02312J09664N6192J53936
$$ plain form
5752 2530468 2694684 2750977 2963153 3065174 3236536 3384975 3533017 3620289 3733892 3904288
5742 3904288 4004390 4100587 4017234 3914697 3637032 3567518 3569097 3541232 3492213 3563603 3564811
5731 3564811 3613626 3604839 3456572 3338126 3062348 2956764 2958259 2916191 2956177 2901615 2913804
5720 2913804 3066180 3145563 3212757 3307436 3349938 3462178 3495521 3446609 3512417 3516061 3666431
5709 3666431 3658330 3627000 3622869 3759439 3904483 3941421 3962166 3971047 3939771 3982399 3934877 3976215
5697 3976215 4008617 3866293 3804310 3665751 3585310 3517000 3267005 3160004 3042001 2964278
5687 2964278 2876975 2853109 2792321 2739808 2712673 2815237 2850423 2819954 2856835 2784492 2923803
5676 2923803 3004085 3067857 3026120 2997674 3034330 3013145 3034025 3136573 3119646 3100402 3162866
$$ packed form
5752B530468J64216N6293K12176J02021J71362J48439J48042Q7272J13603J70396
5742C904288J00102R6197q3353j02537k77665o9514J579k7865m9019P1390J208
5731C564811M8815q787j48267j18446k75778j05584J495m2068L9986n4562J2189
5720B913804J52376P9383O7194R4679M2502J12240L3343m8912O5808L644J50370
5709C666431q101l1330m131J36570J45044L6938K0745Q881l1276M2628m7522M1338
5697C976215L2402j42324o1983j38559q0441o8310k49995j07001j18003p7723
5687B964278q7303k3866o0788n2513k7135J02564L5186l0469L6881p2343J39311
5676B923803Q0282O3772m1737k8446L6656k1185K0880J02548j6927j9244O2464
$$ plain form
5665 3162866 3072672 3040705 2940779 2750065 2545428 2365823 2222060 2118869 2064700 1961288
5655 1961288 1811677 1636056 1580911 1590870 1506857 1427981 1332592 1248642 1245528 1224524 1137901
5644 1137901 1147938 1041467 999693 1103860 1013630 1015178 954349 922449 976798 1023556 956657
5633 956657 936396 934474 906392 800727 813062 773568 831129 839484 811693 798436 807793 814414
5621 814414 675305 590835 652045 680997 672783 683639 578908 577918 620623 640955 619748 646589
5609 646589 652890 729363 627145 551090 582845 610953 636492 658546 690146 807118 872893
5598 872893 937224 857208 842179 903375 815580 782041 815289 884014 928192 880590 834045 868917
5586 868917 966389 976339 1009536 1041408 925165 922984 1043255 1102883 1055465 1082870 1094506 1088473
$$ packed form
5665C162866r0194l1967r9926j90714k04637j79605j43763j03191n4169j03412
5655A961288j49611j75621n5145R959q4013p8876r5389q3950l114k1004q6623
5644A137901J0037j06471m1774J04167r0230J548o0829l1900N4349M6758o6899
5633I56657k0261j922k8082j05665J2335l9494N7561Q355k7791j3257R357O621
5621H14414j39109q4470O1210K8952q214J0856j04731r90M2705K0332k1207K6841
5609F46589O301P6473j02218p6055L1755K8108K5539K2054L1600J16972O5775
5598H72893O4331q0016j5029O1196q7795l3539L3248O8725M4178m7602m6545L4872
5586H68917R7472R950L3197L1872j16243k181J20271N9628m7418K7405J1636o033
$$ plain form
5574 1088473 1042168 1166677 1165559 1139948 1202794 1178198 1162626 1201233 1238731 1229641 1298976 1337758
5562 1337758 1273969 1285862 1281171 1332941 1321517 1373263 1358680 1364507 1452915 1568880 1707836
5551 1707836 1726835 1799529 1805741 1932754 1952227 2020104 2074826 2194685 2365809 2406843 2491103
5540 2491103 2739551 2966664 2989702 3272988 3472270 3607845 3700670 3783264 3909962 3970588
5530 3970588 4035560 4077329 4070653 4103506 4172689 4223494 4153844 4184072 4238528 4196250 4302675
5519 4302675 4331322 4336525 4240407 4265314 4357823 4406657 4535607 4718206 4822187 5024398 5252263
5508 5252263 5512477 5910132 6235050 6571736 6946495 7378077 7898650 8408810 8945854 9505123
5498 9505123 10275280 11068384 11932547 13041250 14618657 16359491 17459386 17241734 15763989
$$ packed form
5574A088473m6305J24509j118k5611O2846k4596j5572L8607L7498r090O9335L8782
5562A337758o3789J1893m691N1770j1424N1746j4583N827Q8408J15965J38956
5551A707836J8999P2694O212J27013J9473O7877N4722J19859J71124M1034Q4260
5540B491103K48448K27113K3038K83286J99282J35575R2825Q2594J26698O0626
5530C970588O4972M1769o676L2853O9183N0805o9650L0228N4456m2278J06425
5519D302675K8647N203r6118K4907R2509M8834J28950J82599J03981K02211K27865
5508E252263K60214L97655L24918L36686L74759M31582N20573N10160N37044N59269
5498I505123P70157P93104Q64163J108703J577407J740834J099895k17652j477745
$$ plain form
5489 15763989 13899399 12151540 10770350 9562471 8772411 8265169 7791892 7295064 6839491
5480 6839491 6611742 6344873 6072204 5777256 5545505 5477664 5390140 5258492 5218956 5165545
5470 5165545 5215039 5271428 5412316 5505151 5607086 5704367 5617970 5345697 5050107 4901828
5460 4901828 4887716 4808422 4739467 4658708 4562419 4645736 4558277 4552574 4465193 4446684 4345845
5449 4345845 4246289 4176996 4027428 4063617 4002412 3905664 3810631 3741275 3797842 3765670 3702173
5438 3702173 3652608 3738757 3784678 3801724 3733951 3720809 3713527 3646947 3491265 3398695 3489297
5427 3489297 3452171 3349087 3320668 3280693 3217655 3152804 3050898 3105579 3129335 3280021 3262247
5416 3262247 3409096 3559441 3654030 3773278 3775256 3801084 3720024 3681465 3562940 3580569 3561133
$$ packed form
5489A5763989j864590j747859j381190j207879p90060n07242m73277m96828m55573
5480F839491k27749k66869k72669k94948k31751o7841q7524j31648l9536n3411
5470E165545M9494N6389J40888R2835J01935R7281q6397k72273k95590j48279
5460D901828j4112p9294o8955q0759r6289Q3317q7459n703q7381j8509j00839
5449D345845r9556o9293j49568L6189o1205r6748r5033o9356N6567l2172o3497
5438C702173m9565Q6149M5921J7046o7773j3142p282o6580j55682r2570R0602
5427C489297l7126j03084k8419l9975o3038o4851j01906N4681K3756J50686j7774
5416C262247J46849J50345R4589J19248J978K5828q1060l8559j18525J7629j9436
$$ plain form
5405 3561133 3457782 3384929 3387653 3391937 3419222 3435023 3476022 3498093 3582999 3589829 3779385 3974686
5393 3974686 4122861 4299604 4428012 4720883 5028233 5289566 5585437 5960890 6422670 6881734
5383 6881734 7261040 7532817 7609829 7584072 7368718 7142455 6855458 6732322 6638437 6590067
5373 6590067 6686575 6761216 6926173 7186770 7372948 7634798 7921246 8358630 8846378 9335794
5363 9335794 9950280 10237202 10330011 10119308 9648063 9075334 8314873 7747204 7272632 7038546
5353 7038546 6800547 6696681 6582936 6467854 6402675 6426565 6442016 6378420 6325748 6378669 6439698
5342 6439698 6447408 6657385 6810141 6950952 7130757 7558655 7785714 7981577 8032159 7871512
5332 7871512 7670844 7254126 6898338 6620286 6334013 6113559 5874092 5697607 5580753 5476276
$$ packed form
5405C561133j03351p2853K724M284K7285J5801M0999K2071Q4906O830J89556J95301
5393C974686J48175J76743J28408K92871L07350K61333K95871L75453M61780M59064
5383F881734L79306K71777P7012k5757k15354k26263k86997j23136r3885m8370
5373F590067R6508P4641J64957K60597J86178K61850K86448M37384M87748M89416
5363I335794O14486K86922R2809k10703m71245n72729p60461n67669m74572k34086
5353G038546k37999j03866j13745j15082o5179K3890J5451o3596n2672N2921O1029
5342F439698P710K09977J52756J40811J79805M27898K27059J95863N0582j60647
5332G871512k00668m16718l55788k78052k86273k20454k39467j76485j16854j04477
$$ plain form
5322 5476276 5407782 5341728 5164836 5232228 5300070 5339188 5468437 5570220 5643955 5675011 5777231
5311 5777231 5828576 5859940 5852446 5744774 5656781 5686217 5591833 5612039 5731204 5909197 5985772
5300 5985772 6014596 5984276 6000828 6126528 6252184 6360088 6416607 6557280 6626736 6727581
5290 6727581 6766819 6831412 6898348 6951769 7058544 7047191 7077209 7122875 7075930 7061643 6963539
5279 6963539 6877863 6791401 6799509 6813145 6830044 6870859 6969161 7079618 7168113 7154946 7268723
5268 7268723 7500538 7540143 7681211 7873033 7932550 8058031 8324070 8589271 8876790 8980425
5258 8980425 9209240 9579199 9868719 10177845 10469019 10832436 11246384 11676590 12166245 12556471
5248 12556471 12848004 13138585 13440778 13850515 14277237 14790841 15295259 15816328 16276940
$$ packed form
5322E476276o8494o6054j76892O7392O7842L9118J29249J01783P3735L1056J02220
5311E777231N1345L1364p494j07672q7993K9436r4384K0206J19165J77993P6575
5300E985772K8824l0320J6552J25700J25656J07904N6519J40673O9456J00845
5290F727581L9238O4593O6936N3421J06775j1353L0018M5666m6945j4287r8104
5279F963539q5676q6462Q108J3636J6899M0815R8302J10457Q8495j3167J13777
5268G268723K31815L9605J41068J91822N9517J25481K66039K65201K87519J03635
5258H980425K28815L69959K89520L09126K91174L63417M13948M30206M89655L90226
5248A2556471K91533K90581L02193M09737M26722N13604N04418N21069M60612
$$ plain form
5239 16276940 16735644 17207800 17729284 18281631 18823560 19305527 19779249 20342781 20894586
5230 20894586 21493415 22009967 22709287 23430519 24309965 25165277 26141412 27241230 28436603
5221 28436603 29706178 31047323 32487446 33946427 35503925 37139892 39121707 41252222
5213 41252222 43667660 46399027 49536480 52996547 56951457 61460253 66553463 72339027
5205 72339027 78764100 86145707 94497096 103999927 114795699 126824954 140433097 155735870
5197 155735870 172724544 191117199 210278069 229466620 247514866 262609557 272483147
5190 272483147 276195652 273951736 265767103 251561343 232956849 212176297 190919983
5183 190919983 170511158 151887673 135752338 121934006 110325429 100364980 91684000
$$ packed form
5239A6276940M58704M72156N21484N52347N41929M81967M73722N63532N51805
5230B0894586N98829N16552O99320P21232Q79446Q55312R76135J099818J195373
5221B8436603J269575J341145J440123J458981J557498J635967J981815K130515
5213D1252222K415438K731367L137453L460067L954910M508796N093210N785564
5205G2339027O425073P381607Q351389R502831J0795772J2029255J3608143J5302773
5197A55735870J6988674J8392655J9160870J9188551J8048246J5094691R873590
5190B72483147L712505k243916q184633j4205760j8604494k0780552k1256314
5183A90919983k0408825j8623485j6135335j3818332j1608577r960449q680980
$$ plain form
5176 91684000 84121049 77403764 71582539 66286950 61821655 57833943 54195344 51002425
5168 51002425 48140462 45510057 43068641 40768779 38687449 36769037 35003435 33486499
5160 33486499 32043176 30793146 29552738 28483570 27428001 26347851 25370472 24366282
5152 24366282 23423356 22607071 21661901 20765222 19970933 19149057 18389199 17672620 17086636
5143 17086636 16565789 16166053 15711179 15278752 14813021 14394654 14104441 13709032 13341572
5134 13341572 13137149 12944816 12668281 12480216 12253213 12016755 11760348 11530509 11315172
5125 11315172 11026085 10820694 10618549 10369889 10105488 9948135 9711835 9414397 9196062
5116 9196062 8943596 8737522 8566642 8380489 8185731 7991789 7776877 7628324 7441717 7290766
$$ packed form
5176I1684000p562951o717285n821225n295589m465295l987712l638599l192919
5168E1002425k861963k630405k441416k299862k081330j918412j765602j516936
5160C3486499j443323j250030j240408j069168j055569j080150r77379j004190
5152B4366282r42926q16285r45170q96679p94289q21876p59858p16579n85984
5143A7086636n20847l99736m54874m32427m65731m18367k90213l95409l67460
5134A3341572k04423j92333k76535j88065k27003k36458k56407k29839k15337
5125A1315172k89087k05391k02145k48660k64401j57353k36300k97438k18335
5116I196062k52466k06074j70880j86153j94758j93942k14912j48553j86607j50951
$$ plain form
5106 7290766 7095272 6885759 6843679 6751874 6533585 6292350 6028319 5841723 5566425 5292699
5096 5292699 5055714 4746237 4519760 4477845 4309778 4114775 4039539 3959807 3938979 3855739
5086 3855739 3818516 3627212 3547241 3656525 3566518 3500843 3578245 3566196 3468144 3523605 3558037
5075 3558037 3609072 3637658 3640500 3595006 3582684 3502013 3417639 3527634 3578570 3588556 3600838 3513329
5063 3513329 3473999 3403361 3374065 3387548 3300389 3277383 3257269 3115246 3132991 3131974 3117929
5052 3117929 3024574 3001433 2997253 2974923 3059821 3164605 3115225 2964159 2948513 3117246 3071985
5041 3071985 2934470 2859074 2857079 2990495 2913918 2917081 2828729 2855621 2851641 2836178 2881365 2993987
5029 2993987 3030416 3067548 3075373 3022022 3067409 3158458 3157576 3140577 3090191 3119844 3043591 2930000
$$ packed form
5106G290766j95494k09513m2080r1805k18289k41235k64031j86596k75298k73726
5096E292699k36985l09477k26477m1915j68067j95003p5236p9732k0828q3240
5086C855739l7223j91304p9971J09284r0007o5675P7402j2049r8052N5461L4432
5075C558037N1035K8586K842m5494j2322q0671q4374J09995N0936R986J2282q7509
5063C513329l9330p0638k9296J3483q7159k3006k0114j42023J7745j017j4045
5052C117929r3355k3141m180k2330Q4898J04784m9380j51066j5646J68733m5261
5041C071985j37515p5396j995J33416p6577L163q8352K6892l980j5463M5187J12622
5029B993987L6429L7132P825n3351M5387R1049q82j6999n0386K9653p6253j13591
$$ plain form
5017 2930000 3009107 3032003 2930557 2879265 2905755 2756898 2654812 2626735 2686960 2666236 2639417
5006 2639417 2500033 2507915 2540062 2468454 2578395 2561808 2587789 2629284 2641035 2662237 2651223
4995 2651223 2691807 2703353 2643981 2680095 2654956 2696080 2665645 2750766 2776497 2828166 2817229
4984 2817229 2804349 2805720 2804336 2765629 2633303 2587215 2608454 2613264 2593577 2628406 2612464 2670742
4972 2670742 2756732 2745261 2629507 2620834 2605438 2633089 2675289 2800380 2889721 2822818 2715842
4961 2715842 2770966 2875595 2939608 2949478 2957239 3019853 3046291 3165623 3284252 3331029 3455289
4950 3455289 3587463 3716642 3759864 3871592 3889923 3896052 3799420 3757825 3773783 3830315 3882168
4939 3882168 3843462 3879482 3911706 3891348 3827424 3830056 3645689 3579784 3485447 3296832 3166602
$$ packed form
5017B930000P9107K2896j01446n1292K6490j48857j02086k8077O0225k0724k6819
5006B639417j39384P882L2147p1608J09941j6587K5981M1495J1751K1202j1014
4995B651223M0584J1546n9372L6114k5139M1124l0435Q5121K5731N1669j0937
4984B817229j2880J371j384l8707j32326m6088K1239M810j9687L4829j5942N8278
4972B670742Q5990j1471j15754q673j5396K7651M2200J25091Q9341o6903j06976
4961B715842N5124J04629O4013R870P761O2614K6438J19332J18629M6777J24260
4950C455289J32174J29179M3222J11728J8331O129r6632m1595J5958N6532N1853
4939C882168l8706L6020L2224k0358o3924K632j84367o5905r4337j88615j30230
$$ plain form
4928 3166602 3194711 3032836 3000073 3048259 2945938 2847513 2863139 2792919 2793358 2758925 2756854 2727145
4916 2727145 2671200 2714184 2667097 2764179 2783946 2847932 2934066 2995737 3053712 3062493 3143652 3261027
4904 3261027 3295083 3432587 3456456 3560367 3769738 4026934 4307571 4499040 4795197 5012155
4894 5012155 5305863 5568013 5849334 6032637 6070977 6139927 6067130 6112284 6116599 6018026 5900959
4883 5900959 5889613 5805723 5673932 5452543 5279163 5020066 4705054 4356793 4193953 4002319
4873 4002319 3724889 3431819 3262448 3073926 2946404 2898996 2717588 2629149 2562518 2541020
4863 2541020 2446725 2300318 2291113 2272284 2154158 2209156 2133620 2039005 2069718 2051727 1939960
4852 1939960 1866543 1862710 1817605 1870942 1885721 1927292 1886938 1867874 1826745 1900525 1813869 1767572
$$ packed form
4928C166602K8109j61875l2763M8186j02321r8425J5626p0220M39l4433k071k9709
4916B727145n5945M2984m7087R7082J9767O3986Q6134O1671N7975Q781Q1159J17375
4904C261027L4056J37504K3869J03911K09371K57196K80637J91469K96157K16958
4894E012155K93708K62150K81321J83303L8340O8950p2797M5154M315r8573j17067
4883E900959j1346q3890j31791k21389j73380k59097l15012l48261j62840j91634
4873D002319k77430k93070j69371j88522j27522m7408j81408q8439o6631k1498
4863B541020r4295j46407r205j8829j18126N4998p5536r4615L0713j7991j11767
4852A939960p3417l833m5105N3337J4779M1571m0354j9064m1129P3780q6656m6297
$$ plain form
4840 1767572 1828066 1855075 1756614 1679813 1761754 1733836 1767674 1659464 1693739 1782238 1823266
4829 1823266 1789316 1657312 1688519 1713171 1617326 1645232 1579637 1615526 1597239 1564488 1611607
4818 1611607 1587436 1540822 1480117 1517540 1545674 1567101 1603224 1677551 1729753 1693513 1704045
4807 1704045 1647547 1700793 1758902 1771041 1741601 1706581 1633069 1695017 1650265 1720782 1794399
4796 1794399 1806318 1832528 1825779 1773290 1762705 1785261 1802507 1843526 1790623 1833108 1889749 1838420
4784 1838420 1835661 1832418 1797489 1891438 1884952 2052838 2108278 2074698 2130880 2203732 2181502 2256906
4772 2256906 2402047 2417998 2466521 2621246 2758074 2761906 2873589 3047687 3092610 3217998
4762 3217998 3341376 3514857 3678628 3708047 3858600 3865441 3870639 3840197 3610404 3395143 3306802
$$ packed form
4840A767572O0494K7009r8461p6801Q1941k7918L3838j08210L4275Q8499M1028
4829A823266l3950j32004L1207K4652r5845K7906o5595L5889j8287l2751M7119
4818A611607k4171m6614o0705L7423K8134K1427L6123P4327N2202l6240J0532
4807A704045n6498N3246N8109J2139k9440l5020p3512O1948m4752P0517P3617
4796A794399J1919K6210o749n2489j0585K2556J7246M1019n2903M2485N6641n1329
4784A838420k759l243l4929R3949o486J67886N5440l3580N6182P2852k2230P5404
4772B256906J45141J5951M8523J54725J36828L832J11683J74098M4923J25388
4762C217998J23378J73481J63771K9419J50553O841N198l0442k29793k15261q8341
$$ plain form
4751 3306802 3188780 3060484 2961347 2972167 2748167 2547924 2634978 2629522 2550909 2549038 2455643
4740 2455643 2356840 2361538 2322615 2377626 2345027 2377596 2440778 2419136 2423159 2484069 2523677 2636194
4728 2636194 2662698 2646279 2772148 2783196 2806560 2964085 3157078 3404726 3609576 3625145
4718 3625145 3843446 3832719 3910736 4034629 3942188 3868915 3788596 3705138 3646338 3597550 3470239
4707 3470239 3426199 3429037 3558724 3544227 3544580 3552687 3308505 3154267 2993487 2787074 2631157
4696 2631157 2490437 2382405 2304028 2190291 2164600 2142460 2016212 2037111 1958653 2010239 2017747
4685 2017747 1965627 1836604 1774965 1850395 1920370 1865229 1804579 1737952 1818768 1938192 1897403
4674 1897403 1908166 1999559 2002900 1976930 2028569 2016008 2001143 2078493 2328736 2282462 2326354
$$ packed form
4751C306802j18022j28296r9137J0820k24000k00243Q7054n456p8613j871r3395
4740B455643r8803M698l8923N5011l2599L2569O3182k1642M023O0910L9608J12517
4728B636194K6504j6419J25869J1048K3364J57525J92993K47648K04850J5569
4718C625145K18301j0727P8017J23893r2441p3273q0319q3458n8800m8788j27311
4707C470239m4040K838J29687j4497L53Q107k44182j54238j60780k06413j55917
4696B631157j40720j08032p8377j13737k5691k2140j26248K0899p8458N1586P508
4685B017747n2120j29023o1639P5430O9975n5141o0650o6627Q0816J19424m0789
4674A897403J0763R1393L341k5970N1639j2561j4865P7350K50243m6274M3892
$$ plain form
4663 2326354 2480581 2465397 2496133 2457385 2447322 2395717 2292339 2104327 1986481 1918076 1743312
4652 1743312 1668581 1647674 1593505 1488109 1433086 1351949 1250109 1281188 1121155 1135531 1229709
4641 1229709 1246045 1194306 1193627 1056556 1024129 1024758 1010102 989760 958086 937863 897439 945107
4629 945107 909378 989312 916792 985349 1009941 870922 866887 876322 910639 857125 872971 890068
4617 890068 810184 932608 942296 855507 737285 752770 847526 929090 911059 864428 803847
4606 803847 736441 906284 945243 950963 888197 986570 995017 1023771 965307 992358 948490 856391
4594 856391 1023861 990293 926062 906395 959783 936738 1025255 1030901 945837 935724 904468 809951
4582 809951 822407 833020 736991 714463 786938 764443 701413 653781 708195 770915 701586 731993
$$ packed form
4663B326354J54227j5184L0736l8748j0063n1605j03378j88012j17846o8405j74764
4652A743312p4731k0907n4169j05396n5023q1137j01840L1079j60033J4376R4178
4641A229709J6336n1739o79j37071l2427O29j4656k0342l1674k0223m0424M7668
4629I45107l5729P9934p2520O8557K4592j39019m035R435L4317n3514J5846J7097
4617H90068p9884J22424R688q6789j18222J5485R4756Q1564j8031m6631o0581
4606H03847o7406J69843L8959N720o2766R8373Q447K8754n8464K7051m3868r2099
4594H56391J67470l3568o4231j9667N3388k3045Q8517N646q5064j0113l1256r4517
4582H09951J2456J0613r6029k2528P2475k2495o3030m7632N4414O2720o9329L0407
$$ plain form
4570 731993 777594 721042 664437 710910 695619 689081 743505 733522 661493 558605 505330 579987
4558 579987 635460 551176 576919 528082 515760 459610 384475 433606 511724 491413 548279 548117
4546 548117 564350 563603 640224 655596 682856 655775 752730 712371 615591 617610 684340 717582
4534 717582 748164 728757 716974 720475 712747 719342 872495 973428 895444 900854 893644 899003
4522 899003 840924 738248 680027 705973 721452 746733 696327 618175 701838 741202 672162
4511 672162 684664 683577 739039 726560 734887 696383 713898 713842 737096 841967 831035 815609
4499 815609 744665 828784 795102 789971 792977 754878 766758 739244 660867 719943 750492 686241
4487 686241 743950 618522 499659 533927 616327 556800 586404 547978 675406 659236 685410
$$ packed form
4570G31993M5601n6552n6605M6473j5291o538N4424r983p2029j02888n3275P4657
4558E79987N5473q4284K5743m8837j2322n6150p5135M9131P8118k0311N6866j62
4546E48117J6233p47P6621J5372K7260k7081R6955m0359r6780K019O6730L3242
4534G17582L0582j9407j1783L501p728O595J53153J00933p7984N410p210N359
4522H99003n8079j02676n8221K5946J5479K5281n0406p8152Q3663L9364o9040
4511F72162J2502j087N5462j2479Q327l8504J7515n6K3254J04871j0932j5426
4499H15609p0944Q4119l3682n131L006l8099J1880k7514p8377N9076L0549o4251
4487F86241N7709j25428j18863L4268Q2400n9527K9604l8426J27428j6170K6174
$$ plain form
4476 685410 600991 682022 747381 814729 877484 845821 810755 779571 691450 721564 747886 749200
4464 749200 781494 839108 860675 879947 857450 786259 711355 740534 753059 767204 817388 802163
4452 802163 828872 867958 871279 914780 941339 935304 1034233 1224508 1218304 1066775 1057347 1043287
4440 1043287 1153382 1261543 1264124 1263632 1243205 1296865 1348791 1341512 1385576 1480211 1318463 1366172
4428 1366172 1500673 1523691 1648202 1648819 1734416 1854607 1964422 2031840 2198486 2195009 2332958
4417 2332958 2511690 2723900 2762274 2642254 2585372 2586367 2662181 2734729 2827350 3041837 3170388
4406 3170388 3257852 3412409 3627287 3898169 4078598 4278292 4592211 4815158 4908509 4890410
4396 4890410 5064265 5367423 5698896 6094965 6435222 6623605 6572690 6505633 6613156 6869630
$$ packed form
4476F85410q4419Q1031O5359O7348O2755l1663l5066l1184q8121L0114K6322J314
4464G49200L2294N7614K1567J9272k2497p1191p4904K9179J2525J4145N0184j5225
4452H02163K6709L9086L321M3501K6559o035R8929J90275o204j51529r428j4060
4440A043287J10095J08161K581m92k0427N3660N1926p279M4064R4635j61748M7709
4428A366172J34501K3018J24511O17Q5597J20191J09815O7418J66646l477J37949
4417B332958J78732K12210L8374j20020n6882R95P5814P2548R2621K14487J28551
4406C170388Q7464J54557K14878K70882J80429J99694L13919K22947R3351j8099
4396D890410J73855L03158L31473L96069L40257J88383n0915o7057J07523K56474
$$ plain form
4386 6869630 7141163 7394048 7508852 7515081 7415509 7109472 6800983 6655288 6560921 6519836
4376 6519836 6580865 6515776 6263595 6001113 5769139 5545780 5378439 5306893 5313018 5294978 5145331
4365 5145331 4925485 4836165 4800242 4822590 4680215 4521038 4365780 4305674 4293903 4163988
4355 4163988 3992819 3851815 3788957 3664701 3572508 3402216 3333666 3282157 3240558 3284298 3200650
4344 3200650 3208066 3163166 3153493 3199550 3179445 3036200 3105125 3174083 3214005 3303945 3362643 3430090
4332 3430090 3589578 3758963 3843313 3907180 4076991 4167803 4316754 4503374 4659012 4745811
4322 4745811 4653738 4576874 4450533 4236923 4010738 3789285 3556667 3421600 3383335 3253579
4312 3253579 3015417 2903939 2842554 2781093 2730565 2758941 2753603 2676201 2669305 2651915 2590269
$$ packed form
4386F869630K71533K52885J14804O229r9572l06037l08489j45695r4367m1085
4376F519836O1029o5089k52181k62482k31974k23359j67341p1546O125j8040j49647
4365E145331k19846q9320l5923K2348j42375j59177j55258o0106j1771j29915
4355D163988j71169j41004o2858j24256r2193j70292o8550n1509m1599M3740q3648
4344C200650P416m4900r673M6057k0105j43245O8925O8958L9922Q9940N8698O7447
4332C430090J59488J69385Q4350O3867J69811R0812J48951J86620J55638Q6799
4322D745811r2073p6864j26341k13610k26185k21453k32618j35067l8265j29756
4312C253579k38162j11478o1385o1461n0528K8376n338p7402o896j7390o1646
$$ plain form
4301 2590269 2580019 2504104 2466670 2545624 2484155 2466268 2516075 2507955 2509171 2570055 2691566 2697465
4289 2697465 2796210 2598813 2626670 2705805 2647556 2561064 2591141 2483278 2389593 2363362 2382195
4278 2382195 2453938 2511438 2563115 2571467 2572218 2522488 2623964 2676927 2566132 2479613 2417597 2484073
4266 2484073 2346241 2273384 2314882 2281770 2289591 2279969 2253669 2277095 2334470 2423330 2402825 2340796
4254 2340796 2454733 2493547 2506107 2562485 2616229 2640083 2651732 2581183 2448501 2390051 2346016
4243 2346016 2310560 2270362 2334179 2361690 2335536 2348087 2394386 2545498 2559267 2644940 2818073
4232 2818073 2851609 2990007 3112931 3166631 3176173 3233529 3239430 3305084 3451013 3454953 3557916
4221 3557916 3574075 3600028 3657986 3797309 3930977 4085721 4171161 4230093 4254748 4223869 4308969
$$ packed form
4301B590269j0250p5915l7434P8954o1469j7887M9807q120J216O0884J21511N899
4289B697465R8745j97397K7857P9135n8249q6492L0077j07863r3685k6231J8833
4278B382195P1743N7500N1677Q352P51m9730J01476N2963j10795q6519o2016O6476
4266B484073j37832p2857M1498l3112P821r622k6300K3426N7375Q8860k0505o2029
4254B340796J13937L8814J2560N6378N3744K3854J1649p0549j32682n8450m4035
4243B346016l5456m0198O3817K7511k6154J2551M6299J51112J3769Q5673J73133
4232B818073L3536J38398J22924N3700R542N7356N901O5654J45929L940J02963
4221C557916J6159K5953N7958J39323J33668J54744Q5440N8932K4655l0879Q5100
$$ plain form
4210 4308969 4255912 4246364 4225297 4181315 4256079 4295175 4341391 4195355 4298883 4364328 4514851
4199 4514851 4546817 4594111 4815150 5035487 5187775 5431219 5612975 5778959 6042679 6191815
4189 6191815 6310233 6468330 6549456 6668539 6806546 7035713 7227068 7443134 7699934 8014942
4179 8014942 8276027 8412569 8719693 8983443 9278855 9667365 9853137 9932278 10189872 10493403
4169 10493403 10857894 10947030 10930165 10842480 10665583 10502503 10452203 10417342 10285913 10297044
4159 10297044 10509443 10650807 10783020 10866204 11036280 11259640 11452792 11609189 11823602 12054418
4149 12054418 12310580 12536702 12796568 13157932 13474076 13826790 14205541 14716519 15150015
4140 15150015 15518527 15937899 16264738 16653182 17215399 17754075 18285823 18823672 19356621
$$ packed form
4210D308969n3057r548k1067m3982P4764L9096M6216j46036J03528O5445J50523
4199D514851L1966M7294K21039K20337J52288K43444J81756J65984K63720J49136
4189F191815J18418J58097Q1126J19083J38007K29167J91355K16066K56800L15008
4179H014942K61085J36542L07124K63750K95412L88510J85772P9141K57594L03531
4169A0493403L64491Q9136j6865q7685j76897j63080n0300l4861j31429J1131
4159A0297044K12399J41364J32213Q3184J70076K23360J93152J56397K14413K30816
4149A2054418K56162K26122K59866L61364L16144L52714L78751N10978M33496
4140A5150015L68512M19372L26839L88444N62217N38676N31748N37849N32949
$$ plain form
4131 19356621 19887233 20480913 21109977 21714619 22265197 22615192 22817424 23025440 23318611
4122 23318611 23588697 23943933 24526280 25127616 25686382 26365063 26970057 27584327 28225563
4113 28225563 28861456 29446122 29995664 30713512 31544268 32370281 33299885 34167571 35212700
4104 35212700 36430841 37694311 39111580 40627394 42183324 43793702 45461625 47375608
4096 47375608 49437931 51623755 53997536 56728255 59577815 62687895 66129048 69887373
4088 69887373 74094345 78636901 83738412 89385486 95639430 102641287 110406303 119065560
4080 119065560 128795180 139640488 151849509 165152854 179914777 196013704 213290035
4073 213290035 231673742 250023443 266861411 280139281 287488885 287995755 281798350 270469435
$$ packed form
4131A9356621N30612N93680O29064O04642N50578L49995K02232K08016K93171
4122B3318611K70086L55236N82347O01336N58766O78681O04994O14270O41236
4113B8225563O35893N84666N49542P17848Q30756Q26013R29604Q67686J045129
4104C5212700J218141J263470J417269J515814J555930J610378J667923J913983
4096D7375608K062323K185824K373781K730719K849560L110080L441153L758325
4088F9887373M206972M542556N101511N647074O253944P001857P765016Q659257
4080A19065560R729620J0845308J2209021J3303345J4761923J6098927J7276331
4073B13290035J8383707J8349701J6837968J3277870P349604N06870o197405j1328915
$$ plain form
4065 270469435 255970071 240634380 226205484 213486534 202700358 193752799 186559830
4058 186559830 180795754 176217494 172766151 170523468 169366442 169100916 169874386 171862650
4050 171862650 174729862 178644387 183719896 189816375 197246392 206143442 216659235 229030089
4042 229030089 243602841 260419213 279442714 301120941 325791674 353159256 382622663
4035 382622663 412296446 439296887 461195567 475206662 477872632 466642072 442870402
4028 442870402 410549375 373214125 334078613 296490924 262706955 233798626 209503115
4021 209503115 189287913 172333832 157875584 145498817 134887377 125653200 117575010
4014 117575010 110475910 104160011 98473281 93242053 88470634 84059844 79913292 76048377
$$ packed form
4065B70469435j4499364j5335691j4428896j2718950j0786176q947559p192969
4058A86559830n764076m578260l451343k242683j157026k65526P73470J988264
4050A71862650K867212L914525N075509O096479P430017Q897050J0515793J2370854
4042B29030089J4572752J6816372J9023501K1678227K4670733K7367582K9463407
4035C82622663K9673783K7000441K1898680J4011095K665970j1230560k3771670
4028D42870402l2321027l7335250l9135512l7587689l3783969k8908329k4295511
4021B09503115k0215202j6954081j4458248j2376767j0611440r234177q078190
4014A17575010p099100o315899n686730n231228m771419m410790m146552l864915
$$ plain form
4006 76048377 72521221 69354022 66440677 63661687 61058844 58700565 56499413 54388486
3998 54388486 52351424 50545584 48785232 46981873 45226486 43581564 41970036 40217880
3990 40217880 38623645 37152999 35835423 34582626 33489026 32512839 31542861 30693308 29822968
3981 29822968 29004305 28232872 27525294 26826299 26122627 25425378 24792053 24145110 23541035
3972 23541035 22988395 22405035 21886105 21500890 21279494 21029326 20719436 20359335 20070259
3963 20070259 19745588 19341935 18925947 18608753 18331845 18015545 17667261 17338100 17177874
3954 17177874 16939061 16583948 16288088 16038722 15864499 15654185 15438918 15158738 14961292
3945 14961292 14747997 14484146 14212160 13869821 13727640 13516478 13145728 12717998 12392717
$$ packed form
4006G6048377l527156l167199k913345k778990k602843k358279k201152k110927
3998E4388486k037062j805840j760352j803359j755387j644922j611528j752156
3990D0217880j594235j470646j317576j252797j093600r76187r69978q49553q70340
3981B9822968q18663p71433p07578o98995p03672o97249o33325o46943o04075
3972B3541035n52640n83360n18930l85215k21396k50168l09890l60101k89076
3963B0070259l24671m03653m15988l17194k76908l16300l48284l29161j60226
3954A7177874k38813l55113k95860k49366j74223k10314k15267k80180j97446
3945A4961292k13295k63851k71986l42339j42181k11162l70750m27730l25281
$$ plain form
3936 12392717 12124736 11792224 11564706 11425558 11273104 11149030 10987732 10964457 11054625 11138068
3926 11138068 11174616 11188399 11153954 11124533 11232715 11383651 11390036 11475486 11675742 11772049 11932001
3915 11932001 12090162 12132193 12182243 12205570 12152776 12337299 12469377 12551145 12538532 12680131
3905 12680131 12803293 12679992 12811081 12878370 12896250 12926196 12892139 12849580 12858569 12831095 12805480
3894 12805480 12722481 12711091 12771249 12831680 12911146 12983821 13045148 13043130 13097572 13234793 13388369
3883 13388369 13613522 13808020 13942548 14075843 14259929 14458702 14599531 14932610 15277986
3874 15277986 15611397 15999535 16376524 16939173 17555562 18022595 18524844 19192325 19973403
3865 19973403 20592470 21287958 21991568 22759384 23535448 24380622 25253504 26041427 26727493
$$ packed form
3936A2392717k67981l32512k27518j39148j52454j24074j61298k3275R0168Q3443
3926A1138068L6548J3783l4445k9421J08182J50936O385Q5450K00256R6307J59952
3915A1932001J58161M2031N0050K3327n2794J84523J32078Q1768j2613J41599
3905A2680131J23162j23301J31089O7289J7880K9946l4057m2559Q989k7474k5615
3894A2805480q2999j1390O0158O0431P9466P2675O1327k018N4442J37221J53576
3883A3388369K25153J94498J34528J33295J84086J98773J40829L33079L45376
3874A5277986L33411L88138L76989N62649O16389M67033N02249O67481P81078
3865A9973403O19067O95488P03610P67816P76064Q45174Q72882P87923O86066
$$ plain form
3856 26727493 27420699 28150413 28881479 29468611 29909033 30364245 30730619 30984032 31094761
3847 31094761 31208263 31232090 31139382 30928144 30620539 30145209 29668768 29270491 28665892 27897714
3837 27897714 27234455 26436111 25542608 24786436 23917450 23039081 22209317 21267948 20459014
3828 20459014 19622443 18767998 18062412 17216453 16472492 15766586 15195945 14650334 13961400
3819 13961400 13476969 12979844 12593613 12244371 11838018 11469378 11140022 10893426 10697603
3810 10697603 10586872 10401463 10297352 10182915 10041401 9893516 9743701 9680508 9529908 9489206
3800 9489206 9353588 9269941 9202541 9157339 9120183 8999582 8947321 8949210 8843996 8704375 8619407
3789 8619407 8548944 8535457 8492348 8495611 8360455 8323196 8415479 8394224 8379221 8299046 8295231 8380712
$$ packed form
3856B6727493O93206P29714P31066N87132M40422M55212L66374K53413J10729
3847C1094761J13502K3827r2708k11238l07605m75330m76441l98277o04599p68178
3837B7897714o63259p98344q93503p56172q68986q78369q29764r41369q08934
3828B0459014q36571q54445p05586q45959p43961p05906n70641n45611o88934
3819A3961400m84431m97125l86231l49242m06353l68640l29356k46596j95823
3810A0697603j10731j85409j04111j14437j41514j47885j49815o3193j50600m0702
3800I489206j35618q3647o7400m5202l7156j20601n2261J889j05214j39621q4968
3789H619407p0463j3487m3109L263j35156l7259R2283k1255j5003q0175l815Q5481
$$ plain form
3777 8380712 8231110 8074651 7964379 7843873 7722268 7624353 7449129 7299470 7299549 7233601 7095759
3766 7095759 6993203 6927566 6724576 6710543 6631106 6631197 6685072 6699720 6766042 6739765 6806519 6802048
3754 6802048 6867444 6911450 6998331 7121953 7222101 7296624 7278745 7426419 7619049 7750890
3744 7750890 7834333 7931841 8046809 8392500 8594334 8699868 8872276 8901478 8881069 8827480
3734 8827480 8720635 8498441 8338395 8417684 8380749 8250357 8293123 8270980 8228565 8305948 8551260
3723 8551260 8676900 8856060 9033848 9187087 9543497 9900289 10355884 10725897 11228692 11691872
3713 11691872 12208785 12801809 13548614 14358016 15139534 15993752 16818561 17775753 18694194
3704 18694194 19548545 20326844 21027667 21490631 21932621 22205724 22404816 22403692 22406453 22416934
$$ packed form
3777H380712j49602j56459j10272j20506j21605r7915j75224j49659P9o5948j37842
3766G095759j02556o5637k02990j4033p9437R1N3875J4648O6322k6277O6754m471
3754F802048O5396M4006Q6881J23622J00148P4523j7879J47674J92630J31841
3744G750890Q3443R7508J14968L45691K01834J05534J72408K9202k0409n3589
3734H827480j06845k22194j60046P9289l6935j30392M2766k2143m2415P7383K45312
3723H551260J25640J79160J77788J53239L56410L56792M55595L70013N02795M63180
3713A1691872N16913N93024P46805Q09402P81518Q54218Q24809R57192R18441
3704A8694194Q54351P78299P00823M62964M41990K73103J99092j124K761J0481
$$ plain form
3694 22416934 22314927 22340705 22286653 22187577 22000059 21895015 21761475 21418674 21069587 20601999
3684 20601999 20019592 19200789 18365076 17509627 16808527 16130993 15447220 14968687 14470727
3675 14470727 14108143 13728067 13460853 13270415 13049995 12848641 12710565 12672342 12630634 12593379
3665 12593379 12576467 12659941 12606073 12595273 12726990 12706088 12709836 12754281 12835642 12875311 12821612
3654 12821612 12920870 12976959 13008628 12936365 12987779 12968897 13019610 13068586 13102189 13054355 13157779
3643 13157779 13267877 13273316 13359175 13443123 13522384 13634503 13867088 14052245 14111506 14120580 14393574
3632 14393574 14671720 14948772 15230239 15666346 16068817 16592929 17103705 17587210 18137983
3623 18137983 18762427 19527989 20305462 20965146 21818600 22708391 23617049 24410710 25309811
$$ packed form
3694B2416934j02007K5778n4052r9076j87518j05044j33540l42801l49087m67588
3684B0601999n82407q18803q35713q55449p01100o77534o83773m78533m97960
3675A4470727l62584l80076k67214j90438k20420k01354j38076l8223m1708l7255
3665A2593379j6912Q3474n3868j0800J31717k0902L748M4445Q1361L9669n3699
3654A2821612R9258N6089L1669p2263N1414j8882N0713M8976L3603m7834J03424
3643A3157779J10098N439Q5859Q3948P9261J12119K32585J85157N9261R074K72994
3632A4393574K78146K77052K81467M36107M02471N24112N10776M83505N50773
3623A8137983O24444P65562P77473O59684Q53454Q89791R08658P93661Q99101
$$ plain form
3614 25309811 26193929 27187387 28200461 29098350 30127675 31215428 32217606 33164411 34028230
3605 34028230 34889352 35723079 36485534 37321335 38033596 38644559 39053699 39542360 40043285
3596 40043285 40295513 40565367 40823781 40872612 40820344 40762622 40712634 40484188 40166319 39780615
3586 39780615 39420365 38932525 38339194 37837788 37163654 36527170 35724704 34906325 34172684
3577 34172684 33307971 32510742 31708714 31076069 30465036 29638810 28957732 28362830 27630117
3568 27630117 26998564 26430026 25845511 25098996 24537932 23966704 23423545 22993461 22561147
3559 22561147 22039255 21557850 21097246 20763581 20411261 20077367 19751415 19362659 19006057
3550 19006057 18611577 18203118 17770770 17301608 16862829 16471223 16169363 15716839 15394450
$$ packed form
3614B5309811Q84118R93458J013074Q97889J029325J087753J002178R46805Q63819
3605C4028230Q61122Q33727P62455Q35801P12261O10963M09140M88661N00925
3596D0043285K52228K69854K58414M8831n2268n7722m9988k28446l17869l85704
3586C9780615l60250m87840n93331n01406o74134o36484q02466q18379p33641
3577C4172684q64713p97229q02028o32645o11033q26226o81078n94902p32713
3568B7630117o31553n68538n84515p46515n61064n71228n43159m30084m32314
3559B2561147n21892m81405m60604l33665l52320l33894l25952l88756l56602
3550A9006057l94480m08459m32348m69162m38779l91606l01860m52524l22389
$$ plain form
3541 15394450 15107140 14685601 14325016 13858830 13588600 13142376 12743045 12448210 12224747
3532 12224747 11885271 11597348 11331963 11052205 10816070 10551923 10382851 10075122 9859544
3523 9859544 9573841 9390238 9182791 8949898 8803769 8605834 8474835 8209994 8051605 7875766
3513 7875766 7757573 7589064 7424302 7308084 7230578 7096744 7003802 6841117 6709643 6541456
3503 6541456 6379966 6269755 6213900 6192962 6093936 6004145 5883659 5841842 5753909 5564073 5407277
3492 5407277 5381818 5333767 5178320 5083515 5005710 4925332 4712978 4523321 4424385 4282851 4124083
3481 4124083 4025544 4009653 3849684 3776888 3644684 3487845 3417979 3366958 3164598 3005100
3471 3005100 2990672 2907565 2812016 2740778 2635417 2527455 2459648 2444099 2415608 2369935 2236766
$$ packed form
3541A5394450k87310m21539l60585m66186k70230m46224l99331k94835k23463
3532A2224747l39476k87923k65385k79758k36135k64147j69072l07729k15578
3523I859544k85703j83603k07447k32893j46129j97935j30999k64841j58389j75839
3513G875766j18193j68509j64762j16218p7506j33834r2942j62685j31474j68187
3503F541456j61490j10211n5855k0938r9026q9791j20486m1817q7933j89836j56796
3492E407277k5459m8051j55447r4805p7805q0378k12354j89657r8936j41534j58768
3481D124083r8539j5891j59969p2796j32204j56839o9866n1021k02360j59498
3471C005100j4428q3107r5549p1238j05361j07962o7807j5549k8491m5673j33169
$$ plain form
3460 2236766 2326364 2319308 2244321 2230989 2139635 2033314 1973095 1990670 1957763 1934367 1918136
3449 1918136 1940292 1894175 1814172 1820278 1814246 1913223 1983520 1930225 1879287 1768470 1675803 1595952
3437 1595952 1645952 1705490 1633168 1655594 1593024 1638798 1515596 1440209 1542338 1459927 1471189
3426 1471189 1524626 1579944 1449047 1417078 1460382 1453059 1550123 1587654 1525176 1457328 1477891
3415 1477891 1397190 1479908 1530773 1450385 1419396 1339905 1391812 1520240 1537249 1469359 1567497
3404 1567497 1542780 1604158 1563857 1458680 1378956 1371188 1253986 1185263 1229308 1139183 1024818
3393 1024818 1042548 1030901 987894 1042326 1047222 1006973 904872 1016397 1020731 1079317 1121209
3382 1121209 1057138 1128767 1160883 1157287 1138145 1131397 1262346 1338841 1316517 1366326 1411012 1502774
$$ packed form
3460B236766Q9598p056p4987j3332r1354j06321o0219J7575l2907k3396j6231
3449A918136K2156m6117q0003O106o032R8977P0297n3295n0938j10817r2667p9851
3437A595952N0000N9538p2322K2426o2570M5774j23202p5387J02129q2411J1262
3426A471189N3437N5318j30897l1969M3304p323R7064L7531o2478o7848K0563
3415A477891q0701Q2718N0865q0388l0989p9491N1907J28428J7009o7890R8138
3404A567497k4717O1378m0301j05177p9724p768j17202o8723M4045r0125j14365
3393A024818J7730j1647m3007N4432M896m0249j02101J11525M334N8586M1892
3382A121209o4071P1629L2116l596j9142o748J30949P6495k2324M9809M4686R1762
$$ plain form
3370 1502774 1550252 1612414 1559614 1527065 1505722 1333597 1312472 1262689 1205321 1152043 1153951
3359 1153951 1043727 934803 915661 855481 918164 875652 917947 1043270 983412 943073 1003674
3348 1003674 1029845 982516 981969 1037490 1116522 1125701 1096789 1092211 1121307 1159834 1243992 1250852
3336 1250852 1155908 1264763 1336636 1312635 1232651 1209856 1159512 1153798 1232455 1142908 1127519
3325 1127519 1123192 1242730 1264961 1135686 1145090 1330178 1336793 1342647 1262415 1230137 1264300 1234524
3313 1234524 1283079 1335455 1362829 1357525 1387759 1299144 1306623 1493928 1560819 1442650 1499998
3302 1499998 1561778 1519434 1529754 1591467 1547234 1571678 1548651 1533765 1644989 1700306 1611056
3291 1611056 1638221 1599525 1694491 1784232 1751266 1709861 1761942 1802497 1746785 1910303 1989707
$$ packed form
3370A502774M7478O2162n2800l2549k1343j72125k1125m9783n7368n3278J908
3359A153951j10224j08924j9142o0180O2683m2512M2295J25323n9858m0339O0601
3348A003674K6171m7329n47N5521P9032R179k8912m578K9096L8527Q4158O860
3336A250852r4944J08855P1873k4001p9984k2795n0344n714P8657q9547j5389
3325A127519m327J19538K2231j29275R404J85088O615N854q0232l2278L4163k9776
3313A234524M8555N2376K7374n304L0234q8615P479J87305O6891j18169N7348
3302A499998O1780m2344J0320O1713m4233K4444k3027j4886J11224N5317q9250
3291A611056K7165l8696R4966Q9741l2966m1405N2081M0555n5712J63518P9404
$$ plain form
3280 1989707 1910678 1979743 1976552 1912021 1947146 2053154 2157858 2135869 2209566 2200646 2189117
3269 2189117 2148597 2214469 2210178 2311715 2398006 2356767 2327501 2405366 2469547 2572265 2654571
3258 2654571 2722464 2797574 2767175 2737852 2769538 2876458 3015096 3142899 3105290 3205829 3318639
3247 3318639 3426145 3524924 3543384 3734840 3827574 3867297 3881895 3903828 4131406 4360315 4586877
3236 4586877 4765842 4932067 5123818 5392649 5563957 5817869 6093587 6269403 6524830 6845697
3226 6845697 7117431 7429162 7713780 7919059 8102578 8243401 8103712 7878116 7670471 7286907
3216 7286907 6899987 6468918 5890455 5603549 5365918 5108493 4894595 4619017 4336938 4114939
3206 4114939 3994897 3867716 3684188 3538363 3411968 3256523 3196011 3006643 2968731 2964005
$$ packed form
3280A989707p9029O9065l191o4531L5125J06008J04704k1989P3697q920j1529
3269B189117m0520O5872m291J01537Q6291m1239k9266P7865O4181J02718Q2306
3258B654571O7893P5110l0399k9323L1686J06920J38638J27803l7609J00539J12810
3247C318639J07506R8779J8460J91456R2734L9723J4598K1933K27578K28909K26562
3236D586877J78965J66225J91751K68831J71308K53912K75718J75816K55427L20867
3226F845697K71734L11731K84618K05279J83519J40823j39689k25596k07645l83564
3216G286907l86920m31069n78463k86906k37631k57425k13898k75578k82079k21999
3206D114939j20042j27181j83528j45825j26395j55445o0512j89368l7912m726
$$ plain form
3196 2964005 2896279 2782665 2668884 2661175 2657547 2636758 2575871 2460670 2463629 2486722 2486060 2428506
3184 2428506 2491239 2565628 2527356 2406926 2308348 2223647 2142030 2091664 1971049 1893970 1818104
3173 1818104 1786173 1777614 1754907 1722912 1722801 1696976 1627749 1655554 1709322 1778827 1673215 1594008
3161 1594008 1623826 1639818 1632834 1524027 1621230 1576909 1626789 1795872 1844594 1956516 2043820
3150 2043820 2054068 2036455 1825259 1723841 1568599 1383307 1383627 1264394 1318065 1315203 1230805
3139 1230805 1218566 1258697 1192691 1098329 1006320 1066755 1153879 1120680 1049441 1065468 1138756
3128 1138756 1157214 1134008 1177534 1043336 1018903 1101714 1237601 1183494 1205013 1361836 1314541
3117 1314541 1333017 1306604 1230026 1031957 1037543 985105 937494 913330 845772 852580 833593 809321
$$ packed form
3196B964005o7726j13614j13781p709l628k0789o0887j15201K959K3093o62n7554
3184B428506O2733P4389l8272j20430r8578q4701q1617n0366j20615p7079p5866
3173A818104l1931q559k2707l1995j11k5825o9227K7805N3768O9505j05612p9207
3161A594008K9818J5992o984j08807R7203m4321M9880J69083M8722J11922Q7304
3150B043820J0248j7613k11196j01418j55242j85292L20j19233N3671k862q4398
3139A230805j2239M0131o6006r4362r2009O0435Q7124l3199p1239J6027P3288
3128A138756J8458k3206M3526j34198k4433Q2811J35887n4107K1519J56823m7295
3117A314541J8476k6413p6578j98069N586n2438m7611k4164o7558O808j8987k4272
$$ plain form
3105 809321 872303 969972 961029 853258 820751 711687 749883 814708 812275 780340 710212 669253
3093 669253 610331 720910 760305 804263 779051 748560 697840 673397 718559 848558 876423
3082 876423 806338 855411 776450 631614 671100 675216 668787 763159 668190 590030 567384 595587
3070 595587 608946 580092 542129 572473 564228 600675 629081 642914 658907 580326 545355 446473
3058 446473 551408 588215 545426 551273 599855 699628 647179 549545 589541 608711 548024 539962
3046 539962 387704 504295 541457 419650 393461 425847 419278 546938 561299 473890 428242
3035 428242 387578 348671 419149 433559 488337 403632 386887 424241 387339 427090 423970 413246
3023 413246 312115 385375 424133 426239 341097 256479 317659 397812 490720 495935 505421 439193
$$ packed form
3105H09321O2982R7669q943j07771l2507j09064L8196O4825k433l1935p0128m0959
3093F69253n8922J10579L9395M3958k5212l0491n0720k4443M5162J29999K7865
3082H76423p0085M9073p8961j44836L9486M116o429R4372r4969p8160k2646K8203
3070E95587J3359k8854l7963L0344q245L6447K8406J3833J5993p8581l4971r8882
3058D46473J04935L6807m2789N847M8582R9773n2449r7634L9996J9170o0687q062
3046E39962j52258J16591L7162j21807k6189L2386o569J27660J4361q7409m5648
3035D28242m0664l8907P0478J4410N4778q4705j6745L7354l6902L9751l120j0724
3023D13246j01131P3260L8758K106q5142q4618O1180Q0153R2908N215R486o6228
$$ plain form
3011 439193 525177 470710 404929 402943 378726 424743 447285 462917 410735 396307 396028 388625
2999 388625 435457 498633 432654 395443 420615 398798 342951 433703 404781 358250 417426 489411
2987 489411 426654 480378 432051 360975 391375 398348 330025 476429 501510 452873 392277 466972
2975 466972 494157 482717 514418 457056 413670 410372 506574 551217 532614 508398 426213 458089
2963 458089 450281 403970 545230 506365 496318 589037 561533 586534 578259 624222 623931 682907
2951 682907 781724 735106 663002 734955 653578 770277 767348 652832 583522 614541 640694
2940 640694 609581 584275 574547 712044 697295 753481 669924 634151 648803 689052 695256 672602
2928 672602 655274 630808 589339 628986 754295 837085 862166 914445 857449 845565 964379
$$ packed form
3011D39193Q5984n4467o5781j986k4217M6017K2542J5632n2182j4428k79p403
2999C88625M6832O3176o5979l7211K5172k1817n5847R0752k8922m6531N9176P1985
2987D89411o2757N3724m8327p1076L0400O973o8323J46404K5081m8637o0596P4695
2975D66972K7185j1440L1701n7362m3386l298R6202M4643j8603k4216q2185L1876
2963D58089p808m6311J41260l8865j0047R2719k7504K5001q275M5963k91N8976
2951F82907R8817m6618p2104P1953q1377J16699k929j14516o9310L1019K6153
2940F40694l1113k5306r728J37497j4749N6186q3557l5773J4652M0249O204k2654
2928F72602j7328k4466m1469L9647J25309Q2790K5081N2279n6996j1884J18814
$$ plain form
2917 964379 961255 787988 910763 1101996 1140306 1201916 1235742 1210445 1128961 1151409 1230220
2906 1230220 1148962 1086355 1110696 1100746 1055547 1144450 1211537 1296410 1303121 1268566 1312830 1309921
2894 1309921 1275499 1421143 1488034 1558840 1542189 1555270 1612841 1708954 1773053 1859415 1844005
2883 1844005 1792388 1766666 1940403 2046382 2068960 1981503 1985421 2088080 2076795 1955623 1909951
2872 1909951 1860227 1797183 1767921 1699367 1757587 1722173 1797240 1809056 1708188 1731935 1784793
2861 1784793 1791008 1823191 1792573 1742072 1683664 1729571 1773420 1812526 1791094 1766414 1737653 1815118
2849 1815118 1784896 1775361 1677594 1663821 1658916 1537304 1457633 1462706 1422967 1402405 1460247 1381481
2837 1381481 1299375 1290860 1286242 1303952 1270178 1219449 1193782 1118475 1059549 1078356 1103164 1026897
$$ packed form
2917I64379l124j73267J22775J91233L8310O1610L3826k5297q1484K2448P8811
2906A230220q1258o2607K4341r950m5199Q8903O7087Q4873O711l4555M4264k909
2894A309921l4422J45644O6891P0806j6651J3081N7571R6113O4099Q6362j5410
2883A844005n1617k5722J73737J05979K2578q7457L918J02659j1285j21172m5672
2872A909951m9724o3044k9262o8554N8220l5414P5067J1816j00868K3747N2858
2861A784793O215L2183l0618n0501n8408M5907M3849L9106k1432k4680k8761P7465
2849A815118l0222r535r7767j3773m905j21612p9671N073l9739k0562N7842p8766
2837A381481q2106q515m618J7710l3774n0729k5667p5307n8926J8807K4808p6267
$$ plain form
2825 1026897 1037290 1047064 1055369 908095 817931 934073 875239 802201 688383 616775 697577
2814 697577 765661 671105 765854 732286 628922 625049 585195 521603 528169 485833 464795 518385
2802 518385 457281 422083 502759 465042 472870 378254 400499 378404 344418 341155 420043 344171
2790 344171 297396 269119 298689 364751 305019 335298 320656 350013 294561 300283 242254 281749
2778 281749 269472 284324 293779 236745 235725 224602 237602 284350 295398 303563 279451 321741
2766 321741 270966 261463 246449 274440 308777 270571 108725 98056 68553 76958 90386 159163
2754 159163 56473 25122 49433 39301 16280 20075 143744 159522 159712 127044 51930 59309
2742 59309 20245 18964 66013 110448 203447 77293 147964 167490 149825 128070 -6937 -29488
$$ packed form
2825A026897J0393R774Q305j47274r0164J16142n8834p3038j13818p1608Q0802
2814F97577O8084r4556R4749l3568j03364l873l9854o3592O566m2336k1038N3590
2802E18385o1104l5198Q0676l7717P828r4616K2245k2095l3986l263P8888p5872
2790C44171m6775k8277K9570O6062n9732L0279j4642K9357n5452N722n8029L9495
2778B81749j2277J4852R455n7034j020j1123J3000M6748J1048Q165k4112M2290
2766C21741n0775r503j5014K7991L4337l8206j61846j0669k9503Q405J3428O8777
2754A59163j02690l1351K4311j0132k3021L795J23669J5778J90l2668p5114P379
2742E9309l9064j281M7049M4435R2999j26154P0671J9526j7665k1755j35007k2551
$$ plain form
2730 -29488 30535 129216 107109 40331 -227 137266 121669 58041 153318 151098 80905 34861
2718 34861 36134 92837 113008 136726 97276 39551 3621 -15027 -50892 -7330 11084 65332
2706 65332 73983 99065 96614 13510 4304 -87927 -11557 -6131 -24034 -65008 -40280 -85546 -148382
2693 -148382 -49932 -24934 -26828 10364 -16693 -38771 51311 65424 -41128 77685 -61572
2682 -61572 -42199 -13188 107353 118600 52899 -35366 -38430 -25849 20901 60229 -23590 8311
2670 8311 -31247 -84711 -2504 22703 -2952 -63163 -50367 11841 66208 -11769 -84260 63478
2658 63478 -21609 60915 -19947 -64813 -22264 -102856 -46517 8031 69326 103725 22292 63519
2646 63519 -12012 -24675 -17743 32190 -33564 -113550 -135798 -93509 -91455 -155531 -52625 -14283
$$ packed form
2730b9488O0023R8681k2107o6778m0558J37493j5597o3628R5277k220p0193m6044
2718C4861J273N6703K0171K3718l9450n7725l5930j8648l5865M3562J8414N4248
2706F5332Q651K5082k451q3104r206r2231P6370N426j7903m0974K4728m5266o2836
2693a48382R8450K4998j894L7192k7057k2078R0082J4113j06552J18813j39257
2682f1572J9373K9011J20541J1247o5701q8265l064J2581M6750L9328q3819L1901
2670H311l9558n3464Q2207K5207k5655o0211J2796O2208N4367p7977p2491J47738
2658F3478q5087Q2524q0862m4866M2549q0592N6339N4548O1295L4399q1433M1227
2646F3519p5531j2663O932M9933o5754p9986k2248M2289K054o4076J02906L8342
$$ plain form
2634 -14283 29760 5468 -42241 -27505 10636 7364 -32690 14530 -15284 -7510 -23823 -128097
2622 -128097 -22368 41170 47689 4684 27896 113823 7262 -32787 -39335 -58349 -163519
2611 -163519 -210460 -169892 -105331 -192755 -57827 3701 -54772 -101055 -77670 -54277 -30651
2600 -30651 5648 -95859 -116499 -119630 -119824 -9875 45890 3252 -94184 -99471 -95580 -112259
2588 -112259 -70410 -82782 45604 -2949 6970 76200 77135 47479 103914 17515 -57914 -11735
2576 -11735 -57116 -41440 -80118 -1340 23500 50226 -24124 -74740 -30882 -94221 -91532 -24743
2564 -24743 -1072 -72458 3568 -8494 6095 -43340 -84208 -86271 51004 -25701 10693 -42805
2552 -42805 -45787 65891 106841 70315 59227 125895 17108 19583 4928 -16424 8450 -13496
$$ packed form
2634a4283M4043k4292m7709J4736L8141l272m0054M7220k9814P774j6313j04274
2622a28097J05729O3538O519m3005K3212Q5927j06561m0049o548j9014j05170
2611a63519m6941M0568O4561q7424J34928O1528n8473m6283K3385K3393K3626
2600c0651L6299j01507k0640l131j94J09949N5765m2638r7436n287L891j6679
2588a12259M1849j2372J28386m8553R919O9230R35k9656N6435q6399p5429M6179
2576a1735m5381J5676l8678P8778K4840K6726p4350n0616M3858o3339K689O6789
2564b4743K3671p1386P6026j2062J4589m9435m0868k063J37275p6705L6394n3498
2552d2805k982J11678M0950l6526j1088O6668j08787K475j4655k1352K4874k1946
$$ plain form
2540 -13496 -38856 -91131 32330 -67258 -117749 -58799 -41275 -66401 -10434 31035 -7164 -31160
2528 -31160 -43345 -30527 -67125 10598 43947 -12711 6746 -20979 -49046 -65318 -7482 -34035
2516 -34035 -189902 -82575 -44409 27898 -67795 -74648 20678 46441 6095 35178 18718 22963
2504 22963 -37330 -116665 -68376 -2681 -106411 -134892 -159503 -150965 -213976 -141592 -28256 -33916
2492 -33916 -84666 -32929 -107761 -88099 -92475 -47651 -13932 -1089 -70059 -150186 -126187 -59392
2480 -59392 -28910 -59989 -42654 4993 -31199 -50214 20022 -19594 -16275 -49180 -28248 -37085
2468 -37085 -48320 -16072 -45072 -62466 -95478 -113017 -6179 -14726 -86366 -46836 71046 -9829
2456 -9829 -88065 6198 -6239 -17777 52795 -68326 -32396 17672 45476 55854 74742 148528
$$ packed form
2540a3496k5360n2275J23461r9588n0491N8950J7524k5126N5967M1469l8199k3996
2528c1160j2185J2818l6598P7723L3349n6658J9457k7725k8067j6272N7836k6553
2516c4035j55867J07327L8166P2307r5693o853R5326K5763m0346K9083j6460M245
2504B2963o0293p9335M8289O5695j03730k8481k4611Q538o3011P2384J13336n660
2492c3916n0750N1737p4832J9662m376M4824L3719J2843o8970q0127K3999O6795
2480e9392L0482l1079J7335M7647l6192j9015P0236l9616L319l2905K0932q837
2468c7085j1235L2248k9000j7394l3012j7539J06838q547p1640L9530J17882q0875
2456i829p8236R4263j2437j1538P0572j21121L5930N0068K7804J0378J8888P3786
$$ plain form
2444 148528 66521 17207 21033 -56389 -70676 -19875 11767 -25252 -68591 -94190 -122232 -159108
2432 -159108 -182664 -169665 -62368 -147164 -87206 20431 84588 13625 8140 42879 -20796
2421 -20796 -46743 2063 67723 -27213 -81556 -137618 -43439 19919 -10259 28579 48713 83712
2409 83712 50797 -21141 -79725 -134609 -112560 21026 16791 43419 -10787 -18784 46935 109314
2397 109314 49976 11186 -7652 -6805 -7968 -13302 9881 -41362 -72849 -33001 28684 6889
2385 6889 30523 28213 -19795 -8791 -10411 -99075 -117628 -146684 -132047 -129578 -95915 -177043 -144131
2372 -144131 -58990 13039 -18158 -15358 90411 44907 30068 108591 149459 74557 107638 56980
2360 56980 4133 27758 41227 -32908 20212 -5411 15835 134354 210436 219419 132806 22963
$$ packed form
2444A48528q2007m9314L826p7422j4287N0801L1642l7019m3339k5599k8042l6876
2432a59108k3556J2999J07297q4796N9958J07637O4157p0963n485L4739o3675
2421b0796k5947M8806O5660r4936n4343n6062R4179O3358l0178L8838K0134L4999
2409H3712l2915p1938n8584n4884K2049J33586m235K6628n4206p997O5719O2379
2397A09314n9338l8790j8838Q47j163n334K3183n1243l1487L9848O1685k1795
2385F889K3634k310m8008J1004j620q8664j8553k9056J4637K469L3663q1128L2912
2372a44131Q5141P2029l1197K800J05769m5504j4839P8523M0868p4902L3081n0658
2360E6980n2847K3625J3469p4135N3120k5623K1246J18519P6082Q983q6613j09843
$$ plain form
2348 22963 91170 152163 34347 91413 72447 37646 108824 5144 -41758 -77600 -99811
2337 -99811 23158 -95623 15964 -17872 -31816 -45361 -20063 -38992 -17282 -36432 -17955
2326 -17955 79512 52919 -10594 3094 -4507 -52948 -45506 -78626 -58683 -8447 -41880 -92507
2314 -92507 -51404 -17165 31110 1562 20495 -73917 -123033 -88172 -97813 41181 32806 8106
2302 8106 -45815 -35235 -4100 -69292 -23851 26464 -58466 -86831 -85823 -99169 -110136 -76015
2290 -76015 -115826 -28775 -27125 -8302 82720 -47918 51167 -31763 -75866 -79047 -11724 -16815
2278 -16815 -35516 89852 121841 145462 2133 25958 -20117 -157 112182 44374 -54837
2267 -54837 -39837 23205 22839 13004 15564 51344 -17672 -97530 -26721 4267 -59099 -47632 -29149
$$ packed form
2348B2963O8207O0993j17816N7066j8966l4801P1178j03680m6902l5842k2211
2337i9811J22969j18781J11587l3836j3944j3545K5298j8929K1710j9150J8477
2326a7955R7467k6593o3513J3688p601m8441P442l3120J9943N0236l3433n0627
2314i2507M1103L4239M8275k9548J8933r4412m9116L4861r641J38994q375k4700
2302H106n3921J0580L1135o5192M5441N0315q4930k8365J008j3346j0967L4121
2290g6015l9811Q7051J650J8823R1022j30638R9085q2930m4103l181O7323n091
2278a6815j8701J25368L1989K3621j43329K3825m6075J9960J12339o7808r9211
2267e4837J5000O3042l66r835K560L5780o9016p9858P0809L0988o3366J1467J8483
$$ plain form
2254 -29149 -8778 -70539 -88046 -79405 -35738 48004 36479 94 1364 -697 42598 79880
2242 79880 40847 104537 119965 54806 31318 5995 1167 54012 70980 -39118 -78056 -65862
2230 -65862 -739 33802 60065 125150 135919 9444 39146 66767 -25509 48861 120228 5331
2218 5331 69575 52261 78956 152937 191950 121554 81119 176040 159368 189449 217189 125289
2206 125289 125819 203579 295485 253059 169653 159492 192532 217359 166782 241249 246171 155119
2194 155119 233130 243625 308638 315509 398082 312221 315542 409076 302596 197281 299042
2183 299042 348397 306806 345038 337809 329184 333862 364471 411192 329259 171986 239368 256435
2171 256435 234733 289431 365098 296170 309904 347043 341112 399729 409968 424343 397788 378930
$$ packed form
2254b9149K0371o1761j7507Q641M3667Q3742j1525l6385J270k061M3295L7282
2242G9880l9033O3690J5428o5159k3488k5323m828N2845J6968j10098l8938J2194
2230f5862O5123L4541K6263O5085J0769j26475K9702K7621r2276P4370P1367j14897
2218E331O4244j7314K6695P3981L9013p0396m0435R4921j6672L0081K7740r1900
2206A25289N30P7760R1906m2426q3406j0161L3040K4827n0577P4467M922r1052
2194A55119P8011J0495O5013O871Q2573q5861L321R3534j06480j05315J01761
2183B99042M9355m1591L8232p229q625M678L0609M6721q1933j57273O7382J7067
2171B56435k1702N4698P5667o8928J3734L7139n931N8617J0239J4375k6555j8858
$$ plain form
2159 378930 333217 429261 452907 419606 505617 473568 449575 445698 447643 521820 527098 543744
2147 543744 607222 720049 736071 638236 802295 790782 767885 768458 838384 801060 891460 890670
2135 890670 901541 956927 1061919 1008538 957628 989887 1152362 1199334 1256610 1336166 1332878
2124 1332878 1326320 1317706 1405397 1577161 1627251 1645085 1579500 1654170 1758908 1884453 2061847
2113 2061847 2121454 2239144 2325820 2427856 2437790 2544063 2778631 2952836 3168722 3324273
2103 3324273 3387277 3670326 3996747 4436636 5065193 5604088 6120658 6457440 6938138 7604569
2093 7604569 8466551 9521698 10635802 12117851 13964589 15822312 17733368 20360412
2085 20360412 24004744 29158550 32693235 31275353 26393162 21281196 17128920 13857680
$$ packed form
2159C78930m5713R6044K3646l3301Q6011l2049k3993l877J945P4177N278J6646
2147E43744O3478J12827J6022r7835J64059j1513k2897N73O9926l7324R0400p90
2135H90670J0871N5386J04992n3381n0910L2259J62475M6972N7276P9556l288
2124A332878o558q614Q7691J71764N0090J7834o5585P4670J04738J25545J77394
2113B061847N9607J17690Q6676J02036R934J06273K34568J74205K15886J55551
2103C324273O3004K83049L26421M39889O28557N38895N16570L36782M80698O66431
2093G604569Q61982J055147J114104J482049J846738J857723J911056K627044
2085B0360412L644332N153806L534685j417882m882191n111966m152276l271240
$$ plain form
2077 13857680 11607537 9951532 8827013 7935850 7142576 6515671 6071897 5687094 5300112
2068 5300112 4975863 4526764 4185656 3967442 3749285 3515155 3254738 3026557 2911925 2754345
2058 2754345 2555077 2384149 2271596 2125508 1982918 1888012 1926495 1811487 1747997 1650396
2048 1650396 1543419 1519993 1408394 1268191 1197573 1117127 1108322 1087079 1006613 978909 877349
2037 877349 747798 829774 817173 760282 781119 765932 890415 872573 725848 625047 628859
2026 628859 743251 621357 524317 513585 491005 400531 530968 584839 596523 688121 572897
2015 572897 649214 742604 595058 524928 558942 520272 494510 598558 594435 540798 484500
2004 484500 411269 338806 365704 250993 302752 296338 331203 413371 407993 388959 221366 231477
$$ packed form
2077A3857680k250143j656005j124519q91163p93274o26905m43774l84803l86982
2068E300112l24249m49099l41108k18214k18157k34130k60417k28181j14632j57580
2058B754345j99268j70928j12553j46088j42590r4906L8483j15008o3490r7601
2048A650396j06977k3426j11599j40203p0618q0446q805k1243q0466k7704j01560
2037H77349j29551Q1976j2601n6891K0837j5187J24483j7842j46725j00801L812
2026F28859J14392j21894r7040j0732k2580r0474J30437N3871J1684R1598j15224
2015E72897P6317R3390j47546p0130L4014l8670k5762J04048m123n3637n6298
2004D84500p3231p2463K6898j14711N1759o414L4865Q2168n378j9034j67593J0111
$$ plain form
1992 231477 258710 307597 220109 172100 148651 156520 98218 66808 40058 134153 122793 131354
1980 131354 64855 65076 167607 35034 39351 98055 83858 111263 158234 170315 116224 77374
1968 77374 201063 188941 297635 191040 81165 114976 35942 9413 41846 91077 105835
1957 105835 105690 171652 171302 162041 156380 111836 128476 41590 68033 48926 21381 625 105734
1944 105734 82201 67227 14993 36221 43007 -20180 -87627 -5080 40822 118796 63668 103846
1932 103846 50926 -21470 -73974 -117827 -68430 -27783 40603 11321 36772 -17682 -56778 -15106
1920 -15106 -23178 -87458 -44127 -10989 95901 49435 79500 86145 86267 34538 42866 45540 -4603
1907 -4603 -13167 -19052 40490 44118 6733 -12619 34801 -15479 113117 145941 112136 60170
$$ packed form
1992B31477K7233M8887q7488m8009k3449P869n8302l1410k6750R4095j1360Q561
1980A31354o6499K21J02531j32573M317N8704j4197K7405M6971J2081n4091l8850
1968G7374J23689j2122J08694j06595j09875L3811p9034k6529L2433M9231J4758
1957A05835j45O5962l50r261n661m4544J6640q6886K6443j9107k7545k0756J05109
1944A05734k3533j4974n2234K1228O786o3187o7447Q2547M5902P7974n5128M0178
1932A03846n2920p2396n2504m3853M9397M0647O8386k9282K5451n4454l9096M1672
1920a5106q072o4280M3331L3138J06890m6466L0065O645J22n1729Q328K674n0143
1907d603q564n885N9542L628l7385j9352M7420n0280J28596L2824l3805n1966
$$ plain form
1895 60170 53034 -71495 -71585 -78856 -65607 22877 5754 -124136 -32543 11009 30985 110153
1883 110153 118548 98436 40384 -55736 -72621 -114201 -140668 -89683 -110413 -118979 -104164 -41667
1871 -41667 -46524 -99231 -67309 46291 74745 85354 -4173 -29533 -10291 39520 -22505 52589
1859 52589 -9623 -69995 -117984 -127980 -70194 59938 23585 28129 -15591 -56775 -85006 -80618
1847 -80618 -51119 -42735 -56787 -60428 -56480 -30866 -57091 -160083 -61147 -38883 -114482 -181629
1835 -181629 -179843 -110135 -92191 -1168 -23152 -99592 -148826 -51520 -71296 -139412 -125955 -104760
1823 -104760 -133622 -201731 -89242 -4095 -64182 -16616 90785 111772 90425 156041 195883
1812 195883 166262 92960 118796 56077 -15927 -84316 -30378 -24982 11373 -15754 -117864 -94969
$$ packed form
1895F0170p136j24529r0p271J3249Q8484j7123j29890R1593M3552J9976P9168
1883A10153Q395k0112n8052r6120j6885m1580k6467N0985k0730q566J4815O2497
1871d1667m857n2707L1922J13600K8454J0609q9527k5360J9242M9811o2025P5094
1859E2589o2212o0372m7989r996N7786J30132l6353M544m3720m1184k8231M388
1847h0618K9499Q384j4052l641L948K5614k6225j02992R8936K2264p5599o7147
1835a81629J786O9708J7944R1023k1984p6440m9234R7306j9776o8116J3457K1195
1823a04760k8862o8109J12489Q5147o0087M7566J07401K0987k1347O5616L9842
1812A95883k9621p3302K5836o2719p2004o8389N3938N396L6355k7127j02110K2895
$$ plain form
1800 -94969 12284 47565 11700 21025 -9752 13649 9195 -41808 -59425 -16177 53053 -9765
1788 -9765 -68546 124952 18666 -71387 -170048 -68229 -56291 -59121 -106635 -86363 10659 40439
1776 40439 -15273 -57972 -145046 -209789 -217752 -117376 -1485 -70436 -77167 -51093 -11396 -31731
1764 -31731 -76386 -45174 -5551 -50560 -90528 -192281 -72700 -26663 -31892 -100407 -153653 -113703
1752 -113703 -43279 67346 4700 -44063 -53932 -34800 -57951 26085 -92091 48933 65616
1741 65616 -54797 -96606 -60677 -65235 -131780 -103316 -92376 -139986 -100986 -37393 -8264 -36990
1729 -36990 -101279 -86993 -112095 -37801 44158 8028 7051 6724 -77504 -60947 -70339 -56919 -57522
1716 -57522 -28091 -22975 -65024 -84699 -132899 -118073 22179 118085 16006 -111867 -107501 -15355
$$ packed form
1800i4969J07253L5281l5865R325l0777K3401m454n1003j7617M3248O9230o2818
1788i765n8781J93498j06286r0053r8661J01819J1938k830m7514K0272R7022K9780
1776D0439n5712m2699q7074o4743p963J00376J15891o8951o731K6074L9697k0335
1764c1731m4655L1212L9623m5009l9968j01753J19581M6037n229o8515n3246L9950
1752a13703P0424J10625o2646m8763r869J9132k3151Q4036j18176J41024J6683
1741F5616j20413m1809L5929m558o6545K8464J0940m7610L9000O3593K9129k8726
1729c6990o4289J4286k5102P4294Q1959l6130r77l27q4228J6557r392J3420o03
1716e7522K9431N116m2049j9675m8200J4826J40252R5906j02079j27873M366R2146
$$ plain form
1704 -15355 1723 -39105 -54660 -38462 -69494 -57067 -31838 -75535 -44052 -64039 -133293 -79984
1692 -79984 -23766 -10450 35867 15909 -70130 -45978 -76054 -102621 -137710 -202127 -71253 -50537
1680 -50537 -108396 -49361 -23519 -64846 -125120 -81119 -129234 -130391 -53152 -71803 -43767 -101283
1668 -101283 9359 172836 163047 -60319 -14072 18053 -16893 -102464 -107176 -33997 -28687 -99255
1656 -99255 -71606 -59805 -39288 -78586 -141787 -40610 108 -20260 -83311 -28936 -75810 -156221
1644 -156221 -87333 -49673 -69993 -99414 13111 10151 21534 114733 42938 -55826 -28379 -14083
1632 -14083 -68120 18986 -41412 -31937 5686 -58013 -113852 -73987 -43961 -80829 -41464 -61257
1620 -61257 -103426 -82013 32412 91827 -31835 -15135 -64271 -166872 -180921 -92263 -15602
$$ packed form
1704a5355J7078m0828j5555J6198l1032J2427K5229m3697L1483j9987o9254N3309
1692g9984N6218J3316M6317j9958q6039K4152l0076k6567l5089o4417J30874K0716
1680e0537n7859N9035K5842m1327o0274M4001m8115j157P7239j8651K8036n7516
1668a01283J10642J63477r789k23366M6247L2125l4946q5571m712P3179N310p0568
1656i9255K7649J1801K0517l9298o3201J01177M0718k0368o3051N4375m6874q0411
1644a56221O8888L7660k0320k9421J12525k960J1383R3199p1795r8764K7447J4296
1632a4083n4037Q7106o0398R475L7623o3699n5839L9865L0026l6868L9365j9793
1620f1257m2169K1413J14425N9415j23662J6700m9136j02601j4049Q8658P6661
$$ plain form
1609 -15602 -147750 -109008 -97733 -143305 -91696 -19225 64248 133387 51537 -82262 -132938
1598 -132938 9522 -65352 -180706 -70870 -31548 -49683 -181525 -162761 -120402 -119362 -3373
1587 -3373 41656 39046 -8783 -10627 -10357 68269 104419 21384 -9902 -74951 -74128 -87580 -98292
1574 -98292 -122623 -133245 -99510 -113170 -105468 -18585 -89490 -60209 18311 16439 113376 107827
1562 107827 45145 -121 30229 4659 -21407 11897 19100 18873 -8722 -37982 -41314 -9878
1550 -9878 -58164 -27691 -84763 -80936 50920 -13089 -39226 -20759 852 50792 111 74259
1538 74259 -7386 80419 -3903 -51662 -21575 -17768 11120 -34267 -132243 -147378 -89394 -57891
1526 -57891 -131850 -123671 -41072 -13638 -77738 -148499 -80572 -18586 -28535 -48689 -86016 -139557
$$ packed form
1609a5602j32148L8742J1275m5572N1609P2471Q3473O9139q1850j33799n0676
1598a32938J42460p4874j15354J09836L9322j8135j31842J8764M2359J040J15989
1587c373M5029k610m7829j844K70P8626L6150q3035l1286o5049Q23j3452j0712
1574i8292k4331j0622L3735j3660P702Q6883p0905K9281P8520j872R6937n549
1562A07827o2682m5266L0350k5570k6066L3304P203k27k7595k9260l332L1436
1550i878m8286L0473n7072L827J31856o4009k6137J8467K1611M9940n0681P4148
1538G4259q1645Q7805q4322m7759L0087L807K8888m5387r7976j5135N7984L1503
1526e7891p3959Q179Q2599K7434o4100p0761O7927O1986r949k0154l7327n3541
$$ plain form
1514 -139557 -72463 23224 -31809 -508 49288 16077 60294 -20992 -51477 7652 5658 -16502
1502 -16502 15512 -1894 -75847 5418 -856 54590 112324 58561 21625 -69036 2528 -38141
1490 -38141 -88176 -174867 -48447 -18756 16956 -29270 -37084 -30735 -26965 -124134 -162125 -111419
1478 -111419 -78469 29904 60441 -53827 -39108 107418 122094 -6190 -36086 -61220 -24683
1467 -24683 -58423 -63379 -52512 4883 -18434 -13362 -39397 11913 25239 83604 55879 -39757
1455 -39757 -12401 -15563 -100722 -50284 54232 -81053 -104434 -84459 -72760 -88557 -37713 -4749
1443 -4749 6537 -8980 -43309 -147734 -122537 -59745 -12668 -58520 -63283 -87829 -48512 79797
1431 79797 117145 14905 39036 -2709 41861 29741 -23484 -21708 6177 28188 -72272 -144154
$$ packed form
1514a39557O7094R5687n5033L1301M9796l3211M4217q1286l0485N9129j994k2160
1502a6502L2014j7406p3953Q1265o274N5446N7734n3763l6936r0661P1564m0669
1490c8141n0035q6691J26420K9691L5712m6226p814O349L770r7169l7991N0706
1478a11419L2950J08373L0537j14268J4719J46526J4676j28284k9896k5134L6537
1467b4683l3740m956J0867N7395k3317N072k6035N1310J3326N8365k7725r5636
1455c9757K7356l162q5159N0438J04516j35285k3381J9975J1699j5797N0844L2964
1443d749J1286j5517l4329j04425K5197O2792M7077m5852m763k4546L9317J28309
1431G9797L7348j02240K4131m1745M4570j2120n3225J776K7885K2011j00460p1882
$$ plain form
1419 -144154 -76746 -71478 -86749 -22279 -73994 -110003 -90745 -83239 -34647 -55100 -139018 -70345
1407 -70345 -12349 43291 20105 -35840 -80406 -103072 -102201 -88748 -36647 -1889 95901 95688 -37358
1394 -37358 -74601 8854 16495 -54526 -10085 -50147 -64783 18934 -43565 -85023 -122821 2648
1382 2648 -35552 -70169 -135170 -123704 -110181 -28131 -73621 -120184 -65706 29042 49322 29381
1370 29381 55786 -10798 -8562 -4385 -14906 43593 24854 -25261 -5285 24119 38447 -19828
1358 -19828 -56123 11774 103109 68111 -45421 28838 136731 46968 -115696 -23381 53565
1347 53565 71672 53354 -22333 -58392 -64405 -59314 19502 128441 104104 17953 117 -29100
1335 -29100 -70246 19070 556 -35876 -27927 18860 -133541 -174825 -128002 -43781 -127068 -148392
$$ packed form
1419a44154O7408N268j5271O4470n1715l6009J9258P506M8592k0453q3918O8673
1407g0345N7996N5640k3186n5945m4566k2666Q71J3453N2101L4758R7790k13j33046
1394c7358l7243Q3455P641p1021M4441m0062j4636Q3717o2499m1458l7798J25469
1382B648l8200l4617o5001J1466J3523Q2050m5490m6563N4478R4748K0280j9941
1370B9381K6405o6584K236M177j0521N8499j8739n0115J9976K9404J4328n8275
1358a9828l6295O7897R1335l4998j13532P4259J07893q9763j62664R2315P6946
1347E3565J8107j8318p5687l6059o013N091P8816J08939k4337q6151j7836k9217
1335b9100m1146Q9316j8514l6432P949M6787j52401m1284M6823Q4221q3287k1324
$$ plain form
1323 -148392 -132552 -38112 -4070 -73293 -174282 -79234 -3700 -138559 -84382 -31816 -85891
1312 -85891 46968 55205 64086 40846 1049 -15944 17188 59787 157586 95229 77708 -10721
1300 -10721 -20021 -19825 51085 71765 25456 -53589 -59570 14601 -49036 -57044 -89059 -163605 -116612
1287 -116612 -24851 -39861 -66940 -42014 27178 41091 9716 -43273 -11857 -51707 -33689 94572
1275 94572 35971 -17271 76418 4511 -72587 -34695 -25673 23778 15223 42345 -8007 -61713
1263 -61713 -2331 -46415 -5195 -42100 -72006 -70240 -61813 -98235 -38956 -43982 -76380 -74913 -91188
1250 -91188 -54559 17433 -66672 29976 10014 -13902 27016 -39115 -107755 -105306 -27411 -66514
1238 -66514 -113197 -80551 -81555 -7041 -54296 13167 -35610 55410 52801 102785 -14875 1327
$$ packed form
1323a48392J5840R4440L4042o9223j00989R5048P5534j34859N4177N2566n4075
1312h5891J32859Q237Q881k3240l9797j6993L3132M2599R7799o2357j7521q8429
1300a0721r300J96P0910K0680m6309p9045n981P4171o3637q008l2015p4546M6993
1287a16612R1761j5010k7079K4926O9192J3913l1375n2989L1416l9850J8018J28261
1275I4572n8601n3242R3689p1907p7098L7892R022M9451q555K7122n0352n3706
1263f1713N9382m4084M1220l6905k9906J766Q427l6422N9279n026l2398J467j6275
1250i1188L6629P1992q4105R6648j9962k3916M0918o6131o8640K449P7895l9103
1238f6514m6683L2646j004P4514m7255O7463m8777R1020k609M9984j17660J6202
$$ plain form
1226 1327 27297 -38295 -95647 -28104 43925 40432 -29172 -122337 -60642 -126407 -30920 -17648
1214 -17648 795 33755 -61914 -68117 -51275 5787 47073 28324 127488 68394 33869 38790
1202 38790 32510 -43551 -104537 -148558 -109088 -44449 14719 87362 26387 26701 17857 -65351 -6933
1189 -6933 16715 -24685 -81234 -18071 -7618 14796 -69458 -55418 -4578 -7749 -66313 -136103
1177 -136103 -110754 -52023 -51586 -79557 -80427 -26228 -103653 -152869 -108297 -69168 -43251 -33242
1165 -33242 -64368 17876 -10908 17485 35325 -19723 -7704 -28011 -12724 -33700 25243 65020
1153 65020 1091 -52582 -40303 110962 27004 -19319 -104607 -144956 -73321 -18499 -30572 -67590
1141 -67590 17528 61011 -35424 -17932 -3913 -57890 14721 31816 108 29311 17272 43176
$$ packed form
1226A327K5970o5592n7352O7543P2029l493o9604r3165O1695o5765R5487J3272
1214a7648J8443L2960r5669o203J6842N7062M1286j8749R9164n9094l4525M921
1202C8790o280p6061o0986m4021L9470O4639N9168P2643o0975L14q844q3208N8418
1189f933K3648m1400n6549O3163J0453K2414q4254J4040N0840l171n8564o9790
1177a36103K5349N8731M37k7971q70N4199p7425m9216M4572L9129K5917J0009
1165c3242l1126Q2244k8784K8393J7840n5048J2019k0307J5287k0976N8943L9777
1153F5020o3929n3673J2279J51265q3958m6323q5288m0349P1635N4822j2073l7018
1141f7590Q5118M3483r6435J7492J4019n3977P2611J7095l1708K9203j2039K5904
$$ plain form
1129 43176 116022 -38619 -36490 -57971 -42568 10549 -14501 31647 -17220 -59421 -81063 -92059
1117 -92059 -96871 -114973 81265 59324 91132 71870 -23978 -41100 -27223 -65764 29191 38298
1105 38298 -12547 -124393 -135211 -33148 -22533 -28672 -25110 15006 57149 80209 110597 63774
1093 63774 -32740 -136830 -127324 -86492 -163503 -54317 30104 -29355 -56274 18352 -82667
1082 -82667 229 143731 36386 42552 68623 113376 143115 121684 58999 98432 138812 68557
1070 68557 48760 23263 -5584 -40904 -35607 30574 52451 -71583 -24852 40357 116573 75871
1058 75871 87747 3078 -70485 -57205 -79770 24069 -52684 -107495 -70957 -33757 -55974 -44182
1046 -44182 24866 121519 157845 41171 16608 4499 17796 39861 24800 -5026 23217 -21719
$$ packed form
1129D3176P2846j54641K129k1481J5403N3117k5050M6148m8867m2201k1642j0996
1117i2059m812j8102J96238k1941L1808j9262r5848j7122J3877l8541R4955R107
1105C8298n0845j11846j0818J02063J0615o139L562M0116M2143K3060L0388m6823
1093F3774r6514j04090R506M0832p7011J09186Q4421n9459k6919P4626j01019
1082h2667Q2896J43502j07345O166K6071M4753K9739k1431o2685L9433M0380p0255
1070F8557j9797k5497k8847l5320N297O6181K1877j24034M6731O5209P6216m0702
1058G5871J1876q4669p3563J3280k2565J03839p6753n4811L6538L7200k2217J1792
1046d4182O9048R6653L6326j16674k4563j2109J3297K2065j5061k9826K8243m4936
$$ plain form
1034 -21719 -65603 23538 30720 -58194 -42646 116934 114763 599 -31558 11163 93083 19486
1022 19486 22354 80102 79011 108755 27650 13578 -4541 78101 80788 44913 -1147 -68831
1010 -68831 -7336 35618 23256 -6212 16224 50841 -60666 -903 14199 7022 46032 -33805
998 -33805 -100453 -86440 12236 -20281 18267 46272 -1072 7956 52422 -49300 -30145 5662
986 5662 -47432 -50191 -56494 -46194 -28525 77566 31441 14602 -21735 -61351 -139157 -65339
974 -65339 2759 16168 -51293 -95225 -164898 -110837 -20570 -64664 17772 -1199 -2092 -129921
962 -129921 -87212 -34679 39116 28545 12079 -35089 -17941 34055 -57948 -22258 51309 -3467
950 -3467 9549 -59618 -139697 -40719 13495 -43246 -50730 -37261 6826 45040 67588 70213 -4993
$$ packed form
1034b1719m3884Q9141P182q8914J5548J59580k171j14164l2157M2721Q1920p3597
1022A9486K868N7748j091K9744q1105j4072j8119Q2642K687l5875m6060o7684
1010f8831O1495M2954j2362k9468K2436L4617j11507N9763J5102p177L9010p9837
998c3805o6648J4013R8676l2517L8548K8005m7344R028M4466j01722J9155L5807
986E662n3094k759o303J0300J7669J06091m6125j6839l6337l9616p7806P3818
974f5339O8098J3409o7461m3932o9673N4061R0267m4094Q2436j8971q93j27829
962a29921M2709N2533P3795j0571j6466m7168J7148N1996r2003L5690P3567n4776
950c467J3016o9167q0079R8978N4214n6741p484J3469M4087L8214K2548K625p5206
$$ plain form
937 -4993 -44146 -91226 -145478 -29996 -2762 -22146 -87163 -24205 -34461 -103654 -27800 -62796
925 -62796 -44751 19058 64763 80411 -16077 -39205 -77124 -108310 -54695 -43613 10448 960
913 960 75831 63056 31604 25189 56313 8981 -43981 -86024 22160 13647 -81866 -58073 13691
900 13691 -45391 25519 77574 -12566 -48167 33760 48384 -84569 -178322 -266113 -194980 -113112
888 -113112 -81883 -33773 -92091 -8420 -53207 -117295 -3718 1242 -57746 -20404 -5313 86083
876 86083 59181 45160 11509 2798 90206 46327 14350 40452 45322 75329 67979 131270 54790
863 54790 556 -15772 -138235 -57763 41886 -14611 35983 27358 -44883 347 -40826 2418
851 2418 -4590 -11185 -26813 -43818 -36717 -22218 -131836 -153377 -82588 40034 -38149 -104685
$$ packed form
937d993l9153m7080n4252J15482K7234j9384o5017O2958j0256o9193P5854l4996
925f2796J8045O3809M5705J5648r6488k3128l7919l1186N3615J1082N4061r488
913I60P4871j2775l1452o415L1124m7332n2962m2043J08184q513r5513K3793P1764
900A3691n9082P0910N2055r0140l5601Q1927J4624j32953r3753q7791P1133Q1868
888a13112L1229M8110n8318Q3671m4787o4088J13577M960n8988L7342J5091R1396
876H6083k6902j4021l3651q711Q7408m3879l1977K6102M870L0007p350O3291p6480
863E4790n4234j6328j22463Q0472R9649n6497N0594q625p2241M5230m1173M3244
851B418p008o595j5628j7005P101J4499j09618k1541P0789J22622p8183o6536
$$ plain form
839 -104685 -68169 105434 171421 104578 107910 184124 138782 157368 42285 46639 31661 42533
827 42533 28048 -14603 28988 -31359 -115986 -94982 -96719 -70642 43433 14008 -28963 92788
815 92788 150277 73335 -14103 10345 64112 42799 82161 103146 30371 68769 -6132 26509
$$ packed form
839a04685L6516J73603O5987o6843L332P6214m5342J8586j15083M354j4978J0872
827D2533j4485m2651M3591o0347q4627K1004j737K6077J14075k9425m2971J21751
815I2788N7489p6942q7438K4448N3767k1313L9362K0985p2775L8398p4901L2641
$$ [...]
##END NTUPLES=NMR SPECTRUM
##END=
