##TITLE=1H_TG-2332
 CDCl3
 8 sc, 
 16.11.2021
##JCAMPDX= 6.0         $$ Bruker NMR JCAMP-DX V2.0
##DATA TYPE= NMR SPECTRUM
##DATA CLASS= NTUPLES
##ORIGIN= UXNMR, Bruker Analytische Messtechnik GmbH
##OWNER= root
$$ XWIN-NMR		Version 3.5
$$ Tue Nov 16 13:01:49 2021 Russian Standard Time (UT+4h)  she@DPX200
##.OBSERVE FREQUENCY= 200.131346
##.OBSERVE NUCLEUS= ^1H
##.ACQUISITION MODE= SIMULTANEOUS
##.ACQUISITION SCHEME= undefined
##.AVERAGES= 8
##.DIGITISER RES= 18
##SPECTROMETER/DATA SYSTEM= spect
##.PULSE SEQUENCE= zg30
##.SOLVENT NAME= CDCl3
##.SHIFT REFERENCE= (INTERNAL, CDCl3, 0, 15.7656)
##AUDIT TRAIL= $$ (NUMBER, WHEN, WHO, WHERE, WHAT)
$$ ##TITLE= Audit trail, XWIN-NMR		Version 3.5
$$ ##JCAMPDX= 5.01
$$ ##ORIGIN= Bruker BioSpin GmbH
$$ ##OWNER= she
$$ F:/spectra/data/she/nmr/H-F/1/pdata/1/auditp.txt
$$ ##AUDIT TRAIL=  $$ (NUMBER, WHEN, WHO, WHERE, WHAT)
(   1,<2021-11-16 13:00:28.78 +0400>,<she>,<DPX200>,
      <created by zg, POWCHK disabled, PULCHK disabled
       configuration hash MD5:
       00 E9 B6 7A A2 85 ED C7 34 08 36 98 17 FE 4E 26
       data hash MD5: 16K
       F3 E0 C1 19 8F 91 79 F2 C9 E7 53 F9 6F 2F FC 0F>)
(   2,<2021-11-16 13:00:33.43 +0400>,<she>,<DPX200>,
      <Start of raw data processing
       efp BC_mod = 2 LB = 0.24 FT_mod = 6 PKNL = 1 PHC0 = -15510.58 PHC1 = 9.800811 SI = 16K 
       data hash MD5: 16K
       28 EE 64 E1 4D 94 DA C1 67 B9 4C BD 72 BD 38 82>)
(   3,<2021-11-16 13:00:55.84 +0400>,<she>,<DPX200>,
      <pk PHC0 = 2.534695 PHC1 = -3 
       data hash MD5: 16K
       4F 5F BC 6F 47 21 C6 DD 33 32 D1 81 14 24 59 28>)
(   4,<2021-11-16 13:00:58.84 +0400>,<she>,<DPX200>,
      <abs ABSG = 5 
       data hash MD5: 16K
       71 55 78 55 5C 42 E3 98 2C 99 40 05 1E E6 0C B9>)
$$ ##END=
$$ 
$$ hash MD5
$$ BA A1 0B B6 D1 67 94 3A 3F 78 9E C4 BA C4 20 FD
##$RELAX= 
##$RELAX= 
##$RELAX= 
##$RELAX= 
##$RELAX= 
##$RELAX= 
$$ Bruker specific parameters
$$ --------------------------
##$DU= <F:/spectra>
##$EXPNO= 1
##$NAME= <H-F>
##$PROCNO= 1
##$TYPE= <nmr>
##$USER= <she>
##$AMP= (0..31)
100 100 100 100 100 100 100 100 100 100 100 100 100 100 100 100 100 100 
100 100 100 100 100 100 100 100 100 100 100 100 100 100 
##$AQSEQ= 0
##$AQ_mod= 1
##$AUNM= <au_zg>
##$AUTOPOS= <>
##$BF1= 200.13
##$BF2= 200.13
##$BF3= 200.13
##$BF4= 200.13
##$BF5= 200.13
##$BF6= 200.13
##$BF7= 200.13
##$BF8= 200.13
##$BYTORDA= 1
##$CFDGTYP= 0
##$CFRGTYP= 5
##$CHEMSTR= <none>
##$CNST= (0..31)
1 1 145 1 1 1 1 1 1 1 1 1 1 1 1 1 1 1 1 1 1 1 1 1 1 1 1 1 1 1 1 1 
##$CPDPRG= <>
##$CPDPRG1= <>
##$CPDPRG2= <>
##$CPDPRG3= <>
##$CPDPRG4= <mlev>
##$CPDPRG5= <mlev>
##$CPDPRG6= <mlev>
##$CPDPRG7= <mlev>
##$CPDPRG8= <mlev>
##$CPDPRGB= <>
##$CPDPRGT= <>
##$D= (0..31)
0 1.2 0 0 0 0 0 0 0 0.06 0 0.03 0 0 0 0 0.0002 0 0 0 0 0 0 0 0 0 0 0 0 
0 0 0 
##$DATE= 1637053228
##$DBL= (0..7)
120 120 120 120 120 120 120 120 
##$DBP= (0..7)
150 150 150 150 150 150 150 150 
##$DBP07= 0
##$DBPNAM0= <>
##$DBPNAM1= <>
##$DBPNAM2= <>
##$DBPNAM3= <>
##$DBPNAM4= <>
$$ [...]
##$SUBNAM2= <"">
##$SUBNAM3= <"">
##$SUBNAM4= <"">
##$SUBNAM5= <"">
##$SUBNAM6= <"">
##$SUBNAM7= <"">
##$SUBNAM8= <"">
##$SUBNAM9= <"">
##$SW= 18.0517287032376
##$SWIBOX= (0..15)
0 0 2 0 0 0 0 0 0 0 0 0 0 0 0 0 
##$SW_h= 3612.71676300578
##$TD= 16384
##$TD0= 1
##$TE= 0
##$TE2= 300
##$TE3= 300
##$TEG= 300
##$TL= (0..7)
0 120 120 120 120 120 120 120 
##$TP= (0..7)
150 150 150 150 150 150 150 150 
##$TP07= 0
##$TPNAME0= <>
##$TPNAME1= <>
##$TPNAME2= <>
##$TPNAME3= <>
##$TPNAME4= <>
##$TPNAME5= <>
##$TPNAME6= <>
##$TPNAME7= <>
##$TPOAL= (0..7)
0.5 0.5 0.5 0.5 0.5 0.5 0.5 0.5 
##$TPOFFS= (0..7)
0 0 0 0 0 0 0 0 
##$TUNHIN= 0
##$TUNHOUT= 0
##$TUNXOUT= 0
##$USERA1= <user>
##$USERA2= <user>
##$USERA3= <user>
##$USERA4= <user>
##$USERA5= <user>
##$V9= 5
##$VALIST= <valist>
##$VCLIST= <CCCCCCCCCCCCCCC>
##$VD= 0
##$VDLIST= <DDDDDDDDDDDDDDD>
##$VPLIST= <PPPPPPPPPPPPPPP>
##$VTLIST= <TTTTTTTTTTTTTTT>
##$WBST= 1024
##$WBSW= 4
##$XGAIN= (0..3)
0 0 0 0 
##$XL= 0
##$YL= 0
##$YMAX_a= 943625
##$YMIN_a= -1086604
##$ZGOPTNS= <>
##$ZL1= 120
##$ZL2= 120
##$ZL3= 120
##$ZL4= 120
##$ABSF1= 15.90885
##$ABSF2= -2.143003
##$ABSG= 5
##$ABSL= 3
##$ALPHA= 0
##$AQORDER= 0
##$ASSFAC= 0
##$ASSFACI= 0
##$ASSFACX= 0
##$ASSWID= 0
##$AUNMP= <proc_1d>
##$AZFE= 0.1
##$AZFW= 0.1
##$BCFW= 0
##$BC_mod= 2
##$BYTORDP= 0
##$COROFFS= 0
##$CY= -3
##$DATMOD= 1
##$DC= 0
##$DFILT= <>
##$DTYPP= 0
##$F1P= 0
##$F2P= 0
##$FCOR= 1
##$FTSIZE= 16384
##$FT_mod= 6
##$GAMMA= 0
##$GB= 0
##$INTBC= 1
##$INTSCL= 0
##$ISEN= 128
##$LB= 0.24
##$LEV0= 0
##$LPBIN= 0
##$MAXI= 10000
##$MC2= 0
##$MEAN= 0
##$ME_mod= 0
##$MI= 1.114404
##$NCOEF= 0
##$NC_proc= -3
##$NLEV= 6
##$NOISF1= 3.799351
##$NOISF2= 2.8
##$NSP= 0
##$NTH_PI= 0
##$NZP= 0
##$OFFSET= 15.76562
##$PC= 1
##$PHC0= -15508.04
##$PHC1= 6.800811
##$PH_mod= 1
##$PKNL= yes
##$PPARMOD= 0
##$PSCAL= 0
##$PSIGN= 0
##$REVERSE= no
##$SF= 200.129997183792
##$SI= 16384
##$SIGF1= 3
##$SIGF2= 2
##$SINO= 5.538805
##$SIOLD= 16384
##$SREGLST= <1H.CDCl3>
##$SSB= 0
##$STSI= 16384
##$STSR= 0
##$SW_p= 3612.71676300578
##$SYMM= 0
##$S_DEV= 0
##$TDeff= 16384
##$TDoff= 0
##$TI= <>
##$TILT= no
##$TM1= 0
##$TM2= 0
##$TOPLEV= 0
##$USERP1= <user>
##$USERP2= <user>
##$USERP3= <user>
##$USERP4= <user>
##$USERP5= <user>
##$WDW= 1
##$XDIM= 16384
##$YMAX_p= 362432975
##$YMIN_p= -112185
$$ End of Bruker specific parameters
$$ ---------------------------------
##NTUPLES= NMR SPECTRUM
##VAR_NAME=  FREQUENCY,     SPECTRUM/REAL,   SPECTRUM/IMAG
##SYMBOL=    X,             R,               I
##VAR_TYPE=  INDEPENDENT,   DEPENDENT,       DEPENDENT
##VAR_FORM=  AFFN,          ASDF,            ASDF
##VAR_DIM=   16384,         16384,           16384
##UNITS=     HZ,            ARBITRARY UNITS, ARBITRARY UNITS
##FACTOR=    0.220516191357247, 1,           1
##FIRST=     3155.17353255653, 0,            0
##LAST=      -457.543230449251, 0,           0
##MIN=       -457.543230449251, -112185,     0
##MAX=       3155.17353255653, 362432975,    0
$$ Real data points
##PAGE= N=1
##DATA TABLE= (X++(R..R)), XYDATA
$$ [...]
11376 -7142 -14240 -4324 -8851 -10380 -7392 -11778 -21095 -20001 -9622 -7478 -22157 -10727 11002 9366
11362 9366 -4507 -7043 -15876 -20709 -22625 -24406 -15038 -9472 -10665 -6780 -10704 -10969 -22659 -18768
11348 -18768 -15934 -574 -2288 -19941 -18443 -13579 -5575 -13140 -9439 -23253 -35069 -18965 -15763
11335 -15763 -24652 -24607 -16171 -21578 -20573 -22410 -12052 -5657 -11907 -10063 -10019 -10044 -16037 -8688 -21589
11320 -21589 -27782 -5039 556 3300 109 -8415 -2727 -7009 -9974 4265 -6845 -7142 -606 -1331
11306 -1331 -7885 -1033 -10980 -27504 -21102 -10752 -18134 -10154 -6453 -4733 -4633 -2466 -7975 -10378
11292 -10378 -7487 -8723 -13872 -14977 -7127 -13037 -6937 -7919 -689 -3778 -1899 5292 -68 3397 -4631
11277 -4631 -21737 -12229 -13584 -13125 -10093 -3831 -8955 -15192 -23547 -15807 -11345 -4647 1864 5685 606
11262 606 5266 -2731 -9369 -13230 -19965 -23714 -16100 -4582 -10407 -14663 -6131 -14693 -9305 -11706 -25904
11247 -25904 -11149 708 6867 6282 641 -4377 -13249 -8989 -10215 -6164 664 -8268 -13257 -10553
11233 -10553 -10209 -19676 -27396 -18680 -16633 -16891 -29754 -13355 -6866 -9361 -13596 -12148 -24823 -28127
11219 -28127 -20353 -23445 -11522 -12092 -3132 -11696 -7269 -9470 -10 -19430 -12919 -12882 -19357 -11532 4563
11204 4563 3047 -5265 -12715 -21652 -23108 -18459 -6845 -7754 -10429 7265 -231 -5012 1667 -4986
11190 -4986 10072 -4181 -22298 -23954 -18785 -24129 -8492 -4128 -4448 -4262 1015 -8862 -10606 -830
11176 -830 -2421 -6476 -3782 9888 -6721 -7631 -10591 -10751 -10872 -13566 -22776 -19728 -21054 -19516 -12922
11161 -12922 -4213 -6331 -5758 -10036 -18262 -10641 -4928 2779 6664 -12763 -20183 -14260 -20222 -19616 -10466
11146 -10466 -6145 -9695 2551 -1224 -19031 -14526 353 1822 -21124 -11099 2023 -6863 -18473
11133 -18473 -16336 -11988 3068 369 -3748 2654 -5033 -3420 -6386 -9810 -11895 -8203 -7860 6420
11119 6420 -10052 -9376 2126 -2795 -18902 -20940 -14756 -4943 -11467 -7623 2247 -3293 -2582 -2908 -4765
11104 -4765 -3205 -3794 -9155 131 2018 7182 9114 -2789 -12635 -7481 -10403 -5314 -9059 -11908 -5053
11089 -5053 -14978 -12759 -9207 3142 4116 3817 -16185 -13665 -15047 -16180 -12133 -13820 -10420 -4581 -4929
11074 -4929 -11434 -15977 -18259 1576 3174 1200 -5654 4832 4567 3776 -3846 4673 -3251 -10215 -10953
11059 -10953 -7958 1536 -9624 -18823 -5072 888 -5650 -2597 86 -1441 4918 17434 25343 8632
11045 8632 -9548 -1662 -259 4612 -2715 -3992 -4046 -6043 -6872 -4568 1879 2958 -5597 4796 -5042
11030 -5042 -8417 92 -7036 -15320 -4028 265 -5104 -7590 -1266 -7160 -5644 -12736 -15473 -2362
11016 -2362 1346 4107 824 -3207 -11768 -5888 -8335 508 -15464 -5459 -496 1373 -1328 -18
11002 -18 10932 5511 14838 19761 27427 34614 42060 34466 36228 29910 20636 5870 671 -3684 -13253
10987 -13253 -11350 -29573 -16280 6444 6361 8077 10859 6402 6682 18299 65 -3218 -4070 -1982
10973 -1982 603 -2587 -5175 -1820 1191 -2617 -881 -1131 7154 4074 1688 3155 -1252 1741 428
10958 428 -4379 -9733 -10267 -1932 -26 198 11664 14563 8648 3217 5992 596 -2758 16778 8445
10943 8445 -2194 -7114 1329 5653 -10258 -4271 13262 5717 1503 1449 17002 10867 17844 6598
10929 6598 17135 18813 9482 9038 3557 6783 6944 4051 -1097 3990 6852 16113 9169 4357 9978
10914 9978 18800 16985 9835 5862 2243 -777 8206 17876 26244 16199 13690 10233 9499 10502 11028
10899 11028 10418 7473 12966 21395 13698 12879 12568 13740 23738 28351 30250 16373 -6800 10668
10885 10668 5288 -2130 5769 7890 15752 18652 12535 22004 21245 12185 19094 15810 23621 26681 21794
10870 21794 17362 14019 8799 18491 20628 22392 13703 16520 20435 13671 18405 16249 11242 23732
10856 23732 29859 13141 9640 12729 19070 14586 17512 18602 18680 11510 15264 20521 28199 21666 -685
10841 -685 11253 17519 14068 20948 29855 25823 11121 14952 13752 15929 31436 25057 25536 18499
10827 18499 12875 19714 18394 12104 8707 9077 15022 23279 29841 20953 27355 17869 19302 17981 18029
10812 18029 20558 6111 9243 12097 9253 14501 16897 12865 17992 15113 19240 19495 19919 20637 11114
10797 11114 23328 13115 6425 1304 3559 9691 11018 21066 23864 26361 13823 15120 18115
10784 18115 14791 7491 6664 13674 18685 17688 24250 22698 22246 14932 21663 29794 20732 26289 24502
10769 24502 18349 16245 25947 37320 35692 13469 12937 12724 16357 15089 23016 27935 21352 24748
10755 24748 15993 17876 17569 18203 25613 29556 30936 31756 30029 15097 16140 27608 29849 34415 26551
10740 26551 22175 19494 28268 25261 26079 22216 28064 23216 21234 28897 20296 7040 7387 20301
10726 20301 18469 17002 22776 32349 28464 28994 24335 24757 25737 26816 39577 31636 31074 33382 32367
10711 32367 30329 39634 47089 37383 28307 21629 14847 19237 28017 31589 30786 32322 18765 25097
10697 25097 33033 15759 22784 20467 25112 30128 29681 24289 15553 25072 28848 23965 29938 28607
10683 28607 12524 5703 9444 28830 36178 37631 35642 26328 32756 44504 35340 40491 41092 33541
10669 33541 34500 31408 29579 21589 17770 17939 32584 27746 16251 15463 12435 21680 24616 27164 29854
10654 29854 20385 13906 26324 34527 31461 33355 25465 26754 32451 33377 29562 27845 35833 30279
10640 30279 31584 27300 14721 31254 33283 35514 30671 21080 29061 33791 29888 29208 29549 26165
10626 26165 27148 36518 40719 43616 37954 36717 36356 35387 33065 37016 31327 31963 54395 46535 37769
10611 37769 38776 33724 41085 52408 37069 24412 26528 34337 37032 31431 27198 31769 43797
10598 43797 41962 45330 46036 41779 37633 41862 39082 41417 45191 45069 40057 49014 47624 44413 47847
10583 47847 40377 40161 52377 43753 41079 44235 45623 48159 39915 32312 44491 58923 50462 42941
10569 42941 34872 43608 43533 43114 43006 50210 53828 60625 49755 45599 54278 46471 45624 41925 35492
10554 35492 33842 38222 37648 42673 58465 51852 49004 47628 44513 44384 44365 48825 51103 58544 50010
10539 50010 48210 50824 45026 54373 64582 54906 51068 63544 61623 47798 42164 53230 56914
10526 56914 63982 65099 52191 58007 60425 52510 58929 56208 57239 60519 52435 64678 59772 41465
10512 41465 53222 62711 63672 58062 67197 68510 77239 86859 73720 57365 48878 50248 64177 61020
10498 61020 55465 59249 61137 62738 63282 65766 58937 48983 57868 60359 65741 67101 66247 73646 70931
10483 70931 58588 61217 58535 70409 70271 58718 53981 51193 57898 61856 72939 62734 60044
10470 60044 68844 74095 73128 68161 53691 54040 60051 53602 54752 56239 62908 59962 56476 58343 63116
10455 63116 65623 65553 67190 71543 72467 67253 70954 68611 72567 71308 70695 73391 68020 80879 74425
10440 74425 72402 71656 62590 78929 75058 72540 77557 79322 71458 63721 67304 76888 71186 65570
10426 65570 67819 77090 70282 69448 67585 73156 67133 73319 68648 69779 73142 72635 65940 56295 69828
10411 69828 65719 64747 67140 71286 73238 78647 81601 72740 79891 84865 92686 83135 75713 73362 83214
10396 83214 82025 82701 85442 83484 81378 80070 86748 81144 81635 68337 63373 69432 76378 91554
10382 91554 98934 89490 89752 94920 84036 92349 97086 87568 83492 81974 74454 79243 71715 81065
10368 81065 92100 81057 90387 85545 88481 91868 88149 90228 88552 93473 97648 96614 100113 94643
10354 94643 83789 72162 87327 93570 94028 102252 99059 91463 104779 107147 101714 92958 89892 89447
10340 89447 86144 88329 97474 101968 104324 103916 97935 98807 109650 101790 107323 102387 92685 95895 98989
10325 98989 92409 87730 105383 113787 108397 108535 99714 103138 107892 111435 103024 116385 108501 110864
10311 110864 110883 112099 110004 91207 100260 98095 101627 96641 110487 108919 102357 96719 93986 94793
10297 94793 111460 93119 83976 104314 99510 115905 118292 111391 119128 115437 107252 112290 107687
10284 107687 112176 110248 107487 114923 120465 116875 103034 101590 116676 110531 101406 105703 105704 106371 96572
10269 96572 93960 107505 127954 127764 129076 117563 117458 110566 109826 114584 110584 98182 107607 113635
10255 113635 115967 122838 118361 104382 109908 118995 123403 126088 127298 128832 117496 114650 119520 127520
10241 127520 121298 123347 128243 132943 130829 136927 137740 136474 129738 125468 132938 128659 144503 137056
10227 137056 137757 130258 115102 119719 119768 118864 124664 130856 128651 130596 120152 120336 125067 134198 129857
10212 129857 128022 118738 124102 125987 135105 143469 141698 134187 117129 120789 130662 135590 142146 142704
10198 142704 130555 138433 134357 132399 132271 128440 129984 139265 149812 141880 141347 134626 132454 132926
10184 132926 127971 140216 137970 130601 139402 136903 133771 139880 141878 144360 139304 144231 159613 162039
10170 162039 158430 153778 150631 151708 154142 151533 139495 141919 140275 154446 159612 151212 161312
10157 161312 167225 159484 143916 152349 154880 158089 155175 144670 136133 137576 153686 155002 150257
10144 150257 152989 158075 157002 162863 160088 165614 169836 165808 154281 143641 142188 154228 154592 158348
10130 158348 154051 151574 160492 157306 153867 160647 171572 170976 168543 158888 158295 163735 166909 169954
10116 169954 150052 168312 173710 160504 173215 160375 154418 161004 160725 156676 176502 177395 172461
10103 172461 167953 174349 183095 194017 175279 169359 175630 173518 174265 165707 167597 169417 166987 166280
10089 166280 169711 183216 185221 179998 180553 172333 175584 172545 170087 173802 178213 172404 170365 165816
10075 165816 169281 166505 170293 176864 167113 173051 182363 172014 178574 189923 192662 182823 180552 191486
10061 191486 177290 185514 190724 193459 192121 186594 197611 201390 186568 175723 188540 185330 181502
10048 181502 186692 192406 183222 187084 194306 189260 191143 194826 196659 186193 196947 184634 193057
10035 193057 203331 202978 188825 189815 199608 196890 206914 210512 210694 194445 193050 200791 201568 210361
10021 210361 206979 208713 207526 197590 184132 193869 199954 199427 200709 204393 207225 192938 192041 197430
10007 197430 200631 205269 202262 207542 198772 202494 209778 197793 195070 203621 207354 202049 188301 201983
9993 201983 216618 209101 215345 205153 202957 189807 192273 197449 190702 196271 218002 221093 211869
9980 211869 212577 218851 215009 217358 215323 212413 215751 218228 218348 217887 202054 204088 205535 196457 190287
9965 190287 208856 215540 209245 212996 215659 211594 216364 219431 222659 224168 204478 210715 207821 211129
9951 211129 212640 217073 218003 223324 226960 221435 236562 234841 229739 228799 222281 214074 217595 223207 231810
9936 231810 234900 222007 219214 219527 217672 225774 232736 216623 230683 233753 231368 246233 243200 235965
9922 235965 225420 223970 227311 225811 228419 219172 210905 221610 220440 223314 229390 229605 217728 235377
9908 235377 229429 225513 235024 226682 226133 222046 232028 239246 232902 237432 228764 231643 227614 235838 231400
9893 231400 230176 226112 218074 219892 223730 235150 236580 232981 233232 234161 227646 227101 234132 224677 222198
9878 222198 229405 229986 224180 228226 231414 216381 205349 210419 225911 218793 232920 233280 237806 232642
9864 232642 219302 228674 232677 242537 242576 224719 211706 203293 233740 239404 227287 217893 227010 217837
9850 217837 220479 230713 233881 239599 241118 233598 232015 226814 237097 231605 235668 231919 239753 239970
9836 239970 234068 234877 228135 231189 242822 246606 240867 242413 242061 235729 235175 229059 225039 233140 242650
9821 242650 236002 231703 241894 244625 245343 242870 237413 238971 252786 241627 238315 241706 241386 248156
9807 248156 256301 229522 226071 234797 243346 232638 223269 228551 231301 239530 241572 233702 229933 247809
9793 247809 245755 238320 257607 248318 247640 249455 246476 235596 239373 241270 239123 241604 228154 230130
9779 230130 230488 235797 250964 249659 240932 240228 237422 238469 252415 256238 260713 253175 250427 250541 249061
9764 249061 249494 248078 250491 241798 240605 248462 256093 242748 226361 221019 227370 232788 237974 242505
9750 242505 246195 251625 240389 235794 229345 226091 228384 241791 246061 246999 242203 243414 244272 245039 241723
9735 241723 241564 243220 246319 245058 248905 252656 246176 239878 246759 247087 234474 243779 245393 246752 248597
9720 248597 245095 246995 249098 248467 244589 241295 244437 246433 248388 243452 235266 246002 252845 250927
9706 250927 247142 234097 244563 244844 252794 251372 255292 253203 245512 252675 261586 250912 243989 250472
9692 250472 249846 249067 250623 254187 267465 290559 286232 289804 293895 300073 283959 301086 305412 289445
9678 289445 291194 293832 290301 289996 283236 283024 276105 261717 267041 259817 256846 253931 259251 262004 267408
9663 267408 260172 261795 260752 261831 246588 251354 247694 262555 261489 261871 272572 272811 267717 256874
9649 256874 261535 251340 251060 262107 251133 250750 249347 239619 246795 268778 259159 243758 253946
9636 253946 252053 255419 252944 251888 238380 248668 252397 250315 254973 248172 240119 248192 240486 242837
9622 242837 249931 242729 250834 246679 245728 242584 225238 222293 221626 230322 240002 250584 255990 252987
9608 252987 258047 260800 251513 251424 243442 247685 258182 266510 271576 274966 275687 274199 270571 274150 277159
9593 277159 285220 294524 285388 289553 299586 307812 310156 304297 295506 294453 305983 314641 313479 318204
9579 318204 314888 325201 328369 323561 326432 328472 306941 300533 296623 314860 313463 308054 308611 293778
9565 293778 295872 301385 300357 289149 289016 298823 302177 313848 310908 312249 312795 312124 324747 308876
9551 308876 307221 302456 311148 315729 319981 320976 317110 326612 323996 331429 328723 338168 333905 328796 330970
9536 330970 326181 325021 329221 320531 309779 309247 309741 301759 297688 291115 287102 296521 294019 291334 290908
9521 290908 289903 283786 287326 285697 288565 289318 289026 283952 294773 295770 276851 272501 279475 283830 279444
9506 279444 275856 281194 275675 256588 259739 265756 266467 274398 265469 269640 265380 268575 274130 281229
9492 281229 280598 272400 277461 284042 277068 276126 272177 273566 276358 272398 273897 254378 248278 256325 262468
9477 262468 268622 273402 268636 275815 279525 287337 291586 277927 287417 285895 276887 286419 279923 264432
9463 264432 273771 274660 274626 272595 285153 291274 296719 290120 287876 294087 300539 298920 297001 303022 297813
9448 297813 288904 291625 299660 314272 314940 315483 311081 310703 315939 307034 312455 311830 309806 322279 335511
9433 335511 342486 330902 317426 318750 318769 319542 323462 336345 351367 350692 346367 359506 344567 337751
9419 337751 342874 354049 354756 361602 357307 355914 342944 358278 374981 383605 363218 362462 374181
9406 374181 383567 385143 379821 391241 395727 398932 403924 417858 420725 424852 427764 418299 414294 433033
9392 433033 441481 443986 451864 466850 458337 460771 456440 464097 461300 454109 461646 453117 447587 456735
9378 456735 474644 465192 452932 458886 470365 472503 474383 470469 481689 502883 522397 519670 524588
9365 524588 536258 534288 527574 524933 537324 544447 543779 537649 543998 557313 569197 569316 574347 586846
9351 586846 593493 584702 576028 586524 591610 587864 591581 604004 613047 614271 610203 613983 616142 619900
9337 619900 631695 641475 649059 659046 669286 682202 675203 673476 690085 691589 700767 718257 734830
9324 734830 748602 738453 752513 759874 787431 800402 803579 826581 835657 857696 869909 878794
9312 878794 907633 919854 928174 942209 967811 985959 1001121 1033629 1051877 1083992 1115300 1142787
9300 1142787 1161693 1187538 1213643 1257208 1300239 1330560 1365704 1402259 1438425 1485466 1536933
9289 1536933 1587870 1624420 1684956 1731390 1789310 1852428 1902085 1950121 2009263 2078360 2140240
9278 2140240 2197787 2270600 2339461 2419767 2512900 2597245 2684882 2764001 2801907 2862403 2926145
9267 2926145 2963823 3031765 3090025 3090843 3102693 3111468 3119803 3124070 3147006 3178045 3185474 3242518 3297027
9254 3297027 3354014 3420082 3498245 3574386 3662145 3763699 3880929 4006987 4143423 4285877
9244 4285877 4433063 4585417 4755376 4927566 5107086 5290595 5480112 5700723 5923358 6161623
9234 6161623 6390561 6650089 6915310 7187651 7462775 7746306 8064924 8394216 8747024 9093769
9224 9093769 9451767 9877097 10347350 10841041 11380163 11955348 12551628 13166067 13816339 14462800
9214 14462800 15124370 15733846 16312780 16843245 17322451 17705222 18006210 18220766 18311528 18320043
9204 18320043 18244752 18089105 17831879 17527867 17185344 16817185 16425001 16050223 15713498 15411191
9194 15411191 15142935 14937712 14776334 14665755 14611803 14627279 14704301 14856366 15070520 15331437
9184 15331437 15665649 16052951 16482598 16945012 17447582 17945576 18444937 18921103 19375111
9175 19375111 19806392 20172661 20450386 20643249 20741390 20711595 20572686 20315496 19919357 19406507
9165 19406507 18804553 18105359 17345342 16555026 15746717 14941386 14163165 13406022 12688437
9156 12688437 12025665 11393883 10829304 10298807 9797330 9326496 8898199 8495353 8118352
9147 8118352 7758687 7437117 7150753 6870435 6613089 6367876 6148311 5937253 5734783 5553227
9137 5553227 5379604 5218150 5066631 4930728 4792323 4673589 4556413 4438323 4324474 4222101
9127 4222101 4127313 4024424 3950464 3864115 3765758 3688810 3626025 3562662 3506172 3441552 3378089
9116 3378089 3315760 3268422 3223140 3174891 3125296 3068830 3019848 2965932 2935223 2901875 2863204
9105 2863204 2816652 2778846 2749866 2731497 2709863 2683576 2644683 2616158 2587981 2559884 2544523
9094 2544523 2530674 2525391 2508797 2493309 2474615 2455987 2453150 2459344 2443637 2434119 2420685 2428837
9082 2428837 2426837 2425051 2428134 2407781 2397860 2416142 2427936 2419500 2419232 2429356 2436256 2448259 2455026
9069 2455026 2442927 2448396 2460707 2480110 2486215 2501286 2517605 2545637 2571685 2579320 2608908 2642582
9057 2642582 2687528 2725081 2760422 2799686 2852884 2910065 2966318 3027490 3106623 3179463 3257037
9046 3257037 3343156 3430862 3531939 3639835 3763463 3886189 4014991 4155295 4297429 4441153
9036 4441153 4596132 4744422 4898610 5043307 5151791 5268842 5376399 5452904 5503092 5539586
9026 5539586 5547729 5542118 5515273 5438984 5358732 5283412 5192411 5095949 5012990 4934700 4868118 4827094
9014 4827094 4767803 4752123 4742555 4742709 4753322 4781782 4834341 4907278 4967472 5051493 5150881 5260107
9002 5260107 5383735 5506987 5641014 5763112 5888993 6001074 6114045 6230411 6305734 6336303
8992 6336303 6361365 6345848 6294807 6217859 6115161 5970572 5801813 5622589 5427373 5235585
8982 5235585 5045227 4854563 4675928 4508714 4368466 4230736 4106602 3989286 3889203 3800730
8972 3800730 3720596 3633401 3572646 3517303 3459234 3408961 3363530 3313019 3274732 3257884 3226910
8961 3226910 3205422 3177298 3164952 3153607 3136956 3111780 3087944 3087209 3081587 3075223 3066548 3057149 3058575
8948 3058575 3060469 3068366 3089938 3114664 3134111 3139995 3155687 3168002 3169984 3190990 3213873 3227884
8936 3227884 3225479 3206653 3209398 3188709 3158864 3136745 3123229 3104621 3078649 3070998 3060811 3044747
8924 3044747 3025741 3019642 3013051 2997414 2985518 2980312 2958902 2938714 2942536 2936472 2927986 2903030 2879656
8911 2879656 2868011 2854973 2842160 2831200 2817369 2805202 2800411 2803475 2789151 2785949 2776582 2744797
8899 2744797 2740177 2751170 2735586 2735402 2726217 2719385 2715862 2706586 2691281 2681162 2681523 2673061 2669146 2648781
8885 2648781 2628094 2604712 2593521 2576913 2564007 2542995 2546752 2543029 2536204 2515038 2510403 2515878
8873 2515878 2502263 2510063 2508801 2506092 2511807 2535768 2530301 2530373 2544094 2554962 2563197 2562720 2589661 2610702
8859 2610702 2626930 2644099 2660041 2712918 2756938 2791215 2836757 2874459 2924889 2964169 2998115
8848 2998115 3039227 3072451 3081456 3082912 3069567 3058490 3075169 3092460 3101751 3119603 3141320 3149570
8836 3149570 3186396 3220418 3242632 3280739 3319264 3377618 3435187 3516371 3585350 3673744 3774204
8825 3774204 3871904 3974530 4079327 4215874 4353604 4505709 4676632 4860305 5039995 5219672
8815 5219672 5396417 5567631 5726490 5866624 6004863 6126796 6261625 6431909 6611636 6803556
8805 6803556 7011443 7246365 7486292 7770727 8091899 8433872 8796035 9202040 9634925 10114849
8795 10114849 10599833 11108005 11637267 12145434 12650703 13127491 13562344 13928760 14247704
8786 14247704 14457732 14594415 14644661 14626131 14563268 14487457 14412514 14333724 14265154 14221958 14181558
8775 14181558 14154923 14143642 14156551 14210872 14334120 14522896 14791417 15119382 15533698 16003929
8765 16003929 16535835 17136924 17796096 18517463 19284662 20105193 20950862 21799812 22635198
8756 22635198 23404359 24106332 24678303 25111580 25391732 25511674 25464969 25287998 25005233 24615288
8746 24615288 24146243 23609640 23044684 22499536 21974329 21499788 21084347 20726923 20433187
8737 20433187 20249972 20167614 20196133 20295344 20494664 20802910 21222859 21802636 22552437 23441971
8727 23441971 24397050 25501113 26805884 28086248 28735058 29327749 30399829 31829686 33612329
8718 33612329 34767792 34326084 33009019 31433717 30260943 29560970 29065809 28602106 28083921
8709 28083921 27057334 25443269 24042933 22784117 21564385 20488104 19496513 18618789
8701 18618789 17894380 17308990 16819147 16390352 16008067 15647607 15304048 14968668 14632659
8692 14632659 14273520 13875686 13473880 13090192 12702104 12341223 11964494 11617160 11285156
8683 11285156 10977202 10695994 10434792 10188251 9961931 9765820 9601229 9446965 9328677
8674 9328677 9223252 9144169 9074423 9012118 8958070 8925018 8913632 8877133 8857710 8848644 8819088
8663 8819088 8796332 8757308 8703504 8642237 8551386 8441876 8317343 8181388 8035491 7855830
8653 7855830 7659868 7429550 7205160 6999716 6800010 6626661 6471555 6327570 6195626 6074291
8643 6074291 5957423 5849026 5755164 5667929 5587871 5508153 5437746 5370942 5322206 5262462 5213132
8632 5213132 5173780 5129758 5094209 5065087 5030793 5024931 5001464 4975398 4962257 4952610 4947947 4955274
8620 4955274 4962447 4966682 4980172 4996042 5022322 5053195 5104932 5136153 5188563 5260974 5337009 5434328
8608 5434328 5542744 5672612 5807316 5968121 6168725 6378139 6613127 6877173 7188912 7533328
8598 7533328 7926118 8341196 8792600 9289596 9812564 10338115 10846569 11339013 11775694 12144753
8588 12144753 12453724 12690302 12825371 12854666 12785882 12591271 12424562 12210854 11965550 11715573
8578 11715573 11458335 11219876 11017430 10877467 10761948 10709746 10690316 10723245 10800190 10936944
8568 10936944 11108310 11337587 11611355 11965872 12376244 12834663 13321717 13816621 14312521
8559 14312521 14819128 15319730 15824274 16299143 16645083 16860841 16901647 16728733 16378422 15912149
8549 15912149 15352532 14755983 14160097 13597363 13083772 12591780 12123547 11686447 11278377
8540 11278377 10896370 10547080 10205898 9892290 9611076 9365226 9146418 8988065 8876816
8531 8876816 8779492 8722638 8709343 8711952 8737194 8784719 8839108 8871662 8880132 8872439 8840396 8765690
8519 8765690 8651512 8480134 8265755 8015491 7730892 7434730 7137180 6842085 6522539 6228182
8509 6228182 5951727 5686573 5445499 5214055 4996325 4788158 4590601 4425970 4255025 4090586
8499 4090586 3916368 3762866 3627040 3492991 3371613 3248548 3140958 3047458 2947142 2853934
8489 2853934 2764205 2693497 2614457 2551007 2491604 2425509 2350567 2299108 2255714 2200732 2144509
8478 2144509 2112823 2063629 2023194 1980626 1935952 1901435 1846365 1808147 1781110 1732229 1685035
8467 1685035 1652694 1620144 1599757 1568635 1531561 1498849 1480432 1462539 1439279 1412714 1392133
8456 1392133 1387057 1367269 1337589 1316744 1292230 1277893 1268146 1250323 1241221 1230329 1210609 1191944
8444 1191944 1178164 1163381 1161767 1163901 1149046 1148269 1139202 1117737 1109277 1091824 1076721 1063709 1044635
8431 1044635 1039481 1025968 1021422 1024808 1011924 1000052 999674 996914 1002137 994433 982032 976871 968681
8418 968681 956230 961633 959191 938104 936968 929261 919883 917043 907048 898681 882439 883587 874464 871587
8404 871587 870930 862647 847543 846895 846592 854679 839476 830826 834922 825383 831049 830676 812434 806095 800521
8389 800521 809416 805849 799640 789291 787082 781157 770760 761033 762358 769687 762306 760157 730912 724046
8375 724046 719922 714474 708457 698350 692370 689289 691661 688940 681345 673117 674675 666496 659071 650363
8361 650363 651299 645155 629261 623712 618744 618170 622341 630496 621483 611287 587812 592542 590023 584188
8347 584188 569846 565672 567003 572372 576942 571257 570617 568223 569871 557810 542614 536573 540747 542731
8333 542731 538696 538620 531552 527529 518243 527947 514496 500285 490084 484874 493788 485757 481098 478297
8319 478297 466956 456712 460509 455697 452739 438356 431052 420165 417388 427914 426467 414779 411080
8306 411080 414759 410650 396812 392506 388505 383284 388064 385515 372029 377887 383271 378558 372529 362250
8292 362250 364896 361207 365271 365353 355198 349815 351410 338983 317290 318455 329313 324011 316204 336596
8278 336596 328407 320550 319388 321168 312385 303902 305005 302122 308373 299100 298423 313643 306446 291543
8264 291543 287528 290534 302860 307983 300799 294865 295966 297468 296852 299647 311886 295777 299691 306883
8250 306883 290190 286746 295771 307801 309615 319766 332022 326960 329978 343389 352503 352514 355159 342235
8236 342235 328934 335164 332066 329964 320991 322151 326928 311548 310066 316337 314391 300023 289360
8223 289360 291961 289082 284041 284209 275323 268086 252241 248515 254979 256250 254277 246494 229246 226418
8209 226418 222885 225408 219105 217535 217730 221757 225591 226108 216535 226818 234647 228387 222879 233475
8195 233475 242426 231028 211011 129890 180519 225643 228188 236173 234141 236746 231709 223801 213523
8182 213523 224564 220505 193460 179835 182676 182891 185199 178134 177358 173770 161455 154996 162333 152570
8168 152570 154186 161430 163694 153626 137432 151893 154661 157396 150182 141013 146850 143824 147999 146670
8154 146670 119171 116956 132512 137021 139240 131353 132995 134139 138014 123727 98582 94817 89493
8141 89493 89548 88136 90852 101281 91586 74944 79229 69860 71986 70447 57045 71924 80719 71441
8127 71441 62870 72423 64089 64175 64757 71245 79278 85344 77742 63098 63308 52330 48223 53627 60242
8112 60242 55089 57709 56985 51655 56552 52961 54772 59341 52430 44751 33601 22900 36288 33939
8098 33939 42230 53027 38005 22468 34837 35478 24915 32544 31818 36951 50853 48745 34250
8085 34250 35543 30338 21478 23527 31985 27989 18916 18681 22525 11346 13164 7152 20597 11983
8071 11983 10844 12621 12035 8638 9802 27085 18334 22583 20016 14152 10771 22575 23501 12989
8057 12989 13445 16968 -3548 -5396 1594 11973 9165 -8670 -7530 5285 10444 1891 6759 6785
8043 6785 7153 7406 12180 11378 11816 4803 6775 9770 -9102 -6623 -17352 -16765 -10568 -18152 -11764 -3087
8027 -3087 -5931 2043 2892 -14206 -13247 -9878 3591 -862 -4401 1718 -83 203 -6610 -5312 933
8012 933 4457 -3689 -15197 -6798 597 551 -10794 -14108 -16091 -18515 -12132 -3720 -20623 -38733 -30738
7997 -30738 -38994 -29359 -14344 -14574 -28075 -14639 -15407 -14462 -12357 -23228 -28869 -25897 -31963 -43260
7983 -43260 -36211 -35197 -25141 -24297 -21062 -15758 -12883 -8959 -8145 -20766 -23602 -26115 -33891 -32171 -22756
7968 -22756 -21108 -23017 -18715 -18517 -19102 -30735 -27255 -23607 -27718 -33592 -35867 -36602 -29856 -37352 -32986
7953 -32986 -32457 -22270 -28818 -38752 -44014 -41456 -25585 -27678 -33622 -44043 -39631 -21480 -21137 -27757
7939 -27757 -24001 -27557 -36510 -38174 -29827 -34363 -44500 -38478 -38219 -45992 -40025 -27520 -33850 -34301 -40252
7924 -40252 -36978 -24461 -43858 -33505 -38295 -45742 -41817 -26984 -22438 -33915 -41270 -39698 -52300
7911 -52300 -49983 -55166 -51913 -47478 -37347 -45695 -35650 -28636 -38840 -40479 -27143 -26587 -34423 -42591
7897 -42591 -42642 -40940 -37724 -43819 -55734 -57833 -58402 -34749 -30441 -38184 -46029 -42859 -41033 -41281 -60985
7882 -60985 -47224 -37551 -27065 -30193 -24237 -23744 -38593 -35152 -29810 -37907 -52651 -42843 -37879 -45076
7868 -45076 -50371 -39018 -49305 -54595 -45472 -49221 -51593 -59010 -62787 -57564 -52149 -57606 -50492 -48251
7854 -48251 -45773 -47798 -47690 -46296 -41211 -38642 -47404 -56421 -46975 -54327 -48097 -56403 -57261 -50707 -61110
7839 -61110 -53871 -65912 -58222 -49558 -60156 -62297 -62335 -60903 -55769 -61603 -65932 -69796 -67098 -68375 -59683
7824 -59683 -62065 -65009 -57751 -69988 -69655 -67833 -66780 -65577 -58060 -54165 -56110 -63584 -68651 -59094 -56919
7809 -56919 -52309 -56779 -62183 -61833 -55226 -55701 -40597 -39850 -37840 -61129 -79703 -67306 -64506 -72384
7795 -72384 -78754 -68936 -65332 -67652 -73097 -76321 -77418 -79718 -68696 -57297 -53592 -71743 -73097 -75494
7781 -75494 -74177 -59932 -59558 -66143 -66182 -65356 -74139 -74562 -81214 -78433 -80623 -74735 -73428 -77954 -75610 -66866
7765 -66866 -70060 -71375 -73447 -67703 -72282 -72164 -72257 -76302 -66581 -58590 -67946 -61431 -62110 -67804 -64664 -66969
7749 -66969 -64049 -51772 -59555 -68524 -62575 -66932 -64113 -66456 -61703 -57990 -61160 -62408 -58114 -61061
7735 -61061 -57524 -58020 -59069 -60527 -62115 -63431 -65818 -67817 -69316 -66315 -68445 -66104 -62569 -70553 -71839
7720 -71839 -74432 -77587 -72507 -67842 -73730 -69101 -69513 -67704 -77083 -86242 -70713 -69761 -76004 -88152 -87148
7705 -87148 -72322 -74470 -75459 -68052 -64974 -67786 -67732 -79356 -69088 -61651 -61039 -69220 -77637 -79533 -72031
7690 -72031 -79008 -79520 -69408 -69345 -70412 -70857 -56326 -69771 -69558 -65982 -70826 -69442 -55842 -70442 -66211
7675 -66211 -68588 -71741 -79316 -74309 -72477 -68557 -64043 -67492 -80352 -78828 -77791 -75187 -76998 -67960
7661 -67960 -70899 -82298 -77017 -84140 -90876 -90322 -77787 -72109 -64389 -74400 -73689 -66735 -62563 -67710
7647 -67710 -71643 -69210 -63446 -67555 -75493 -77026 -61892 -68305 -60937 -56211 -75922 -71954 -68300 -78032
7633 -78032 -78587 -82694 -82722 -67069 -70448 -82233 -81482 -85442 -80347 -76767 -76116 -79584 -85782 -86343 -76472 -83405
7617 -83405 -77836 -73860 -75072 -69795 -76767 -77388 -76120 -73337 -76936 -74157 -76087 -73791 -69993 -66023 -63293
7602 -63293 -77296 -79640 -83589 -90793 -83265 -79425 -76149 -74090 -72326 -75712 -83725 -72557 -65365 -79326
7588 -79326 -80515 -81230 -87272 -80512 -88537 -83575 -80667 -76411 -71988 -60250 -59579 -68118 -81530 -86344 -76864
7573 -76864 -74118 -84714 -86129 -81176 -77183 -68010 -77634 -85760 -95137 -103820 -95235 -87266 -94093 -90664
7559 -90664 -85719 -87792 -96999 -96787 -92844 -95739 -90813 -76898 -90502 -104784 -99622 -94938 -102085 -90514
7545 -90514 -84223 -95435 -94728 -104296 -94334 -88982 -86597 -85684 -86486 -80636 -89435 -87944 -91059 -90543 -88404
7530 -88404 -95485 -94338 -87176 -84383 -71247 -76437 -88848 -83165 -71440 -60851 -74025 -75454 -73669
7517 -73669 -68711 -63818 -67751 -73603 -89073 -103280 -98721 -83531 -75728 -90559 -89256 -92493 -92270 -84668
7503 -84668 -80712 -71355 -74761 -71572 -78135 -86500 -88266 -89747 -90109 -91680 -92288 -86523 -83614 -87142 -98207
7488 -98207 -89346 -89241 -92339 -92642 -90436 -90808 -86171 -89095 -86132 -91535 -87531 -92915 -88446 -85187 -76801
7473 -76801 -77940 -86830 -84497 -85049 -88215 -91062 -82861 -84798 -78584 -74793 -72759 -80770 -77558 -77957 -107645
7458 -107645 -93848 -85002 -84277 -84821 -84078 -71975 -77863 -84411 -92247 -89643 -94948 -96308 -85904 -73625
7444 -73625 -89540 -97941 -91999 -86053 -88363 -91770 -89921 -89390 -98004 -105846 -100259 -91147 -90566 -96225 -102157
7429 -102157 -92272 -86949 -86555 -87346 -88331 -94238 -99512 -88743 -71742 -61416 -58832 -70046 -71231 -68152
7415 -68152 -78835 -80120 -77399 -78327 -82049 -71988 -81502 -74826 -77379 -77432 -84183 -79475 -68920 -80546
7401 -80546 -86816 -88554 -76169 -79666 -83840 -90283 -79007 -84661 -91721 -90772 -102925 -93423 -88161 -89000
7387 -89000 -90245 -86670 -90250 -99324 -98586 -103072 -101652 -96918 -92329 -92046 -85828 -88193 -89533 -89388 -87080
7372 -87080 -86092 -90352 -92462 -97298 -100485 -107030 -96290 -85486 -94297 -103839 -109091 -102643 -96480 -78043
7358 -78043 -95608 -96261 -101593 -104492 -112185 -108981 -98009 -106752 -105220 -102376 -108785 -107373 -108147 -99659 -104852
7343 -104852 -94737 -91210 -83907 -81363 -89023 -88098 -101622 -107189 -98496 -93075 -92722 -103998 -97951 -94086
7329 -94086 -98203 -95952 -101843 -99535 -98550 -92414 -92536 -92376 -106181 -109115 -96844 -92861 -87154 -93277 -108278
7314 -108278 -95926 -95332 -95042 -91160 -94102 -103747 -95110 -101862 -93513 -97107 -96199 -72794 -71420 -84740
7300 -84740 -91481 -93079 -85278 -93920 -87688 -91016 -88950 -95039 -90395 -84790 -81848 -80082 -85412 -77711 -79605
7285 -79605 -81399 -83117 -89661 -94472 -92594 -85415 -95393 -101693 -95569 -98730 -93667 -97767 -98341 -89835 -87406
7270 -87406 -77706 -91885 -98912 -85018 -92442 -89649 -96393 -105227 -103815 -95314 -87643 -87101 -83251 -83966 -82194
7255 -82194 -90855 -94629 -95317 -97250 -90299 -95743 -107194 -98072 -97691 -92774 -92882 -86132 -78610 -97241 -109842
7240 -109842 -100965 -99971 -101240 -96942 -93869 -84140 -81013 -87702 -79901 -86829 -90618 -88977 -100891 -97889
7226 -97889 -101873 -86561 -83602 -77143 -81431 -81172 -79879 -76884 -75665 -83247 -83450 -78442 -76835 -71294 -88395
7211 -88395 -97009 -93539 -89070 -77412 -83019 -81157 -79598 -77068 -83971 -93753 -92732 -95974 -107201 -110034
7197 -110034 -94993 -92179 -98982 -86245 -87812 -82438 -83885 -87937 -93883 -96952 -87985 -78119 -79403 -83939
7183 -83939 -105021 -104507 -100525 -94437 -90410 -101033 -94942 -91615 -82352 -90995 -92068 -99089 -107771 -85307
7169 -85307 -85228 -84123 -83789 -84439 -77729 -87433 -82877 -84625 -90711 -93987 -92240 -93938 -101797 -97604 -89459 -75109
7153 -75109 -81709 -91521 -88744 -103222 -89830 -70430 -86503 -84061 -76411 -83890 -82427 -86616 -77761 -72969
7139 -72969 -70296 -70747 -66117 -80795 -67055 -66928 -78855 -79652 -72995 -75396 -74495 -87086 -67457 -64525
7125 -64525 -67629 -77787 -81938 -74051 -76204 -80371 -77334 -70159 -70720 -84091 -82674 -84305 -88001 -96488
7111 -96488 -91043 -88903 -95165 -92161 -85930 -91765 -70878 -74280 -87470 -81328 -84302 -86675 -78646 -87351
7097 -87351 -80856 -76177 -93616 -87577 -83433 -81835 -93139 -84046 -90727 -75643 -71362 -76753 -89711 -84074
7083 -84074 -85742 -80408 -93411 -90697 -79809 -81644 -83544 -78756 -75666 -74822 -75243 -75439 -88288 -75495
7069 -75495 -68177 -63985 -69819 -71948 -74441 -75762 -82295 -76752 -75593 -66978 -72742 -64556 -71950 -64119 -62484
7054 -62484 -61720 -63004 -70273 -57539 -61417 -70882 -62062 -67178 -74367 -66014 -52413 -61810 -63643 -63952 -76745
7039 -76745 -69059 -75824 -81666 -65589 -57550 -59846 -56404 -52408 -46282 -47912 -41038 -46991 -58024 -46700
7025 -46700 -28034 -25874 -18625 -21467 -19639 -12719 -1807 6829 21496 22110 27589 30536 41645 52657
7011 52657 49548 50972 38199 29636 27806 21048 18729 11593 -2932 -14240 -15786 -23961 -19462 -27674
6997 -27674 -30465 -33057 -40989 -28964 -31658 -37549 -52197 -43020 -45927 -55477 -53161 -47289 -45200 -46685
6983 -46685 -48544 -54609 -65047 -70288 -74168 -67999 -59853 -63759 -63959 -67237 -66465 -54488 -49070 -52428 -48798
6968 -48798 -48412 -45757 -53782 -55395 -66978 -50995 -56397 -66725 -62403 -53696 -50014 -64228 -59978 -56074
6954 -56074 -58014 -42057 -46840 -51258 -51246 -36818 -36450 -47973 -43513 -45225 -56738 -57541 -53621 -45940 -51890
6939 -51890 -44569 -34944 -44776 -50651 -47297 -39217 -42348 -50775 -52001 -46441 -44117 -43240 -40532 -42064 -35450
6924 -35450 -58851 -49025 -37187 -42519 -51030 -48645 -48733 -47021 -34514 -38060 -46785 -49013 -53239 -45966
6910 -45966 -43691 -53070 -50144 -45653 -39691 -38800 -43165 -33509 -38111 -49383 -43082 -46471 -41663 -41533 -43567
6895 -43567 -46105 -41900 -33351 -36756 -48994 -38221 -26796 -19922 -30111 -29469 -28924 -34987 -26097 -36620
6881 -36620 -39376 -22712 -25182 -31996 -36178 -30853 -28221 -23288 -9141 444 1580 -6111 -12112 -4715
6867 -4715 -2442 -5451 -13604 -25264 -29877 -20158 -13400 -16756 -12190 -18085 -25247 -11434 -20912 -14747
6853 -14747 -13313 -16261 -21243 -25635 -20556 -23730 -14160 -11972 -3693 -6977 -10518 -1592 -11248 -7659 205
6838 205 20599 10589 11775 20055 20508 13808 22183 27392 32719 26483 29239 22410 26975 32610 33320
6823 33320 42732 51695 45070 40968 39184 38573 48218 45654 60423 74011 74385 70276 69828 65046 76064
6808 76064 79848 84209 91380 88682 85532 106076 99685 95433 113845 113583 106925 119069 111875 133773
6794 133773 136663 139231 135869 133220 150633 154140 148935 147761 155476 165090 174746 177987 181575 188433
6780 188433 200738 191536 213408 221126 222998 228872 244735 252021 269450 267954 287917 292255 304667
6767 304667 314243 315554 307027 315066 317985 313363 324785 323000 342571 346936 355245 358767 361252 371517
6753 371517 379827 378545 389482 398973 410580 412442 418501 426913 443659 450355 467353 468904 486254
6740 486254 493898 501801 527975 534465 537656 534711 538561 562686 580998 596701 601270 615982 633400
6727 633400 648767 651443 663224 679439 687460 692031 699664 703658 717076 723180 734910 744633 738413
6714 738413 762199 774520 761146 762543 762218 765175 770794 773606 781255 786789 793018 796215 785615 793048
6700 793048 786614 792826 783085 776248 778979 781554 763154 744596 745173 753926 748846 733324 702740 704240
6686 704240 701195 682807 676179 668020 653362 635347 620296 603939 602638 588783 589619 578967 571224
6673 571224 563728 545053 527052 522365 505366 500635 494027 483639 459608 444972 431683 423995 427202
6660 427202 426012 417126 411505 399079 391971 380870 368666 357187 354807 337324 338570 325471 305828
6647 305828 303252 295498 295435 290807 285014 285167 265883 260024 250442 236022 246473 241031 236364 234217
6633 234217 226147 219202 222999 224383 206425 193219 201490 186481 167689 179214 188935 180875 169607
6620 169607 167424 165705 162988 150663 164663 155607 144735 136024 133268 135941 128219 124684 125543 123197
6606 123197 109058 122147 105013 93981 91896 93196 90302 83474 88641 88466 77355 83512 83249 75767
6592 75767 72256 73906 81106 69276 57763 63441 62593 58790 62506 51990 43259 53898 53912 40928
6578 40928 37423 50220 52859 44672 45031 43116 43587 39086 45023 43534 39449 36241 38503 21730 19709
6563 19709 28049 34861 32715 21613 20822 17349 15673 29239 13635 14913 25033 29843 24251 10375
6549 10375 9766 6925 10522 -167 -2001 -3373 4033 8548 1252 8001 8412 8190 4898 2388 -5065
6534 -5065 -9479 7941 11731 5102 12254 -1889 -4852 5777 505 2647 6686 -2695 -5675 -3523
6520 -3523 -9356 -12456 -1416 -3685 -7781 -8953 -11569 -13192 -13324 -7645 -1687 -8131 -20458 -19759 -27118
6505 -27118 -26605 -23009 -13306 -13855 -13534 -8111 -20461 -26432 -22718 -18345 -12210 -23336 -28963 -33763 -22357
6490 -22357 -17984 -15176 -10002 -20033 -18001 -5996 -19169 -14354 -16672 -13048 -16975 -10656 -8120 -8300
6476 -8300 -10197 -15587 -6288 -9981 -11254 -12603 -20638 -16379 -9087 -1338 -4872 -33 2212 -4575 8301
6461 8301 22156 17517 30592 29228 26865 26116 30884 40900 42268 41808 45849 49084 36006 53114
6447 53114 74789 76863 64274 62758 69570 55240 56875 52353 43284 39948 48377 39451 8485 18585
6433 18585 25981 14263 6087 -7420 2058 -11714 -9230 -13903 -18615 -21225 -26979 -25419 -29053 -14291
6419 -14291 -14519 -22741 -30412 -25390 -34538 -46489 -47726 -27955 -28544 -27334 -22311 -17931 -28567 -27160
6405 -27160 -32745 -41944 -42566 -40150 -36377 -38767 -33077 -41614 -44535 -36268 -39796 -33912 -32015 -32616 -39277
6390 -39277 -35214 -24676 -21187 -7930 -13861 -22924 -28678 -29030 -38913 -33753 -28494 -40716 -29391 -36430
6376 -36430 -35358 -36033 -34028 -30906 -37484 -38417 -52845 -45069 -27311 -32131 -32025 -34680 -31720 -29176 -31115
6361 -31115 -28182 -26914 -31047 -27580 -26213 -18921 -21587 -29090 -34684 -27603 -34704 -30775 -21695 -17552 -17728
6346 -17728 -18659 -30220 -34535 -35277 -27745 -19222 -10704 -15281 -10118 -7527 -13716 -10527 -13276 -23506 -22375
6331 -22375 -26414 -25945 -21283 -13002 -16920 -18497 -13097 -5733 3551 45 -8192 -22299 -24206 -24345 -19720
6316 -19720 -17679 -21663 -18116 -13368 -21783 -6765 -19701 -16644 -7776 -2016 -4035 8083 13350 4514
6302 4514 -464 -16150 -23607 -23993 -13953 -4014 -2220 -4539 -2434 -910 -6788 -8525 -4674 -6582 4626
6287 4626 6616 -3488 -6227 -8301 -10477 5160 11355 14552 9227 8831 10043 -6921 1720 545
6273 545 -3069 -11803 -4377 8277 1032 2757 3863 677 -7765 -657 -6685 1710 -654 5360 -4352
6258 -4352 -9296 -7916 -5613 -15532 -16184 -2652 -16971 -15237 -9475 -3864 -20588 -13699 -8236 3171
6244 3171 2170 -2289 -11128 110 5360 5621 -3890 -5264 -138 7874 3518 -8038 1564 -2011 -6787
6229 -6787 -5697 2075 9592 -3671 -5448 -13040 540 13979 13691 3485 9448 -3635 193 5921
6215 5921 -4915 1466 14060 8979 18630 9261 2143 2506 6332 -4943 2702 3144 1369 3997 6019
6200 6019 3456 -4911 -8114 9276 13164 -1475 -167 16658 18358 4429 15831 10817 4476 23972
6186 23972 31545 29853 29194 19662 29900 32496 28512 25854 24961 20206 16668 18121 23561 20604 8722
6171 8722 3372 12601 13071 7779 1171 18740 9036 -4185 3692 25320 20106 12125 7237 2752
6157 2752 11806 5649 4936 17294 26654 14279 5746 15575 18382 33680 30083 29965 24588 22579 15472
6142 15472 19298 16931 21106 31204 30462 25946 29226 37049 43478 39246 40345 30848 43693 33311
6128 33311 25929 15195 18659 28706 27468 19811 33380 33024 37035 53134 53884 53716 43741 33837
6114 33837 45938 57690 50907 38190 37334 31114 48025 51268 44727 35813 43712 46471 47081 39175
6100 39175 40774 57610 60444 67486 67337 67828 61599 65789 70460 69042 66284 83016 91702 104405
6086 104405 120139 113850 120019 126467 147175 151572 149453 170291 177184 188664 192206 206029 214251
6073 214251 205651 194449 183574 186757 175863 176755 165353 175917 185094 192887 209296 216832 231003
6060 231003 234775 254197 264447 255830 248654 268477 262582 250455 236644 233115 232339 235351 219886
6047 219886 212950 224527 221433 213715 224331 228778 225754 238533 261580 253886 263766 268530 280648
6034 280648 294388 291822 274793 272241 268161 264175 246087 231671 231553 235351 224266 205639 217862
6021 217862 224619 232849 264208 270261 284298 285706 281486 277042 262649 247606 252502 245707 242661
6008 242661 226440 212738 220090 246683 248143 251922 233385 236219 255994 262383 272503 291201 289344
5995 289344 278793 291363 309606 309873 325541 328349 349085 363149 373028 391482 414460 438697
5983 438697 479700 527795 573809 639000 695377 742778 771360 740419 664794 575354 510215 460246
5971 460246 420754 408878 367467 357664 357056 333642 311154 311037 310043 304128 303027 307653 310292 316698
5957 316698 310209 295002 282974 278181 284324 302058 317548 311556 312503 315202 317748 321834 306214
5944 306214 298761 304927 304325 302240 313403 313517 313119 306464 313714 303112 310333 319131 308441 303622
5930 303622 304321 316698 319174 311537 307592 293751 291860 291699 280374 264818 269255 261891 266777 261096
5916 261096 266748 271731 297900 299742 306538 309084 311430 317275 325907 342974 359268 359365 367671 371551
5902 371551 368783 389058 401622 392567 386339 374653 380205 370611 358072 337528 334352 333211 334395
5889 334395 329312 339344 320551 337734 340919 351579 360711 362114 364325 375625 392269 404338 396752
5876 396752 387747 392635 416973 423115 402869 398736 388641 381017 384152 378708 384536 390954 384415 386241
5862 386241 374450 372756 372848 365832 353464 362254 370902 370473 365768 365069 366430 370682 362474 376633 384033
5847 384033 387556 397555 406054 406323 401792 409761 401799 382346 365729 340671 350611 337196 318776
5834 318776 304540 323270 315737 311051 309836 303161 297667 300338 310096 308062 308107 304752 290673 291286
5820 291286 288651 299487 307769 310142 298559 302391 304696 315492 308171 302462 311437 313467 326197
5807 326197 339678 347475 357253 367943 377460 391806 408471 426287 428365 410122 410009 397924 387182
5794 387182 369080 366951 348306 339135 333654 332459 333454 344622 368265 392853 400722 420261 441596
5781 441596 451173 458525 472357 482778 488886 505270 527697 538077 546007 559498 594116 604360
5769 604360 634337 658467 703401 747390 765790 793230 825529 855605 888182 927851 969376 1029118
5757 1029118 1098139 1188587 1287147 1398476 1523091 1668278 1827358 2011210 2233560 2481473
5747 2481473 2779105 3111699 3452905 3725925 3826315 3645085 3272100 2875588 2540233 2275000
5737 2275000 2085011 1976217 1920687 1890860 1871292 1842241 1771272 1679927 1586333 1499933 1427964
5726 1427964 1397630 1397651 1406728 1425822 1456106 1510338 1554941 1598423 1632571 1663769 1689657 1736290
5714 1736290 1799041 1861645 1914883 1937727 1910862 1860517 1804828 1739349 1684982 1633806 1614173
5703 1614173 1605061 1574285 1545024 1541065 1537419 1563190 1596276 1653646 1694065 1748182 1810952 1865735
5691 1865735 1891966 1891609 1848867 1831819 1794807 1780695 1778500 1804518 1813757 1833787 1842748 1862725
5679 1862725 1878578 1893461 1892665 1897651 1882088 1886335 1893478 1892366 1869473 1853858 1841517 1828604 1801657
5666 1801657 1785782 1776451 1758159 1746571 1736368 1738521 1745195 1725349 1746071 1757998 1773757 1785849
5654 1785849 1805927 1827118 1866337 1900082 1941835 1994158 2041735 2078862 2138100 2195428 2248939
5643 2248939 2277079 2295078 2303818 2297916 2281630 2254910 2219485 2178690 2114406 2051820 1964383 1893473
5631 1893473 1825603 1757984 1692092 1636602 1597969 1555033 1499773 1455138 1421459 1387649 1376405
5620 1376405 1374247 1371070 1370240 1367258 1360866 1372497 1369047 1364776 1366871 1375277 1373006 1378128 1366309 1361368
5606 1361368 1355015 1355111 1354661 1353504 1331571 1326237 1301128 1275674 1239417 1227540 1215866 1207501 1208913
5593 1208913 1204341 1188338 1193091 1173374 1167929 1154284 1147407 1134972 1126216 1101715 1084257 1051986
5581 1051986 1019973 999161 1008239 1030276 1077312 1112104 1157448 1189594 1188645 1178836 1179530 1180037 1202207
5568 1202207 1222046 1258145 1274321 1276024 1260710 1244055 1185919 1140217 1121536 1138842 1174642 1233705
5556 1233705 1253691 1275830 1278034 1291864 1309375 1341270 1378796 1419495 1429208 1469569 1502576 1542785
5544 1542785 1552129 1568469 1579442 1622417 1653435 1687943 1728727 1794862 1828248 1856946 1884565 1910784
5532 1910784 1944180 1978500 2022488 2065360 2106678 2164460 2224428 2289427 2347488 2416266 2481391
5521 2481391 2543665 2587361 2648060 2690995 2741172 2768950 2801683 2836441 2850418 2846392 2831140 2809568
5509 2809568 2794259 2813524 2858582 2918443 3016803 3100778 3177004 3264709 3344734 3398799 3466640
5498 3466640 3556902 3620745 3702617 3801965 3918922 4047135 4179015 4323142 4481840 4665438
5488 4665438 4853115 5033829 5215766 5391072 5605824 5795453 5992125 6190744 6438626 6738471
5478 6738471 7087851 7441808 7829609 8289176 8872682 9528077 10274765 11067332 11898210 12545778
5468 12545778 12788872 12496664 11922359 11351417 11020896 10825277 10763011 10701374 10716336 10769196
5458 10769196 10906125 11055453 11269998 11468885 11743763 12047507 12411265 12681837 12862816
5449 12862816 12944542 13089372 13238696 13397869 13473144 13561295 13601857 13696306 13801998 13984441
5439 13984441 14153234 14327262 14414549 14569413 14752696 15047044 15382391 15878959 16453751 17179909
5429 17179909 17938676 18819409 19735030 20750659 21736039 22705631 23619677 24680319 25746865
5420 25746865 26839591 27732926 28659522 29636779 30872385 32385842 34345069 36628845 39175721
5411 39175721 41791608 44600568 47625956 51076005 54940245 59413765 64362205 70089753
5403 70089753 77020094 85683597 96143147 108466396 121944849 136730441 154279185
5396 154279185 175920843 201183341 229110747 260265186 297543879 337117786 362432975
5389 362432975 350801992 296812000 237061157 190215699 156888715 133335197 114942715
5382 114942715 100393965 88542609 78721802 70671206 64401133 59137169 54571827 50538976
5374 50538976 47175348 44390195 42211942 40181360 38267547 36347657 34684066 33244215
5366 33244215 32125797 30960731 29742947 28325702 26906629 25472376 24246043 23175017
5358 23175017 22339345 21612523 20978802 20359375 19867918 19431543 19091807 18684632 18227916
5349 18227916 17681887 17200267 16669473 16159255 15570174 15036220 14480391 13998359 13514955
5340 13514955 13177574 12873373 12612146 12311391 12042430 11748301 11502546 11252592 11095565
5331 11095565 10949711 10826083 10635103 10458977 10277067 10161878 10001413 9817863 9535645
5322 9535645 9292776 9048760 8854307 8652969 8484827 8308020 8189198 8076342 8017532 7984153
5312 7984153 7979627 7973880 7977892 7929700 7782108 7559657 7347437 7101106 6884692 6646244 6428502
5301 6428502 6221223 6073510 5914249 5770066 5606174 5489714 5407098 5378628 5338142 5290695
5291 5290695 5249109 5217159 5177513 5160366 5117523 5071117 5027401 4967961 4907688 4856570 4809243
5280 4809243 4772563 4735227 4719410 4724193 4758726 4782072 4816426 4847100 4874281 4886290 4887642 4850580
5268 4850580 4813560 4802235 4789645 4796092 4808499 4815176 4809815 4792042 4782787 4779236 4770603 4757842 4740172
5255 4740172 4723612 4706543 4696064 4667787 4667584 4643898 4626628 4591244 4563354 4548452 4548625 4546956
5243 4546956 4566919 4552188 4545634 4538928 4518703 4478299 4433601 4378381 4316246 4252195 4209426 4164788
5231 4164788 4126513 4086907 4070523 4008310 3978086 3930698 3881813 3816446 3780623 3739934 3709399
5220 3709399 3675982 3640176 3549181 3456102 3360795 3321130 3272659 3247132 3217451 3204255 3169336
5209 3169336 3134113 3092512 3047026 3003304 3000415 2988937 3002893 2990291 2993801 2968842 2927352 2877576
5197 2877576 2834304 2804617 2793770 2778360 2777326 2778096 2775717 2761462 2756852 2747814 2749096 2743704 2763836
5184 2763836 2777460 2783571 2798252 2821407 2817705 2826976 2844560 2874857 2923637 2981729 3034351 3085480
5172 3085480 3137166 3203444 3278644 3358712 3443507 3552033 3664632 3789527 3899949 4039415
5162 4039415 4184281 4274184 4290484 4273767 4258053 4253117 4265931 4301076 4343511 4387721 4455026
5151 4455026 4536301 4613448 4691501 4779322 4855334 4948921 5059955 5186417 5339370 5498650 5672490
5140 5672490 5865763 6049141 6254311 6480549 6748085 7008713 7293594 7598283 7913083 8227052
5130 8227052 8586042 8950560 9349850 9772681 10241842 10747113 11294435 11896436 12582117 13320993
5120 13320993 14122451 14959822 15842716 16815232 17864975 18995522 20202760 21472030 22827294
5111 22827294 24263469 25742334 27247921 28740010 30188982 31548162 32742019 33758032
5103 33758032 34502748 34955701 35076495 34862919 34318737 33486884 32380160 31096624 29624601
5094 29624601 28060078 26456540 24875652 23362212 21919269 20579370 19349756 18203740
5086 18203740 17159149 16188188 15284149 14407339 13593228 12831234 12131375 11511768 10978425
5077 10978425 10466639 10009153 9581932 9178933 8806283 8468949 8133217 7820055 7515234
5068 7515234 7256533 7020417 6817978 6626392 6438557 6252341 6038019 5816463 5601483 5399033
5058 5399033 5233665 5080181 4905012 4726912 4567582 4402238 4245752 4111696 3986343 3879333
5048 3879333 3796801 3712826 3645434 3578032 3497041 3405763 3274909 3137269 3005312 2895088 2796824
5037 2796824 2693830 2596758 2515747 2443141 2384125 2295053 2225389 2172733 2114815 2079626 2050734
5026 2050734 2012062 1967656 1942205 1910400 1864427 1830557 1796569 1746478 1727170 1689312 1638801
5015 1638801 1620690 1601630 1582345 1556119 1553377 1546498 1503899 1484057 1462563 1413640 1382630 1356960
5003 1356960 1342587 1339606 1334340 1298072 1273282 1258440 1247733 1242485 1242243 1225960 1218951 1202005 1193145
4990 1193145 1176378 1155684 1125463 1106574 1072827 1062269 1049154 1031590 996444 976805 951007
4979 951007 941513 941621 940017 935279 935097 913823 906266 901979 891550 892425 890126 876516 873689 869883
4965 869883 870826 862159 859677 846743 859880 846114 841467 822991 822907 820547 831049 831163 828547 822897
4951 822897 834797 844703 847774 859242 874960 880108 879130 877864 883592 882157 867342 856146 842306
4938 842306 828335 804851 788777 787534 788813 786137 769552 752355 744580 734950 725826 706235 701655
4925 701655 693610 666023 658054 659509 637865 622184 615927 601635 596347 578561 566428 561915 550006
4912 550006 548587 530286 532304 523227 512437 505567 491031 476504 478512 478633 483068 468659 462558
4899 462558 452355 439341 426512 412612 406312 399387 395626 388688 386509 382200 372804 373929 356960
4886 356960 341159 336299 338430 319205 316258 305986 321468 337006 347195 354319 359774 352214 347757
4873 347757 353395 374222 368146 377929 380004 379831 373086 380145 387218 400135 388739 390990 389069 386489
4859 386489 371100 370382 377648 371018 372309 371856 370520 369601 372003 387728 388003 392905 391907 397126 395924
4844 395924 381758 388580 399540 401299 407118 412731 412771 411390 400243 395140 384610 383669 389950 386589
4830 386589 392465 398913 406959 398834 393475 395917 408166 415559 408275 396090 393384 408730 399254 415428
4816 415428 417940 426144 426291 421047 414370 427393 438269 446322 449446 445367 455354 463994 477950 505102
4802 505102 498205 494796 501493 503207 524097 527720 523193 518352 518727 518647 512734 521350 513324 497002 497649
4787 497649 478970 473062 463346 468731 477838 463801 460433 453460 441804 427367 424145 412286 411547
4774 411547 419004 412351 411051 400834 387103 386907 372584 352124 346353 350810 354821 353472 341932
4761 341932 342745 340291 330469 325070 328375 316668 310425 302281 314348 316558 311994 314477 299018 290335
4747 290335 291359 290429 291428 278687 272593 279185 284973 265088 267889 268014 282977 290561 282150 287128
4733 287128 295027 292714 287733 287593 301138 299756 283816 275402 269832 273058 275648 270664 265851 261009
4719 261009 260685 247903 250045 264484 265350 262396 259995 254387 246568 249109 252974 273721 285705 289169
4705 289169 290853 280458 271667 277412 289636 274711 269453 278431 267541 273760 291287 292573 302471
4692 302471 310968 301348 291334 296125 307136 312227 316251 332535 324501 318725 323772 340086 337406
4679 337406 324953 332219 342624 342849 345902 346669 351691 356677 367403 362146 349337 359686 369283 367565
4665 367565 357295 357730 353981 351223 347191 352049 342332 341630 341933 337720 334086 336342 326725 319473 314469
4650 314469 309668 312610 306558 303912 311322 305462 300208 313415 317931 311078 303708 310885 327025 328797
4636 328797 326339 332027 337138 342060 346932 353488 351386 343474 368378 373888 369485 361175 358184 351830
4622 351830 347220 352493 367178 358742 365700 364601 355749 360029 351103 352947 354046 334928 335398 339194
4608 339194 346816 342169 322883 321544 308975 297242 298367 288050 279573 272172 273061 276607 291759
4595 291759 287689 290107 283671 281345 273074 285884 284944 278083 279646 285010 289950 289001 275993 290586
4581 290586 295019 277290 287611 300285 302035 291856 298813 307980 296920 298118 294500 289345 271267
4568 271267 269063 273761 255028 255535 264557 262014 260033 251382 243752 247642 240522 239030 238818 263473
4554 263473 254926 248264 241439 215619 224328 236277 237358 228696 227932 219769 215505 225316 218178 217482
4540 217482 214210 206690 217104 228416 212197 216848 219607 217070 212284 218446 216179 217489 214609 214594
4526 214594 209165 211988 215930 212059 207169 209481 209720 206183 206297 197999 198520 211906 215277 216147 189660
4511 189660 185423 176481 181265 186466 179847 179084 184971 180642 188038 183617 193422 195515 189921 184746 189322
4496 189322 190082 199213 202905 197799 207769 205808 203922 202954 205728 199510 198748 198506 189995 191122 190664 186627
4480 186627 196210 208190 208374 194123 177850 185201 195246 200032 196776 201747 210971 201064 197463 203602
4466 203602 199000 207083 210273 217493 212983 204291 188506 197045 219921 208042 212683 220886 224508 230413
4452 230413 228200 230227 232982 229800 223917 230972 226425 224415 224780 212859 229388 223393 221398 219225
4438 219225 224352 247610 245426 242916 242726 240278 249459 250262 245267 239423 236307 232798 244290 234843
4424 234843 230274 232167 234298 230914 247590 253502 250072 248584 256237 264922 269557 271044 255489 263947
4410 263947 264969 259914 271943 258483 276563 273570 277652 278484 273165 282798 292553 312092 317236 316034
4396 316034 318565 335502 364424 366373 378581 380451 405405 424690 448883 480753 525609 559361
4384 559361 594359 652156 699277 755951 828538 882897 920751 916141 873876 791887 697385 611417
4372 611417 536297 496533 466336 443103 431096 417693 389030 370950 364224 359192 354737 353485
4360 353485 363842 341859 335762 323338 316658 330713 334001 338012 339253 343775 339499 340373 332567 347867
4346 347867 349602 362355 350134 347220 361076 381307 382202 377156 390804 391130 404743 418971 422526
4333 422526 429829 443986 473887 473207 489808 504582 510557 524881 534821 535273 528998 510390 495656
4320 495656 483728 479571 473031 470744 466519 463024 459306 449893 458638 463841 479898 477699 473014 496642
4306 496642 500290 514690 519070 532436 546123 552164 560072 561330 576249 571749 571590 569612 567472 570422
4292 570422 550356 543639 550781 553603 568056 590257 587948 600260 601387 611299 632478 655947 686451
4279 686451 697834 724350 749188 777601 794537 809457 825702 845511 868142 877301 894944 891821
4267 891821 878192 868825 855792 838292 807819 796127 782867 759843 745266 734452 718700 720380
4255 720380 707592 710955 708927 702902 717243 715971 713233 711303 719627 726863 728847 736907 748720 763861
4241 763861 787850 791118 788271 797542 805964 820046 829635 843781 864697 881040 887591 900028 911745
4228 911745 913932 919770 920653 931254 929705 940825 947869 951871 959383 971865 995783 1023270 1030583
4215 1030583 1040531 1054152 1085362 1105150 1110517 1142109 1172403 1199042 1223625 1282526 1337242 1374196
4203 1374196 1422333 1475881 1539642 1606317 1688464 1761108 1825174 1901783 1955725 1972741 1963378 1912614
4191 1912614 1846734 1771160 1722370 1700180 1687344 1685835 1691432 1710993 1726108 1749146 1779278 1793952
4179 1793952 1835443 1885999 1921241 1988243 2071596 2170833 2297530 2449781 2594833 2794849 3024843
4168 3024843 3288672 3576432 3893257 4218474 4539392 4813429 4974266 4945938 4633924 4124307
4158 4124307 3616465 3226280 2943449 2736847 2578089 2436885 2331165 2243557 2173156 2115761
4148 2115761 2086777 2080537 2057895 2042745 2041598 2040839 2065901 2078142 2095461 2126445 2155471 2203110
4136 2203110 2249452 2306126 2365875 2435198 2511926 2568061 2629695 2690688 2751509 2803232 2836435
4125 2836435 2844745 2826367 2807294 2768566 2733302 2732215 2736168 2750597 2768367 2785775 2808273 2849410
4113 2849410 2884702 2924513 2975800 3031552 3094542 3156633 3213953 3275055 3330228 3382199 3439125
4102 3439125 3493333 3553452 3619362 3675816 3741414 3803711 3867520 3933513 3997889 4070886 4106085
4091 4106085 4161077 4239391 4296875 4357205 4432057 4481622 4523987 4551434 4552863 4565137 4564911 4571228
4079 4571228 4598757 4631587 4668685 4719449 4765238 4825844 4904332 5004268 5110528 5227718 5346162
4068 5346162 5464610 5565115 5628833 5650606 5627853 5592691 5556454 5562442 5568758 5589146 5632764
4057 5632764 5688354 5747174 5810447 5882868 5977727 6062655 6149461 6240058 6360229 6471996 6602410
4046 6602410 6736612 6870136 7018255 7185872 7354933 7542096 7744578 7954110 8170169 8402955
4036 8402955 8651468 8889673 9142914 9398785 9671950 9955594 10245399 10552107 10855608 11186046
4026 11186046 11534499 11888572 12262965 12686892 13127940 13602549 14128660 14695119 15283658
4017 15283658 15921268 16586649 17260905 17949189 18588662 19207625 19779095 20255832 20641794
4008 20641794 20977098 21298946 21609134 21951274 22329355 22792405 23385825 24114761 24984769
3999 24984769 26018503 27254957 28681153 30317681 32222946 34285618 36340784 38307226
3991 38307226 40358345 42800067 45689740 48991053 52603428 56463333 60473572 64480789
3983 64480789 68366234 71945564 75002871 77343723 78797787 79181681 78423585 76523845
3975 76523845 73559124 69747016 65391799 60777990 56216803 51894049 47895005 44289895
3967 44289895 41057420 38194014 35645220 33387598 31375747 29587755 27994811 26558221
3959 26558221 25272225 24104296 23030582 22060461 21148102 20310541 19522678 18802904 18105698
3950 18105698 17460554 16845727 16259121 15722928 15208425 14705759 14252132 13808584 13371241
3941 13371241 12967403 12601213 12254058 11910562 11564676 11241774 10924921 10607369 10320623
3932 10320623 10026852 9734551 9460754 9189252 8924957 8677861 8432523 8205647 7982382
3923 7982382 7776371 7580231 7380405 7195213 7012271 6839276 6670688 6534392 6411676 6280551
3913 6280551 6143854 6014680 5912097 5816804 5715275 5622771 5542576 5474592 5403831 5347723 5316040
3902 5316040 5259156 5214511 5181026 5135368 5085178 5037207 4967448 4900153 4820245 4741947 4665237
3891 4665237 4589043 4515740 4448940 4382225 4310894 4259304 4192961 4116538 4048519 3991084 3919521
3880 3919521 3818698 3734252 3665482 3566751 3491357 3415628 3328896 3264491 3204364 3149643 3087623
3869 3087623 3040352 2989243 2932095 2894768 2848392 2801169 2763480 2726360 2689648 2640722 2596929
3858 2596929 2565292 2525536 2494542 2454728 2419377 2385104 2343617 2315367 2273129 2251321 2229460
3847 2229460 2194590 2165232 2148287 2130297 2108015 2094389 2068790 2036157 2026855 2006670 1987215 1970974
3835 1970974 1958513 1947915 1929508 1916138 1912699 1910297 1897670 1870064 1856600 1838934 1838854 1827977
3823 1827977 1800987 1780678 1761392 1749147 1742875 1746355 1735872 1709242 1685418 1674115 1662203 1642804
3811 1642804 1636386 1623442 1603594 1599561 1594148 1584557 1581970 1571826 1563826 1551923 1544419 1531796 1530243
3798 1530243 1538850 1537282 1533421 1527345 1532537 1550554 1565242 1568503 1557107 1553860 1562268 1549776 1553169
3785 1553169 1564554 1563898 1579681 1605828 1603862 1607242 1608123 1603822 1604667 1606555 1618973 1611948 1610510 1624617
3771 1624617 1647512 1664911 1664486 1677554 1683953 1687389 1700232 1694800 1707634 1728714 1733387 1730738 1724784
3758 1724784 1734224 1742731 1759721 1770272 1790910 1793698 1812108 1829199 1841471 1859840 1876464 1889294
3746 1889294 1919164 1948693 1970236 1989825 2014015 2042971 2069855 2101075 2131450 2161553 2187032
3735 2187032 2225558 2261760 2288984 2314451 2352810 2398257 2441957 2463244 2495487 2550789 2590856
3724 2590856 2614650 2652176 2678660 2697673 2718859 2734847 2761022 2782449 2792267 2801524 2806047 2801213
3712 2801213 2803880 2802270 2792410 2782549 2777842 2762922 2735424 2736190 2721775 2699103 2676631 2657479 2644876
3699 2644876 2626655 2616591 2605710 2597436 2591045 2579569 2569817 2552981 2548717 2545204 2536356 2526864 2525024
3686 2525024 2514782 2508237 2489179 2464992 2437889 2400524 2367643 2322634 2289047 2242278 2205240 2184178
3674 2184178 2145144 2103164 2077232 2055662 2039781 2025599 2014640 1987269 1960864 1943502 1923821
3663 1923821 1921925 1906127 1882836 1873879 1851182 1843860 1845257 1832096 1824565 1819560 1812060 1806861 1783327
3650 1783327 1781215 1781048 1786590 1787177 1796407 1790185 1792979 1807103 1807628 1829422 1842296 1852483 1858620 1866371
3636 1866371 1886627 1897800 1916320 1936440 1949646 1964818 1979043 1996030 2005163 2024895 2053699 2069726
3624 2069726 2080786 2094699 2124989 2140424 2163346 2192581 2207164 2214037 2212045 2236663 2253138 2265085
3612 2265085 2285954 2295869 2310799 2315146 2329878 2350826 2360083 2385319 2398800 2408047 2420041 2448573
3600 2448573 2465880 2488085 2499850 2516928 2532310 2551407 2567233 2576658 2589080 2581440 2590092 2601885
3588 2601885 2605152 2614178 2622895 2633577 2644230 2637797 2640980 2661684 2663763 2663591 2654535 2644859 2654696 2654049
3574 2654049 2637597 2657903 2671249 2667969 2671389 2670796 2681825 2706233 2709432 2711916 2728621 2735550 2759861
3561 2759861 2772916 2791703 2807660 2831311 2851041 2866944 2891840 2903396 2919176 2938394 2946278 2958422
3549 2958422 2980972 2999140 3018217 3034384 3054412 3072577 3086606 3117586 3137354 3147373 3172658
3538 3172658 3176144 3177861 3207566 3220452 3232045 3215746 3211855 3227457 3217547 3223041 3223906 3216616 3214085
3525 3214085 3202863 3206624 3216196 3210673 3211063 3209047 3197304 3179259 3170137 3159769 3154455 3145022 3128548
3512 3128548 3137655 3143087 3133254 3145336 3145862 3132914 3132909 3124508 3127513 3135731 3131417 3136674 3129441 3125569 3118614
3497 3118614 3114484 3108461 3105091 3113264 3127416 3119808 3122119 3122518 3122476 3114492 3107872 3110041 3100935 3102665 3113573
3482 3113573 3107842 3102040 3095006 3101164 3105462 3101234 3091493 3069726 3047532 3041924 3034924 3015125 2993961
3469 2993961 2978748 2975759 2959633 2923795 2883508 2859768 2842989 2815507 2775237 2746052 2708711 2674171
3457 2674171 2640457 2611002 2577409 2537367 2504927 2469614 2446587 2426675 2399596 2357697 2328108
3446 2328108 2304030 2277301 2254941 2228983 2217531 2196038 2180190 2160065 2155197 2137822 2120682 2095853
3434 2095853 2081066 2073085 2070780 2058361 2049503 2040191 2030642 2007769 1993850 1987353 1972107 1956859 1946455
3421 1946455 1948399 1934908 1904815 1885661 1872285 1864210 1855764 1857296 1826916 1805318 1791893 1781504
3409 1781504 1776069 1759630 1739637 1705648 1676500 1676626 1660039 1643007 1629126 1611243 1600824 1598190
3397 1598190 1583657 1567311 1543388 1531510 1525421 1505905 1501660 1494050 1477571 1475220 1479149 1461577
3385 1461577 1451409 1445106 1433450 1426993 1429182 1426851 1430375 1416911 1413137 1419870 1425242 1419699 1417755
3372 1417755 1404972 1416517 1396310 1399884 1412851 1401924 1388636 1395497 1388375 1373021 1371720 1374183
3360 1374183 1366678 1363180 1353815 1357279 1345000 1346002 1356314 1346749 1334405 1314606 1327503 1332765 1323235
3347 1323235 1309971 1313876 1315102 1307317 1305225 1308805 1311575 1317204 1311445 1310998 1309808 1314603 1316880 1291592
3333 1291592 1268166 1263092 1264786 1262643 1259434 1246813 1240674 1257303 1258987 1253867 1263938 1258939 1261307
3320 1261307 1266595 1271396 1273026 1252692 1247994 1263180 1265685 1257238 1268188 1273678 1271686 1283664 1286196
3307 1286196 1292270 1298134 1302511 1316819 1321306 1323572 1322607 1318133 1331717 1336137 1343564 1352945 1351206 1357645
3293 1357645 1357416 1361461 1364498 1370984 1373868 1385278 1391803 1400113 1413582 1419269 1429434 1427845 1434774 1440578
3279 1440578 1455413 1458318 1448328 1454196 1478352 1492029 1507694 1516276 1533871 1535026 1551684 1567964
3267 1567964 1583742 1616642 1632357 1645660 1654229 1673046 1685160 1717787 1738177 1754809 1775106 1790000
3255 1790000 1820710 1855383 1868785 1898026 1919376 1942915 1965512 1983730 2005479 2041463 2080210
3244 2080210 2109910 2151517 2188051 2230483 2282896 2332680 2374983 2439792 2509821 2577343 2641213
3233 2641213 2736432 2828191 2914262 3007584 3115524 3225537 3350790 3489717 3629600 3773871
3223 3773871 3935112 4098716 4258592 4400307 4536930 4664728 4759295 4843251 4899346 4920454
3213 4920454 4898858 4848538 4761080 4640791 4505725 4362578 4182854 4007939 3832983 3660045
3203 3660045 3484201 3323918 3180229 3047993 2916876 2807066 2686361 2595952 2513521 2434671
3193 2434671 2358167 2300629 2251831 2205108 2167922 2123978 2078111 2025766 1971157 1929938 1886009
3182 1886009 1833211 1799265 1775610 1744004 1713817 1677163 1640762 1612477 1584449 1558870 1545097
3171 1545097 1522896 1488148 1485597 1462774 1435792 1420849 1409128 1398406 1386124 1375838 1379316 1377777
3159 1377777 1367628 1366478 1350890 1314507 1300828 1282548 1258518 1234363 1223468 1205148 1182895 1169393
3147 1169393 1161278 1155999 1143048 1135125 1120803 1112696 1092496 1080498 1081336 1098472 1102838 1097088 1101700
3134 1101700 1106284 1108260 1116833 1117857 1130721 1146356 1159362 1164018 1160349 1139959 1099672 1075059 1042581
3121 1042581 1017008 999600 967757 955817 951848 939904 920984 903840 908711 902575 886819 888749
3109 888749 885853 878711 866798 862873 854419 847997 847415 847932 859532 865900 857827 858315 874257 868476
3095 868476 867779 856457 837620 820253 809379 787451 777132 755486 746572 749961 751072 737016 730123
3082 730123 710552 709062 718880 715695 686058 682679 681424 676520 657867 643895 658837 655260 655271 650774
3068 650774 636105 640102 633946 643597 650212 633954 619397 599713 607441 617026 617249 621347 623251 617548
3054 617548 620113 613333 607572 610281 592907 593606 590040 590776 582369 571664 561188 566851 573324 571084
3040 571084 570590 566618 555238 541236 558057 561918 547144 560086 552608 535702 536499 532597 529048
3027 529048 531080 531942 523940 521197 523957 529085 531347 533318 521279 516467 523588 522712 502571 505881
3013 505881 503861 501935 498420 492093 502858 508965 511385 506712 510864 517258 506779 510020 501327 510434
2999 510434 518065 514904 500759 502639 502190 507586 503253 520469 521411 518754 522361 510681 513532 513071
2985 513071 523256 529999 524078 526025 534442 539624 537103 531550 519357 530909 540413 550770 550873 549470
2971 549470 558892 563479 563786 571311 569327 574886 574987 591885 593994 589117 597279 603234 615948 621429
2957 621429 621531 639045 630713 636196 654192 653116 650468 657963 663090 670715 674187 686961 685225 680670
2943 680670 683433 684943 683601 687808 707464 704264 708692 704988 723256 727256 733469 742515 740246 731756
2929 731756 743929 755553 770244 772765 772263 786003 801134 813430 824557 823968 831013 845594 857147
2916 857147 874015 887460 889334 896944 901579 910957 936710 960903 970481 990493 1022232 1036250 1054636
2903 1054636 1088207 1112630 1128937 1137927 1150349 1160985 1176172 1190512 1198859 1215443 1222528 1228546
2891 1228546 1250564 1265508 1282211 1301513 1334137 1350870 1372956 1399477 1434849 1465202 1489548
2880 1489548 1528422 1588378 1619629 1649553 1693198 1740787 1761384 1773289 1782896 1793004 1789719 1779645
2868 1779645 1754395 1731227 1700172 1673208 1647463 1621294 1611504 1596566 1576407 1571066 1586353 1593806
2856 1593806 1588893 1588242 1604207 1614254 1614606 1614458 1610459 1609836 1617808 1613153 1606941 1585100 1573271 1567628
2842 1567628 1538637 1508367 1485958 1456926 1412469 1378465 1367199 1343965 1323949 1291631 1265531
2831 1265531 1251530 1222898 1194952 1166171 1158594 1144729 1116735 1100108 1073041 1042673 1016711 987320
2819 987320 974146 946721 910334 894850 873945 844470 815677 803822 782055 758347 737409 734533
2807 734533 708066 687573 671576 649185 650332 633698 629971 626931 606511 591615 585256 576420 570567
2794 570567 563646 552925 549573 525573 523151 516912 508093 490531 475781 466067 457379 448680 440923
2781 440923 435879 431415 424366 417470 409885 405771 398706 402395 386832 375831 364425 359055 354381 347139
2767 347139 344935 342612 341444 331568 325699 339207 335459 319877 315211 303298 294015 286792 274370
2754 274370 266066 272046 286540 285267 276502 275939 277997 265748 257298 247591 240267 229211 218479 222227
2740 222227 228409 224785 214748 225186 228328 222769 212395 208418 198439 197993 208245 192948 190778
2727 190778 185295 185014 187004 187021 184669 163484 156942 162998 152194 147181 144912 144875 147746 148629 152351
2712 152351 130182 123734 126152 131611 129423 122684 109989 108014 108276 111483 115965 109987 101518 96365
2698 96365 104683 109655 101758 98238 101032 99415 101987 105803 101562 94929 75249 84483 84665 85672 86030
2683 86030 79551 72472 64402 67098 70246 65315 64471 54299 64166 68490 63688 57652 61852 60395 56799
2668 56799 57631 65399 52300 51115 53831 56191 58536 43965 36345 43847 48735 37502 28977 43094
2654 43094 47364 48762 45279 40654 42358 34454 29952 36422 51667 45526 42406 36691 39885 38868
2640 38868 30858 47047 53206 51512 38360 39068 39142 28733 40043 30872 30100 34230 44547 41812
2626 41812 41491 46881 47326 25134 21991 35805 28583 24648 32773 27379 31132 25683 22404 33184
2612 33184 33697 24777 25100 25206 31055 31242 23419 17022 23116 19327 20993 25487 23320 26363 12481
2597 12481 -1745 11277 14845 22299 26831 28514 36620 29803 27224 32951 19886 26064 28617 23382
2583 23382 29734 33878 32146 16922 28918 34111 31748 27175 29096 28779 30815 33023 24572 22116
2569 22116 30573 28439 30447 26752 21563 19180 18534 16620 20238 15295 17887 16691 17274 11504 7307
2554 7307 11369 9933 12653 17866 13104 -381 8143 901 3198 1145 2168 12102 16964 10119 -1403
2539 -1403 6774 9519 -4358 -5184 -4853 -602 14613 10701 -1808 -13745 -3761 12626 8027 -7910
2525 -7910 -16587 -10013 -3139 -12176 -4095 -19194 -20934 -18463 -8197 -686 -9700 -4466 -4936 -7485 -7626
2510 -7626 -4688 -2031 -6845 -9279 -19256 -24103 -5956 32 -7982 -10445 -11241 -16310 -22167 -20260 -6206
2495 -6206 -14498 -5855 -20730 -15685 -2628 -7533 -9719 -20418 -16863 -14848 -18500 -22332 -26810 -30451
2481 -30451 -34811 -28813 -32021 -17772 -23591 -30969 -21549 -21315 -25595 -27419 -28092 -26238 -15614 -18440 -34874
2466 -34874 -29862 -21350 -26857 -28844 -32993 -39059 -47799 -48270 -29355 -34920 -33400 -32063 -30440 -24011 -14136
2451 -14136 -2982 -7078 -13790 -24350 -41678 -32970 -20272 -19083 -21130 -30363 -20661 -27209 -43745
2438 -43745 -38392 -29529 -29726 -25807 -23887 -23193 -12134 -2586 -16548 -18648 -30133 -31543 -27747 -21200
2424 -21200 -23064 -30196 -39646 -40013 -40356 -27614 -33580 -28295 -18126 -17924 -16007 -15329 -19461 -29321 -20829
2409 -20829 -16895 -18149 -18807 -20905 -26647 -26340 -35257 -40405 -32902 -33142 -37283 -41208 -44087 -44092 -32165 -33528
2393 -33528 -36754 -34866 -33264 -43901 -37803 -42212 -39701 -25549 -21025 -37925 -32617 -35395 -32800 -24089
2379 -24089 -20299 -32471 -29133 -29984 -34141 -31531 -30556 -8142 -22971 -32818 -42357 -55813 -48867 -26109
2365 -26109 -19153 -28053 -22266 -8232 -26847 -28149 -12995 -19593 -25194 -32295 -32067 -17471 -25322 -27868
2351 -27868 -23437 -24295 -31533 -25377 -23697 -26019 -32527 -35116 -29766 -18866 -23030 -33060 -26371 -18870
2337 -18870 -29010 -29661 -38595 -25681 -30610 -36361 -20649 -15207 -16168 -21735 -27939 -23809 -26701 -40528
2323 -40528 -35423 -39175 -38160 -34255 -39007 -46763 -27291 -23030 -21521 -18540 -18547 -27871 -25577 -16606 -22503
2308 -22503 -18291 -24945 -32389 -39980 -31028 -31590 -31076 -25124 -16908 -24199 -29181 -27028 -27241 -32297 -25090
2293 -25090 -12989 -12610 -28904 -31706 -36784 -33157 -14865 -17515 -21385 -25930 -31996 -36294 -40202 -21839
2279 -21839 -18810 -29788 -24311 -30495 -24534 -18266 -5924 -11815 -28038 -32135 -41727 -41171 -44763 -36112
2265 -36112 -22171 -20986 -39452 -38979 -48114 -38566 -33594 -30089 -22049 -20672 -20562 -27745 -22103 -18206 -20454
2250 -20454 -29390 -35230 -32021 -13739 -18843 -29361 -39740 -32080 -23168 -15510 -23318 -29963 -29677 -27799
2236 -27799 -24758 -21496 -26048 -26098 -38215 -41364 -37547 -25764 -24080 -22280 -12592 -15369 -22858 -24197 -21344
2221 -21344 -10691 -23841 -35585 -36331 -41482 -43737 -31455 -24764 -19585 -13935 -15950 -19756 -14044 -6708
2207 -6708 -2302 -2139 -15624 -27878 -25119 -17130 -3619 1981 1988 -2393 -9494 -5617 -2346 3105 9680
2192 9680 5167 4968 6182 -5736 -10752 -10483 -11872 -16590 -16477 -21796 -18352 -17972 -10962 5491 -5033
2177 -5033 1130 9082 1750 4698 2084 11094 1279 18659 4039 6551 16123 20556 27098 34527
2163 34527 36811 15553 21240 27584 37192 34581 26354 26429 37228 43577 34246 40791 50766 50019 51793
2148 51793 47670 40237 51103 46352 50829 69568 73322 66428 63629 67963 62978 64656 73852 77499
2134 77499 66236 65170 78769 92744 91752 96958 85457 82679 89383 96800 103959 97501 89478 93268
2120 93268 91939 103527 98663 106481 113518 118310 131669 129616 141605 156911 163858 184201 192398
2107 192398 203011 215386 223876 233411 233342 250711 278247 313386 337319 342465 366339 389436 424259
2094 424259 474835 502367 539849 592954 651475 712064 768501 841143 935021 1049257 1171644
2083 1171644 1326101 1493854 1704538 1915356 2183452 2495743 2754504 3040095 3430834 3490004
2073 3490004 3073859 2756643 2550668 2360905 2066958 1757479 1469910 1231077 1052501 920023
2063 920023 826636 750661 698052 665974 624990 567566 526823 492922 457951 429307 401780 372803
2051 372803 353441 331445 300378 282005 265073 251941 253874 237196 215896 204998 198464 185016
2039 185016 178482 182803 164720 154649 158947 159789 150958 145882 145937 145335 128966 121429 113859 105861 101967
2024 101967 90298 88733 81090 90747 94856 70698 56101 67513 61637 59233 56678 55443 64123
2011 64123 68689 60750 62531 48168 51219 47049 41195 23013 36712 52367 39069 36321 48720
1998 48720 48962 39627 32673 36119 29620 32130 33760 17460 26971 31919 28004 32920 34803 16169
1984 16169 7957 6941 136 6303 25680 21015 12382 6458 864 -8296 -9037 8086 2187 6856
1970 6856 2049 6390 20154 7572 11141 3439 5572 14479 8900 8262 8661 8491 3120 2652 5516
1955 5516 6608 -2789 1521 -3135 -6847 3924 2607 -9127 -11313 -2658 -8305 -3485 9669 1217
1941 1217 -5088 -3067 8577 751 -10916 -13341 -7073 -9626 -9823 4388 13972 9807 -1857 -8098
1927 -8098 -9946 -2292 -8026 -4155 -17319 -23104 -17196 2722 -672 -7444 -6913 402 -1487 -3728 -9198
1912 -9198 -6857 11135 -4641 -5267 -997 -6868 -10580 -14426 -17435 -17850 -19346 -14846 -8858 -11523 -18462
1897 -18462 -10350 -3750 -952 -7677 -13421 5544 -7058 -23078 -4165 2154 8510 -6932 -21565
1884 -21565 -8849 -5899 6079 4447 -6678 -7444 -15575 -18090 -24250 -12514 -14394 -22610 -12944 -27320
1870 -27320 -25801 -19851 -21242 -26983 -29391 -14522 -24317 -21425 -18896 -27982 -27946 -24805 -16401 -30194 -25021
1855 -25021 -33260 -30279 -14906 -15692 -22312 -28558 -30197 -19738 -15109 -16796 -25582 -22566 -22771 -31245 -31345
1840 -31345 -30906 -26087 -30895 -18614 -11467 -24893 -25697 -22455 -20915 -11747 -19732 -25860 -17009 -20355 -22167
1825 -22167 -20720 -14866 -15119 -17238 -15884 -10177 -13686 -15891 -9867 -8217 -8450 -10608 -12366 -23664 -17764
1810 -17764 -11266 -12299 -13538 -7413 -5167 -1667 -12922 -13448 -20502 -9294 -18442 -17662 -14626 -21037 -17392
1795 -17392 -15792 -14949 -18453 -14857 -24843 -22237 -19891 -25289 -36845 -32403 -28974 -23045 -20786 -17788 -30604
1780 -30604 -31870 -24890 -27721 -35568 -31788 -16728 -9908 -15604 -26755 -29910 -19363 -20897 -15727 -13869
1766 -13869 -14242 -14596 -23186 -28997 -30144 -28934 -21663 -9361 -17178 -14940 -9220 -16640 -23327 -22575 -34950
1751 -34950 -32786 -19814 -15546 -24034 -18218 -24862 -16716 550 -14253 -13153 -18142 -16347 -17319 -17871
1737 -17871 -26968 -33059 -34008 -36861 -35685 -25023 -14567 -24217 -13217 -1930 -18092 -22540 -19925 -22323
1723 -22323 -11243 -19434 -29250 -21037 -15048 -16663 -15875 -20374 -19969 -19639 -15269 -13554 -20260 -26727 -25833
1708 -25833 -16791 -21175 -28194 -22095 -22469 -28139 -24697 -19993 -20645 -27544 -22265 -18591 -14519 -17890 -20703
1693 -20703 -7927 -8776 -16348 -21641 -18227 -20404 -24003 -20230 -19199 -14551 -16988 -19510 -16833 -23042 -32164
1678 -32164 -24789 -10628 -21562 -15877 -15275 -17718 -19801 -14674 -11263 -15980 -8967 -14130 -22850 -26006
1664 -26006 -19729 -17261 -30103 -32018 -23880 -27434 -24451 -14089 -9325 -17646 -28108 -24341 -27141 -31756
1650 -31756 -26078 -22187 -18956 -9829 -11901 -11175 -14234 -20911 -26851 -24972 -19277 -22185 -22528 -26347 -21632
1635 -21632 -2823 -6515 -28419 -38631 -20994 -23112 -31167 -30689 -36977 -35479 -34153 -25206 -19251 -6084
1621 -6084 -18114 -9529 -12326 -21659 -9452 -18556 -31507 -38519 -30081 -23648 -24307 -22737 -24138 -22845
1607 -22845 -21653 -16906 -15366 -9546 -16980 -13007 -9123 -7976 -18901 -19601 -21807 -19326 -18454 -12158 -11463
1592 -11463 -16863 -6623 -4828 -5041 -9705 -23028 -30660 -23342 -25469 -25575 -19996 -17504 -11367 -3794 -18128
1577 -18128 -9505 -17343 -20768 -15407 -26705 -26766 -36815 -19906 -14481 -34066 -30155 -26411 -28288 -22521
1563 -22521 -15531 -18284 -15866 -10831 -5740 -15133 -26601 -12926 -16984 -27385 -27246 -7526 -5047 -7772
1549 -7772 -6760 -11900 -16939 -7180 -5882 -7862 -7231 -16153 -11816 -15018 -13479 -15864 -10215 -3383 -8430
1534 -8430 -15540 -12544 -22456 -21570 -17334 -21387 -9743 -14839 -18062 -9436 -12993 -21526 -23246 -19562 -14016
1519 -14016 -18810 -12052 -22024 -18542 -7106 -17185 -23086 -37784 -32811 -32402 -19807 -19041 -25625 -11040
1505 -11040 -16597 -4612 -5756 -21423 -26077 -26375 -20865 -24139 -19025 -17446 -23638 -25380 -22704 -16257
1491 -16257 -20817 -25533 -13576 -17460 -24534 -27438 -17095 -14172 -30575 -25762 -19079 -22816 -4798 -15706
1477 -15706 -16976 -14182 -4056 -19101 -26586 -21357 -19231 -16613 -13072 -16566 -17176 -11840 -5771 5686
1463 5686 -11971 -16543 -22609 -15188 -10463 -23248 -18868 -13982 -95 -16119 -16438 -5163 -4692 -5262
1449 -5262 -6276 -10041 -4847 -8368 -11818 -14121 -20669 -12777 -18938 -10322 -13397 -12521 -4671 -12409 -20793
1434 -20793 -9385 -9854 -6767 -10379 -16455 -7901 8215 2758 -14110 -18163 -16982 -7920 8500 5114
1420 5114 -3695 -7354 1696 3820 1182 -4025 -17253 -12136 -10820 -21767 -17875 -17232 -12293 -12196 -8434
1405 -8434 -12935 -12689 -16204 -5620 -8928 -2826 -17624 -18007 -3322 -7553 7522 -2071 -13749 3206
1391 3206 -2 -6542 -4227 -3699 -6325 -16589 -4664 -13002 -17206 -8113 -7587 3155 -15 -5442 -7959
1376 -7959 -2253 5450 -6234 -10308 -17683 -16838 -19468 -18049 -25724 -23329 -10647 -6616 -411 -4796 -7407
1361 -7407 -4584 -8033 -17306 -19503 -6233 -12157 -16013 -22115 -13431 -11854 -13853 -5227 8077 162
1347 162 67 4968 -6554 -7526 -9278 -13189 -3465 112 -11418 -17197 -5778 -3629 -996 -1364 -6299
1332 -6299 -6467 -10778 -6872 -7382 -9737 -12614 -19036 -9773 -20798 -14832 -5968 -14962 -10064 -11146 -13705
1317 -13705 -15831 -5252 -8478 -19648 -19930 -17082 -11540 -3002 -21711 -20244 -14717 372 -1482 -7376
1303 -7376 702 -5382 -3721 -1116 -6947 -3710 -14824 -10822 -12152 -21014 -15732 -13679 -1749 -11273
1289 -11273 -17638 -16944 -11480 -10669 -8951 -14217 -8330 375 -6341 9966 2686 1622 -9893 -19524 -10151
1274 -10151 120 -5079 -17104 -19112 -17334 -12365 -19286 -17049 -712 6379 182 -1806 -8290 -11641
1260 -11641 -7513 -697 -8621 -7741 1021 3176 -6409 -2566 -244 -11597 -8866 -33 -341 -1682 2895
1245 2895 -3339 -14444 -7366 -12646 -9233 -16071 -10076 -11540 -8814 -4152 4645 -4604 -4193 5819 -4600
1230 -4600 -2420 -9450 2879 -4869 -12122 -7107 -5398 -1 -11016 -8780 -1106 -9672 -10039 -11690 -3882
1215 -3882 -17202 -14828 -7013 5675 2519 2787 13955 -216 166 5513 9905 1724 5823 3938
1201 3938 554 -1501 -784 3751 -43 -12502 -21799 -3326 2081 -14057 -14567 -10051 -9684 -8109 -4314
1186 -4314 3217 -7665 -12397 -13945 -8929 -6924 -1647 -1285 -1640 12457 902 -7293 -13215 -4002 -2404
1171 -2404 -6613 -7419 5585 9724 3723 10285 5718 9510 3957 -8159 -4560 13288 8828 4699
1157 4699 -1724 -7848 -10602 -8807 -8259 -9688 -9275 -13097 -9808 -11918 -4213 1245 1827 9950 7554 -8679
1141 -8679 -6849 1735 -1990 3575 5757 -14406 -10425 1147 -8224 -1875 -7342 -8208 -6805 -10673 -15606
1126 -15606 -9440 -5377 -5415 -4352 13181 3568 -5618 -4969 -15729 -7879 -233 13043 4182 -4860 -18757
1111 -18757 -19338 -19072 -12094 -8641 -3430 -11072 -13668 -8592 1686 -5536 -6861 3660 -7469 -6850 -6534
1096 -6534 -5245 -11649 -3051 -14538 -13175 -9174 -15244 -11788 -16805 -12021 -10805 -12884 2655 9432
1082 9432 7655 -109 769 1976 -889 2681 265 -6608 -282 9366 -2299 -7136 803 3107 8716
1067 8716 155 -3332 -1167 12430 15405 -1269 -6065 -6130 -3630 -14091 -3317 2954 2822 -3136 -6690
1052 -6690 -4584 8709 17316 -4654 -1603 2300 10607 4607 11860 13542 -5426 4456 8159 -203
1038 -203 9523 10257 1656 3070 1178 4237 -3176 3189 3775 -3538 -6275 -3675 919 2010 3147 11199
1022 11199 293 -9070 -7933 -1257 -2907 -5142 -7430 -6853 -4354 -5051 -20620 -10057 3613 2743
1008 2743 -3961 15038 17699 9988 13176 16789 24031 3698 2557 9808 7951 5881 6703 -6433
994 -6433 -4079 -7678 -10054 -13989 -2090 5527 5054 -801 3356 6112 6881 12591 9509 10718 4359
979 4359 -2738 -9023 -1551 -1407 4320 10156 8902 4296 -5302 -11943 -11177 2010 -4201 -6723 -10538
964 -10538 -13327 -7114 191 -13608 -13949 4119 10800 -6163 -9182 4391 1521 -10409 -5081 376
950 376 -12388 2141 8840 -114 -10180 -11824 -6565 -763 -6191 -2920 1659 12420 10178 -3681
936 -3681 1578 4045 3843 -3125 -5428 6602 12617 9352 5048 3658 -8277 -12553 -4875 2320 11016
921 11016 5767 6179 8812 -18748 -12955 -13739 3577 7646 6243 11417 5550 494 8372 18818 8077
906 8077 -1908 -2009 6954 -1619 -6275 -6550 5125 5787 1917 -5650 1828 10357 23926 6879 2968
891 2968 19954 14965 6590 6162 13113 5554 -2301 3746 -9825 5153 22749 104 774 3317
877 3317 -2086 8526 592 1747 9014 -3720 -7217 5413 142 -897 1152 -214 6081 8754
863 8754 -2296 6100 -1858 -8751 -2227 11020 20465 21251 10465 7495 12511 7460 14339 2504
849 2504 5218 -217 -3726 2395 8923 4561 9422 12086 12582 4854 474 2706 20084 5943 -1680
834 -1680 9377 2034 9585 7201 -8953 -5663 -9497 -2230 2092 -3151 598 2513 12501 3260 -9406
819 -9406 -5817 -8067 -5096 -1762 -6966 -2929 -5399 6806 -2536 -7756 7725 16850 6382 6010 4313
804 4313 2498 1686 1731 -9432 -12755 -3775 1222 4073 1394 11572 12600 8145 14040 12881 5991
789 5991 4712 4034 16424 14635 16842 4468 3487 4146 6160 3012 4570 10486 10371 6499 1874 13206
773 13206 15279 26091 21078 16187 8291 7912 3675 -2166 -7920 -9084 -2346 4016 3568 3257 2553 9873
757 9873 8662 7412 6413 9371 8865 -130 5530 5968 -4688 -8443 12704 10369 6308 14783 6763
742 6763 2174 23825 11059 16928 13359 12567 5679 5943 8794 -3280 6910 12308 9417 18578 11907
727 11907 17315 11185 10962 20541 15031 8696 -5426 7853 9378 4108 -308 9802 12441 293
713 293 -7268 12748 23326 11091 20441 24193 18398 8472 12999 4471 -7902 -2284 9405 24024
699 24024 23440 4722 10072 9855 -21 13362 12660 3392 -11047 -5961 -3813 276 2799 7461 5400
684 5400 1836 8348 9472 -443 410 2195 -1739 -6366 1042 2887 7537 1449 6541 14913 17957
669 17957 21698 22492 12928 13314 9986 5130 2581 1488 2724 3657 11071 23804 19591 19079 19794 9423
653 9423 13302 14629 24788 13675 8804 18894 8294 -2173 5455 2881 2222 8750 10944 8188
639 8188 11320 14355 12717 8556 9921 10056 11776 4857 2096 9550 20552 27665 17262 14809 5485
624 5485 14703 22557 30359 39058 16645 21788 18298 4737 4498 2944 11903 10932 7354 10094 12386
609 12386 20208 21174 25129 27157 20573 22679 32065 21738 18938 18038 19710 29015 23180 22822 28491
594 28491 21128 19886 15025 19079 31416 25416 18152 13582 13421 25280 38126 29036 29928 27245 26043
579 26043 13161 15799 11968 17971 11091 5707 14457 16566 27622 28471 20570 5037 12619 14729
565 14729 13412 8832 7023 15195 10667 16934 29365 12040 12138 5520 14195 21981 9924 8722 23006
550 23006 26251 23078 36750 38149 31182 19363 13122 20351 23618 18886 11262 1484 10638 14403
536 14403 11302 21773 32498 31644 27791 23399 21072 15066 13592 11943 20511 31664 18386 10935
522 10935 7396 13070 9044 18494 23851 24879 23050 23438 22600 19104 18310 18839 26807 30551 23092 27521
506 27521 23792 11391 19208 22010 11772 25454 25881 15371 12900 12243 11325 22359 27541 27954 25130
491 25130 17329 22330 14865 15336 25298 14528 11022 10408 20324 20098 16301 20530 15480 22489 22498 18840
475 18840 14988 8445 8196 11777 14646 12039 -338 11294 19119 30381 23889 21223 17103 13290
461 13290 12401 19433 14255 11015 16017 18917 12683 11939 4440 14222 23603 16300 9980 16434 18356
446 18356 19977 28173 14576 4669 18887 17393 27116 22177 14477 17419 23396 32643 33934 27922
432 27922 21251 18634 9932 4725 4010 18648 20426 19130 16909 19881 20413 25562 18876 25251 19408
417 19408 17345 9437 106 11704 16762 27630 28170 28574 21317 8303 10813 12581 14371 17701 10092
402 10092 14729 25647 15730 16553 18487 19414 24641 18651 36630 34213 19754 16725 20758 19648 3130
387 3130 13924 10921 25358 37555 31165 13980 18341 26542 16863 30335 35866 20603 11838 9604
373 9604 13135 16554 7429 10416 15640 20097 13104 20044 27369 29954 24545 17282 17134 20950 19885
358 19885 26038 32565 29162 42356 38732 29313 25814 29525 22926 28097 38067 27609 23319 26433
344 26433 17891 20948 20870 17683 15535 7759 13575 23759 16929 22574 27450 27994 21587 22711 13691
329 13691 10481 19366 26810 30137 33030 27216 29487 24119 19207 9797 7094 19334 18106 19929 27138
314 27138 45171 35194 20202 16938 20688 24154 27913 19538 20467 19415 20564 23274 17771 12373 17957
299 17957 20956 23153 16778 23099 22453 27907 34767 19392 9680 14927 19026 28152 30994 18574 16092
284 16092 21399 20479 42369 45203 38270 35416 29247 31384 42055 27899 11426 16868 16701 14668
270 14668 11497 5877 1712 8899 30971 31572 36661 39334 22156 25493 20233 9970 3456 9949
256 9949 24634 33689 23726 15635 19351 17431 22046 21944 10649 24498 29854 30772 38780 35192 20529
241 20529 17713 19275 22574 22763 23826 36913 40498 27748 23403 15315 22560 32790 38650 26972
227 26972 30341 29122 23946 31204 32122 32270 29189 37386 27961 22005 28414 30893 36409 39785 29967
212 29967 20900 19310 26037 26353 20814 26467 26350 29842 18886 22479 25498 31031 27649 24391 29096
197 29096 33188 38176 35055 27224 22411 27786 31170 23305 15961 24025 30240 22291 22707 30615 24804
182 24804 22543 26272 31687 31145 29446 29596 41064 35639 37643 24008 24786 35245 33953 36356 34660
167 34660 31025 31580 35666 39822 31687 31225 28333 34925 29630 24188 29901 32793 32865 31940 39128 33471
151 33471 31445 26865 17945 19237 27773 35688 31087 26575 32119 26923 35207 39155 31221 41492 45456
136 45456 43623 31923 33151 36322 31849 28707 31124 24936 25536 25753 32518 24160 25269 26946 16587
121 16587 21811 21440 30760 35203 29555 35999 38622 34907 44554 38237 39376 34370 27817 31255 29812
106 29812 22751 23361 25582 32175 31534 23015 25202 35411 32081 33648 28652 30896 37339 39733 37527
91 37527 28794 23637 18371 23021 25521 30449 29493 30028 30010 34771 31615 30775 33303 32317 37557 36811 41963
74 41963 36251 44108 41016 43315 43910 36084 37535 26653 30310 29990 25480 23176 31697 30144 27673
59 27673 24614 30267 35315 30077 33072 31511 35343 39742 39320 26953 32508 32478 35017 27401 26209 35866
43 35866 34886 38412 41302 33574 33937 27524 28059 36139 40122 40780 47588 46178 42051 42397 47248 42683
27 42683 32979 28743 29568 43441 38333 38604 35842 32261 29056 29754 35419 31773 26757 31425 39280 40158
11 40158 32542 33027 33117 34651 38498 40771 41424 32208 42497 43399 29643
0 29643
$$ Imaginary data points
##PAGE= N=2
##DATA TABLE= (X++(I..I)), XYDATA
16383 -225729 -225045 -210281 -203262 -199273 -201655 -191409 -181852 -173680 -166791 -158579 -151209 -144680 -127669 -128748
16369 -128748 -125676 -117938 -107702 -98866 -100087 -102182 -96429 -86222 -70961 -69646 -62583 -50246 -42553
16356 -42553 -44487 -39025 -24747 -24385 -27222 -14970 -4393 8483 3185 17805 26406 37976 45134
16343 45134 38475 48266 57466 57189 59032 73691 78529 85612 88254 95839 105877 120846 126735 129420
16329 129420 133564 142862 151655 152749 154531 150963 157959 164754 168692 178426 184586 192952 200533 206801
16315 206801 199279 208814 225132 229721 236002 237019 244969 256556 254759 267310 272859 269200 280863
16302 280863 288822 291870 291816 295841 301043 307695 312032 313046 324202 326618 329320 341999 345728 348411
16288 348411 350870 355152 362772 370042 378968 380241 380823 377670 392407 404909 399190 401702 411210 405498
16274 405498 415301 431004 435057 432737 444581 447829 455449 467471 463871 463587 460485 458145 466604 473170
16260 473170 481463 489717 488864 494338 502304 508944 514312 507649 504937 516921 529412 527409 529381 538104
16246 538104 549818 543869 555630 548223 550448 549591 560132 569190 577840 584323 572599 575314 585914
16233 585914 595721 599631 602133 596244 598041 604414 610851 605060 619109 616433 617558 625088 632634 629418
16219 629418 624222 627514 631675 637572 646941 649327 656493 658083 648605 652930 667238 664908 663487 668033
16205 668033 681449 688826 691886 688720 685810 688563 695812 694730 691240 690930 695337 697666 695714 697374
16191 697374 705716 700973 697428 705571 717333 712045 707542 721007 717642 719344 716048 714375 724110 733549
16177 733549 742814 733644 723976 729355 731030 749003 760962 751580 753338 761236 750169 753185 754122 757425
16163 757425 759334 754464 755600 743790 752072 762632 768099 769538 774567 773637 775587 777032 785920 786532
16149 786532 782169 777528 772918 775879 771342 768201 767216 771393 770195 779140 793470 794057 789185 785107
16135 785107 784797 781701 795015 792703 790369 803878 799960 796741 795420 795812 801116 797212 798884 796518
16121 796518 794674 794094 798722 796534 793995 804966 809040 813927 815736 808936 809006 818868 826001 819389 817214
16106 817214 826194 815720 810915 819668 826996 818696 813614 816705 817637 818008 814502 824610 827161 828271
16092 828271 814822 813938 825249 828089 821199 819473 813665 808954 812694 816008 825148 834342 833939 818173
16078 818173 829928 826411 829814 832740 828960 815966 825578 817590 825538 810229 819197 833666 827053
16065 827053 834246 826219 819904 826608 842019 838901 831605 835238 841769 830064 829483 837003 830540 827783
16051 827783 831498 835080 837204 837324 836846 827124 827871 826936 829729 841157 843486 838283 845712 850006 849313
16036 849313 837905 829462 817158 817333 832686 834557 826342 818787 819546 840413 848665 837699 850610
16023 850610 851217 850821 837774 839213 836275 840819 847549 854644 840454 833360 842066 842823 838998 832042
16009 832042 850523 849558 850859 835784 838396 846475 846638 843087 840497 840227 838924 834133 828451 839765
15995 839765 839087 834672 840561 835510 836995 824942 833148 834066 840942 843973 837783 842300 839648 844438
15981 844438 850467 845298 838114 838051 834907 847278 848608 847071 838420 834636 842151 837160 840777 849305
15967 849305 834875 825322 814594 821617 830482 828114 827262 836743 828924 837931 843949 847205 845741 842616
15953 842616 846474 837467 841093 844655 843835 834431 849048 855560 856605 855924 870051 864295 851805 841500
15939 841500 856012 860231 845198 843272 840224 842516 852105 851868 846423 851864 857545 849951 848596 842229
15925 842229 839830 846900 855474 846773 840829 845693 844617 857230 852280 852384 856864 862622 850042 848644
15911 848644 858900 854257 850643 844172 859736 863537 849730 843818 842319 842986 842600 846104 848937 857832
15897 857832 855247 846662 846918 857790 860799 855628 862441 852198 849106 853089 844324 854456 863051 859751
15883 859751 857073 861413 867076 859485 867852 861349 854214 851445 848553 848125 855972 850852 858172 864949
15869 864949 861481 863557 853353 857698 855878 855005 858635 856400 853245 847238 851542 852255 847374 851265
15855 851265 854188 854192 846547 849047 851847 858057 863355 862064 856373 855700 849760 850989 855474 851233 850372
15840 850372 855223 850220 858037 866971 863448 856264 856894 858861 858624 858546 856382 857148 868538 866241 859929
$$ [...]
##END NTUPLES=NMR SPECTRUM
##END=
