##TITLE=1H_TG-2331
 CDCl3
 8 sc, 
 16.11.2021
##JCAMPDX= 6.0         $$ Bruker NMR JCAMP-DX V2.0
##DATA TYPE= NMR SPECTRUM
##DATA CLASS= NTUPLES
##ORIGIN= UXNMR, Bruker Analytische Messtechnik GmbH
##OWNER= root
$$ XWIN-NMR		Version 3.5
$$ Tue Nov 16 12:47:20 2021 Russian Standard Time (UT+4h)  she@DPX200
##.OBSERVE FREQUENCY= 200.131346
##.OBSERVE NUCLEUS= ^1H
##.ACQUISITION MODE= SIMULTANEOUS
##.ACQUISITION SCHEME= undefined
##.AVERAGES= 8
##.DIGITISER RES= 18
##SPECTROMETER/DATA SYSTEM= spect
##.PULSE SEQUENCE= zg30
##.SOLVENT NAME= CDCl3
##.SHIFT REFERENCE= (INTERNAL, CDCl3, 0, 15.9089)
##AUDIT TRAIL= $$ (NUMBER, WHEN, WHO, WHERE, WHAT)
$$ ##TITLE= Audit trail, XWIN-NMR		Version 3.5
$$ ##JCAMPDX= 5.01
$$ ##ORIGIN= Bruker BioSpin GmbH
$$ ##OWNER= she
$$ F:/spectra/data/she/nmr/H-F/1/pdata/1/auditp.txt
$$ ##AUDIT TRAIL=  $$ (NUMBER, WHEN, WHO, WHERE, WHAT)
(   1,<2021-11-16 12:45:41.51 +0400>,<she>,<DPX200>,
      <created by zg, POWCHK disabled, PULCHK disabled
       configuration hash MD5:
       00 E9 B6 7A A2 85 ED C7 34 08 36 98 17 FE 4E 26
       data hash MD5: 16K
       90 42 5D A9 3D 26 C4 25 A0 EE 51 F9 DC AD 88 56>)
(   2,<2021-11-16 12:45:44.51 +0400>,<she>,<DPX200>,
      <Start of raw data processing
       efp BC_mod = 2 LB = 0.24 FT_mod = 6 PKNL = 1 PHC0 = -15516.26 PHC1 = 18.40081 SI = 16K 
       data hash MD5: 16K
       8D FA 49 2B 24 17 B5 79 8B 21 9E 87 2C DE 08 19>)
(   3,<2021-11-16 12:46:13.85 +0400>,<she>,<DPX200>,
      <pk PHC0 = 6.619648 PHC1 = -11.2 
       data hash MD5: 16K
       30 86 66 F8 7D 6C 70 D4 66 08 4E CB 30 80 13 8E>)
(   4,<2021-11-16 12:46:19.54 +0400>,<she>,<DPX200>,
      <abs ABSG = 5 
       data hash MD5: 16K
       44 1C 2B 72 99 CC 46 2D 49 65 57 1C F8 17 C5 60>)
$$ ##END=
$$ 
$$ hash MD5
$$ E4 23 14 38 9A A5 97 23 9F 0C C1 9F 2A AE BD 97
##$RELAX= 
##$RELAX= 
##$RELAX= 
##$RELAX= 
##$RELAX= 
##$RELAX= 
$$ Bruker specific parameters
$$ --------------------------
##$DU= <F:/spectra>
##$EXPNO= 1
##$NAME= <H-F>
##$PROCNO= 1
##$TYPE= <nmr>
##$USER= <she>
##$AMP= (0..31)
100 100 100 100 100 100 100 100 100 100 100 100 100 100 100 100 100 100 
100 100 100 100 100 100 100 100 100 100 100 100 100 100 
##$AQSEQ= 0
##$AQ_mod= 1
##$AUNM= <au_zg>
##$AUTOPOS= <>
##$BF1= 200.13
##$BF2= 200.13
##$BF3= 200.13
##$BF4= 200.13
##$BF5= 200.13
##$BF6= 200.13
##$BF7= 200.13
##$BF8= 200.13
##$BYTORDA= 1
##$CFDGTYP= 0
##$CFRGTYP= 5
##$CHEMSTR= <none>
##$CNST= (0..31)
1 1 145 1 1 1 1 1 1 1 1 1 1 1 1 1 1 1 1 1 1 1 1 1 1 1 1 1 1 1 1 1 
##$CPDPRG= <>
##$CPDPRG1= <>
##$CPDPRG2= <>
##$CPDPRG3= <>
##$CPDPRG4= <mlev>
##$CPDPRG5= <mlev>
##$CPDPRG6= <mlev>
##$CPDPRG7= <mlev>
##$CPDPRG8= <mlev>
##$CPDPRGB= <>
##$CPDPRGT= <>
##$D= (0..31)
0 1.2 0 0 0 0 0 0 0 0.06 0 0.03 0 0 0 0 0.0002 0 0 0 0 0 0 0 0 0 0 0 0 
0 0 0 
##$DATE= 1637052340
##$DBL= (0..7)
120 120 120 120 120 120 120 120 
##$DBP= (0..7)
150 150 150 150 150 150 150 150 
##$DBP07= 0
##$DBPNAM0= <>
##$DBPNAM1= <>
##$DBPNAM2= <>
##$DBPNAM3= <>
##$DBPNAM4= <>
$$ [...]
##$SUBNAM2= <"">
##$SUBNAM3= <"">
##$SUBNAM4= <"">
##$SUBNAM5= <"">
##$SUBNAM6= <"">
##$SUBNAM7= <"">
##$SUBNAM8= <"">
##$SUBNAM9= <"">
##$SW= 18.0517287032376
##$SWIBOX= (0..15)
0 0 2 0 0 0 0 0 0 0 0 0 0 0 0 0 
##$SW_h= 3612.71676300578
##$TD= 16384
##$TD0= 1
##$TE= 0
##$TE2= 300
##$TE3= 300
##$TEG= 300
##$TL= (0..7)
0 120 120 120 120 120 120 120 
##$TP= (0..7)
150 150 150 150 150 150 150 150 
##$TP07= 0
##$TPNAME0= <>
##$TPNAME1= <>
##$TPNAME2= <>
##$TPNAME3= <>
##$TPNAME4= <>
##$TPNAME5= <>
##$TPNAME6= <>
##$TPNAME7= <>
##$TPOAL= (0..7)
0.5 0.5 0.5 0.5 0.5 0.5 0.5 0.5 
##$TPOFFS= (0..7)
0 0 0 0 0 0 0 0 
##$TUNHIN= 0
##$TUNHOUT= 0
##$TUNXOUT= 0
##$USERA1= <user>
##$USERA2= <user>
##$USERA3= <user>
##$USERA4= <user>
##$USERA5= <user>
##$V9= 5
##$VALIST= <valist>
##$VCLIST= <CCCCCCCCCCCCCCC>
##$VD= 0
##$VDLIST= <DDDDDDDDDDDDDDD>
##$VPLIST= <PPPPPPPPPPPPPPP>
##$VTLIST= <TTTTTTTTTTTTTTT>
##$WBST= 1024
##$WBSW= 4
##$XGAIN= (0..3)
0 0 0 0 
##$XL= 0
##$YL= 0
##$YMAX_a= 528995
##$YMIN_a= -554568
##$ZGOPTNS= <>
##$ZL1= 120
##$ZL2= 120
##$ZL3= 120
##$ZL4= 120
##$ABSF1= 15.71824
##$ABSF2= -2.33361
##$ABSG= 5
##$ABSL= 3
##$ALPHA= 0
##$AQORDER= 0
##$ASSFAC= 0
##$ASSFACI= 0
##$ASSFACX= 0
##$ASSWID= 0
##$AUNMP= <proc_1d>
##$AZFE= 0.1
##$AZFW= 0.1
##$BCFW= 0
##$BC_mod= 2
##$BYTORDP= 0
##$COROFFS= 0
##$CY= -3
##$DATMOD= 1
##$DC= 0
##$DFILT= <>
##$DTYPP= 0
##$F1P= 0
##$F2P= 0
##$FCOR= 1
##$FTSIZE= 16384
##$FT_mod= 6
##$GAMMA= 0
##$GB= 0
##$INTBC= 1
##$INTSCL= 0
##$ISEN= 128
##$LB= 0.24
##$LEV0= 0
##$LPBIN= 0
##$MAXI= 10000
##$MC2= 0
##$MEAN= 0
##$ME_mod= 0
##$MI= 1.114404
##$NCOEF= 0
##$NC_proc= -6
##$NLEV= 6
##$NOISF1= 3.799351
##$NOISF2= 2.8
##$NSP= 0
##$NTH_PI= 0
##$NZP= 0
##$OFFSET= 15.90886
##$PC= 1
##$PHC0= -15509.64
##$PHC1= 7.20081
##$PH_mod= 1
##$PKNL= yes
##$PPARMOD= 0
##$PSCAL= 0
##$PSIGN= 0
##$REVERSE= no
##$SF= 200.129968519793
##$SI= 16384
##$SIGF1= 3
##$SIGF2= 2
##$SINO= 5.538805
##$SIOLD= 16384
##$SREGLST= <1H.CDCl3>
##$SSB= 0
##$STSI= 16384
##$STSR= 0
##$SW_p= 3612.71676300578
##$SYMM= 0
##$S_DEV= 0
##$TDeff= 16384
##$TDoff= 0
##$TI= <>
##$TILT= no
##$TM1= 0
##$TM2= 0
##$TOPLEV= 0
##$USERP1= <user>
##$USERP2= <user>
##$USERP3= <user>
##$USERP4= <user>
##$USERP5= <user>
##$WDW= 1
##$XDIM= 16384
##$YMAX_p= 302368438
##$YMIN_p= -372092
$$ End of Bruker specific parameters
$$ ---------------------------------
##NTUPLES= NMR SPECTRUM
##VAR_NAME=  FREQUENCY,     SPECTRUM/REAL,   SPECTRUM/IMAG
##SYMBOL=    X,             R,               I
##VAR_TYPE=  INDEPENDENT,   DEPENDENT,       DEPENDENT
##VAR_FORM=  AFFN,          ASDF,            ASDF
##VAR_DIM=   16384,         16384,           16384
##UNITS=     HZ,            ARBITRARY UNITS, ARBITRARY UNITS
##FACTOR=    0.220516191357247, 1,           1
##FIRST=     3183.83969233345, 0,            0
##LAST=      -428.877070672333, 0,           0
##MIN=       -428.877070672333, -372092,     0
##MAX=       3183.83969233345, 302368438,    0
$$ Real data points
##PAGE= N=1
##DATA TABLE= (X++(R..R)), XYDATA
$$ [...]
7414c9843J03348m7920J3476J4909L7108l2336M9665P71j47571N4714m672M4802
7402D6451n2970M296m624l4063k2119R0960q4708r838M7694r1007M8719l4059
7390i5268N9295M8495k8638J4173j10095L8375j3340j8091L9019j8978L1362k9269
7378h2960K3456l5681j8626q462k2792J05848J3364j09615N6626L8959N9568k8987
7366i302k8956r253J9400j01455J00347N5108m3070j5564N127r0982l0532K0389
7354a28743n5780N4422J28866l2510m0987M9921m2423j1592O3612J8235r1472
7343h8451J31018n3388j49596J07288l9796L8825K7878J59j7724Q0445l8683j22222
7331a24247M809M7055L7429O1979q9495N6127K7056M4779r1379o7088P1793R0230
$$ y = [-39843, 63505, 15585, 29061, 43970, 81078, 48742, 98407, 99178, -48393, 6321, 1649, 46451, -6519, -2223, -6847, -40910, -63029, 27931, -56777, -66615, -18921, -109928, -61209, -95268, -35973, 12522, -16116, -1943, -112038, -73663, -87003, -105094, -66075, -85053, -53691, -82960, -59504, -95185, -113811, -122273, -145065, -39217, -25853, -135468, -78842, -39883, 19685, -9302, -38258, -47511, -28111, -129566, -29219, 25889, -17181, -32745, -27618, -118600, -149132, -128743, -184523, -130101, -1235, -33745, -74732, -24811, -67234, -78826, -15214, 3021, -88451, 42567, -10821, -160417, -53129, -92925, -54100, -26222, -26063, -43787, 36658, -2025, -124247, -119438, -72383, -34954, 27025, -62470, -6343, 20713, 65492, -25887, -92975, -21182, 69048]
7319F9048m0194j38119m5242P8544o596J7550k2676q7712L2767P0607Q4234q939
7307C272m4831K2738o1530K2967M0759k1613o7918r904J0082j09440k0267M4396
7295a91289R5417n1315n9424J26893K9050p3870m2056L6763j1570L8238o388m1059
7283a50610Q9576l3568J13262p669j3718n0060J8545k7784m1740q1205K337n6820
7271b39454P0087N0394k825l8315n3930M0213P2468L9723M4793N5551r17o3480
7259b5692k8467P329J6830M7496L1663k8546k3273K3373n0567k642K6455o9054
7247g5095r6045J5224J00095l1755O0095p9121j3911n5911m1108L9294M8800p713
7235a37151k561L4580L245K4004R179l935q645l0617k0239O9327p791J5185j0627
$$ y = [69048, 28854, -109265, -154507, -75963, -82559, -65009, -87685, -175397, -142630, -72023, 12211, 3272, -41559, -18821, -80351, -57384, -16625, -38238, -106156, -116060, -105978, -215418, -235685, -191289, -95872, -147187, -206611, -79718, -50668, -124538, -166594, -129831, -141401, -103163, -109551, -150610, -61034, -94602, 18660, 10991, -2727, -52787, -34242, -62026, -103766, -184971, -182634, -239454, -169367, -118973, -121798, -160113, -214043, -173830, -101362, -61639, -16846, 38705, 37788, -25692, -54159, -46830, -30000, 17496, 49159, 20613, -2660, 20713, -29854, -32496, -6041, -75095, -171140, -155916, -55821, -87576, -27481, -106602, -120513, -176424, -217532, -178238, -129438, -137151, -139712, -105132, -101887, -77883, -68704, -72639, -81284, -111901, -132140, -62813, -70604, -55419, -66046]
7222f6046o049M8491m1072j60597R6946Q2457m5578k1159j5473Q9009M683m5817
7210h0205L5645K4973o6588J6742l5174o6826P4823R4908J2532o0733r529M8626
7198a0806Q3051j12508o2340M5391M0463K696J2085n2392l0934L1702m1715p1051
7186a66358R0634N042L0818N3854q498k5464q8581O5998J12305n4529J8404n6419
7174b2794o5232R573K4070Q325o9744K8583J21717O2073j18472K2692j1624p7089
7162h7922P7914P5964K2320r8142l4476l908j3253k0748Q2034P6455p6804P2323
7150G1757k3028n2657M9250p1983Q937o1258k2607J63329Q092J0370k8538j18890
7138f7226J02994L330j41936R888M4052l0955j0706j1534L3923L4019j3887q8345
$$ y = [-66046, -72095, -23604, -64676, -225273, -128327, -45870, -91448, -112607, -128080, -39071, -34388, -80205, -44560, -19587, -86175, -69433, -104607, -171433, -96610, -1702, 10830, -49903, -59432, -10806, 72245, -40263, -102603, -57212, -16749, -14053, -1968, -54360, -85294, -53592, -95307, -166358, -75724, -70682, -39864, 13990, 5492, -19972, -108553, -42555, 69750, 15221, 33625, -22794, -88026, -78453, -54383, -46058, -115802, -87219, 34498, 96571, -21901, 791, -10833, -87922, -10008, 65956, 88276, -9866, -44342, -48250, -61503, -82251, -217, 76238, -566, 71757, 48729, -3928, 45322, -26661, -17724, -78982, -101589, 61740, 69832, 80202, 51664, -67226, 35768, 39098, -102838, -92950, -48898, -79853, -90559, -102093, -68170, -34151, -48038, -136383]
7126a36383J3050Q9063J241L1732M2071n871n8978m3045n2092k7674M9495j7737
7114a15128J031N15M343M2275p3580k8553J13289J9319j4208o8881M7956j11496
7102a83118j4745Q7676J9049R0300j25647j05482P6248r3975J1194R3109r381
7091a54772n9080m0412Q4639Q957L8024k01L8688Q236J0231j17977M2515M9361
7079i1791k2743M0578J15711m0138p9627o1226L0435o433L69p240o5624J23153
7067f4576J6786o3182m8464k8558J12077J8982J1271l4669o3825m750J45879n4842
7055e7871K3759m2544p3855O5021l2660J1061J49298m1764n5676o1120m0890R4227
7043f3014q7055J8736j7234J3168L7451m3116m6728M7011L2053L9699q489N5561
$$ y = [-136383, -123333, -34270, -33029, -1297, 40774, 34903, -24075, -67120, -119212, -146886, -97391, -115128, -114097, -113582, -109239, -66964, -140544, -169097, -55808, -36489, -50697, -119578, -71622, -183118, -197863, -110187, -91138, -838, -126485, -231967, -155719, -249694, -238500, -145391, -154772, -213852, -254264, -169625, -160668, -122644, -122845, -84157, -75921, -65690, -183667, -141152, -91791, -114534, -73956, 41755, 1617, -78010, -139236, -108801, -115234, -114865, -122105, -187729, -64576, -47790, -110972, -159436, -187994, -75917, -56935, -45664, -80333, -144158, -148908, -3029, -57871, -34112, -76656, -150511, -85490, -118150, -107089, 42209, 445, -55231, -116351, -157241, -63014, -150069, -131333, -148567, -135399, -97948, -141064, -187792, -140781, -108728, -69029, -77518, -21957]
7031b1957l856N1592k1974m9092J5447K0355J2779O3764J6374k2335m4111L7563
7019E4549K513R292j1310K0363l8328m6890N1481M0532J10330m0911j8892k2932
7007A09797o3336J14967K0122k7802J1125P8739M3519q8407k6620Q0871J4567
6996B67542o7330m0120k9491N4919J3174k00M9000J56713J00432l5334J67709
6985F37014K50463J17236Q4329r74K11458L04891J30166N6444J06055K02339J75677
6974B275098N7018L8461k41716k60475k92670k57685k33584k66614o5462n1723
6964G00648j8159l5950j5522j16646n8542K4977n6515o4377J8332M5634k2658
6953D01222L1722Q4046r8996p1236K7270q5689r0319P4996M3537K6859K7569o8537
$$ y = [-21957, -25813, 25779, 3805, -45287, -29840, -9485, 3294, 67058, 83432, 61097, 16986, 54549, 57062, 66354, 55044, 75407, 37079, -9811, 41670, 82202, 192532, 151621, 132729, 109797, 46461, 161428, 181550, 153748, 164873, 243612, 287131, 198724, 172104, 252975, 267542, 200212, 160092, 130601, 185520, 198694, 198494, 247494, 404207, 504639, 469305, 637014, 887477, 1004713, 1089042, 1088068, 1299526, 1604417, 1734583, 1791027, 1897082, 2099421, 2275098, 2332116, 2370577, 2128861, 1868386, 1575716, 1318031, 1084447, 817833, 752371, 700648, 682489, 646539, 631017, 514371, 455829, 480806, 424291, 359914, 378246, 423880, 401222, 432944, 516990, 417994, 346758, 374028, 288339, 198020, 273016, 316553, 343412, 370981, 302444]
6941C02444j69352k5198O9559l3878j0060j37M4815k7461Q7272M0456p9037n4773
6929A44650k9275m7112J10870L8025q5416m5010n3128N5041L3196K1633N1384
6918A94858k5795m1808K4134Q3694J3591l6610N5658L4247p4761Q1810O9157r2495
6906B85680p9570k1883J29K733m6793M5963j6684q5488J01583P7893k1151m8129
6894A94283l3303q7805M8246m3264K5941R9650J3427r0864l5461p503K3477J4758
6882A21582J12928J8856J5700j07692k2757P9991n158q0793k7110P6576O7177
6871B49300P398n4729R5173K9539O1249N5327j31060k5481p3829q606R5877J19374
6859D19532k7161p2483K8260l0376R8632K1341J3181j3072K3050m6010R2122J8882
$$ y = [302444, 133092, 107894, 177453, 143575, 133515, 133378, 178193, 150732, 238004, 278460, 199423, 144650, 115375, 68263, 179133, 217158, 131742, 86732, 33604, 88645, 121841, 143474, 194858, 169063, 127255, 151389, 235083, 248674, 212064, 267722, 301969, 227208, 309018, 378175, 285680, 206110, 184227, 184356, 187089, 140296, 186259, 169575, 84087, 185670, 263563, 242412, 194283, 160980, 73175, 121421, 78157, 104098, 203748, 217175, 126311, 90850, 83347, 106824, 121582, 234510, 253366, 269066, 161374, 138617, 218608, 213450, 132657, 105547, 182123, 249300, 256698, 201969, 297142, 326681, 387930, 443257, 312197, 286716, 212887, 204281, 300158, 419532, 392371, 319888, 348148, 317772, 416404, 437745, 450926, 437854, 460904, 414894, 507016, 525898]
6847E25898R1583o5334R0966O7171K2931J7431P911M0365P8173l9860L305P1042
6835I11582L9460N9500o1062J15754J3556p128m4251L8775K8448M4230M4103M0713
6823A223680J07740L083O6705N10k546R5834J31637K5905k1935r6408K0267J15903
6811A670375K402M666J15586J11212L3445Q2000n0338Q3990P584J27217J30401
6800B318540k1838L4501R8853J7321P9657P4922J10243R7243J51345K2709N3956
6789C037452R4240J25117K52161J55249J12195J75728J74872R6054J52029K74437
6779D649534K81031K01125K27619K05933K01328L33367K99835K59242M48027L39517
6769G446558L64366M44121N77264O56210N92001N92137P41461O67635P30234O62867
$$ y = [525898, 617481, 552147, 643113, 710284, 733215, 750646, 758557, 798922, 877095, 837235, 840540, 911582, 951042, 1010542, 949480, 1065234, 1078790, 1071662, 1027411, 1066186, 1094634, 1138864, 1182967, 1223680, 1331420, 1334503, 1401208, 1401718, 1399172, 1495006, 1626643, 1652548, 1630613, 1534205, 1554472, 1670375, 1672777, 1677443, 1793029, 1904241, 1937686, 2019686, 1969348, 2053338, 2060922, 2188139, 2318540, 2296702, 2331203, 2430056, 2447377, 2527034, 2601956, 2712199, 2809442, 2960787, 2983496, 3037452, 3131692, 3256809, 3508970, 3664219, 3776414, 3952142, 4127014, 4223068, 4375097, 4649534, 4930565, 5131690, 5359309, 5565242, 5766570, 6099937, 6399772, 6659014, 7107041, 7446558, 7810924, 8255045, 8832309, 9488519, 10080520, 10672657, 11414118, 12081753, 12811987, 13474854]
6759A3474854P84874P62628P08156P30882P14711M48840M52024N08146J78056
6750A8763171k5905j16117k55953m59875n47752o43641p00495q22452p93772q12076
6740A3585133p01607p34265o75606o21961o56684n03639m66823n05868o08094
6731H110586l11236l78162n28965k92623l63267k83958k97485k27760k94762k35208
6721D897160j82299k13722r9925k44694k77315o1045j23009j11272k26951k63397
6711C093531q9164r161m3477q1581j60767j02575j26933l2638p8616q6350j06082
6700B176187m8550l301j55608o4306j43993l7893K7045M257m8338q9420j00012
6689A516068J3290m3747l4636n4714k7200q0875n758k8777r5430R998K1389M7354
$$ y = [13474854, 14259728, 15022356, 15730512, 16461394, 17176105, 17624945, 18076969, 18585115, 18763171, 18737266, 18621149, 18365196, 17905321, 17357569, 16713928, 16013433, 15190981, 14397209, 13585133, 12883526, 12149261, 11473655, 10851694, 10195010, 9691371, 9224548, 8718680, 8110586, 7799350, 7421188, 6892223, 6599600, 6236333, 5952375, 5654890, 5427130, 5132368, 4897160, 4714861, 4501139, 4401214, 4156520, 3879205, 3818160, 3695151, 3583879, 3356928, 3093531, 3004367, 2995206, 2951729, 2870148, 2709381, 2606806, 2479873, 2447235, 2368619, 2282269, 2176187, 2127637, 2124336, 1968728, 1904422, 1760429, 1722536, 1749581, 1753838, 1705500, 1616080, 1516068, 1529358, 1485611, 1450975, 1396261, 1369061, 1288186, 1282428, 1253651, 1158221, 1168219, 1189608, 1236962]
6677A236962p916o6622n2676q2644n2506n0149j2431J9775J6049q621o9375P2986
6665I42832l3515l5445m6048r9471k1729q2258J8632K822n6165n3968n3363J03589
6653E85913k3920j28146M2484J1224k3967Q3984P856M2053O2711p6605K026O0112
6641F45725p3628p4841N2675J2578k2576l6265j50824K1465k0654o8846L9110
6630C23919O6591r370L2164M0794o8114M5810q2951o5925k1598J2624K1796O03
6618B96343j5577O8228J4551j36532k0321j6923L052j9590l2875M2428L4895M6466
6606B64145j0752k6917l4134o0645J23634o7339l9958P8366p0605n1963O6711
6595A70543j8851r002K7k3528k9366O5567N3121j00938J2892J164k6599m8303
$$ y = [1236962, 1229046, 1162424, 1109748, 1027104, 974598, 924449, 912018, 931793, 947842, 939221, 869846, 942832, 909317, 873872, 827824, 728353, 706624, 624366, 642998, 645820, 589655, 535687, 482324, 585913, 561993, 433847, 476331, 487555, 463588, 547572, 555428, 597481, 660192, 583587, 585613, 645725, 572097, 497256, 549931, 562509, 539933, 503668, 352844, 374309, 353655, 284809, 323919, 390510, 381140, 413304, 454098, 385984, 431794, 348843, 282918, 261320, 273944, 295740, 296343, 280766, 348994, 363545, 227013, 206692, 189769, 192821, 173231, 140356, 182784, 217679, 264145, 253393, 226476, 192342, 131697, 255331, 187992, 148034, 226400, 155795, 103832, 170543, 151692, 142690, 142717, 119189, 89823, 155390, 208511, 107573, 120465, 121629, 95030, 46727]
6583D6727N7287j4752K1536K1379P0053j46348J5026O5039K4208R058q021n1747
6571A09445p3759N1212j5419N9941P238P189l0140q693k7670j2829J4163l0410
6559E0268q8364M741Q0725J14269J6963m9509j10280L4730J9066p411J1319N0146
6547A26663m5814j5094O47j11258o369J36178j4236l1410l4205M1618M2046m6267
6535D2499P3417l8362J5039l9700p77l3659J5674l5088k7545Q569P4646n9432
6523d719K786o4527q2870J88782K884k2603l5147l9361Q767K9005L7158N046j06040
6510h0839L8273j8544p4230J33663R6564j8278M6789L9249q2509J631m8777q9909
6498e6917K1468J42728N097k7605O6711r742k5346p1027j4445J52703q2039r0736
$$ y = [46727, 104014, 89262, 110798, 132177, 202230, 55882, 70908, 135947, 160155, 169213, 161192, 109445, 35686, 86898, 71479, 131420, 138658, 145847, 115707, 107014, 79344, 66515, 80678, 50268, -38096, -33355, 47370, 161639, 178602, 129093, 18813, 53543, 72609, 65198, 76517, 126663, 80849, 65755, 66402, -44856, -51225, 84953, 70717, 39307, 5102, 46720, 88766, 42499, 115916, 77554, 92593, 52893, 52116, 18457, 34131, -957, -28502, -19933, 54713, -4719, -1933, -66460, -149330, 39452, 42336, 19733, -15414, -54775, -46008, -17003, 20155, 25201, -80839, -42566, -61110, -135340, -1677, 94887, 76609, 123398, 162647, 80138, 81769, 32992, -56917, -35449, 107279, 112376, 84771, 151482, 141740, 116394, 45367, 30922, 183625, 101586, 10850]
6486A0850k4009J11369N1045m3404o3079n2550J61314K3692q485N0477l6793K8713
6474B09140q3326j0645P7996M8691m2482j11635K8255M1570k0288m1829Q4413
6463A79860R3655R105J3126j4950n1448J08179l7357l6518k7865R8943l1087o5772
6451B37871j5094Q8883l8987M5136K6327K1946K7175j3884Q9072P4425J11563
6440F54433Q3697L1169p4515K0629O4974O10L5679P1577J01078K2480J11930J32913
6428A256654J50937L6778Q0409Q7812p2354o1003P285o2647j26829p7253r181
6417A210608L3175j05856k4568n4608o2149Q633N7270o3754q3305q7879J08071
6406I35638M5463n8880R260N5269J47556r6358k11064O1003O364L6527J55861
$$ y = [10850, -13159, 98210, 149255, 105851, 42772, -9778, 151536, 175228, 166743, 217220, 180427, 209140, 125814, 115169, 193165, 241856, 199374, 87739, 115994, 157564, 137276, 95447, 179860, 273515, 282620, 295746, 280796, 229348, 337527, 300170, 263652, 235787, 334730, 303643, 237871, 222777, 311660, 272673, 317809, 344136, 366082, 393257, 379373, 468445, 542870, 654433, 738130, 769299, 694784, 715413, 780387, 780997, 816676, 888253, 989331, 1011811, 1123741, 1256654, 1407591, 1444369, 1524778, 1612590, 1540236, 1479233, 1486518, 1423871, 1297042, 1219789, 1210608, 1243783, 1137927, 1113359, 1058751, 996602, 1005235, 1062505, 998751, 915446, 827567, 935638, 981101, 922221, 931481, 986750, 1134306, 1037948, 826884, 887887, 894251, 930778, 1086639]
6395A086639O472l8223k1646k0596J00265K1296N759j1769P5484J3626o565L7842
6383A248584L4442M3274M2108N3668N1951j49797L4366O8530N2603j9681K6342
6372A486390l1804M1867k222o4214J30202J38123J0116l4851M9630K435M872J24626
6360A855170O6841Q0490m6510o1109J7280J1423m9710l9213J60449l1350j20508
6349A843253j7602J656k4201J02033k1675p6166r3262O3057R6421k2178l6435
6338A814901O040j40224j7633J5484m7045j53612l1311L219L1706j10710k349
6327A368466J22528m2417j05607J5116o3996j00146J5809k9215l9257p2324m7233
6316A021724M5403m1882l1181j1395m0573j01573j2625k8992M6347l9226k3405
$$ y = [1086639, 1093111, 1054888, 1033242, 1012646, 1112911, 1134207, 1139966, 1128197, 1203681, 1217307, 1210742, 1248584, 1283026, 1326300, 1368408, 1422076, 1474027, 1324230, 1358596, 1427126, 1479729, 1460048, 1486390, 1454586, 1496453, 1494231, 1430017, 1560219, 1698342, 1708458, 1673607, 1723237, 1725672, 1730544, 1855170, 1922011, 2002501, 1955991, 1894882, 1912162, 1923585, 1873875, 1834662, 1995111, 1963761, 1843253, 1825651, 1827307, 1803106, 1905139, 1883464, 1807298, 1714036, 1777093, 1873514, 1851336, 1814901, 1820941, 1680717, 1663084, 1678568, 1631523, 1477911, 1446600, 1449819, 1481525, 1370815, 1368466, 1490994, 1448577, 1342970, 1358086, 1294090, 1193944, 1209753, 1180538, 1141281, 1068957, 1021724, 1067127, 1025245, 994064, 982669, 942096, 840523, 827898, 798906, 845253, 806027, 782622]
6305G82622m3768l6029N8900O862m9435j08935m8747O2061j9471k2026K0164M7578
6293F49776k6645j18997j7658n3395K1170l9803L0790p5893K5266M0604k3093
6282D12122m0286j21169M5386J13588p5203L4920j5346K5133k6548j2843L0907
6271C70661j28544k3386M2871n1621R5799q1806m0947M0352l0540L9334m9360
6260A82813k0446j0469K7671r58N227r7298o6115J08514K6455K5834n4319j5636
6248A11273l1948L7169o4973j05916K5723l080j1459L5144R6303K7358o5434l2229
6236A7931M563j2957p956K2186L0009o5998j04811P8878O6259r9843K7353R1087
6224D6701l4663m9400M1900r455L7713p1407o5432L4146L8261J3571j4742K2268
$$ y = [782622, 738854, 702825, 761725, 768587, 719152, 610217, 561470, 623531, 604060, 582034, 602198, 649776, 623131, 504134, 486476, 433081, 454251, 414448, 445238, 369345, 394611, 435215, 412122, 371836, 250667, 296053, 409641, 334438, 369358, 354012, 379145, 352597, 339754, 370661, 242117, 218731, 261602, 209981, 305780, 223974, 183027, 223379, 192839, 232173, 182813, 162367, 151898, 179569, 178611, 183838, 86540, 20425, 128939, 155394, 181228, 126909, 111273, 79325, 116494, 51521, -54395, -28672, -31752, -43211, -8067, 88236, 115594, 50160, 17931, 22494, 9537, 1581, 23767, 53776, -12222, -117033, -38155, 28104, -71739, -44386, 46701, 12038, -37362, 4538, -4917, 32796, -38611, -104043, -69897, -31636, -18065, -32807, -10539]
6212a0539q0768M1223J3383k4813l7066M0784O669p0852J12262q3103P6800L3401
6200A7381q174m0520n1631o373J26953k9227n2786q524j1950P1503l8648p9602
6188a11598J35496j4364q7497P0260J4807l5193M8551j7608q2006k9788j9024
6177a27964M5548k1558J01115o05m4851k7247K2781O7934Q0975k7909q7668J976
6165a7473M2577o4257m1394O1297p8003L7824J00549K8695p0646m2973p354q7592
6153a38750N5739k0683N6003m1742m832l8153Q2307N3656L0928l2185j62982L1056
6141a29638R5280p341j3506l5969K0316k141k0995M4352J08826M9348p952j00655
6129g5j17749O8418J16O3495L6186l1964k5844k4580N4457n7463J1606L9711R105
$$ y = [-10539, -91307, -50084, -36701, -61514, -98580, -57796, -51127, -121979, -9717, -92820, -16020, 17381, 9207, -31313, -82944, -89317, 37636, 8409, -44377, -52901, -64851, 6652, -31996, -111598, 23898, 9534, -77963, -7703, 7104, -28089, 20462, 2854, -79152, -108940, -127964, -82416, -103974, -2859, -3464, -48315, -75562, -52781, 15153, 96128, 68219, -19449, -17473, 25104, -39153, -80547, -19250, -97253, -59429, 41120, 69815, -831, -43804, -51158, -138750, -83011, -103694, -47691, -89433, -94265, -132418, -50111, 3545, 34473, 2288, -160694, -129638, -34358, -41699, -55205, -91174, -70858, -72999, -93994, -49642, 59184, 108532, 100580, -75, -117824, -49406, -49290, 14205, 50391, 18427, -7417, -31997, 22460, -35003, -23397, 16314, 25419]
6116B5419L6546j45683k7563M6633j2564K5521O932r0370m5747J9584Q6097j9678
6104i4873n2413P9240k3672m2893N7334M4470k4806m9339R8799M1796o0859j2989
6092d0205l6706p1912J57601J3352k8304R334n1167m5629n9281L4833K6822p1011
6080a62273l8754M4647K286j1334P1249k1615K210L4222l2832N4334M2507L136
6068a2217k5549K1458L4106n0551n4797N9415l2519k3057n7049m8727J21758P2131
6056D402o0796L4946M814j20535M6114l555l4230P5225K8697q8778O2757j38597
6044a89536l1838Q9J13861L6847o2663P0761n3804L6998N5319L3960l5666m343
6032c0015J5594L9072n1278Q873P3551m1687m2149m3443R4403R0914l9188j58073
$$ y = [25419, 61965, -83718, -111281, -64648, -77212, -51691, -44759, -135129, -180876, -161292, -75195, -94873, -147286, -68046, -91718, -134611, -77277, -32807, -57613, -106952, -8153, 33643, -27216, -40205, -76911, -148823, 8778, 22130, -6174, 3160, -48007, -93636, -152917, -118084, -91262, -162273, -201027, -156380, -154094, -165428, -94179, -115794, -113584, -79362, -112194, -57860, -15353, -12217, -37766, -16308, 17798, -32753, -87550, -28135, -60654, -83711, -140760, -189487, -67729, 4402, -56394, -21448, -16634, -137169, -91055, -94610, -128840, -53615, -24918, -113696, -50939, -189536, -221374, -221285, -107424, -70577, -133240, -62479, -116283, -79285, -23966, 9994, -25672, -30015, -14421, 24651, -26627, -17754, 55797, 14110, -28039, -71482, 22921, 113835, 74647, -83426]
6020h3426N8326N6236O0247J6294m4401k7635P7530q480n9477J43531J8482J04039
6008C11266J3739q1422q6624K6570m010L3218L720l6958N1320O1077j3633M2910
5996C21173O7401k9906j03250J468J16866P2386l0464o118N877O5355J2245R9071
5984E92104k5553j40223l056K6642P4919m9167k9837r149M6441J66985j52461
5973D97645K6580k716n3165k2078L2763k70j13067K6604K7853J814K3689j03731
5961C41921O6092J16560N8598M6230r8262k3838P2931L2345N5456p3430m7849
5950E46754m6334o7371J1938L7177R3706k1245k9216k2950m6358k4705p814j1617
5938D11965p369K5791P4556K1230j14744K5220k160k6916J04928L042p612m7551
$$ y = [-83426, -25100, 31136, 91383, 107677, 63276, 35641, 113171, 104691, 45214, 188745, 207227, 311266, 325005, 243583, 156959, 183529, 179519, 212737, 216457, 179499, 230819, 291896, 278263, 321173, 388574, 358668, 255418, 256886, 373752, 446138, 415674, 409556, 415433, 480788, 493033, 592104, 566551, 426328, 423272, 449914, 524833, 475666, 445829, 436680, 483121, 650106, 497645, 524225, 521509, 468344, 446266, 479029, 478759, 365692, 392296, 420149, 421963, 445652, 341921, 408013, 524573, 583171, 629401, 531139, 507301, 580232, 612577, 668033, 594603, 546754, 500420, 433049, 444987, 482164, 575870, 554625, 525409, 502459, 456101, 431396, 423582, 411965, 404596, 430387, 504943, 526173, 411429, 436649, 434489, 407573, 512501, 515543, 507931, 460380]
5926D60380K218k353N080K058P1508Q1581n1649n3485P0255M6744M3102J18746
5914G94185L6756j7889R2423m9179o9091q040N3205o5447J44065k1141m266k9530
5902H56051Q6039M134J11896M1909L4470m4052p4041K7193P1814J08957J5270
5891A239640k6329R7707l1965k1856M8143j0186J89568K6043k9119o4911O6316
5880A483051O9795P4690L645M4585Q8300l4746L1492M6871L4632O5157q8122k2478
5868A796872M4872J93867j7477q5588L6592m7860m6123L0262J7585m3856K5661
5857A904807K9243n5284M7965o3803M3901R7195N557m8085q1691n3252J43509
5846A970062n2614N1796J2579j44643k8784k4626r1462N4577O0802k16K6677l078
$$ y = [460380, 462598, 460245, 465325, 467383, 538891, 620472, 568823, 515338, 585593, 632337, 675439, 794185, 830941, 813052, 905475, 856296, 787205, 779165, 832370, 766923, 910988, 889847, 885581, 856051, 942090, 946224, 1058120, 1100029, 1134499, 1090447, 1016406, 1043599, 1115413, 1224370, 1239640, 1213311, 1311018, 1279053, 1257197, 1305340, 1295154, 1484722, 1510765, 1481646, 1416735, 1483051, 1552846, 1627536, 1631181, 1675766, 1764066, 1729320, 1760812, 1807683, 1842315, 1907472, 1819350, 1796872, 1841744, 2035611, 2018134, 1932546, 1969138, 1921278, 1875155, 1905417, 1923002, 1879146, 1904807, 1934050, 1878766, 1926731, 1862928, 1906829, 2004024, 2009581, 1961496, 1879805, 1826553, 1970062, 1917448, 1969244, 1981823, 1837180, 1808396, 1783770, 1692308, 1746885, 1807687, 1807471, 1834148, 1831070]
5834A831070m3744j46217J4376p6105m5516O728K6461k7535k2196J9861j06651
5823A430532m3353n5288m9952P116k3842j1321m080n9177K033k2440l2952j959
5811A135317J4693q3738K419j524r6657q1235n4057K7645N8466J864j20903J219
5799H03509m7500o7471j21500K6449N2722m994j05195J3947M4940O0226j4133
5788F41000J15934o1745J078l584N1679j13924K6678n5509j14877J20839l04J1226
5776F18491l8615M4230q180p73j08352R121J7528J08881j06140M848J24226R9057
5764G64322N686o579o0201m6700k6657J29807l0322k5552M8381P2769M9507l6101
5752H38360j7057m2031p3350j0484M3806N7784N4669M2787L2802n2488j06821
$$ y = [1831070, 1787326, 1641109, 1655485, 1579380, 1533864, 1540592, 1567053, 1539518, 1517322, 1537183, 1430532, 1387179, 1331891, 1281939, 1289055, 1265213, 1253892, 1249812, 1190635, 1192668, 1170228, 1137276, 1135317, 1150010, 1066272, 1068691, 1067167, 970510, 889275, 835218, 862863, 921329, 923193, 802290, 803509, 756009, 688538, 567038, 593487, 646209, 641215, 536020, 549967, 594907, 655133, 641000, 756934, 695189, 696267, 692683, 744362, 630438, 657116, 601607, 486730, 607569, 607265, 618491, 579876, 624106, 615926, 615153, 506801, 515922, 533450, 642331, 536191, 541039, 665265, 764322, 770008, 763429, 703228, 656528, 629871, 759678, 729356, 703804, 752185, 824954, 874461, 838360, 821303, 779272, 705922, 695438, 739244, 797028, 851697, 894484, 927286, 874798, 767977]
5741G67977N853Q0128P2412j55083N5168K9299n9724L1605J07520K5569m7524
5730I13200K0599k4439J74198N4396J37475K5939o563J30299M4588r9641O9571
5719A439622r8672P53R1312j02743M5693p1554p958q515J2757N367n1352L1882
5707A286592O4587J50023j02043N0607P9155M6844k7795N0661N2517l4529k5571
5696A591048M5357J2443J51069n6246m402Q7713M8915L373o3497N39N8371M1630
5684A916313k5692l925J08014k2140O1166M5578j8837R0111j6149O4001R8932
5673B297372R8875o9672n2820N0176J25848P157J10437J11708L0428J16129K08381
5662C034019O7469K78545L27828L04427K86235M47032N22673O65734P52010P70560
$$ y = [767977, 773830, 853958, 926370, 771287, 826455, 855754, 796030, 827635, 935155, 960724, 913200, 933799, 909360, 1083558, 1137954, 1275429, 1301368, 1294805, 1425104, 1469692, 1370051, 1439622, 1340950, 1341703, 1433015, 1330272, 1375965, 1304411, 1296453, 1287938, 1300695, 1306062, 1254710, 1286592, 1351179, 1501202, 1399159, 1449766, 1528921, 1575765, 1547970, 1598631, 1651148, 1616619, 1591048, 1636405, 1648848, 1799917, 1743671, 1739269, 1826982, 1875897, 1879270, 1815773, 1816312, 1874683, 1916313, 1890621, 1886696, 1994710, 1972570, 2033736, 2079314, 2060477, 2150588, 2134439, 2198440, 2297372, 2396247, 2326575, 2273755, 2323931, 2449779, 2456936, 2567373, 2679081, 2709509, 2825638, 3034019, 3101488, 3380033, 3707861, 4012288, 4298523, 4745555, 5268228, 5933962, 6685972, 7456532]
5652G456532J060661J094966J152128J290713J118582J092410R82790K72293j147154
5643A4373921k238975k299628j746795j134861q33934n90758m43116l07407l37205
5634D441242k69721j76303j45985j6057j97926k41914j55867j97555j87642k20484
5624B631788j14159k58095q5012L0215j56060j29478k8081J0508J5320l8817j42372
5613A735757q5279M0806K3471j4707P9095L7529L4951k9686m653M5656J56220
5602B019160K3750j2122J57984L3026R1577O1377Q1512J09596P2546O9228M293
5591B711927n4737j85633k25361k32874k42703r1417j23218k06942J05150K3032
5581A477224o013J6857l064J09073O416M1221Q0949J17743J07860J6126o2283
$$ y = [7456532, 8517193, 9612159, 10764287, 12055000, 13173582, 14265992, 15248782, 15521075, 14373921, 12134946, 9835318, 8088523, 6953662, 6119728, 5528970, 5085854, 4778447, 4441242, 4171521, 3995218, 3849233, 3833176, 3635250, 3393336, 3237469, 3039914, 2852272, 2631788, 2517629, 2259534, 2174522, 2204737, 2048677, 1919199, 1891118, 1901626, 1916946, 1878129, 1735757, 1650478, 1691284, 1714755, 1700048, 1779143, 1816672, 1851623, 1821937, 1817284, 1862940, 2019160, 2042910, 2030788, 2188772, 2221798, 2313375, 2374752, 2456264, 2565860, 2638406, 2707634, 2711927, 2657190, 2471557, 2246196, 2013322, 1770619, 1679202, 1555984, 1349042, 1454192, 1477224, 1471211, 1488068, 1485004, 1594077, 1600493, 1641714, 1722663, 1840406, 1948266, 1964392, 1902109]
5570A902109P208Q672J1437r3449n3426j82878j97423m0379j71817p4811j2234
5559A103009p5050q570m406O93k2456j30534r7827k494M1042O0689n1041n643
5547H07412L8962k6208j36484j4274J8430k2506J9917J9371r0335m2765k820J1502
5535E80202K4539J5303O0643j11683q6440O3469l553k4678O8458P727q8906q8769
5523D16312M7836k0086k2578o9756P5608P7857k3202N4351j35622n0350k7005
5512C23365n0223O5572K1784O935m530N218N756n1939j3563O8314k9l8104o06
5499C37950L8376J2614j43431m7818P0714m6296J09738k4048J4213M7562P2769
5488D42343k3778n2288Q2864q6963q6276p5833O2143Q9848J7986o9082R23j6613
$$ y = [1902109, 1909317, 1917989, 1929426, 1835977, 1782551, 1599673, 1402250, 1361871, 1190054, 1115243, 1103009, 1027959, 1019389, 1014983, 1015676, 993220, 862686, 764859, 762365, 803407, 864096, 813055, 807412, 846374, 820166, 683682, 669408, 687838, 665332, 685249, 704620, 614285, 571520, 568700, 580202, 604741, 620044, 680687, 569004, 482564, 546033, 542480, 517802, 586260, 593987, 505081, 416312, 464148, 444062, 421484, 351728, 427336, 505193, 481991, 536342, 400720, 350370, 323365, 273142, 338714, 360498, 367433, 362903, 368121, 373877, 321938, 308375, 376689, 376660, 338556, 337950, 376326, 388940, 245509, 197691, 268405, 222109, 331847, 307799, 322012, 369574, 442343, 418565, 366277, 449141, 362178, 275902, 200069, 262212, 352060, 370046, 300964, 301887, 285274]
5476B85274n5712L0793J8146k6556J25520J01341o4526n7946j8632m1469J4952
5465C11185M4870l3217j7996K0335K7115P3511J2370j10090n9482K243J27254
5454C98098Q2203P036J7686L6260r1630j6574J9436J40114n5320N2049M6978N0547
5442F86883O2584L5580R5757k7174N5999l6776p8251r2800j4848j5433R463J94248
5430H75232k2856q349P3362j6560M1879N5067J5903P6747j02178N6986K09251
5419A254484k2564j02212m0340R0474k8749M4584n3375j3356m5920j05892J3788
5408I90922J3395o7243M7434K7058N2817Q0528k7803n1153L8961J5180J6873J21226
5396A258195J13686q0904L8576O0705J64023N6260l7793J50272J58976p6985N1152
$$ y = [285274, 229562, 260355, 278501, 251945, 377465, 478806, 414280, 356334, 337702, 296233, 311185, 356055, 322838, 304842, 325177, 352292, 425803, 438173, 328083, 268601, 270844, 398098, 480301, 487337, 505023, 541283, 449653, 433079, 452515, 592629, 537309, 589358, 636336, 686883, 749467, 785047, 880804, 853630, 909629, 872853, 794602, 701802, 686954, 671521, 680984, 875232, 852376, 844027, 917389, 900829, 942708, 997775, 1013678, 1090425, 988247, 1045233, 1254484, 1231920, 1129708, 1089368, 1179842, 1151093, 1195677, 1142302, 1128946, 1083026, 977134, 990922, 1004317, 937074, 984508, 1011566, 1064383, 1144911, 1117108, 1065955, 1104916, 1120096, 1136969, 1258195, 1371881, 1290977, 1329553, 1390258, 1554281, 1610541, 1572748, 1723020, 1881996, 1805011, 1856163]
5385A856163Q5490L5196P7751Q6269J24333Q1764n3521J06902R7007J60960J35600
5374B793914J29661K09195L48203J57913K35431K78391L25960N49925O66124P64647
5364F459364P59520J010687J256975J397268J518835J790603J897045J992512
5356A8082809J582330J558857J369634j96674k422069l664908l140954k152129
5348A1016896j501764j120191q23272o40874m09395l42106l73634j69852j78119
5339E457689p5116k7546o72L8928m5065o434J69069J05127l995p1820j64224k54446
5327E121495l42980m55169l40325l92394j49084j46888j64837j89025L0919r6036
5317B875676l8288j65182j80700n1198o6438K5056n5919j42055J8002k2752L6067
$$ y = [1856163, 1941653, 1976849, 2054600, 2140869, 2265202, 2346966, 2293445, 2400347, 2497354, 2658314, 2793914, 2923575, 3132770, 3480973, 3638886, 3874317, 4152708, 4478668, 5028593, 5694717, 6459364, 7218884, 8229571, 9486546, 10883814, 12402649, 14193252, 16090297, 18082809, 19665139, 21223996, 22593630, 22396956, 19974887, 16309979, 13169025, 11016896, 9515132, 8394941, 7571669, 6930795, 6521400, 6179294, 5805660, 5635808, 5457689, 5382573, 5355027, 5354355, 5393283, 5348218, 5341784, 5510853, 5615980, 5611985, 5540165, 5375941, 5121495, 4778515, 4323346, 3983021, 3590627, 3441543, 3294655, 3129818, 2940793, 2971712, 2875676, 2837388, 2672206, 2491506, 2440308, 2373870, 2398926, 2343007, 2200952, 2218954, 2196202, 2232269]
5306B232269o7617j06060k0430q1780O4100Q3918L4978J2707r29n5573P9147L5280
5294B210010L3288P4123P2088Q1057L0969P3842k3683M910J39909J7896K997L5323
5282B752729O2648P7593m386J10239Q7287N7667N6558N1784Q4108R0314J56202
5271C582743J57531J79780J76758J98906J11063j72340k36100j72771k51892n2594
5261C521084l0988j45867r1282j9876K8025l2356N6892J6625L8501J17041n4723
5250C403076J46832R8075J24225J36976J36208L8159R5916m2014J10720J23803
5240D371976K06275J95672J43858J16505K46405P2000P2228K13482j1811m6969
5230E579621q3602K287l925q8556j70657J4630K8759N2077K29732J25658K58703
$$ y = [2232269, 2164652, 2058592, 2038162, 1956382, 2020482, 2104400, 2139378, 2152085, 2151156, 2095583, 2174730, 2210010, 2243298, 2317421, 2389509, 2470566, 2501535, 2575377, 2551694, 2556604, 2696513, 2714409, 2717406, 2752729, 2815377, 2892970, 2888584, 2998823, 3086110, 3143777, 3200335, 3252119, 3336227, 3426541, 3582743, 3740274, 3920054, 4096812, 4295718, 4406781, 4234441, 3998341, 3825570, 3573678, 3521084, 3490096, 3344229, 3252947, 3233071, 3261096, 3228740, 3285632, 3302257, 3340758, 3457799, 3403076, 3549908, 3647983, 3772208, 3909184, 4045392, 4083551, 4179467, 4137453, 4248173, 4371976, 4578251, 4773923, 4917781, 5034286, 5280691, 5352691, 5424919, 5638401, 5626590, 5579621, 5496019, 5498306, 5494381, 5405825, 5235168, 5249798, 5278557, 5330634, 5560366, 5686024, 5944727]
5219E944727M17350K80870J84454K88648L05252K53763k2628r9132l302k09567
5209G340435k84178l18872k99366k53297m44623l26389k24854j94806j56498k05292
5199D632260j79852j11976l5523j7183k07363j5067J19276O7684K09571L8892
5189D500719J36808J02323Q7458J39893J62877J66301Q8093o0623p5858m0536
5179E207455j67641k45668r4562l05694k06472j04335j86497m6996j79873j31727
5169C537990L2047q4009j00515O819M1067L452O0500J09167o3846N244M1736R9684
5157C689336P0686m1431o7540q7830O871n7119r856q219L962Q012n867P5535J7463
5144C594003k3509K7251m234n8819J24264M8363O2588O5312K9373P2043P2102
$$ y = [5944727, 6362077, 6642947, 6827401, 7116049, 7421301, 7675064, 7652436, 7553304, 7550002, 7340435, 7056257, 6737385, 6438019, 6184722, 5740099, 5413710, 5188856, 4994050, 4837552, 4632260, 4452408, 4340432, 4304909, 4287726, 4080363, 4065296, 4184572, 4252256, 4461827, 4500719, 4637527, 4739850, 4827308, 4967201, 5130078, 5296379, 5384472, 5323849, 5247991, 5207455, 5039814, 4794146, 4699584, 4393890, 4187418, 4083083, 3896586, 3849590, 3669717, 3537990, 3570037, 3486028, 3385513, 3392332, 3433399, 3436851, 3497351, 3606518, 3542672, 3547916, 3589652, 3689336, 3760022, 3718591, 3651051, 3563221, 3570092, 3512973, 3503117, 3494898, 3498860, 3506872, 3501005, 3576540, 3594003, 3570494, 3597745, 3593511, 3534692, 3658956, 3707319, 3769907, 3835219, 3864592, 3936635, 4008737]
5133D008737J13691n1162R4509Q5943Q4987m8219j9645M7325L4394j805k924K7715
5121D373546P7294O7280J35845M8071N0204k6674J1434K41605K10162N8408J23017
5110E370192J28595J73016J68609J62699R8877J88408J16696J50575J64339J02032
5100F824038K20780J67282J03727K32682K84510J90264J61885J66136K10805J85909
5090H748018K09390K31794K80495K03377L00754K61490K96891K73747L12418L40228
5080A1458602M81567M01810M01380M82892M28223N65275N49490O36224O56887
5071A6062350O46478N68226P20548R19562P92881R15888R18151J048008J081058
5062B3673150J149569J265593J368167J578262J707805J901492J930654K354415
$$ y = [4008737, 4122428, 4071266, 4165775, 4251718, 4336705, 4288486, 4268841, 4316166, 4350560, 4348755, 4345831, 4373546, 4450840, 4518120, 4653965, 4702036, 4752240, 4725566, 4737000, 4978605, 5188767, 5247175, 5370192, 5498787, 5671803, 5840412, 6003111, 6101988, 6290396, 6407092, 6557667, 6722006, 6824038, 7044818, 7212100, 7315827, 7548509, 7833019, 8023283, 8185168, 8351304, 8562109, 8748018, 8957408, 9189202, 9469697, 9673074, 9973828, 10235318, 10532209, 10805956, 11118374, 11458602, 11940169, 12341979, 12743359, 13226251, 13654474, 14219749, 14769239, 15405463, 16062350, 16708828, 17277054, 17997602, 18917164, 19710045, 20625933, 21544084, 22592092, 23673150, 24822719, 26088312, 27456479, 29034741, 30742546, 32644038, 34574692, 36929107]
5054C6929107K672999K867586L338740L733237M315151M815043N428566N996457
5046G0096886O690661P300125P878324Q304630Q545701Q270583P787399P325693
5038A32200002O406002M861188K975152O75243j771949m150478o125896p778604
5030A27290660q913261r415330r366995r028307q283489p409271o605974n753013
5022F2515020n214983m426456l826528l483212l148590k790379k564469k250775
5014C4809628j989804j880480j649538j556872j449218j248244j090935r34064
5006B3010473r70757q14724o62770o34011n29311o38748n50282m19216m87429
4997A7303225m83143o38493r06430q73262o59773n22173n85480m75064l62342
$$ y = [36929107, 39602106, 42469692, 45808432, 49541669, 53856820, 58671863, 64100429, 70096886, 76787547, 84087672, 91965996, 100270626, 108816327, 117086910, 124874309, 132200002, 138606004, 143467192, 146442344, 147117587, 145345638, 141195160, 135069264, 127290660, 118377399, 108962069, 99595074, 90566767, 82283278, 74874007, 68268033, 62515020, 57300037, 52873581, 49047053, 45563841, 42415251, 39624872, 37060403, 34809628, 32819824, 30939344, 29289806, 27732934, 26283716, 25035472, 23944537, 23010473, 22039716, 21224992, 20562222, 19928211, 19398900, 18760152, 18209870, 17790654, 17303225, 16820082, 16181589, 15275159, 14401897, 13742124, 13219951, 12634471, 12159407, 11797065]
4988A1797065l55112m09001m30436m25139l53293l60661k36068k25542l14744
4979H687069k47919k57131k15743k29475j92753j78757j15402k44668k08260j72487
4969F624474j80919r1883j04669k06777j53817j44767r2812j86245j29445q8296
4959E244844p6267l2529m0441j26822j49816q0797m6749j82312j53871q539k5860
4948D320841j10819j61283j25056o5389j32724r4376k2317q2657r1246j04053
4938C330921N235j157k5633r6191j6890m7816k9777p4392p5020N0253j11201l4378
4926B873954j00250m5611l3476k6256P0526R4049N342m4550P6036O1960R1378
4915C023102l6531J50938O3660j3981J1282J09307Q784M4710k487j37609Q511
$$ y = [11797065, 11441953, 11032952, 10602516, 10177377, 9824084, 9463423, 9227355, 9001813, 8687069, 8439150, 8182019, 7966276, 7736801, 7544048, 7365291, 7249889, 7005221, 6796961, 6624474, 6443555, 6351672, 6247003, 6040226, 5886409, 5741642, 5648830, 5462585, 5333140, 5244844, 5168577, 5136048, 5095607, 4968785, 4818969, 4738172, 4691423, 4509111, 4355240, 4346701, 4320841, 4210022, 4048739, 3923683, 3858294, 3725570, 3631194, 3608877, 3526220, 3434974, 3330921, 3336156, 3334999, 3309366, 3213175, 3196285, 3148469, 3118692, 3044300, 2969280, 3019533, 2908332, 2873954, 2773704, 2728093, 2694617, 2668361, 2738887, 2832936, 2838278, 2793728, 2869764, 2931724, 3023102, 2986571, 3137509, 3201169, 3187188, 3198470, 3307777, 3316561, 3361271, 3358784, 3221175, 3229686]
4904C229686j44437p6747j27537q4188j89665j91178j0344m7246j42201O8952
4894B285095n6630j59217o2163j6205L5826Q818k453k1327l4428o3562o2774o1387
4882A789593k0486L3699j8775m8383M2161p4940r157j24239j08481Q0761M7630
4871A589383l0341j0057l0031q9280Q3063o4665n1797j6896R0905Q953j13336
4860A365901j9371Q6754L5467j03832r0J43765m405j37947M162n6708N9557K8120
4848A401373m5892o2103j7947J8472o04r209p5954J04899M6860o6543p977o5826
4836A219549K7991l286m602O0289J1391O6787n2165q9096L4463M4814l3704o3059
4824A219372M1261J13925J5573j6935j0085j8360O0365P0387J08973J6175j2046
$$ y = [3229686, 3085249, 3008502, 2880965, 2796777, 2607112, 2415934, 2405590, 2358344, 2216143, 2285095, 2228465, 2069248, 2007085, 1990880, 2026706, 2035524, 2033071, 2011744, 1977316, 1913754, 1850980, 1789593, 1769107, 1802806, 1784031, 1735648, 1777809, 1702869, 1693712, 1569473, 1460992, 1541753, 1589383, 1559042, 1548985, 1518954, 1429674, 1512737, 1448072, 1396275, 1379379, 1470284, 1479237, 1365901, 1346530, 1433284, 1468751, 1364919, 1364829, 1508594, 1504189, 1366242, 1370404, 1313696, 1373253, 1401373, 1355481, 1293378, 1275431, 1293903, 1293299, 1284090, 1208136, 1313035, 1359895, 1293352, 1285375, 1219549, 1247540, 1244254, 1239652, 1299941, 1311332, 1378119, 1325954, 1236858, 1271321, 1316135, 1282431, 1219372, 1260633, 1374558, 1390131, 1373196, 1363111, 1344751, 1405116, 1475503, 1584476, 1600651, 1588605]
4813A588605R8055M7899Q7453J42269L5209Q3657J92148J29452R546L2139L8105
4802B484537R2088N0694N1736m393m1583n5961o4166R8960J96780r0584m4437
4791B673671j429j0462n7825j9639r1273p0979j65156j5248j07980j2661l0672
4780B090347j7609J0914r0284n5057L217J72125j3870p602q3316j3612j107L690
4768A997836M8517j5650R2937Q8265J09725O7836M0055M9151K7157K40321K1531
4757B767681R29R2746J28556O7454K24977J97716J87370J15780J12105K07410
4747D102724J60747P6532j333J8164J01618l9089n3695J3073J5935j0082J5972
4736D400566j6474j2746j60583q6544j42915j36230j95758k64667o6780j20533
$$ y = [1588605, 1686660, 1734559, 1822012, 1964281, 1999490, 2083147, 2275295, 2404747, 2414293, 2446432, 2484537, 2576625, 2627319, 2679055, 2674662, 2633079, 2577118, 2512952, 2611912, 2808692, 2718108, 2673671, 2672242, 2661780, 2603955, 2584316, 2493043, 2422064, 2256908, 2241660, 2133680, 2121019, 2090347, 2072738, 2083652, 1993368, 1938311, 1941528, 2113653, 2099783, 2092181, 2008865, 1995253, 1994146, 1997836, 2046353, 2030703, 2123640, 2211905, 2321630, 2389466, 2429521, 2478672, 2505829, 2746150, 2767681, 2768610, 2861356, 2989912, 3057366, 3282343, 3480059, 3667429, 3783209, 3895314, 4102724, 4263471, 4340003, 4338670, 4356834, 4458452, 4419363, 4365668, 4378741, 4394676, 4384594, 4400566, 4384092, 4371346, 4210763, 4124219, 3981304, 3845074, 3649316, 3384649, 3317869, 3197336]
4726C197336o7728k41946j06573k04816j49214J5185K9250q7046n0772R5222k2055
4715B406843p0985j44098K5707k299o564P5954j4648q9933L1007j03788L0253
4704B137449Q5856m843k3321k8497o7974K6210n9473o6497j9127r4827R349J20055
4692B014360j6157j86282j11279m1770j07778k0194m9305Q8980K4746r2040o1429
4681A441852n6828L3937j07185m4006L0017k1400j5880o6071K8658P3472o9539
4670A227027l262J42913K989n9790m5887l3808L7097n8526J52420o2219o6999
4659A231955M0078n276j01536M4732J19750o1185j39120R6894k1627J22134k365
4648A324434O1090m1933j00399J02576j1079n455Q3530N2777k132J1401j1261
$$ y = [3197336, 3129608, 2887662, 2781089, 2576273, 2427059, 2442244, 2471494, 2384448, 2333676, 2428898, 2406843, 2335858, 2191760, 2217467, 2215168, 2208604, 2284558, 2269910, 2179977, 2210984, 2107196, 2137449, 2223305, 2218462, 2195141, 2166644, 2098670, 2124880, 2065407, 1998910, 1979783, 1884956, 1894305, 2014360, 1998203, 1811921, 1700642, 1658872, 1551094, 1530900, 1481595, 1570575, 1595321, 1503281, 1441852, 1385024, 1418961, 1311776, 1267770, 1297787, 1276387, 1260507, 1194436, 1223094, 1296566, 1227027, 1223765, 1366678, 1369667, 1309877, 1263990, 1230182, 1267279, 1208753, 1361173, 1298954, 1231955, 1272033, 1266757, 1165221, 1209953, 1329703, 1268518, 1129398, 1226292, 1204665, 1326799, 1324434, 1385524, 1343591, 1243192, 1345768, 1334689, 1329234, 1412764, 1465541, 1463409, 1474810, 1463549]
4637A463549J7285J35248J08259l2647P3513Q1289K3967J15635J13444j26529
4627A973013j9075N6138J83297L5296J6240J47821P5769J26419J3421R1520Q6204
4616B786063J31353J32361k1032J60375R0337R5410L4532J8847n6051q7546j5738
4605C268911j49163l8105j51362l7866K8684q4535n8389m5084K0431J25930n7537
4594B821915J0394j1292K5291j3108j9560M8473O527Q2152J3928j9505O1643J09001
4582C115859m6280Q8416Q4948J33964L5229R1498M2102N8457J36764J36392J59270
4571D036619J48979K03563K25005J67717J44404N0653J5283P5625o0100k23131
4561D784617k24451k25210j07853j67691k76280j5254o2406r3848j49642r4090
$$ y = [1463549, 1480834, 1616082, 1724341, 1691694, 1765207, 1846496, 1870463, 1986098, 2099542, 1973013, 1953938, 2010076, 2193373, 2228669, 2244909, 2392730, 2468499, 2594918, 2608339, 2699859, 2786063, 2917416, 3049777, 3028745, 3189120, 3279457, 3374867, 3409399, 3428246, 3372195, 3284649, 3268911, 3119748, 3081643, 2930281, 2892415, 2921099, 2836564, 2778175, 2733091, 2753522, 2879452, 2821915, 2832309, 2821017, 2846308, 2833200, 2813640, 2862113, 2868640, 2950792, 2964720, 2945215, 3006858, 3115859, 3069579, 3157995, 3242943, 3376907, 3412136, 3503634, 3545736, 3604193, 3740957, 3877349, 4036619, 4185598, 4389161, 4614166, 4781883, 4926287, 4976940, 4992223, 5067848, 5007748, 4784617, 4560166, 4334956, 4227103, 4059412, 3783132, 3767878, 3705472, 3611624, 3461982, 3367892]
4551C367892L1329k31703j31317o7207j53647j32292j4032l6117l5881p0570m9128
4540B477327k3530K7776k9979m0092P696j0250K6247J5805J2865P3116K1827K383
4528B561191j141O6780Q4344R931j7615J2268N5755j00625j1069J00359J8090
4517B778268j9468N2135k5712O8724M3582o5606j09249p3006q4108j17809p6652
4506B371099j39089j24069k0509j40446p9462J5633p8114n5129j8137J17736J6164
4495A865677r5599k4122L8952j32888J5445Q5538k0983q2345j08289R4525j14923
4484A520988Q4901p471k5514L3063j73831K2678K7341j3461j3351L7545J5796
4473A508684k89k086m8959q7028R7273J44517j46271J22618J8496j16644O8098
$$ y = [3367892, 3399221, 3167518, 3036201, 2968994, 2815347, 2683055, 2669023, 2632906, 2597025, 2526455, 2477327, 2453797, 2481573, 2451594, 2411502, 2419198, 2408948, 2435195, 2451000, 2463865, 2536981, 2558808, 2561191, 2560050, 2626830, 2711174, 2721105, 2703490, 2715758, 2771513, 2670888, 2659819, 2760178, 2778268, 2758800, 2810935, 2785223, 2853947, 2897529, 2831923, 2722674, 2649668, 2565560, 2447751, 2371099, 2232010, 2107941, 2087432, 1946986, 1867524, 1883157, 1805043, 1749914, 1731777, 1849513, 1865677, 1770078, 1745956, 1784908, 1652020, 1667465, 1753003, 1732020, 1649675, 1541386, 1635911, 1520988, 1605889, 1598418, 1572904, 1605967, 1432136, 1454814, 1482155, 1468694, 1455343, 1492888, 1508684, 1508395, 1506309, 1457350, 1370322, 1467595, 1612112, 1465841, 1588459, 1606955, 1490311, 1558409]
4462A558409N3866r2799k5871k4383p7184M9355N9809n1137N8820R4094r3702
4451A509277N8566J11506J0601K7455Q4154k5900n7463R7417n7598l1406M4710
4440A771319J637K8090M5575J586k9893N8881m3171M0876L9207J22145n8017p9231
4428A899004R0335O9380O7747Q782k1106Q3078Q1273J840k6881J9572K0891J00018
4416B393933j7142j621N8182K5076O1050j2931o2854M6181Q495o2709j2124j3102
4404B410434N7326K3866K4723K2199J1741Q3769J4554J06541J25531k3097J92189
4393C049776J01738M9633P4140J64250J62202K23841J10434J57928J31725J50817
4383D376484J93016J34505R0563R123P320n3124k73415j69693K3522J21631o9244
$$ y = [1558409, 1612275, 1519476, 1493605, 1469222, 1392038, 1441393, 1501202, 1450065, 1508885, 1602979, 1509277, 1567843, 1679349, 1689950, 1717405, 1801559, 1775659, 1718196, 1815613, 1758015, 1726609, 1771319, 1772956, 1801046, 1846621, 1848207, 1818314, 1877195, 1834024, 1874900, 1914107, 2036252, 1978235, 1899004, 1989339, 2058719, 2126466, 2135248, 2114142, 2197220, 2278493, 2280333, 2253452, 2273024, 2293915, 2393933, 2376791, 2375170, 2433352, 2458428, 2519478, 2506547, 2443693, 2489874, 2498369, 2435660, 2423536, 2410434, 2467760, 2491626, 2516349, 2538548, 2550289, 2634058, 2648612, 2755153, 2880684, 2857587, 3049776, 3151514, 3201147, 3275287, 3439537, 3601739, 3825580, 3936014, 4093942, 4225667, 4376484, 4569500, 4704005, 4794568, 4803691, 4811011, 4757887, 4484472, 4314779, 4338301, 4459932, 4390688]
4372D390688J0362J10560o8019j9736k7943J08102J21767l474n7369J82830K9518
4361D777286M7089J30465m471M3567J07715J17081J46237N2463K17828L30104
4351E965364K34615K52817K14380K05026L21955K40571J60028J41759K33879J28059
4341H098453J87256J40092J42579K71315K47069K06854J96996K94993K11181J87587
4331A0184375L27332L65187L28032L96364M56108M81977N06270L90038M17593
4322A3853276L95126J49407P1645J34804K16355K65503M44702M55103L73990M77999
4312A6837910N44505N68845P10690O89775P21527P76233P23114P92007Q00922
4303B3165528Q42239J117472J204333J286915J221280J397807J396253J466233
$$ y = [4390688, 4401050, 4511610, 4443591, 4423855, 4395912, 4504014, 4625781, 4622307, 4564938, 4747768, 4777286, 4824375, 4954840, 4950369, 4993936, 5101651, 5218732, 5364969, 5417432, 5635260, 5965364, 6199979, 6452796, 6667176, 6872202, 7194157, 7434728, 7594756, 7736515, 7970394, 8098453, 8285709, 8425801, 8568380, 8839695, 9086764, 9293618, 9490614, 9785607, 9996788, 10184375, 10511707, 10876894, 11204926, 11601290, 12057398, 12539375, 13045645, 13435683, 13853276, 14248402, 14397809, 14469454, 14604258, 14820613, 15086116, 15530818, 15985921, 16359911, 16837910, 17382415, 17951260, 18661950, 19351725, 20073252, 20849485, 21572599, 22364606, 23165528, 24007767, 25125239, 26329572, 27616487, 28837767, 30235574, 31631827, 33098060]
4295C3098060J684893J770331K093180K390832K887687L369871L910776M582778
4287E5788408N474664O515542P629459R319272J0976436J2518676J4625563J6811687
4279A39659707J9385772K1555542K3264070K3227712K1613304J8717503J2383475
4272B79807085n50966j8425197l2813348l7512731l3164857k5811661j9038153
4265A12490172j4076969j0836180q569306o959987n731556m985728m534651l692734
4257E3103061l168040k938628k621173k432321k291547j956050j831504j744343
4249C4119455j438294j079463r91203q98019m85243o06363o70068o89167p08410
4240B6553225n20967o11112o21445o35095o45585p16281p03801n99468n44473
$$ y = [33098060, 34782953, 36553284, 38646464, 41037296, 43924983, 47294854, 51205630, 55788408, 61263072, 67778614, 75408073, 84727345, 95703781, 108222457, 122848020, 139659707, 159045479, 180601021, 203865091, 227092803, 248706107, 267423610, 279807085, 279256119, 260830922, 228017574, 190504843, 157339986, 131528325, 112490172, 98413203, 87577023, 79007717, 72047730, 66316174, 61330446, 56795795, 53103061, 49935021, 46996393, 44375220, 41942899, 39651352, 37695302, 35863798, 34119455, 32681161, 31601698, 30610495, 29712476, 29227233, 28620870, 27950802, 27261635, 26553225, 26032258, 25421146, 24799701, 24164606, 23519021, 22802740, 22098939, 21499471, 20954998]
4231B0954998m55426n05691n30273m49984n51873n86106n51039m74267m81725
4222A6368614m61342l38382k69574k48777m68705m65042k61298l16246k98700
4213A3240548m09960l46165j12734j58972j83774j46587r2493j68404j40197m671
4203A1476591p5089j65064n041K1874j50611k7974M3669m896q7771n7086l2993
4192A0935609n5132J0508p0302l6519O6296J38386j947j8414J55808J6677J17705
4181A1258675J84553k2661K9255P268J0357L8916P1981k5193O1086Q2076j2325
4170A1683988K7375J45766P3794J74245L7498J13468K34769K18359Q0564J68160
4160A2957986L00601J46724J40649J57090K63330K16470J21764J47865K07729
$$ y = [20954998, 20499572, 19993881, 19463608, 19013624, 18461751, 17875645, 17324606, 16850339, 16368614, 15907272, 15568890, 15299316, 15050539, 14581834, 14116792, 13855494, 13539248, 13240548, 12830588, 12484423, 12371689, 12212717, 12028943, 11882356, 11789863, 11621459, 11481262, 11476591, 11401502, 11236438, 11231397, 11253271, 11102660, 11074686, 11118355, 11113459, 11025688, 10968602, 10935609, 10880477, 10890985, 10820683, 10784164, 10850460, 10988846, 10986899, 10968485, 11124293, 11140970, 11258675, 11443228, 11420567, 11449822, 11457090, 11467447, 11506363, 11578344, 11553151, 11614237, 11696313, 11683988, 11711363, 11857129, 11930923, 12105168, 12142666, 12256134, 12490903, 12709262, 12789826, 12957986, 13258587, 13405311, 13545960, 13703050, 13966380, 14182850, 14304614, 14452479, 14660208]
4151A4660208L55921L10246K20834L07794K42364K62841L16514M24117K63257
4142A7364096K77869L31853L51491L36696K70053K84230L47783M03547M62037
4133B0429655N78675N59636O60756P23975O99971P99095R48795Q27348Q67758
4124B7095664R33202R22394R18447J050657J111859J157829J445409J554790J600118
4115C7790369J602150J699579J909306J946426K219226K726505L150915L496461
4107E6540937M020152M640600N243113O420280P637120R140736J0789638J2620690
4099A17053266J4508136J6678538J8944319K0967819K2544984K2709637K1163209
4092B54569908J8516948J4097220M254476j2429765k8502542l5445658l2919688
$$ y = [14660208, 15016129, 15326375, 15547209, 15855003, 16097367, 16360208, 16676722, 17100839, 17364096, 17641965, 17973818, 18325309, 18662005, 18932058, 19216288, 19564071, 19967618, 20429655, 21008330, 21567966, 22228722, 22952697, 23652668, 24451763, 25400558, 26227906, 27095664, 28028866, 28951260, 29869707, 30920364, 32032223, 33190052, 34635461, 36190251, 37790369, 39392519, 41092098, 43001404, 44947830, 47167056, 49893561, 53044476, 56540937, 60561089, 65201689, 70444802, 76865082, 84502202, 93642938, 104432576, 117053266, 131561402, 148239940, 167184259, 188152078, 210697062, 233406699, 254569908, 273086856, 287184076, 291438552, 279008787, 250506245, 215060587, 182140899]
4085A82140899k6372503k0043068j5190312j1821366r306691p448347o098143
4078H5860469m822861l986262l430197k793815k383210k085789j781481j615672
4070F2961182j506153j145502r98166q63796m16727k45514R468M62873O82822
4061E8940487Q10309R51857R34449J067190J275987J271748J380127J793128K223199
4052G0648481K587337L178673L848301M260198M984481N798643P272351Q798983
4044A11377448J0340776J2092439J3971029J6090432J8357316K0592549K2239220
4037B25061209K2526645K0984133J8266102J2866524K663825j2252643k6592587
4030B63523208l4022203l3158343k7441452k0864450j5738440j2028644r439171
$$ y = [182140899, 155768396, 135725328, 120535016, 108713650, 99406959, 91958612, 85860469, 81037608, 77051346, 73621149, 70827334, 68444124, 66358335, 64576854, 62961182, 61455029, 60309527, 59311361, 58447565, 58030838, 57785324, 57794792, 58257665, 58940487, 59750796, 60702653, 61637102, 62704292, 63980279, 65252027, 66632154, 68425282, 70648481, 73235818, 76414491, 80262792, 84522990, 89507471, 95306114, 102578465, 111377448, 121718224, 133810663, 147781692, 163872124, 182229440, 202821989, 225061209, 247587854, 268571987, 286838089, 299704613, 302368438, 290115795, 263523208, 229501005, 196342662, 168901210, 148036760, 132298320, 120269676, 110830505]
4023A10830505p571822o385523n396214m825973m274190l877419l551462l175353
4015G1772549k984585k695833k489284k334236j908765j877383j645257j486621
4007E4350585j241071r41196r16027q76958o40593o21200o57904n80737m85026
3998D7389873k70144k20310j37622j91037N1812K90594L02547N15404P01904Q13000
3988D9246021R84535R50147O80718N75089M01153J94468P6109k73792q98954j436140
3978E0499354j917466k204878k269654k107996j854519j492438j130330j021368
3970C6500705p67609o05717m32725m57188j21387k57345k51833P7680K93402K28887
3960C4206870K30874L77725M24096M43039N10320M60743N54055N20295L34821
$$ y = [110830505, 103258683, 96873160, 91476946, 86650973, 82376783, 78499364, 74947902, 71772549, 68787964, 66092131, 63602847, 61268611, 59359846, 57482463, 55837206, 54350585, 53109514, 52168318, 51252291, 50375333, 49734740, 49113540, 48455636, 47874899, 47389873, 47119729, 46899419, 46761797, 46570760, 46622572, 46913166, 47215713, 47731117, 48433021, 49246021, 50230556, 51180703, 51861421, 52436510, 52837663, 53032131, 53108240, 52834448, 51935494, 50499354, 48581888, 46377010, 44107356, 41999360, 40144841, 38652403, 37522073, 36500705, 35733096, 35127379, 34694654, 34237466, 34116079, 33858734, 33606901, 33684581, 33977983, 34206870, 34437744, 34815469, 35239565, 35682604, 36192924, 36653667, 37207722, 37728017, 38062838]
3951C8062838L35791N19675N28875N29986Q20566Q63744J059375J136597J256310
3942D5113757J469415J710254J820973K024781K257365K528760K676190K886839
3934F2488334L147216L186822L368073L317221L539228L539266L360412L045448
3926H8992020K837746K555430K084860J633279J351920P57057M62224M0677j98820
3917A00516393j67333k53343j01889j20017m7834R1638L72714M48919P14942Q88341
3907A02342531J202948J501332J850920K164849K550687K967971L423768M115520
3899A22120526M764906N421349O294438P316955Q055434R290777J0268171J1268478
3891A84801034J2212679J2714739J2926097J2639539J1696318R806529P057385
$$ y = [38062838, 38398629, 38918304, 39447179, 39977165, 40797731, 41661475, 42720850, 43857447, 45113757, 46583172, 48293426, 50114399, 52139180, 54396545, 56925305, 59601495, 62488334, 65635550, 68822372, 72190445, 75507666, 79046894, 82586160, 85946572, 88992020, 91829766, 94385196, 96470056, 98103335, 99455255, 100212312, 100674536, 100715213, 100516393, 100349060, 100095717, 99993828, 99873811, 99825977, 99917615, 100290329, 100739248, 101454190, 102342531, 103545479, 105046811, 106897731, 109062580, 111613267, 114581238, 118005006, 122120526, 126885432, 132306781, 138601219, 145918174, 153973608, 163264385, 173532556, 184801034, 197013713, 209728452, 222654549, 235294088, 246990406, 256796935, 263854320]
3884B63854320L400614q46232n415571r701320j3673420j6529781j7797797j7980406
3876A85310407j7275251j5802973j3990375j2263025j0685625r228240p961719
3869I8103199o924097o217433n386493m847140m305040l921531l776236l267546
3861E9457683l012246k761293k479291k335932k013292j911915j832032j591938
3853D1519744j497044j362772j264990j347436j180295j189902j136912r57138
3845C1583255r40387r63167p73118p64997p41140q50455p42372n71038n62505
3836B4674076n34611o21841n73775n00416m28680n41308m38950m20711l89232
3827B0224552m94453m33643l45121l86773k85665m02144l58123k93689k76978
$$ y = [263854320, 267254934, 266408702, 260993131, 251291811, 237618391, 221088610, 203290813, 185310407, 168035156, 152232183, 138241808, 125978783, 115293158, 106064918, 98103199, 91179102, 84961669, 79575176, 74728036, 70422996, 66501465, 62725229, 59457683, 56445437, 53684144, 51204853, 48868921, 46855629, 44943714, 43111682, 41519744, 40022700, 38659928, 37394938, 36047502, 34867207, 33677305, 32540393, 31583255, 30642868, 29679701, 28906583, 28141586, 27400446, 26549991, 25807619, 25236581, 24674076, 24139465, 23517624, 22943849, 22443433, 22014753, 21473445, 21034495, 20613784, 20224552, 19730099, 19296456, 18951335, 18564562, 18278897, 17876753, 17518630, 17224941, 16947963]
3818A6947963l83248k07211m7285k40231k39617j16128o2410q1558j71256m7917
3808A5351102q9450q8459N644p5076p1671m9564M8076o7408l8655J4521l7662
3797A4901398n4951k35782j90467k15106l00597k16709l04409j34487j53713k19502
3787A2875675q5818j91382k3215j13711j48390O251J3493J9028j7088p5055l5808
3776A2223980K6818k5919j9338N2419Q7879M1382J30354L5349M6111J50064P0908
3765A2820007o9483J80448J18865R9670J38557Q8078N4105N0648P8733J68257
3755A3727885N6161J45513J64931K4469J80210K11855K01249N5313K18754J84940
3745A5171280J13423K51368J83295J50202P6462J03616K8023K9887n3535q5654
$$ y = [16947963, 16564715, 16357504, 16310219, 16069988, 15830371, 15714243, 15651833, 15570275, 15399019, 15351102, 15261652, 15173193, 15178837, 15103761, 15032090, 14982526, 15030602, 14963194, 14924539, 14939060, 14901398, 14846447, 14610665, 14420198, 14205092, 13904495, 13687786, 13383377, 13248890, 13095177, 12875675, 12789857, 12598475, 12575260, 12461549, 12313159, 12319410, 12332903, 12351931, 12334843, 12259788, 12223980, 12250798, 12224879, 12205541, 12257960, 12345839, 12387221, 12517575, 12552924, 12599035, 12749099, 12820007, 12750524, 12930972, 13049837, 13149507, 13288064, 13376142, 13430247, 13480895, 13559628, 13727885, 13784046, 13929559, 14094490, 14118959, 14299169, 14511024, 14712273, 14767586, 14986340, 15171280, 15284703, 15536071, 15719366, 15869568, 15946030, 16049646, 16077669, 16107556, 16054021, 15968367]
3735A5968367M9871J48630J72930J72316J67042K47556L25654L74256L86696L53320
3725A8366638K76023M95075N18809N12842N95619N01086N78108O36839P21978
3716B3203017P65852P75524Q31217Q96027Q44248Q19746Q51577R19664O98405
3707C0605277Q81819R22618N86055M76863M71357M64116L60339J56866K64545
3698C5189855q575j65826j70184j30899j74833k75450l77139m65655n04502n46432
3688C2370360n49817n81988n65527p02758o67830o24474p58638o22987n24418
3679B6771923n62219m72219n69969m27412l74341k87298l47247l27805k29983
3670B3173430k95638l09999k09713k18892j39301j41898k02887j05736j11330
$$ y = [15968367, 16018238, 16166868, 16339798, 16512114, 16679156, 16926712, 17252366, 17626622, 18013318, 18366638, 18642661, 19137736, 19656545, 20169387, 20765006, 21266092, 21844200, 22481039, 23203017, 23968869, 24744393, 25575610, 26471637, 27315885, 28135631, 28987208, 29906872, 30605277, 31487096, 32409714, 32995769, 33472632, 33943989, 34408105, 34768444, 34925310, 35189855, 35181280, 35015454, 34845270, 34714371, 34539538, 34264088, 33886949, 33421294, 32916792, 32370360, 31820543, 31238555, 30673028, 29970270, 29302440, 28677966, 27919328, 27296341, 26771923, 26209704, 25737485, 25167516, 24740104, 24365763, 24078465, 23731218, 23403413, 23173430, 22877792, 22567793, 22358080, 22139188, 21999887, 21857989, 21655102, 21549366, 21438036]
3661B1438036j76294k71858j20646q8698k10746j41313j92813p7022j31718j92119
3651A9834809j98120j95237j97335k86223k83979j80546k17085l53221j23417
3642A7799646j14531j63066k14059k71799k40881j09054k75940k42675j71073
3633A5996568k04302k43068k44451j14588j11801q6423k54404j49977q524l3776
3623A4545254r3673k5312M0154p7463o2722k0979P0918J29748J92240J47488K03889
3612A5049542K09768K11895M1989J05845K33189K56607J60127J29250O7258J12326
3602A6577796K93967K40621Q7458J29682J32844j30700j28189j62474l37216j78163
3592A6525626j12308k59680p4927k8249L312m3436n3255P7222j9750J50122J86959
$$ y = [21438036, 21261742, 20989884, 20869238, 20780540, 20569794, 20428481, 20235668, 20158646, 20026928, 19834809, 19636689, 19441452, 19244117, 18957894, 18673915, 18493369, 18276284, 17923063, 17799646, 17685115, 17522049, 17307990, 17036191, 16795310, 16686256, 16410316, 16167641, 15996568, 15792266, 15549198, 15304747, 15190159, 15078358, 14991935, 14737531, 14587554, 14579030, 14545254, 14451581, 14426269, 14466423, 14388960, 14326238, 14305259, 14376177, 14505925, 14698165, 14845653, 15049542, 15259310, 15471205, 15513194, 15619039, 15852228, 16108835, 16268962, 16398212, 16465470, 16577796, 16871763, 17112384, 17199842, 17329524, 17462368, 17331668, 17203479, 17041005, 16703789, 16525626, 16413318, 16153638, 16078711, 16050462, 16053774, 16010338, 15957083, 16034305, 16014555, 16164677, 16351636]
3581A6351636n1393l373P4012N5818L9644J0283j39215k47844k89666k38148k18062
3570A5343692k37594j65515j67394p4348k5072L6151K3590J14463R4082l3860
3560A4908195J0999J37888J71001Q1838n9038l9570J412k4158K1902l359Q0948
3549A5288058J4960o2127R7093J46270P8837J31826M6257K2603M0556J68299L7196
3538A6009828J47912J02553J16942J10375n794K2326J43057J81644J85054N2191
3528A7066088J5318J68431J86724J58034J50956K19708J79846J86596M0672R0005
3518A8462378K73764K16459J88788J85124J02631M3741K14276K73752R4509N0492
3508B0105914J49931P1804P4457J09823J73134J70728J10219J63000J78371J39713
$$ y = [16351636, 16300243, 16296870, 16370882, 16426700, 16466344, 16476627, 16337412, 16089568, 15799902, 15561754, 15343692, 15106098, 14940583, 14773189, 14698841, 14673769, 14709920, 14733510, 14847973, 14942055, 14908195, 14919194, 15057082, 15228083, 15309921, 15250883, 15211313, 15212725, 15188567, 15210469, 15207110, 15288058, 15303018, 15240891, 15337984, 15484254, 15563091, 15694917, 15741174, 15763777, 15804333, 15972632, 16009828, 16157740, 16260293, 16377235, 16487610, 16481816, 16504142, 16647199, 16828843, 17013897, 17066088, 17081406, 17249837, 17436561, 17594595, 17745551, 17965259, 18145105, 18331701, 18372373, 18462378, 18736142, 18952601, 19141389, 19326513, 19429144, 19472885, 19687161, 19960913, 20055422, 20105914, 20255845, 20327649, 20402106, 20511929, 20685063, 20855791, 20966010, 21129010, 21307381, 21447094]
3498B1447094J70012P2033J03369J33808R9863K17285J47482P7301K29094L46216
3488B3043557K56670J84012K10190J29848L21293M02688K87097L22366L42348
3479B5500069M90557L40216L37986O06061M17790M81799N35191O35651N60424
3470B9905744L77210N02721N26817N38520M96676M59926N08917O56973N11047
3461C4484551L06523L54642M26105K80493K96120J79784P7059J28855J01510K3346
3451C6658988L8236k16075k37438m6508q1530k29304k47238l16508l37648n07646
3441C4477329m55040n42246m82728m72053o44058n40513o09065m87219n26248
3432B9718159n69904m41514n66938l67174m54968n69068m66939l82694l45217
$$ y = [21447094, 21617106, 21689139, 21792508, 21926316, 22026179, 22243464, 22390946, 22468247, 22697341, 23043557, 23300227, 23484239, 23694429, 23824277, 24145570, 24548258, 24835355, 25157721, 25500069, 25990626, 26330842, 26668828, 27274889, 27692679, 28174478, 28709669, 29345320, 29905744, 30282954, 30785675, 31312492, 31851012, 32347688, 32807614, 33316531, 33973504, 34484551, 34791074, 35145716, 35571821, 35852314, 36148434, 36328218, 36405277, 36534132, 36635642, 36658988, 36697224, 36481149, 36243711, 36197203, 36115673, 35886369, 35639131, 35322623, 34984975, 34477329, 34022289, 33480043, 32997315, 32525262, 31881204, 31340691, 30731626, 30244407, 29718159, 29148255, 28706741, 28139803, 27772629, 27317661, 26748593, 26281654, 25898960, 25553743]
3423B5553743m16041m93091n67810m61317m72190n16731m25563m84608l86530
3414B1329862l92038l87459l21307l41402l06715k24729m08684k93767j60411
3405A8493350j03162l04414k96851r0661j08478j73035j29633p9091k23650k9198
3395A6955177q8327q6830j03868j13413n3824q6560j45688l7511p785j99842k07959
3384A5823570k44183k56646k26116j65786q8309l31224j60483k29060j95724p9603
3374A3846436q8823j23722j18327j46069j27035j12617k11157j06361j09705j09281
3364A2593339j2275j53218p5351m4058j24900q5907k6582q8166j37023n2683j507
3353A1791669j97750k59352j68900o3618N676j74163j00508p3454j74501J4350
$$ y = [25553743, 25137702, 24644611, 24076801, 23615484, 23143294, 22626563, 22201000, 21716392, 21329862, 20937824, 20550365, 20229058, 19887656, 19580941, 19356212, 18947528, 18653761, 18493350, 18390188, 18085774, 17788923, 17698262, 17589784, 17416749, 17287116, 17208025, 16984375, 16955177, 16866850, 16780020, 16676152, 16562739, 16508915, 16422355, 16276667, 16239156, 16231371, 16031529, 15823570, 15579387, 15322741, 15096625, 14930839, 14842530, 14511306, 14350823, 14121763, 13926039, 13846436, 13757613, 13633891, 13515564, 13369495, 13242460, 13129843, 12918686, 12812325, 12702620, 12593339, 12581064, 12427846, 12352495, 12308437, 12183537, 12097630, 12071048, 11982882, 11845859, 11793176, 11791669, 11593919, 11334567, 11165667, 11102049, 11107725, 10933562, 10833054, 10759600, 10585099, 10599449]
3343A0599449k8458n8582j59254r9753m6507K4514l8871q1899j24165n4941n1091
3332I880442J9349l5218N1468J7870j46813O9994j42343l3462K3544m5465n7272
3321I602094o4532n673j9722n2089N5463o4976q8378k1891n8876J7242L8773K074
3309I339509l2448J2846q606O834J58020N915l6090l5276Q889J00383J77267n175
3297I692068k9322J01062P8722J54850n4314P5393L4636j20599J0991j25090p4745
3286I743652j14358k33145j4174K1876r7054K3496n2960q6828J5173M0566l4990
3275I211254n7996L6213M0612J0304R6454M4808n4891L950K171q9262O5213P2312
3263I381142k710M0918P6499J31898N5773O5279k3956K9657N0679M481O2412K0641
$$ y = [10599449, 10570991, 10512409, 10353155, 10253402, 10206895, 10231409, 10192538, 10110639, 9986474, 9931533, 9880442, 9899791, 9864573, 9916041, 9933911, 9787098, 9857092, 9714749, 9681287, 9704831, 9659366, 9602094, 9537562, 9531889, 9512167, 9460078, 9515541, 9450565, 9362187, 9340296, 9281420, 9298662, 9337435, 9339509, 9307061, 9319907, 9311301, 9318135, 9476155, 9482070, 9445980, 9410704, 9419593, 9519976, 9697243, 9692068, 9662746, 9763808, 9842530, 9997380, 9943066, 10018459, 10053095, 9932496, 9943487, 9818397, 9743652, 9629294, 9396149, 9381975, 9403851, 9306797, 9330293, 9277333, 9190505, 9205678, 9246244, 9211254, 9153258, 9189471, 9230083, 9240387, 9336841, 9381649, 9326758, 9330708, 9332879, 9243617, 9308830, 9381142, 9378432, 9419350, 9495849, 9627747, 9683520, 9748799, 9724843, 9754500, 9805179, 9809660, 9872072, 9892713]
3251I892713O9646L1137K8217J03769M6892N905l530M3674o194P2636J19964J15784
3239A0520613J50738M8019M4185J41184K72667Q7473M8061J04583J43322Q3113
3229A1643958J94113J60780L0685Q7204R9919M6926J96106J46634j8784J47212
3219A2734753K08355J39532J23509J29838K36299J68027J40465J36758K21222
3210A4238758K43270K64832L02559J22010J71978J24345J6578J33403Q9800J96435
3200A5903968J34845L1977J38014K1375J86926M5235K32902J8789p84J90060K22642
3189A7125949J08118M5442J59662K44237K04718J37454R6092J85514K87518J49835
3179A8744539K40817K80687K35080J30265J76667K28995K52488K26279K14165
$$ y = [9892713, 9962359, 9993496, 10021713, 10125482, 10172374, 10178279, 10174749, 10218423, 10212229, 10284865, 10404829, 10520613, 10671351, 10719370, 10763555, 10904739, 11177406, 11264879, 11312940, 11417523, 11560845, 11643958, 11838071, 11998851, 12029536, 12116740, 12216659, 12263585, 12459691, 12606325, 12587541, 12734753, 12943108, 13082640, 13206149, 13335987, 13572286, 13740313, 13880778, 14017536, 14238758, 14482028, 14746860, 15049419, 15171429, 15343407, 15467752, 15484330, 15617733, 15707533, 15903968, 16038813, 16070790, 16208804, 16230179, 16417105, 16462340, 16695242, 16714031, 16713247, 16903307, 17125949, 17234067, 17279509, 17439171, 17683408, 17888126, 18025580, 18121672, 18307186, 18594704, 18744539, 18985356, 19266043, 19501123, 19631388, 19808055, 20037050, 20289538, 20515817, 20729982]
3170B0729982J84949K27386J57353K20808K31468L03386K60143K33485L29231
3161B2878191L95516K83311K78963K91070L77399L86750M27228L66967L80175
3152B6065570N14417K72900L19062L22010K07870Q1706L2098r0726K5568r4507
3142B7655968j94315j09298M8568M7218J13807J11605J48989J23682J77409K49363
3132B8372996L12388K74648J70521M14135K62769L80601L56048L38231M01613
3123C1283950M52782M28814M16290M76976M52495M83751O58681N98894N57656
3114C5810289O41140O32997P86413P08695P61627Q24198Q95926Q50713R25319
3105D2837317J045148J111165J172757J220375J342446J489245J668258J703263
$$ y = [20729982, 20914931, 21142317, 21299670, 21520478, 21751946, 22055332, 22315475, 22548960, 22878191, 23273707, 23557018, 23835981, 24127051, 24504450, 24891200, 25318428, 25685395, 26065570, 26579987, 26852887, 27171949, 27493959, 27701829, 27783535, 27815633, 27724907, 27750475, 27655968, 27461653, 27352355, 27400923, 27448141, 27561948, 27673553, 27822542, 27946224, 28123633, 28372996, 28685384, 28960032, 29130553, 29544688, 29807457, 30188058, 30544106, 30882337, 31283950, 31736732, 32165546, 32581836, 33058812, 33511307, 33995058, 34653739, 35252633, 35810289, 36451429, 37084426, 37870839, 38579534, 39341161, 40165359, 41061285, 41911998, 42837317, 43882465, 44993630, 46166387, 47386762, 48729208, 50218453, 51886711, 53589974]
3097E3589974J945391K185391K221812K336953K537302K676657K963122L060411
3089G3517013L393807L521046L347217L290674L113588K895301K467893J685879
3081I7232418O42241k35298j549738k733830l824973m881260n413762n297208
3073G3938590n218447m721511m114949l648104l234088k886917k515586k207906
3065D5391082j955740j797680j564863j316423j410182j291860j140758j173639
3057C3739937r92690r94051q65736q46025o48010n68072o28969n26977n47133
3048B7122274n91117m38709m78033m51957n03905n50191n15127m71047m32947
3039B2689241l50781l45011k76518j28956k12967k11944k57374j00665k1364J3802
$$ y = [53589974, 55535365, 57720756, 59942568, 62279521, 64816823, 67493480, 70456602, 73517013, 76910820, 80431866, 83779083, 87069757, 90183345, 93078646, 95546539, 97232418, 97874659, 97639361, 96089623, 93355793, 89530820, 84649560, 79235798, 73938590, 68720143, 63998632, 59883683, 56235579, 53001491, 50114574, 47598988, 45391082, 43435342, 41637662, 40072799, 38756376, 37346194, 36054334, 34913576, 33739937, 32747247, 31753196, 30887460, 30041435, 29393425, 28825353, 28196384, 27669407, 27122274, 26531157, 26092448, 25614415, 25162458, 24658553, 24108362, 23593235, 23122188, 22689241, 22338460, 21993449, 21716931, 21587975, 21375008, 21163064, 20905690, 20805025, 20783661, 20797463]
3029B0797463J142n579Q4552l4139J2426J8927j14835j54036k84425k70902j96096
3018A9854498m05910l62759l52897k46528k05514k77620m29875n66430n06072
3009A6500893m60602k81136k72155k06117j08643k47178q3314j88168j81953l39464
2999A4132163o1474q4732j38522p0120j69447q4773j27703n200K4739j06218q0883
2988A3227830p9231p9836L1590q648j2240P1164l1571m7782j38129k42856m6119
2977A2644172p2892o0831n0258k5821P5491J11495M7955J05995P0181J10501J80691
2966A3136679J83723P9720Q7693j11944j13721j91584k70089l53948k76690k45796
2956A1924043k30825l49439k56410k09155k04143k12993j59690j66927r0636k16153
$$ y = [20797463, 20798605, 20793026, 20877578, 20843439, 20855865, 20874792, 20759957, 20605921, 20321496, 20050594, 19854498, 19448588, 19085829, 18732932, 18486404, 18280890, 18003270, 17573395, 17006965, 16500893, 16040291, 15759155, 15487000, 15280883, 15172240, 14925062, 14841748, 14653580, 14471627, 14132163, 14070689, 13985957, 13847435, 13777315, 13607868, 13523095, 13395392, 13390192, 13414931, 13308713, 13227830, 13148599, 13068763, 13100353, 13091705, 13079465, 13150629, 13119058, 13071276, 12933147, 12690291, 12644172, 12571280, 12510449, 12460191, 12434370, 12509861, 12621356, 12669311, 12775306, 12845487, 12955988, 13136679, 13320402, 13400122, 13487815, 13375871, 13262150, 13070566, 12800477, 12446529, 12169839, 11924043, 11693218, 11343779, 11087369, 10878214, 10674071, 10461078, 10301388, 10134461, 10043825, 9827672]
2946I827672j06084n7722j35765j25946k27474m1423l4659n6185p4676j5120j59870
2935H792748n2220m6024j0382r6422J8639m7271n0796r1080k2184L0834k6741
2924H399101o5008j39840j12954q0364M5662J1934o4696j10564R8329q2899j32979
2913G765722o2472p3161J9679m2400J9863o3458O2652m2125k8928n0461M69o7072
2901G438308j00595q5254K0729P1515o4049k7037p6588J4484o3822l6703n1043
2890G039945j6132J9189N699o336k6145p6838N1587k3480k2975l1277l1402l8435
2878F843400q1876j27542j853O2187k3950P0223Q0082K4905l5448n5129N314j9212
2866F741101R8150J40550r4632m1374J5791J0108j6254L2849J4281M1036J02753
$$ y = [9827672, 9721588, 9663866, 9528101, 9402155, 9174681, 9133258, 9098599, 9042414, 8967738, 8952618, 8792748, 8740528, 8694504, 8684122, 8587700, 8606339, 8559068, 8508272, 8417192, 8395008, 8425842, 8399101, 8334093, 8194253, 8081299, 8000935, 8046597, 8058531, 7993835, 7883271, 7981600, 7898701, 7765722, 7703250, 7630089, 7649768, 7607368, 7627231, 7563773, 7626425, 7584300, 7555372, 7504911, 7505380, 7438308, 7337713, 7252459, 7273188, 7344703, 7280654, 7253617, 7177029, 7191513, 7127691, 7090988, 7039945, 7023813, 7043002, 7048701, 7042365, 7016220, 6939382, 6990969, 6967489, 6944514, 6913237, 6881835, 6843400, 6761524, 6633982, 6632129, 6694316, 6670366, 6740589, 6820671, 6845576, 6810128, 6754999, 6760313, 6741101, 6839251, 6979801, 6885169, 6843795, 6859586, 6869694, 6853440, 6886289, 6900570, 6941606, 7044359]
2855G044359k3077M4910K2206k6513J27927K6702j02983Q2134J09368J91071N7923
2844G554027r5393M4907L1720J17197P0087L271L1988N0027L6763r877Q8861J46710
2832H070288K6940j2272J41693J40058Q3777R6652M6211J09723J81711p6K26583
2821I111288K49084j47J23025J8731J68900K6013Q8398J12325J00934J08061N8134
2810A0164746K9308l790L5960K5045O2804K0924O3130K17104J55624N5488J16598
2799A0942941L214J46971J43783J44811J7312J99815J56753J18623L04264J61468
2789A2339955J71600K33789K41379K94603K00087J91067K51793L19754K13008
2780A4457035J75426L25327M15913L69059K11926L23577L92874M47602M60313
$$ y = [7044359, 7021282, 7066192, 7088398, 7061885, 7189812, 7216514, 7113531, 7195665, 7305033, 7496104, 7554027, 7458634, 7503541, 7535261, 7652458, 7722545, 7725816, 7757804, 7807831, 7844594, 7834717, 7923578, 8070288, 8097228, 8084956, 8226649, 8366707, 8450484, 8547136, 8593347, 8703070, 8884781, 8884705, 9111288, 9360372, 9360225, 9483250, 9501981, 9670881, 9696894, 9785292, 9897617, 9998551, 10106612, 10164746, 10194054, 10190264, 10226224, 10251269, 10314073, 10334997, 10398127, 10615231, 10770855, 10826343, 10942941, 10946155, 11093126, 11236909, 11381720, 11399032, 11598847, 11755600, 11874223, 12178487, 12339955, 12511555, 12745344, 12986723, 13281326, 13481413, 13672480, 13924273, 14244027, 14457035, 14632461, 14957788, 15373701, 15742760, 15954686, 16278263, 16671137, 17118739, 17579052]
2771A7579052K86862L17118L98348K57666K77547J60446J77033R4374J43706J40898
2761A9833050J34557L22738K85112K31874K55489L54210M19605M96696M33367
2752B2766698N31279O02786O74730P44599P48416P10135P69713P66870O95617
2743B9010843O20691M47166K76043J87609N4422k02206m69912q14281q02554o42933
2733B7664888n35354m74260l11670k16149j29635o6896J5274k3835N2348J23546
2723B6098257J38812J55612R6710M1005J56606P2434K5769J52509m601j36235
2713B6796878k68261m60468l93946m78047m18112m79219n46303m47325o20704
2704B2684493o28828m05868m80457m23022l94738k54804l19708l10852l46536
$$ y = [17579052, 17865914, 18183032, 18581380, 18839046, 19116593, 19277039, 19454072, 19548446, 19692152, 19833050, 19967607, 20290345, 20575457, 20807331, 21062820, 21417030, 21836635, 22333331, 22766698, 23297977, 23900763, 24575493, 25320092, 26068508, 26778643, 27548356, 28315226, 29010843, 29631534, 30078700, 30354743, 30542352, 30596774, 30394568, 29924656, 29110375, 28307821, 27664888, 27129534, 26655274, 26343604, 26127455, 25997820, 25930924, 25946198, 25922363, 25974711, 26098257, 26237069, 26392681, 26489391, 26530396, 26687002, 26759436, 26785205, 26937714, 26933113, 26796878, 26528617, 26068149, 25674203, 25196156, 24778044, 24298825, 23752522, 23305197, 22684493, 22055665, 21649797, 21169340, 20746318, 20351580, 20096776, 19777068, 19466216, 19119680]
2695A9119680k49295l37430n02939l77086l93798m36869l70815m61853n16439
2686A5473156m11364m26427m20153l06663l28382l83839l56174k81317k11252
2677A2347585k60030k82885l26450k19558k26645n9322k56771k66562j63111o6084
2667A0220167k46681j71742k79968o2750j08190k06578k27178j01396j28083p6740
2657H610861j45955j76305j75881o3305n4519j50176j57584j22199j16177j18788
2647G329972p7400j92574j60092q4640j85790j30014n5176o5700p4332q2287k3867
2636F198100j00248j80411j45468r8129n7673M4957j31563j78286j21866j3351
2626E216062K0223j68992o7882n1556j15156k5242j04675L1704k1138j05040p3045
$$ y = [19119680, 18870385, 18532955, 18030016, 17652930, 17259132, 16822263, 16451448, 15989595, 15473156, 15061792, 14635365, 14215212, 13908549, 13580167, 13196328, 12840154, 12558837, 12347585, 12087555, 11804670, 11478220, 11258662, 11032017, 10972695, 10715924, 10449362, 10286251, 10220167, 9973486, 9801744, 9521776, 9459026, 9350836, 9144258, 8917080, 8815684, 8687601, 8610861, 8464906, 8288601, 8112720, 8049415, 7994896, 7844720, 7687136, 7564937, 7448760, 7329972, 7252572, 7059998, 6899906, 6815266, 6629476, 6499462, 6444286, 6378586, 6304254, 6221967, 6198100, 6097852, 5917441, 5771973, 5673844, 5616171, 5661128, 5529565, 5351279, 5229413, 5216062, 5236285, 5067293, 4999411, 4947855, 4832699, 4807457, 4702782, 4734486, 4713348, 4608308, 4535263]
2615D535263j56557j28096o6420l762q7786q5223J6020n7451j8645j38557M1442
2604C850228J7463j82720j52335r7118K6678n3473j9161k4888J1138l6255r9514
2593C240043P73o4179k3557j6290n3081o8885L9518j45173m5955r6223j44226
2582B622765Q537k3955J9770k6513n0664p863j8147j2758r7363M7122j02055r8992
2570B259884M6045m3795l9650Q5838j82495m1384k4253n1319O53k4608n7970r18
2558A926028j4512Q0573K3624k50j56344j01062R5408j8028o5662n2079J2737
2547A730433q690m8442K4986L2655j1229N3786j27532o7794p972K1797J12711
2536A704709M9465j41699q4206n0131L3676n0517o7565m0019k3465L0880M5294
$$ y = [4535263, 4378706, 4250610, 4184190, 4180428, 4092642, 4007419, 4023439, 3965988, 3947343, 3808786, 3850228, 3867691, 3684971, 3532636, 3435518, 3462196, 3408723, 3389562, 3364674, 3375812, 3339557, 3240043, 3240816, 3176637, 3153080, 3136790, 3083709, 3014824, 3054342, 2909169, 2863214, 2766991, 2622765, 2631302, 2607347, 2627117, 2600604, 2549940, 2542077, 2523930, 2511172, 2413809, 2460931, 2358876, 2259884, 2305929, 2262134, 2222484, 2308322, 2125827, 2084443, 2060190, 2008871, 2009524, 1984916, 1926946, 1926028, 1911516, 1992089, 2015713, 2015463, 1859119, 1758057, 1853465, 1835437, 1769775, 1717696, 1730433, 1721743, 1673301, 1698287, 1730942, 1719713, 1773499, 1645967, 1578173, 1570201, 1591998, 1704709, 1754174, 1612475, 1528269, 1478138, 1511814, 1461297, 1393732, 1353713, 1330248, 1361128, 1406422]
2525A406422l7339o981q4689N0765K020q7446j2061M7095R9040M234l0457O215
2513A356818o7631o2024Q7785P584j06019j0236J1256m8179N815l2653Q758O5107
2501A216381j7383p8215m8440Q4229L2654r0744j04962L4407Q516L6346J07070
2490A179859m0216m0068j8525l1782M8203r919l6583O189p5673L2749O0048L0537
2478A104819l6377o1449L9809O7435r1336j26669n4458n1542Q8611M0396q0547
2467H38692O0191J61419r1123L5415j3918j3037l9905J17829J9370n0613M797
2456A029117o9073L7411j1755j4784m5286m6678N0490o0630O8302j4138k7436
2445H95540p1864j16790R0470J07014k2922J6213Q2210m2920k3643l1958k6337
$$ y = [1406422, 1369083, 1362102, 1277413, 1328178, 1330198, 1242752, 1230691, 1277786, 1376826, 1381060, 1350603, 1356818, 1289187, 1227163, 1314948, 1322532, 1216513, 1206277, 1217533, 1169354, 1175169, 1142516, 1151274, 1216381, 1198998, 1120783, 1072343, 1156572, 1189226, 1098482, 993520, 1027927, 1036443, 1072789, 1179859, 1139643, 1099575, 1081050, 1049268, 1097471, 1087552, 1050969, 1057158, 981485, 1014234, 1074282, 1104819, 1068442, 1006993, 1046802, 1114237, 1022901, 896232, 841774, 790232, 878843, 919239, 838692, 898883, 1060302, 969179, 1004594, 990676, 977639, 937734, 1055563, 1074933, 1024320, 1029117, 960044, 997455, 985700, 970916, 925630, 878952, 929442, 868812, 937114, 922976, 895540, 823676, 706886, 797356, 904370, 881448, 897661, 979871, 936951, 913308, 881350, 855013]
2434H55013R0063o7366n9913m3924Q8053K2113n6794k9231j8463K1656r935k5848
2422G65424j4678m9042R7665J4657q6680J06313j83772K5145K2678j0983o071
2411F80656k6972N7479L6935n2106Q0167n6690o7601n9095O6799o8099n6777O8603
2399F03299N59n0554L8041J4059M1886p9090k9185O648J4952j916k425l3533k1711
2386E01030q098m8350J0071P277M8252m59j09372j4010n7532K4000N7411J5250
2374D25470R636n5930n3644m3496n3299L19O8393P642K1397J10387M5440j15720
2362C66595q2993k8627Q486J32823K6479j01521K6069p7686k0045O4606j0177
2351C04009r99l3377k7307j4734q5692Q8422J34391n8671n0124k4295L8195m63
$$ y = [855013, 945076, 877710, 817797, 773873, 861926, 884039, 827245, 798014, 779551, 801207, 791272, 765424, 750746, 701704, 799369, 814026, 727346, 833659, 649887, 675032, 697710, 686727, 680656, 653684, 711163, 748098, 695992, 776159, 719469, 651868, 592773, 659572, 591473, 534696, 603299, 603858, 553304, 591345, 605404, 647290, 568200, 539015, 545663, 560615, 558699, 556274, 522741, 501030, 492932, 444582, 454653, 461930, 510182, 509723, 400351, 386341, 328809, 352809, 410220, 425470, 435106, 379176, 325532, 282036, 228737, 229056, 297449, 305091, 326488, 436875, 482315, 366595, 283602, 254975, 263461, 396284, 422763, 321242, 347311, 269625, 249580, 314186, 304009, 303010, 269633, 242326, 227592, 141900, 230322, 364713, 306042, 255918, 231623, 269818, 269355]
2339B69355o4011P5234P6227m4473j67830M5065Q9752r4284k1743L6181P869L0178
2327B37520q7496L9574K1443Q7390j11628q3779K8043k187k2099J19337j7987
2316B08131j2264k7491j4613l9219K9404L5352P176Q363R4833J5374l9557K7566
2304B93055j05862M1728P9834l8365N2164p1417m2759j5636M445o0507p2015P6699
2292A41364m9037N6223O1931p8660m6012J24704m2398M3009M0179q3996O8630
2281B35937k4947p1051J09442k7495k0474r58n9179j1445O062Q341M4966n0411
2269A38788n0552O1148O1604n6255N2614M5401q2376n6254O1863p5458J0820M588
2257A15931L3751J5320O2760j18243M810N589N208j0871j2835n8999N332R0877
$$ y = [269355, 205344, 280578, 356805, 312332, 144502, 189567, 279319, 185035, 163292, 199473, 207342, 237520, 150024, 189598, 211041, 298431, 186803, 103024, 131067, 128880, 106781, 226118, 208131, 195867, 168376, 153763, 114544, 143948, 179300, 186476, 194839, 289672, 305046, 265489, 293055, 187193, 228921, 308755, 270390, 322554, 251137, 208378, 192742, 197187, 136680, 64665, 141364, 92327, 148550, 210481, 131821, 85809, 210513, 168115, 211124, 251303, 167307, 235937, 210990, 139939, 249381, 221886, 201412, 200454, 141275, 129830, 135892, 144233, 189199, 138788, 88236, 149384, 210988, 154733, 207347, 252748, 170372, 114118, 175981, 100523, 111343, 115931, 149682, 165002, 227762, 109519, 114329, 119918, 125126, 114255, 101420, 42421, 47753, 138630]
2245A38630J6354Q9230o9558m6376O0888K372n1476p6459n798R7189j3761J08541
2233B49776m4795r0395m6131l8691J13569j15762q508M9037K8305j234k9670J9418
2221H4919J44822o5953n9447J35502r3420m4269P0054K6411L1382Q3121m5100
2210B68022N433M6934q832j02945K6702p3887o0591J3496J09003k3801m1869K3057
2198A80722l8536q0576k5449N5410K8008m255l8180m912J15199q32p8602o5015
2186D2982R5107o7532m175r503J618n315O4289o2117j4273o0817j624J12926p4662
2173A6904p1912p5349j3042J36379M3170J1278L4252K0922P2833k9474r7085l4012
2161A4864J5475l2163J02495J05118q5244p4122J23043l0063j8602L229P422M1814
$$ y = [138630, 154984, 244214, 174656, 128280, 189168, 191540, 140064, 63605, 57807, 154996, 141235, 249776, 204981, 114586, 68455, 29764, 143333, 27571, 19063, 68100, 96405, 95171, 65501, 84919, 229741, 163788, 104341, 239843, 146423, 102154, 172208, 198619, 230001, 313122, 268022, 273455, 320389, 311557, 208612, 235314, 161427, 100836, 114332, 223335, 199534, 157665, 180722, 142186, 61610, 36161, 91571, 119579, 115324, 77144, 72232, 187431, 186599, 107997, 42982, 138089, 70557, 66382, 56879, 58497, 53182, 117471, 55354, 41081, -19736, -21360, 91566, 16904, -55008, -130357, -143399, -7020, 36150, 47428, 81680, 102602, 175435, 145961, 48876, 14864, 30339, -1824, 100671, 205789, 120545, 46423, 169466, 139403, 120801, 124030, 131452, 173266]
2149A73266m0065L1543K3282j44260m3694O9200M4924O353Q6795l1874j8040j41357
2137A6073M2254O5497j2818k0899m4064L5859P0993l8073j13932M4309m3243k6084
2125b4128K7270k166J50319L0971j7695o4328L7083L9970n7164j699l9516L8925
2113A17842J1921q2341j8224L2671Q9204Q859j55049O6759P5363L5169k5345k3204
2101A33625L0257k6333L7639P3476R659j7379j00395J8173K0026r0952J0788m9753
2089D8831K1952Q8709N4056p6566J7830M131K0352j19590n5426Q6759O9414J6758
2077A77210K6926p0766k4017M3404m2844M6606L8370o8081J05717L8264l6520
2066B34269O5325K9112L2176k1677r4630K5708n1927K2971O893P4719L3387j08376
$$ y = [173266, 133201, 164744, 188026, 43766, 72, 69272, 114196, 120549, 207344, 175470, 157430, 16073, 58327, 123824, 111006, 90107, 46043, 81902, 152895, 114822, 890, 45199, 1956, -24128, 3142, 976, 151295, 182266, 164571, 100243, 137326, 177296, 120132, 118433, 78917, 117842, 129763, 47422, 29198, 61869, 151073, 159932, 4883, 71642, 147005, 182174, 156829, 133625, 163882, 137549, 175188, 248664, 258323, 240944, 140549, 158722, 178748, 87796, 98584, 48831, 70783, 159492, 213548, 136982, 154812, 158943, 179295, 59705, 4279, 91038, 160452, 177210, 204136, 133370, 109353, 152757, 109913, 156519, 194889, 126808, 232525, 270789, 234269, 299594, 328706, 360882, 339205, 244575, 270283, 218356, 241327, 248220, 322939, 356326, 247950]
2054B47950K956o3685M4362j3338p5820J7563J57679j8188O6204L3781l1754m1122
2042C26588R4478k8695r2296O3494O412J1376l91j06378J9338N9060J19336j4993
2030D57329n9138n4879j5430O0687K1573M6571j392K7480N2755J32883j9333L9321
2018F88427N1676n2770j4288m5369J04975J5830q568m085L8033N6776k9645k198
2006G98794M4792L4149L1575J11290L855o4157Q3432P412m3102M0089K5863K0785
1994A094777P9270J0809P3494j9077P6930N1130N6434o609O992J16278J18491
1983A658919M0017Q8997L9511J49954J11851Q2520J1291O0288J98964N5084J12153
1972B609549O8290J77796K08417K08667K41806K08857Q5504J75649L26866L48756
$$ y = [247950, 250906, 187221, 231583, 218245, 142425, 159988, 317667, 299479, 365683, 399464, 367710, 326588, 421066, 392371, 300075, 363569, 369981, 381357, 380966, 274588, 293926, 352986, 472322, 457329, 398191, 343312, 327882, 388569, 410142, 456713, 455321, 482801, 535556, 668439, 649106, 688427, 740103, 687333, 673045, 627676, 732651, 748481, 739913, 735828, 773861, 830637, 800992, 798794, 843586, 877735, 909310, 1020600, 1024455, 960298, 1043730, 1051142, 1008040, 1048129, 1073992, 1094777, 1174047, 1184856, 1258350, 1239273, 1316203, 1367333, 1423767, 1417158, 1424150, 1540428, 1658919, 1698936, 1787933, 1827444, 1977398, 2089249, 2171769, 2183060, 2243348, 2442312, 2497396, 2609549, 2677839, 2855635, 3064052, 3272719, 3514525, 3723382, 3808886, 3984535, 4311401, 4660157]
1962D660157M08948L39771N15963O03895N20007O33705P95510J077034J155532
1953A0710522J502592J838706K077085K396056K723731L128550K992935J725720
1945B9095897K559791K812586o36721n774401o499140m417344k998517j971599
1937A2170552j673092j269341r29340p51425n79082l88861m18844l56072m10937
1928E393558l04107l42877m50530l19356k58765k76533k60001k16435k47799j75170
1918B541985L6461q7382j53675j14819o6814k47634J05035k5561q3177j56207
1908A748212m3209o0141o9685K5280n5583n0074j13612j7734o8426l016q5593
1897A206419j00885n6992J7871q9277N3174k2836N966j48908n6587J1114k6446
$$ y = [4660157, 5069105, 5408876, 5924839, 6528734, 7048741, 7682446, 8477956, 9554990, 10710522, 12213114, 14051820, 16128905, 18524961, 21248692, 24377242, 27370177, 29095897, 31655688, 34468274, 33831553, 28057152, 21558012, 17140668, 14142151, 12170552, 10497460, 9228119, 8298779, 7547354, 6968272, 6579411, 6160567, 5804495, 5393558, 5089451, 4746574, 4296044, 3976688, 3717923, 3441390, 3181389, 2964954, 2717155, 2541985, 2578446, 2491064, 2337389, 2222570, 2155756, 1908122, 2013157, 1987596, 1904419, 1748212, 1705003, 1644862, 1575177, 1600457, 1544874, 1494800, 1381188, 1363454, 1295028, 1292012, 1206419, 1105534, 1048542, 1066413, 977136, 1030310, 1007474, 1013440, 864532, 807945, 819059, 792613]
1886G92613L1890j1629m4496q9030P025K2003K0922m7914K6396p9825L9459j6007
1874F51407P408O2342j7393k560L801r4443l9024p5049m6490j5056j07821Q9168
1862D16290K6644m8289o5928m1437O3397o2488L1626M1225j817M7794M8805n5718
1850D00104M6203r6843m8913j32p974r572r2720P5302K6133n6850o3865L7833
1838B08706Q3772j6668n117L2878J4837q1957k5794M3812j16J20612j38556J3545
1826B49954K7381k9266p8789k3279N8028J08467q4242j2661K2310q4344J10595
1815B64154M0837l1750l4168o9116k7707K2312j8200n9420k379O2152n0367k8571
1803F7777K7428j421Q9525J0741j0202q6414R616M5074n5790m1884L9355m384
$$ y = [792613, 824503, 812874, 768378, 679348, 686373, 708376, 729298, 681384, 707780, 627955, 667414, 651407, 658815, 721157, 703764, 701204, 705005, 610562, 571538, 496489, 449999, 434943, 327122, 416290, 442934, 394645, 328717, 287280, 350677, 288189, 319815, 361040, 359223, 407017, 455822, 400104, 446307, 349464, 300551, 300419, 292445, 282873, 190153, 265455, 291588, 234738, 170873, 208706, 292478, 275810, 270693, 303571, 318408, 236451, 210657, 254469, 254353, 374965, 236409, 249954, 277335, 248069, 169280, 146001, 204029, 312496, 228254, 215593, 237903, 153559, 264154, 304991, 273241, 239073, 169957, 142250, 164562, 146362, 86942, 84563, 146715, 96348, 67777, 95205, 93784, 183309, 194050, 183848, 97434, 107050, 152124, 96334, 54450, 93805, 89421]
1791H9421j1960l8062j2845Q5205n8282J14100m9963p9137L6188K2964K4337K0225
1779A42191O947M6590l7876r9000M7555L1572K6833l8525k9203M6257j9213o1766
1767F2362J1922P4945N4375j8561L1344p9543n0916N6705J886j1530J577O2800
1755A97366K6850m9885q0513r806p0463p6113N7956J22727r3661N1454j9370J7402
1743G3944k6288q3935N0825M9636K2331j0028p0298R4003R6092m6663j02428n8182
1731a0991Q014J08205j28329O504M4370j1042O0975P3815q6642m5726K8882k2702
1719B5333j2678K54r3142K5114J5816K2241O5363k9070K225L1141P0175k1154
1707A01618L0686j7674j03668K5291l9596L6415J08093m323r8583M318Q0365q1775
$$ y = [89421, 77461, 39399, 26554, 111759, 53477, 167577, 117614, 38477, 74665, 97629, 121966, 142191, 149138, 195728, 157852, 58852, 106407, 137979, 164812, 126287, 97084, 143341, 124128, 62362, 74284, 149229, 203604, 185043, 216387, 136844, 85928, 142633, 144519, 132989, 134566, 197366, 224216, 174331, 93818, 84012, 13549, -62564, -4608, 118119, 24458, 75912, 56542, 73944, 47656, -36279, 14546, 64182, 86513, 76485, 6187, 100190, 196282, 149619, 47191, -10991, -2977, 105228, -23101, -16597, 27773, 16731, 77706, 151521, 64879, 19153, 48035, 25333, 12655, 12909, -80233, -55119, -39303, -17062, 48301, 19231, 21456, 52597, 122772, 101618, 132304, 114630, 10962, 36253, -3343, 33072, 141165, 136842, 38259, 42577, 122942, 41167]
1695D1167P1968j6628l9176K340L8356p6398M7922o7252L2243R0298O8936r8424
1683I5352j22071M0805N5326K0230J05891M1022K5738j2644n563K4535r318m3284
1671B16019j6365n7235O5636n9621m5461q8546o344n1737L3554J28799o2319K2798
1659G9178J02302N584o2400m6387l9543k0528M8446j303k2419k574O0550R345
1647A10251j2595j07298J2690P5747Q0176r3109j09668O388K5898k0273K3069
1636h724M2002j35096O7721Q1785j28728R9584K2249j64429J25820J13981n2622
1625F3543j26538L5680J8966m8345L7709R4078M723L5662n2655p4082o1326P4687
1613B102P8246r6467j07674n0296P0167P3248M7670l5009k0020M8773p2970j9554
$$ y = [41167, 113135, 96507, 57331, 59671, 98027, 21629, 69551, 2299, 34542, 124840, 193776, 95352, -26719, 14086, 69412, 89642, 195533, 236555, 262293, 249649, 244086, 268621, 259303, 216019, 199654, 142419, 208055, 148434, 102973, 14427, 8083, -43654, -10100, 118699, 56380, 79178, 181480, 187064, 124664, 78277, 38734, 18206, 66652, 65349, 42930, 40356, 100906, 110251, 97656, -9642, 3048, 78795, 158971, 65862, -43806, -37418, -11520, -31793, -8724, 33278, -101818, -34097, 47688, -81040, 18544, 40793, -123636, 2184, 116165, 63543, -62995, -27315, -8349, -56694, -18985, 75093, 79816, 115478, 62823, -11259, -72585, 2102, 80348, -16119, -123793, -174089, -103922, -30674, 16996, -18013, -38033, 10740, -62230, -81784]
1601h1784m9438q3638n0843l0563p197K04963J092J14275O5390m0925o3545l2549
1589e4762J8127o6336l4518P0223P8675J3357M8590m3009p2662L1274m4396O629
1577d8808J685K2794r4801m75j0740Q5273j00628P035J4013J0345L3862O6119
1565a4326k346p227K8769l5060Q4676k579q5610L3439q4380n3209L0630q27R6075
1552a1975k9643K4405q205j1893J31639M3497l0841L9299m0675j9963j08706m5735
1540f8796l275L7516L3293n4919L8195Q6310l8463j5021K7284j8279o3376m0584
1528h0115J5622j2658P3989L2093k8411J7550N6347o1372n2245j5140o5178J64962
1516D5444m1073p4971L3736P0750r1996k4288J278k0016q1415K7517P4149Q5186
$$ y = [-81784, -131222, -214860, -265703, -296266, -303463, -98500, -97408, 16867, 82257, 41332, -22213, -54762, -36635, -102971, -137489, -67266, 11409, 24766, 73356, 30347, -42315, -11041, -55437, -48808, -47123, -24329, -119130, -119605, -130345, -45072, -145700, -138665, -124652, -114307, -80445, -14326, -16672, -23899, 4870, -30190, 54486, 51907, -33703, -264, -84644, -137853, -107223, -108050, -11975, -41618, -17213, -25418, -37311, 94328, 137825, 106984, 146283, 105608, 85645, -23061, -68796, -72071, -34555, -1262, -56181, -17986, 68324, 29861, 14840, 42124, 23845, -39531, -80115, -64493, -77151, -3162, 28931, 520, 18070, 74417, 13045, -39200, -54340, -119518, 45444, 4371, -70600, -36864, 33886, -58110, -82398, -81120, -101136, -182551, -155034, -80885, 4301]
1504D301l585O5553k0882m8823n5158m4924K2975J13940K131O5429O611N7006
1492A64574J080q5533q4017j8945K7291O0001K4501p1926N7951r3717j9570k154
1480d0464n3605L7050N2305r646r487m4463L0205Q5758J4822n2054n521L8775
1468D3675r381o6344J181J1830l5303k4166P895M1279j0265N3105o5118q7219
1456a38831M5222L9293K8500M6705j09036N5058j8300j00206K8630K2340J3558
1445h7067n0442Q341Q0209J13135K2674j27329j4935J7842j10063P1375J03627
1434B7367M7969j24773L4726J19758L2203l2513p1996p526p2655p0491J34265
1423A6334j03007Q698R1888Q2561o5526J6909m4201j0199K58k913R3209P3370
$$ y = [4301, 716, 66269, 45387, -3436, -58594, -103518, -80543, 33397, 35528, 100957, 107568, 164574, 165654, 80121, -3896, -22841, 4450, 64451, 88952, 17026, 74977, -18740, -38310, -40464, -94069, -57019, -4714, -14360, -23847, -68310, -38105, 47653, 62475, 10421, 4900, 43675, 34294, -32050, -30869, -19039, -54342, -78508, -70613, -29334, -39599, 13506, -51612, -138831, -93609, -54316, -25816, 20889, -88147, -33089, -51389, -151595, -122965, -100625, -87067, -137509, -129168, -48959, 64176, 86850, -40479, -55414, -37572, -147635, -76260, 27367, 75336, -49437, -14711, 105047, 137250, 104737, 32741, 25215, -47440, -117931, 16334, -86673, -77975, 13913, 96474, 30948, 47857, 3656, -6543, -6285, -9198, 84011, 157381]
1411A57381r9171N6874J0660n129n8538l0327l6033J09945k9099m7957J3724m573
1399C7757J36880r6328k3135r2072j4943L0081j6411o0496l4545M0334J09800
1388A6922J1989l8922O2730m4596j40225L6345P2295J00045M9387J6441j19262
1377B3149O6302K2898j7196q2240N6421l9874p4823j9914O3353K6070o8967q857
1365e3678K9425q9P4084n4080o5424n2224l8236J15772O505M7247R819r1499J27727
1352E5349M9244j19009K5044K7692P5217k0215O6215k6724o8811J6248J4286m9592
1340D4944j03815k5288k6185J04470R0626l1983l1703J1044M6134l9956j2511
$$ y = [157381, 58210, 115084, 125744, 120615, 62077, 31750, -4283, 105662, 76563, 28606, 42330, 37757, 174637, 78309, 55174, -36898, -51841, -21760, -38171, -98667, -133212, -92878, 16922, 28911, -10011, 52719, 8123, -132102, -95757, -23462, 76583, 125970, 142411, 23149, 89451, 112349, 95153, 12913, 69334, 29460, -45363, -65277, -1924, 24146, -44821, -53678, -24253, -24342, 49742, -4338, -69762, -121986, -160222, -44450, -37945, 9302, 19121, -72378, 55349, 104593, -14416, 10628, 38320, 113537, 93322, 159537, 132813, 64002, 80250, 94536, 44944, -58871, -84159, -110344, -5874, 84752, 52769, 21066, 32110, 78244, 38288, 25777]
$$ [...]
##END NTUPLES=NMR SPECTRUM
##END=
