##TITLE=1H_TG-2330
 CDCl3
 8 sc, 
 11.11.2021
##JCAMPDX= 6.0         $$ Bruker NMR JCAMP-DX V2.0
##DATA TYPE= NMR SPECTRUM
##DATA CLASS= NTUPLES
##ORIGIN= UXNMR, Bruker Analytische Messtechnik GmbH
##OWNER= root
$$ XWIN-NMR		Version 3.5
$$ Thu Nov 11 10:17:38 2021 Russian Standard Time (UT+4h)  she@DPX200
##.OBSERVE FREQUENCY= 200.1313468511
##.OBSERVE NUCLEUS= ^1H
##.ACQUISITION MODE= SIMULTANEOUS
##.ACQUISITION SCHEME= undefined
##.AVERAGES= 8
##.DIGITISER RES= 18
##SPECTROMETER/DATA SYSTEM= spect
##.PULSE SEQUENCE= zg30
##.SOLVENT NAME= CDCl3
##.SHIFT REFERENCE= (INTERNAL, CDCl3, 0, 15.7568)
##AUDIT TRAIL= $$ (NUMBER, WHEN, WHO, WHERE, WHAT)
$$ ##TITLE= Audit trail, XWIN-NMR		Version 3.5
$$ ##JCAMPDX= 5.01
$$ ##ORIGIN= Bruker BioSpin GmbH
$$ ##OWNER= she
$$ F:/spectra/data/she/nmr/H-F/1/pdata/1/auditp.txt
$$ ##AUDIT TRAIL=  $$ (NUMBER, WHEN, WHO, WHERE, WHAT)
(   1,<2021-11-11 10:16:27.37 +0400>,<she>,<DPX200>,
      <created by zg, POWCHK disabled, PULCHK disabled
       configuration hash MD5:
       00 E9 B6 7A A2 85 ED C7 34 08 36 98 17 FE 4E 26
       data hash MD5: 16K
       5B 7E 3C 5B 13 A0 DA 93 57 01 3C A6 B5 CD EB 0C>)
(   2,<2021-11-11 10:16:30.15 +0400>,<she>,<DPX200>,
      <Start of raw data processing
       efp BC_mod = 2 LB = 0.24 FT_mod = 6 PKNL = 1 PHC0 = -15512.5 PHC1 = 8.600809 SI = 16K 
       data hash MD5: 16K
       E2 02 4C 1E 86 9B D0 46 39 D1 BC 86 64 4D 13 87>)
(   3,<2021-11-11 10:16:51.37 +0400>,<she>,<DPX200>,
      <pk PHC0 = -2.41903 PHC1 = 9.999999 
       data hash MD5: 16K
       C3 BC CC F6 38 0F 14 DE 67 07 33 AA C6 49 EA E8>)
(   4,<2021-11-11 10:16:54.34 +0400>,<she>,<DPX200>,
      <abs ABSG = 5 
       data hash MD5: 16K
       A3 45 1E 93 C8 A4 99 B9 4F ED 49 A0 B9 4A 99 DB>)
$$ ##END=
$$ 
$$ hash MD5
$$ 6B D7 30 5E DA 1C 6B 4A 2A 52 00 1A 66 7C 63 35
##$RELAX= 
##$RELAX= 
##$RELAX= 
##$RELAX= 
##$RELAX= 
##$RELAX= 
$$ Bruker specific parameters
$$ --------------------------
##$DU= <F:/spectra>
##$EXPNO= 1
##$NAME= <H-F>
##$PROCNO= 1
##$TYPE= <nmr>
##$USER= <she>
##$AMP= (0..31)
100 100 100 100 100 100 100 100 100 100 100 100 100 100 100 100 100 100 
100 100 100 100 100 100 100 100 100 100 100 100 100 100 
##$AQSEQ= 0
##$AQ_mod= 1
##$AUNM= <au_zg>
##$AUTOPOS= <>
##$BF1= 200.13
##$BF2= 200.13
##$BF3= 200.13
##$BF4= 200.13
##$BF5= 200.13
##$BF6= 200.13
##$BF7= 200.13
##$BF8= 200.13
##$BYTORDA= 1
##$CFDGTYP= 0
##$CFRGTYP= 5
##$CHEMSTR= <none>
##$CNST= (0..31)
1 1 145 1 1 1 1 1 1 1 1 1 1 1 1 1 1 1 1 1 1 1 1 1 1 1 1 1 1 1 1 1 
##$CPDPRG= <>
##$CPDPRG1= <>
##$CPDPRG2= <>
##$CPDPRG3= <>
##$CPDPRG4= <mlev>
##$CPDPRG5= <mlev>
##$CPDPRG6= <mlev>
##$CPDPRG7= <mlev>
##$CPDPRG8= <mlev>
##$CPDPRGB= <>
##$CPDPRGT= <>
##$D= (0..31)
0 1.2 0 0 0 0 0 0 0 0.06 0 0.03 0 0 0 0 0.0002 0 0 0 0 0 0 0 0 0 0 0 0 
0 0 0 
##$DATE= 1636611386
##$DBL= (0..7)
120 120 120 120 120 120 120 120 
##$DBP= (0..7)
150 150 150 150 150 150 150 150 
##$DBP07= 0
##$DBPNAM0= <>
##$DBPNAM1= <>
##$DBPNAM2= <>
##$DBPNAM3= <>
##$DBPNAM4= <>
$$ [...]
##$SUBNAM2= <"">
##$SUBNAM3= <"">
##$SUBNAM4= <"">
##$SUBNAM5= <"">
##$SUBNAM6= <"">
##$SUBNAM7= <"">
##$SUBNAM8= <"">
##$SUBNAM9= <"">
##$SW= 18.0517286264689
##$SWIBOX= (0..15)
0 0 2 0 0 0 0 0 0 0 0 0 0 0 0 0 
##$SW_h= 3612.71676300578
##$TD= 16384
##$TD0= 1
##$TE= 0
##$TE2= 300
##$TE3= 300
##$TEG= 300
##$TL= (0..7)
0 120 120 120 120 120 120 120 
##$TP= (0..7)
150 150 150 150 150 150 150 150 
##$TP07= 0
##$TPNAME0= <>
##$TPNAME1= <>
##$TPNAME2= <>
##$TPNAME3= <>
##$TPNAME4= <>
##$TPNAME5= <>
##$TPNAME6= <>
##$TPNAME7= <>
##$TPOAL= (0..7)
0.5 0.5 0.5 0.5 0.5 0.5 0.5 0.5 
##$TPOFFS= (0..7)
0 0 0 0 0 0 0 0 
##$TUNHIN= 0
##$TUNHOUT= 0
##$TUNXOUT= 0
##$USERA1= <user>
##$USERA2= <user>
##$USERA3= <user>
##$USERA4= <user>
##$USERA5= <user>
##$V9= 5
##$VALIST= <valist>
##$VCLIST= <CCCCCCCCCCCCCCC>
##$VD= 0
##$VDLIST= <DDDDDDDDDDDDDDD>
##$VPLIST= <PPPPPPPPPPPPPPP>
##$VTLIST= <TTTTTTTTTTTTTTT>
##$WBST= 1024
##$WBSW= 4
##$XGAIN= (0..3)
0 0 0 0 
##$XL= 0
##$YL= 0
##$YMAX_a= 384375
##$YMIN_a= -651630
##$ZGOPTNS= <>
##$ZL1= 120
##$ZL2= 120
##$ZL3= 120
##$ZL4= 120
##$ABSF1= 15.71273
##$ABSF2= -2.339119
##$ABSG= 5
##$ABSL= 3
##$ALPHA= 0
##$AQORDER= 0
##$ASSFAC= 0
##$ASSFACI= 0
##$ASSFACX= 0
##$ASSWID= 0
##$AUNMP= <proc_1d>
##$AZFE= 0.1
##$AZFW= 0.1
##$BCFW= 0
##$BC_mod= 2
##$BYTORDP= 0
##$COROFFS= 0
##$CY= -3
##$DATMOD= 1
##$DC= 0
##$DFILT= <>
##$DTYPP= 0
##$F1P= 0
##$F2P= 0
##$FCOR= 1
##$FTSIZE= 16384
##$FT_mod= 6
##$GAMMA= 0
##$GB= 0
##$INTBC= 1
##$INTSCL= 0
##$ISEN= 128
##$LB= 0.24
##$LEV0= 0
##$LPBIN= 0
##$MAXI= 10000
##$MC2= 0
##$MEAN= 0
##$ME_mod= 0
##$MI= 1.114404
##$NCOEF= 0
##$NC_proc= -6
##$NLEV= 6
##$NOISF1= 3.799351
##$NOISF2= 2.8
##$NSP= 0
##$NTH_PI= 0
##$NZP= 0
##$OFFSET= 15.75681
##$PC= 1
##$PHC0= -15514.92
##$PHC1= 18.60081
##$PH_mod= 1
##$PKNL= yes
##$PPARMOD= 0
##$PSCAL= 0
##$PSIGN= 0
##$REVERSE= no
##$SF= 200.129999799962
##$SI= 16384
##$SIGF1= 3
##$SIGF2= 2
##$SINO= 5.538805
##$SIOLD= 16384
##$SREGLST= <1H.CDCl3>
##$SSB= 0
##$STSI= 16384
##$STSR= 0
##$SW_p= 3612.71676300578
##$SYMM= 0
##$S_DEV= 0
##$TDeff= 16384
##$TDoff= 0
##$TI= <>
##$TILT= no
##$TM1= 0
##$TM2= 0
##$TOPLEV= 0
##$USERP1= <user>
##$USERP2= <user>
##$USERP3= <user>
##$USERP4= <user>
##$USERP5= <user>
##$WDW= 1
##$XDIM= 16384
##$YMAX_p= 302328565
##$YMIN_p= -3994332
$$ End of Bruker specific parameters
$$ ---------------------------------
##NTUPLES= NMR SPECTRUM
##VAR_NAME=  FREQUENCY,     SPECTRUM/REAL,   SPECTRUM/IMAG
##SYMBOL=    X,             R,               I
##VAR_TYPE=  INDEPENDENT,   DEPENDENT,       DEPENDENT
##VAR_FORM=  AFFN,          ASDF,            ASDF
##VAR_DIM=   16384,         16384,           16384
##UNITS=     HZ,            ARBITRARY UNITS, ARBITRARY UNITS
##FACTOR=    0.220516191357247, 1,           1
##FIRST=     3153.41041983121, 0,            0
##LAST=      -459.306343174571, 0,           0
##MIN=       -459.306343174571, -3994332,    0
##MAX=       3153.41041983121, 302328565,    0
$$ Real data points
##PAGE= N=1
##DATA TABLE= (X++(R..R)), XYDATA
$$ [...]
$$ plain form
6997 8817478 8528779 8663091 8466291 8123436 7870289 7400819 7155443 7056184 6715975 6527799
6987 6527799 6669731 6598039 6124952 6050105 6244632 6339138 6411576 6606165 6825255 7123584
6977 7123584 7173067 7162115 7558139 7808597 7949267 7760565 7778897 7812932 7571393 7206630
6967 7206630 7328679 7280387 7212601 6933413 6736281 6777478 6736922 6525010 6390802 5953404
6957 5953404 5769397 5767719 5742556 5456968 4977969 4608058 4267999 4239135 4247012 4026072 3988314
6946 3988314 3710568 3673209 3991315 3834613 3810955 3780884 3618951 3552826 3414135 3240290
6936 3240290 3221351 3136822 3155587 3139297 3200350 3369067 3267474 3014810 3305996 3276959 3239142
6925 3239142 3304766 3229579 3179191 3310505 3158947 3471336 3533460 3450808 3350004 3365029 3564678
$$ packed form
6997H817478k88699J34312j96800l42855k53147m69470k45376r9259l40209j88176
6987F527799J41932p1692m73087p4847J94527R4506P2438J94589K19090K98329
6977G123584M9483j0952L96024K50458J40670j88702J8332L4035k41539l64763
6967G206630J22049m8292o7786k79188j97132M1197m0556k11912j34208m37398
6957E953404j84007j678k5163k85588m78999l69911l40059k8864P877k20940l7758
6946C988314k77746l7359L18106j56702k3658l0071j61933o6125j38691j73845
6936C240290j8939q4529J8765j6290O1053J68717j01593k52664K91186k9037l7817
6925C239142O5624p5187n0388J31314j51558L12389O2124q2652j00804J5025J99649
$$ plain form
6914 3564678 3576741 3145620 3020118 2797170 2767192 3159720 3077938 3141704 3087392 2754684
6904 2754684 2663105 2619858 2569293 2747446 2773684 3074260 3137635 3036478 3068831 3148300 3015572
6893 3015572 3057347 3031410 3453190 3766606 3500140 3702709 4074215 3819477 3893271 4371616
6883 4371616 4505161 4753043 5020572 4727103 4628238 4777138 4445708 4244004 4128527 3516208
6873 3516208 3150305 3416055 3351113 3326384 3060321 2862386 2755270 2754174 2670984 2695753 2500366
6862 2500366 2479040 2522631 2468433 2223621 2239627 2351968 2597928 2444294 2337284 2133168
6852 2133168 1896016 1819022 1914530 1843082 1680143 1745669 1771493 1799042 1746504 1458903 1177168
6841 1177168 1025745 1192298 1320525 1269888 1131431 864502 1083270 1212934 1299908 1280817
$$ packed form
6914C564678J2063m31121j25502k22948k9978L92528q1782O3766n4312l32708
6904B754684r1579m3247n0565J78153K6238L00576O3375j01157L2353P9469j32728
6893C015572M1775k5937M21780L13416k66466K02569L71506k54738P3794M78345
6883D371616J33545K47882K67529k93469r8865J48900l31430k01704j15477o12319
6873C516208l65903K65750o4942k4729k66063j97935j07116j096q3190K4769j95387
6862B500366k1326M3591n4198k44812J6006J12341K45960j53634j07010k04116
6852B133168k37152p6994R5508p1448j62939O5526K5824K7549n2538k87601k81735
6841A177168j51423J66553J28227n0637j38457k66929K18768J29664Q6974j9091
$$ plain form
6831 1280817 1068764 643311 948908 1017883 982409 920454 876105 785717 1175247 1386124
6821 1386124 1088307 931764 819317 548431 904053 1151603 1056870 944373 788661 720955
6811 720955 1047385 1281213 1449272 1376904 1343811 1341641 1353357 1271947 1499027 1707388 1841707
6800 1841707 1856499 1995075 2058082 1994784 2062669 1985353 1692851 1564682 1557590 1355096 1347009
6789 1347009 1300924 1104249 1103704 1428832 1393341 1680934 1733871 1968981 2071573 1750385 1375258
6778 1375258 1446057 1490438 1238734 1333062 1770054 1701541 1676528 1915724 1605974 1546272 1902317
6767 1902317 1783885 1564665 1571426 1585459 1329181 1096930 1349751 1516289 1443146 1520456
6757 1520456 1492905 1396383 1642811 1490685 1478549 1751647 1950153 1676261 1561860 1612378
$$ packed form
6831A280817k12053m25453L05597O8975l5474o1955m4349r0388L89530K10877
6821A386124k97817j56543j12447k70886L55622K47550r4733j12497j55712o7706
6811G20955L26430K33828J68059p2368l3093k170J1716q1410K27080K08361J34319
6800A841707J4792J38576O3007o3298O7885p7316k92502j28169p092k02494q087
6789A347009m6085j96675n45L25128l5491K87593N2937K35110J02592l21188l75127
6778A375258P0799M4381k51704R4328M36992o8513k5013K39196l09750n9702L56045
6767A902317j18432k19220O761J4033k56278k32251K52821J66538p3143P7310
6757A520456k7551r6522K46428j52126j2136K73098J98506k73892j14401N0518
$$ plain form
6747 1612378 1882045 1901295 1697542 1630029 1616630 1469247 1507825 1801279 1873989 1952757 2248050
6736 2248050 2336888 2250795 2067693 1747760 1885019 1955913 1480629 1158375 1358737 1602160
6726 1602160 1525857 1396443 1567281 1517567 1449325 1467119 1683455 1554421 1693580 1674936
6716 1674936 1453552 1622227 1727201 1396739 1367538 1763697 2027255 1570305 1363269 1452292
6706 1452292 1429579 1259238 1214622 1200385 1152892 1103513 1145223 1092803 1092031 1301584 1413067
6695 1413067 1073185 905267 1051076 1151707 1451616 1482859 1370789 1516742 1369367 1154527
6685 1154527 1254921 1294151 1330714 1202703 1146195 1378394 1404918 1048616 893703 897435 797612
6674 797612 778797 758524 776702 817243 874434 825168 927523 746530 650753 795258 775642
$$ packed form
6747A612378K69667J9250k03753o7513j3399j47383L8578K93454P2710P8768K95293
6736B248050Q8838q6093j83102l19933J37259P0894m75284l22254K00362K43423
6726A602160p6303j29414J70838m9714o8242J7794K16336j29034J39159j8644
6716A674936k21384J68675J04974l30462k9201L96159K63558m56950k07036Q9023
6706A452292k2713j70341m4616j4237m7493m9379M1710n2420p72K09553J11483
6695A413067l39882j67918J45809J00631K99909L1243j12070J45953j47375k14840
6685A154527J00394L9230L6563j28011n6508K32199K6524l56302j54913L732r9823
6674G97612j8815k0273J8178M0541N7191m9266J02355j80993r5777J44505j9616
$$ plain form
6663 775642 623121 667928 626054 795633 848502 826393 992135 851933 899845 972462 749751
6652 749751 613085 770423 791652 807167 811508 890102 965993 992769 1074362 1079934 1107176 1273559
6640 1273559 1203860 993240 1044441 955176 827821 1126654 1052190 941951 919957 946830 1106962
6629 1106962 1206109 1221066 1266015 1026478 917084 845512 832507 819736 734841 833746 884898
6618 884898 820308 887068 852760 632894 428875 263048 289690 538340 683489 695993 874529
6607 874529 960892 681205 577813 551945 842419 784637 801730 532478 508914 516005 488594
6596 488594 396550 471854 422136 562250 656887 702082 666648 698873 603141 326503 354519
6585 354519 682336 812058 798236 722923 627869 638434 499080 252907 245336 367926 494256
$$ packed form
6663G75642j52521M4807m1874J69579N2869k2109J65742j40202M7912P2617k22711
6652G49751j36666J57338K1229J5515M341P8594P5891K6776Q1593N572K7242J66383
6640A273559o9699k10620N1201q9265j27355K98833p4464j10239k1994K6873J60132
6629A106962R9147J4957M4949k39537j09394p1572j3005j2771q4895R8905N1152
6618H84898o4590O6760l4308k19866k04019j65827K6642K48650J45149J2504J78536
6607H74529Q6363k79687j03392k5868K90474n7782J7093k69252k3564P091k7411
6596D88594r2044P5304m9718J40114R4637M5195l5434L2225r5732k76638K8016
6585C54519L27817J29722j3822p5313r5054J0565j39354k46173p571J22590J26330
$$ plain form
6574 494256 474021 447500 523829 833817 899981 638573 700482 726548 556340 261974 594135
6563 594135 827235 921500 682160 540863 562826 745719 741182 773834 758541 882557 456064
6552 456064 308135 543389 612643 261179 276597 529181 786074 836694 848281 709627
6542 709627 644492 493906 434875 512026 728026 1092577 807175 416702 699439 958271
6532 958271 845988 741449 587457 660070 548328 458888 455028 971574 1035226 612036 638802
6521 638802 911860 831396 853905 851456 799112 774494 1035840 1082287 790751 761331 1034769
6510 1034769 839043 848025 1196826 1400990 1314251 925162 1026678 1017064 871352 653129
6500 653129 797851 664444 601696 559012 685955 686980 868915 883506 621912 443002 856395
$$ packed form
6574D94256k0235k6521P6329L09988O6164k61408O1909K6066j70208k94366L32161
6563E94135K33100R4265k39340j41297K1963J82893m537L2652j5293J24016m26493
6552D56064j47929K35254O9254l51464J5418K52584K56893N0620J1587j38654
6542G09627o5135j50586n9031P7151K16000L64551k85402l90473K82737K58832
6532I58271j12283j04539j53992P2613j11742q9440l860N16546O3652m23190K6766
6521F38802K73058q0464K2509k449n2344k4618K61346M6447k91536k9420K73438
6510A034769j95726Q982L48801K04164q6739l89089J01516r614j45712k18223
6500F53129J44722j33407o2748m2684J26943J025J81935J4591k61594j78910M13393
$$ plain form
6489 856395 623202 528955 690642 805472 792071 766262 720397 788032 754481 681781 621927
6478 621927 608822 636369 639206 400440 256983 402071 662945 683714 587941 727530 961798
6467 961798 805820 687297 740707 611279 680809 836338 703502 490412 719228 898333
6457 898333 986060 509691 555578 802784 845013 430613 491812 564296 689360 607983 317762
6446 317762 473225 717056 600508 842083 752085 757176 1140258 870721 835996 1166229
6436 1166229 720937 437439 756023 941204 642860 726488 777807 775269 822405 835173 564027
6425 564027 606837 632069 647241 613071 484172 496665 549972 720435 792312 846872 994689
6414 994689 759543 596895 551388 630172 761441 680816 891284 1090089 847347 604530
$$ packed form
6489H56395k33193r4247J61687J14830j3401k5809m5865O7635l3551p2700n9854
6478F21927j3105K7547K837k38766j43457J45088K60874K0769r5773J39589K34268
6467I61798j55978j18523N3410j29428O9530J55529j32836k13090K28816J79105
6457H98333Q7727m76369M5887K47206M2229m14400O1199P2484J25064q1377k90221
6446C17762J55463K43831j16548K41575q9998N091L83082k69537l4725L30233
6436A166229m45292k83498L18584J85181k98344Q3628N1319k538M7136J2768k71146
6425E64027M2810K5232J5172l4170j28899J2493N3307J70463P1877N4560J47817
6414I94689k35146j62648m5507P8784J31269q0625K10468J98805k42742k42817
$$ plain form
6404 604530 795547 954867 778174 811537 843372 606479 644864 923109 779533 998153
6394 998153 983667 968352 998906 908882 870530 1094488 1210595 1197486 1052584 966020 1148491
6383 1148491 1104682 1019642 939578 902826 874707 1054230 902335 968181 916238 916571 928513
6372 928513 592966 721476 1088708 1062014 1234103 1267787 1192960 1105787 906933 873369 1126477
6361 1126477 1239209 1247602 1010570 1121626 1180856 1172892 1095388 1195168 976141 1067615 835328
6350 835328 1014603 1118267 926537 722885 888297 831398 727237 925454 1059822 1282599
6340 1282599 1116670 943295 1000928 1135588 1217468 1122518 1067865 1198619 1297717 1332690 1327687
6329 1327687 1319140 1318058 1348595 1357575 1271074 1443343 2070908 2161746 1805657 1683151 1856577
$$ packed form
6404F04530J91017J59320j76693L3363L1835k36893L8385K78245j43576K18620
6394I98153j4486j5315L0554r0024l8352K23958J16107j3109j44902q6564J82471
6383A148491m3809q5040q0064l6752k8119J79523j51895O5846n1943L33J1942
6372I28513l35547J28510L67232k6694J72089L3684p4827q7173j98854l3564K53108
6361A126477J12732Q393k37032J11056N9230p964p7504R9780k19027R1474k32287
6350H35328J79275J03664j91730k03652J65412n6899j04161J98217J34368K22777
6340A282599j65929j73375N7633J34660Q1880r4950n4653J30754R9098L4973n003
6329A327687q547j082L0537Q980q6501J72269O27565R0838l56089j22506J73426
$$ plain form
6318 1856577 2010710 2196698 2118186 2078224 1852508 1892526 1848260 1905930 2122197 2177012 1629045
6307 1629045 1382203 1372509 1137747 1242738 1609935 1494167 1302940 1575617 1799723 1920806
6297 1920806 1783179 1715432 1580930 1559929 1492548 1487617 1286412 1192729 981007 1115536 1395505
6286 1395505 1398606 1183669 1163529 1337994 1552528 1384786 1156475 1212498 938046 943787 964978
6275 964978 1106955 1403892 1368133 1138112 1405499 1476595 1376991 1322276 1413566 1807594 1573460
6264 1573460 1293094 1287505 1409409 1499044 1538025 1380827 1376797 1636860 1486331 1281261 1187167
6253 1187167 1050479 921462 1200916 1519187 1463507 1315786 1508828 1271424 1127038 1386438
6243 1386438 1577927 1341473 1618600 1649646 1361844 1345079 1352099 1247841 1572869 1830308
$$ packed form
6318A856577J54133J85988p8512l9962k25716M0018m4266N7670K16267N4815n47967
6307A629045k46842r694k34762J04991L67197j15768j91227K72677K24106J21083
6297A920806j37627o7747j34502k1001o7381m931k01205r3683k11722J34529K79969
6286A395505L101k14937k0140J74465K14534j67742k28311N6023k74452N741K1191
6275I64978J41977K96937l5759k30021K67387P1096r9604n4715R1290L94028k34134
6264A573460k80366n589J21904Q9635L8981j57198m030K60063j50529k05070r4094
6253A187167j36688j29017K79454L18271n5680j47721J93042k37404j44386K59400
6243A386438J91489k36454K77127L1046k87802j6765P020j04258L25028K57439
$$ plain form
6233 1830308 1767394 1800833 1825182 1835531 1632014 1457693 1526485 1680558 1701749 1762567 1792958
6222 1792958 2017284 2071571 1922667 1991158 2033424 1805299 1708715 1560262 1642273 1855677
6212 1855677 1873917 1884342 1938193 1979923 1943359 2005281 1961043 1859547 2083737 2287544 2132529
6201 2132529 2101988 2287391 2294947 2386894 2535121 2469636 2408613 2405760 2286728 2342211 2755300
6190 2755300 2925142 3005204 2986661 3148789 2966445 2858361 2871369 2751825 2755337 3006743
6180 3006743 2999872 2951210 3132702 2911242 2920071 3128415 3221270 3044122 3082226 3044415 2868896
6169 2868896 2669894 3094532 3304293 3335169 3477419 3271990 3178896 3411818 3560752 3846024
6159 3846024 3707788 3680532 3692714 3679923 3603390 3788222 3714509 3715757 3933702 3896040 3714599
$$ packed form
6233A830308o2914L3439K4349J0349k03517j74321O8792J54073K1191O0818L0391
6222A792958K24326N4287j48904O8491M2266k28125r6584j48453Q2011K13404
6212A855677J8240J0425N3851M1730l6564O1922m4238j01496K24190K03807j55015
6201B132529l0541J85403P556R1947J48227o5485o1023k853j19032N5483M13089
6190B755300J69842Q0062j8543J62128j82344j08084J3008j19544L512K51406
6180C006743o871m8662J81492k21460Q829K08344R2855j77148L8104l7811j75519
6169B868896j99002M24638K09761L0876J42250k05429r3094K32922J48934K85272
6159C846024j38236k7256J2182j2791p6533J84832p3713J248K17945l7662j81441
$$ plain form
6148 3714599 3884322 4141390 4003846 3817488 3652249 3918894 3877476 3985392 4164066 4422156
6138 4422156 4531827 4593957 4187422 4168427 4196804 4352071 4640596 4583716 4535694 4873041
6128 4873041 4603167 4337002 4688378 4718798 4616179 4698339 4879987 5256780 5268823 5104862
6118 5104862 5206046 5045325 4966545 5187724 5557105 5760004 5548047 5253518 5447661 5608564
6108 5608564 5775748 5848134 5952607 6337868 6604953 6286020 6322764 6766515 6832748 6861141
6098 6861141 7022911 7193057 7496045 7867549 8239756 8169180 8035814 8378663 8630864 8862116
6088 8862116 9656627 10240135 10521266 11115472 11860042 12233645 12694021 13318078 13873511 14106843
6078 14106843 13679558 13012763 12624394 12708822 12671590 12713767 13147344 13644964 14154317 14434273
$$ packed form
6148C714599J69723K57068j37544j86358j65239K66645m1418J07916J78674K58090
6138D422156J09671O2130m06535j8995K8377J55267K88525n6880m8022L37347
6128D873041k69874k66165L51376L0420j02619Q2160J81648L76793J2043j63961
6118E104862J01184j60721p8780K21179L69381K02899k11957k94529J94143J60903
6108E608564J67184P2386J04473L85261K67085l18933L6744M43751O6233K8393
6098F861141J61770J70146L02988L71504L72207p0576j33366L42849K52201K31252
6088H862116P94511N83508K81131N94206P44570L73603M60376O24057N55433K33332
6078A4106843m27285o66795l88369Q4428l7232M2177M33577M97620N09353K79956
$$ plain form
6068 14434273 14466941 14336342 13714954 12946407 12409146 12027142 11465152 11455185 11715342 11372325
6058 11372325 11250544 11615342 11663174 11568499 11668648 11640243 11942423 12204845 12215075 12174839
6048 12174839 12428711 12560013 12885243 13106333 13277743 13961187 14120405 14116273 14378538 14660836
6038 14660836 15365676 16344027 17058678 17632968 18438444 19003362 19660072 20478763 21308672
6029 21308672 21736950 21802443 21980530 21741055 21361140 21187264 21166920 21203443 21407202 21524237
6019 21524237 22221736 22830699 23091401 23403472 23102186 21979278 21389557 20566540 19966278
6010 19966278 19545492 19284706 19089853 18861845 18672460 18734513 18958257 18933954 18623638 18632984
6000 18632984 18756019 18411013 18734908 18967973 18813205 18899892 19031797 18586256 18631361 18899538
$$ packed form
6068A4434273L2668j30599o21388p68547n37261l82004n61990r967K60157l43017
6058A1372325j21781L64798M7832r4675J00149k8405L02180K62422J0230m0236
6048A2174839K53872J31302L25230K21090J71410O83444J59218m132K62265K82298
6038A4660836P04840R78351P14651N74290Q05476N64918O56710Q18691Q29909
6029B1308672M28278O5493J78087k39475l79915j73876k0344L6523K03759J17035
6019B1524237O97499O08963K60702L12071l01286j122908n89721q23017o00262
6010A9966278m20786k60786j94853k28008j89385O2053K23744k4303l10316R346
6000A8632984J23035l45006L23895K33065j54768Q6687J31905m45541M5105K68177
$$ plain form
5990 18899538 19071032 19047037 18936794 19016692 19180710 19311007 19367692 19271794 19296104 19325226
5980 19325226 19428765 19172918 18871063 18764006 18662271 18529258 18405785 18183598 18280186 18360479
5970 18360479 18106182 17982630 18171313 18103033 18138261 18228151 18108255 18112009 18164866 18061283
5960 18061283 18088712 18108296 18061113 17904812 17705649 17915806 18077237 18097188 18177479 18159717
5950 18159717 18129250 18450724 18310288 18401491 18427010 18728928 18853260 18695914 18359232 18452064
5940 18452064 18473227 18161007 18011068 17866287 17694098 17994308 17875432 17653022 17638065 17405259
5930 17405259 17155855 16857177 16630689 16389979 16352175 16222891 16234730 16059118 16190816 16306095
5920 16306095 16221971 16032688 15949016 15757329 15616697 15674749 15445117 15013582 14389989 14084616
$$ packed form
5990A8899538J71494k3995j10243P9898J64018J30297N6685r5898K4310K9122
5980A9325226J03539k55847l01855j07057j01735j33013j23473k22187R6588Q0293
5970A8360479k54297j23552J88683o8280L5228Q9890j19896L754N2857j03583
5960A8061283K7429J9584m7183j56301j99163K10157J61431J9951Q0291j7762
5950A8159717l0467L21474j40436R1203K5519L01918J24332j57346l36682R2832
5940A8452064K1163l12220j49939j44781j72189L00210j18876k22410j4957k32806
5930A7405259k49404k98678k26488k40710l7804j29284J1839j75612J31698J15279
5920A6306095q4124j89283q3672j91687j40632N8052k29632m31535o23593l05373
$$ plain form
5910 14084616 14024856 13630899 13631246 13574458 13291160 13185511 13178973 12485497 12141336 12127168 12112745
5899 12112745 12198154 12320303 12157138 12065519 12070716 11953269 11857384 11676321 11568022 11358688
5889 11358688 11336679 11300628 11607113 11558670 11704191 11846892 11763094 11753456 12171800 12201704 12062081
5878 12062081 11787169 11738899 11633872 11761645 11779708 11836263 11865915 11780066 11743343 11901647
5868 11901647 11803858 11749879 11888201 11943866 12009093 12117338 12131902 12368770 12669971 12462194
5858 12462194 12280863 12195171 12206100 12506753 12669121 12414811 12646065 12773628 12798747 12819045
5848 12819045 12969104 12712064 12759012 12842081 12928980 12969980 13713869 13909921 14030408 14227840
5838 14227840 14513940 14755359 15030834 14912019 14643959 14452528 14775054 15005907 14824749
$$ packed form
5910A4084616n9760l93957L47n6788k83298j05649o538o93476l44161j4168j4423
5899A2112745Q5409J22149j63165r1619N197j17447r5885j81063j08299k09334
5889A1358688k2009l6051L06485m8443J45521J42701q3798r638M18344K9904j39623
5878A2062081k74912m8270j05027J27773J8063N6555K9652q5849l6723J58304
5868A1901647r7789n3979J38322N5665O5227J08245J4564K36868L01201k07777
5858A2462194j81331q5692J0929L00653J62368k54310K31254J27563K5119K0298
5848A2819045J50059k57040M6948Q3069Q6899M1000P43889J96052J20487J97432
5838A4227840K86100K41419K75475j18815k68060j91431L22526K30853j81158
$$ plain form
5829 14824749 14624305 14424438 14311625 14010543 14104957 14141887 13555377 13413453 13483677 13235868
5819 13235868 13363884 13404931 13241764 13261255 13386239 13291031 13176787 13013307 13361621 13598677
5809 13598677 13339797 13298105 13626863 13669221 13566747 13339074 13035438 13120718 13319355 13069077
5799 13069077 13182917 13279715 13089944 13102216 13025570 13233818 13513580 13618157 13877939 13926433
5789 13926433 13928652 14292411 14328720 14524077 15118294 15179372 15064462 15182947 15281982 15659845
5779 15659845 16172433 16051867 16208269 15922756 15684644 15882297 15811107 15739103 15627898 15469630
5769 15469630 15751107 15826961 15621411 15661708 15818792 15680333 15884841 16364282 16410248 16371828
5759 16371828 16365651 16344429 16477680 16614527 16662988 16675169 16946736 17187712 17178173 17309755 17605837
$$ packed form
5829A4824749k00444j99867j12813l01082R4414L6930n86510j41924P0224k47809
5819A3235868J28016M1047j63167J9491J24984r5208j14244j63480L48314K37056
5809A3598677k58880m1692L28758M2358j02474k27673l03636Q5280J98637k50278
5799A3069077J13840R6798j89771J2272p6646K08248K79762J04577K59782M8494
5789A3926433K219L63759L6309J95357N94217O1078j14910J18485R9035L77863
5779A5659845N12588j20566J56402k85513k38112J97653p1190p2004j11205j58268
5769A5469630K81477P5854k05550M0297J57084j38459K04508M79441M5966l8420
5759A6371828o177k1222J33251J36847M8461J2181K71567K40976r539J31582K96082
$$ plain form
5748 17605837 17555988 17537880 17545866 17977049 18457812 19272832 20107974 20550270 20998165 21965101
5738 21965101 22785702 23374309 24030715 24799781 25558125 25639529 25571470 25711861 25400515 24710962
5728 24710962 24586991 24614316 24608319 24452049 24647076 24722913 25009479 25607917 26576266 27510164
5718 27510164 28885213 30191360 31498306 33139945 34951876 36708084 38571041 40375808
5710 40375808 42004330 43305117 44259165 44840832 45114343 44979415 44311240 43297464 42004346
5701 42004346 40881978 40057787 39429559 39093387 38596273 38708894 39409159 40136459 41365511
5692 41365511 43489498 45468347 47421754 49634575 51949028 54113934 55589646 56608223
5684 56608223 57802943 58419987 58270804 57807622 56584926 55051199 53066257 50538065 48450542
$$ packed form
5748A7605837m9849j8108P986M31183M80763Q15020Q35142M42296M47895R66936
5738B1965101Q20601N88607O56406P69066P58344Q1404o8059J40391l11346o89553
5728B4710962j23971K7325n997j56270J95027P5837K86566N98438R68349R33898
5718B7510164J375049J306147J306946J641639J811931J756208J862957J804767
5710D0375808J628522J300787R54048N81667K73511j34928o68175j013776j293118
5701D2004346j122368q24191o28228l36172m97114J12621P00265P27300J229052
5692D1365511K123987J978849J953407K212821K314453K164906J475712J018577
5684E6608223J194720O17044j49183m63182j222696j533727j984942k528192k087523
$$ plain form
5675 48450542 46479825 44389107 43434264 42583465 41974259 41940120 42287209 42599517 43855366
5666 43855366 45293398 46899851 48181445 49361722 50519522 51477050 52192159 52644421 52797545
5657 52797545 52255926 51028099 49307356 47368731 44929119 42501658 40251637 37899414
5649 37899414 35826155 34295671 33148152 32275438 31551697 30833421 30275288 29743878 29300470
5640 29300470 29196723 29258906 29167428 28799747 28629588 28494746 28074171 27342820 26853608 26306947
5630 26306947 25696903 25256158 24799012 24119614 23747812 23088794 22551833 22728090 22308843
5621 22308843 22079697 22175121 22153639 21989337 22090242 22447384 23159282 23125166 23262554 23882576
5611 23882576 24322729 25003736 25875689 26425509 27112594 28101372 28917869 30336817 31702529
$$ packed form
5675D8450542j970717k090718r54843q50799o09206l4139L47089L12308J255849
5666D3855366J438032J606453J281594J180277J157800R57528P15109M52262J53124
5657E2797545n41619j227827j720743j938625k439612k427461k250021k352223
5649C7899414k073259j530484j147519q72714p23741p18276n58133n31410m43408
5640B9300470j03747O2183r1478l67681j70159j34842m20575p31351m89212n46661
5630B6306947o10044m40745m57146o79398l71802o59018n36961J76257m19247
5621B2308843k29146R5424k1482j64302J00905L57142P11898l4116J37388O20022
5611B3882576M40153O81007Q71953N49820O87085R88778Q16497J418948J365712
$$ plain form
5602 31702529 32736835 34003007 35532803 36925888 38641068 39875628 40726409 40701018 40009073
5593 40009073 38929414 37580027 36415214 36026715 35806429 35854974 36158823 36989491 37785573
5584 37785573 38532998 39460232 40428273 40090349 39709505 38684726 36766031 35178215 33836467
5575 33836467 32457869 31890960 31663226 31164400 30903613 30834519 30707424 30520063 30490801 30018945
5565 30018945 30045450 30154220 30177028 30370345 31018319 31407971 31897530 32436235 32971438 33639963
5555 33639963 34611540 35441450 36559549 37752587 38834088 40124294 41410908 42178302 43275597
5546 43275597 44505059 44937297 44957015 44927461 45000714 45415359 45860852 46428176 46794665 47052013
5536 47052013 47726624 48578317 49405809 50203784 51081779 52443348 53899322 55419037 57397352
$$ packed form
5602C1702529J034306J266172J529796J393085J715180J234560Q50781k5391o91945
5593D0009073j079659j349387j164813l88499k20286M8545L03849Q30668P96082
5584C7785573P47425R27234R68041l37924l80844j024779j918695j587816j341748
5575C3836467j378598n66909k27734m98826k60787o9094j27095j87361k9262m71856
5565C0018945K6505J08770K2808J93317O47974L89652M89559N38705N35203O68525
5555C3639963R71577Q29910J118099J193038J081501J290206J286614P67394J097295
5546D3275597J229462M32238J9718k9554P3253M14645M45493N67324L66489K57348
5536D7052013O74611Q51693Q27492P97975Q77995J361569J455974J519715J978315
$$ plain form
5527 57397352 59706843 62299400 64872235 66973811 68194523 67655024 66341479 65159731
5519 65159731 64086102 63571209 63349072 63068549 63352214 63568397 63827572 64541225 65147444
5510 65147444 65604106 65790374 64889149 62243359 58764414 55628051 53025710 50736776 48695704
5501 48695704 46742417 45344936 44241561 42625625 40998313 39298272 37576747 35986051
5493 35986051 34712150 34026648 33537551 32998936 32308559 31351038 30718118 30511255 30427776
5484 30427776 30149622 29957898 30175193 30273279 30581681 30735605 30482020 29988255 29873632 29723206
5474 29723206 29698054 29528585 28780408 27800767 27216947 26696184 26525580 26332887 26167310 26440923
5464 26440923 26754089 26659956 27011132 27662905 28263203 28983226 29694459 30474327 31394889 32081767
$$ packed form
5527E7397352K309491K592557K572835K101576J220712n39499j313545j181748
5519F5159731j073629n14893k22137k80523K83665K16183K59175P13653O06219
5510F5147444M56662J86268r01225k645790l478945l136363k602341k288934k041072
5501D8695704j953287j397481j103375j615936j627312j700041j721525j590696
5493C5986051j273901o85502m89097n38615o90377r57521o32920k06863q3479
5484C0427776k78154j91724K17295R8086L08402J53924k53585m93765j14623j50426
5474B9723206k5152j69469p48177r79641n83820n20763j70604j92693j65577K73613
5464B6440923L13166r4133L51176O51773O00298P20023P11233P79868R20562O86878
$$ plain form
5454 32081767 32912211 33952367 34480331 34365199 34247631 34305774 34289261 34168129 34140476 34701591
5444 34701591 34942076 35049126 35383037 36133172 36728957 37782149 38850585 39429236 40056987
5435 40056987 40674474 40967434 41126962 41086653 40928816 40688335 40370463 39974499 39662047 39757592
5425 39757592 39885931 39717663 39719724 40102449 40691573 41112481 41496936 42295375 43172882 43962405
5415 43962405 44695907 45119554 45684970 46375907 47144907 48241598 49331026 50481349 51534644
5406 51534644 52876161 54352752 56023730 57839698 60101510 62809351 65947639 69669889
5398 69669889 73585191 77418447 81888341 87684909 95195223 103799803 113793492 125729867
5390 125729867 139403239 155540355 173621716 192865212 212266532 229124204 240659535
$$ packed form
5454C2081767Q30444J040156N27964j15132j17568N8143j6513j21132k7653N61115
5444C4701591K40485J07050L33911P50135N95785J053192J068436N78651O27751
5435D0056987O17487K92960J59528m0309j57837k40481l17872l95964l12452R5545
5425C9757592J28339j68268K061L82725N89124M20908L84455P98439Q77507P89523
5415D3962405P33502M23647N65416O90937P69000J096691J089428J150323J053295
5406E1534644J341517J476591J670978J815968K261812K707841L138288L722250
5398F9669889L915302L833256M469894N796568P510314Q604580R993689J1936375
5390A25729867J3673372J6137116J8081361J9243496J9401320J6857672J1535331
$$ plain form
5383 240659535 250858321 263293124 276586557 281435606 272239037 259511546 246856489
5376 246856489 229253331 209363945 190388901 175072000 164903169 158934541 156672078
5369 156672078 156890064 159451773 164436933 172014494 181726746 193428890 205776017 218026843
5361 218026843 228183843 236067829 243451291 250867989 255495641 254222940 247088405 235294710
5353 235294710 220511998 204525365 188018212 172172640 159398935 150065938 143298039
5346 143298039 138337583 133988094 128730111 122664797 116957481 112573460 109430921 107017584
5338 107017584 104577796 101796981 98542135 95090697 92348773 90173863 88541516 88127690
5330 88127690 88455158 89634640 91642311 93891655 96301316 99304740 102740364 104842623
$$ packed form
5383B40659535J0198786J2434803J3293433M849049r196569j2727491j2655057
5376B46856489j7603158j9889386j8975044j5316901j0168831n968628k262463
5369A56672078K17986K561709M985160P577561R712252J1702144J2347127J2250826
5361B18026843J0157000P883986P383462P416698M627652j272701p134535j1793695
5353B35294710j4782712j5986633j6507153j5845572j2773705r332997o767899
5346A43298039m960456m349489n257983o065314n707316m384021l142539k413337
5338A07017584k439788k780815l254846l451438k741924k174910j632347m13826
5330H8127690L27468J179482K007671K249344K409661L003424L435624K102259
$$ plain form
5322 104842623 104037955 100845797 96543108 91550890 87397591 84597788 82069443 80027951
5314 80027951 78682661 78023421 77342483 76610268 76017459 75005815 72914215 70247143 67544182
5305 67544182 65234059 63268152 61913014 61808846 62123160 62033261 61930950 62148482 62410839
5296 62410839 62660537 62074061 61021143 59481627 57517207 55067683 52589817 50255352
5288 50255352 48101429 46251133 44839316 43538735 42227402 41323368 40605108 39621586 39120443
5279 39120443 39171175 39073933 38988116 39267422 40050400 40975466 41645912 42149425 43349351 44276833
5269 44276833 44525836 45140237 45577405 45120062 43720360 41765905 39769258 37667784 35486773
5260 35486773 33792165 32638244 31760336 31208388 30606170 30290371 30317847 30453527 30604174
$$ packed form
5322A04842623q04668l192158m302689m992218m153299k799803k528345k041492
5314H0027951j345290o59240o80938p32215n92809j011644k091600k667072k702961
5305F7544182k310123j965907j355138j04168L14314q9899j02311K17532K62357
5296F2410839K49698n86476j052918j539516j964420k449524k477866k334465
5288E0255352k153923j850296j411817j300581j311333r04034p18260r83522n01143
5279C9120443N0732r7242q5817K79306P82978R25066O70446N03513J199926R27482
5269D4276833K49003O14401M37168m57343j399702j954455j996647k101474k181011
5260C5486773j694608j153921q77908n51948o02218l15799K7476J35680J50647
$$ plain form
5251 30604174 30896082 31374426 32040254 32507116 33537001 34593422 35156039 35789962 36404030
5242 36404030 36583647 37178510 37283638 36804926 36116618 35042296 33681931 31845770 29536320
5233 29536320 27450154 25817843 24248352 23295118 22781362 22440205 21906165 21481114 21081921
5224 21081921 20785293 20397848 19960540 19396744 19516374 19707579 19603902 19292464 18885605
5215 18885605 18467050 18007406 17363732 16568470 16145308 15714129 15006306 14745786 14769196 14386023
5205 14386023 14183480 14179447 13988515 13689776 13558910 13542304 13616252 13402512 13012633 12919784
5195 12919784 12924611 12704360 12413584 12144771 11920429 11707214 11637432 11200098 11156229 11213897
5185 11213897 11124696 10899131 10839042 10841175 10766624 10631100 10653339 10757157 10282109 10096491
$$ packed form
5251C0604174K91908M78344O65828M66862J029885J056421N62617O33923O14068
5242C6404030J79617N94863J05128m78712o88308j074322j360365j836161k309450
5233B9536320k086166j632311j569491r53234n13756l41157n34040m25051l99193
5224B1081921k96628l87445m37308n63796J19630J91205j03677l11438m06859
5215A8885605m18555m59644o43674p95262m23162m31179p07823k60520K3410l83173
5205A4386023k02543m033j90932k98739j30866j6606P3948k13740l89879r2849
5195A2919784M827k20251k90776k68813k24342k13215o9782m37334m3869N7668
5185A1213897q9201k25565o0089K133p4551j35524K2239J03818m75048j85618
$$ plain form
5175 10096491 10438265 10465241 10088068 10027322 10448483 10658258 10464469 10186236 9868961 9788029
5165 9788029 9857536 9938265 10055110 9997494 9935883 9904336 9912664 10176344 10216983 10271674 10684236
5154 10684236 11059497 11144181 11492495 11863787 12091401 12250588 12735848 12733529 12778474 13025044
5144 13025044 13021160 12710264 12565242 12692074 12854346 12899731 12999426 13399436 13470432 13648049
5134 13648049 14000129 14123847 13850892 13784189 13822184 14266916 14536394 14361326 14336338 14373745
5124 14373745 14155620 14076780 14195877 14143301 14300241 14340020 14297488 14156388 14111573 14178884
5114 14178884 13945231 13745547 13827490 13777838 13870619 14055742 14052812 14011638 14111005 13962736 13860264
5103 13860264 13989313 13736681 13178493 13185749 13364712 13245432 13220770 12974599 12771124 12528011
$$ packed form
5175A0096491L41774K6976l77173o0746M21161K09775j93789k78233l17275q0932
5165I788029O9507Q0729J16845n7616o1611l1547Q328K63680M0639N4691M12562
5154A0684236L75261Q4684L48314L71292K27614J59187M85260k319M4945K46570
5144A3025044l884l10896j45022J26832J62272M5385R9695M00010P0996J77617
5134A3648049L52080J23718k72955o6703L7995M44732K69478j75068k4988L7407
5124A4373745k18125p8840J19097n2576J56940L9779m2532j41100m4815O7311
5114A4178884k33653j99684Q1943m9652R2781J85123k930m1174R9367j48269j02472
5103A3860264J29049k52632n58188P256J78963j19280k4662k46171k03475k43113
$$ plain form
5093 12528011 12184015 12243538 12123322 11765572 11789839 11543983 11083357 10964514 10467732 9901378
5083 9901378 9740167 9686092 9572202 9577291 9645666 9761327 9354519 9369054 9604715 9374301
5073 9374301 9371324 9434984 9008415 8989660 9165359 9300255 9108685 8953509 9444652 9770196
5063 9770196 9747246 10348145 11009919 11167183 11809394 12015961 12216397 12709207 13436573 13556554
5053 13556554 13528416 13651205 13738186 13797517 14500272 14997665 15512596 16415379 17156779 17746958
5043 17746958 18244486 18848994 19410689 20163563 20774329 21429014 21877620 22207324 22507122
5034 22507122 22708402 23071797 23523372 23396820 23674670 23846899 23660664 24031112 24325734
5025 24325734 24073916 23920665 24141296 24590011 24750733 24487228 24825576 25101953 24925949
$$ packed form
5093A2528011l43996N9523j20216l57750K4267k45856m60626j18843m96782n66354
5083I901378j61211n4075j13890N089O8375J15661m06808J4535K35661k30414
5073I374301k977O3660m26569j8755J75699J34896j91570j55176M91143L25544
5063I770196k2950O00899O61774J57264O42211K06567K00436M92810P27366J19981
5053A3556554k8138J22789Q6981N9331P02755M97393N14931R02783P41400N90179
5043A7746958M97528O04508N61695P52874O10766O54685M48606L29704K99798
5034B2507122K01280L63395M51575j26552K77850J72229j86235L70448K94622
5025B4325734k51818j53251K20631M48715J60722k63505L38348K76377j76004
$$ plain form
5016 24925949 24908766 25109092 24861208 24609021 24849073 24728975 23655462 23240650 23187074 22905156
5006 22905156 22658458 22750800 22791772 22309333 21621251 21454576 21587460 21061083 20222984 19937988
4996 19937988 19686297 19319325 18823534 18557917 18347121 18553650 18775821 18886377 18819966 18868014
4986 18868014 18796758 18646032 18762452 19117857 19432540 19707214 20034876 20389424 20444767 19940871
4976 19940871 19428604 18520997 17475850 16830238 16662970 15948277 15624962 15423690 15354973
4967 15354973 15480869 15299091 15161859 15078111 14822249 15007102 15218559 15114878 15212745 15307131
4957 15307131 15211532 15523789 15756099 15671294 16027995 15985260 16074752 16428341 16597545 16732952
4947 16732952 16815113 16644370 16957504 17201360 17061689 17170746 17191724 17416585 17833299 17989806
$$ packed form
5016B4925949j7183K00326k47884k52187K40052j20098j073513m14812n3576k81918
5006B2905156k46698R2342M0972m82439o88082j66675J32884n26377q38099k84996
4996A9937988k51691l66972m95791k65617k10796K06529K22171J10556o6411M8048
4986A8868014p1256j50726J16420L55405L14683K74674L27662L54548N5343n03896
4976A9940871n12267r07607j045147o45612j67268p14693l23315k01272o8717
4967A5354973J25896j81778j37232q3748k55862J84853K11457j03681R7867R4386
4957A5307131r5599L12257K32310q4805L56701m2735Q9492L53589J69204J35407
4947A6732952Q2161j70743L13134K43856j39671J09057K0978K24861M16714J56507
$$ plain form
4937 17989806 18034019 18335429 18477143 18897398 18997420 19072075 19621287 19660995 19378656 19495919
4927 19495919 19649103 19817578 20026852 20333217 20593251 20636427 20690228 20882488 20887479 20810672
4917 20810672 20678695 20399205 20346508 20474170 20353387 20345819 20496674 20832457 20797894 20550601
4907 20550601 20509534 20647400 20295096 20028126 19649805 19574005 19594659 19336541 18899344 18629541
4897 18629541 18206998 18014213 17820186 17511171 17206315 16907691 16751764 16648878 16572365 16054496
4887 16054496 15644394 15067099 14822854 14870473 14767400 14167059 13836940 13443344 12848053 12592348
4877 12592348 12406224 12214353 11882646 11525707 11553100 11598306 11108230 10763502 10656241 10365514
4867 10365514 10302945 9921454 9281448 9506739 9383522 8856685 8564575 8468781 8533537 8461327
$$ packed form
4937A7989806M4213L01410J41714M20255J00022P4655N49212L9708k82339J17263
4927A9495919J53184J68475K09274L06365K60034M3176N3801J92260M991p6807
4917B0810672j31977k79490n2697J27662j20783p568J50855L35783l4563k47293
4907B0550601m1067J37866l52304k66970l78321p5800K0654k58118m37197k69803
4897A8629541m22543j92785j94027l09015l04856k98624j55927j02886p6513n17869
4887A6054496m10102n77295k44245M7619j03073o00341l30119l93596n95291k55705
4877A2592348j86124j91871l31707l56939K7393M5206m90076l44728j07261k90727
4867A0365514o2569l81491o40006K25291j23217n26837k92110r5794O4756p2210
$$ plain form
4857 8461327 8322838 8444910 8560418 8281214 8228699 8113696 8216059 8077291 7926381 8026549
4847 8026549 8030618 7874258 7966825 7694713 7538276 7414697 7212127 7127813 7189868 7316558
4837 7316558 7495762 7461815 7402639 7228909 7145217 7360683 7427035 7440978 7226931 7404227
4827 7404227 7652233 7684498 7694283 8044396 8058131 7839692 7455811 7438813 7701454 7869061
4817 7869061 7745986 7783886 7808584 8067436 8408087 8556695 8558983 8374327 8403771 8311120 8434910
4806 8434910 8592799 8603883 8225591 8045769 7990286 8171724 8332292 8548604 8509908 8461261
4796 8461261 8490870 8652392 8730370 8911412 8917588 8809429 8782509 9219490 9862218 10119447
4786 10119447 9763500 9523000 9655782 9854983 9886726 10184284 10207326 9990894 9993564 10238035
$$ packed form
4857H461327j38489J22072J15508k79204n2515j15003J02363j38768j50910J00168
4847H026549M069j56360R2567k72112j56437j23579k02570q4314O2055J26690
4837G316558J79204l3947n9176j73730q3692K15466O6352J3943k14047J77296
4827G404227K48006L2265R785L50113J3735k18439l83881j6998K62641J67607
4817G869061j23075L7900K4698K58852L40651J48608K288j84656K9444r2651J23790
4806H434910J57889J1084l78292j79822n5483J81438J60568K16312l8696m8647
4796H461261K9609J61522P7978J81042O176j08159k6920M36981O42728K57229
4786A0119447l55947k40500J32782J99201L1743K97558K3042k16432K670K44471
$$ plain form
4776 10238035 10329891 10473406 10629204 11017662 11074341 10819170 11201329 11599774 11825669 12071009
4766 12071009 12282227 12466010 13218366 13937247 14683509 15418523 16572362 17546915 18378649
4757 18378649 19220249 20205259 21344682 22298684 22504827 22504756 22143083 21061184 19900783 18775511
4747 18775511 17718254 16798032 16089223 15809464 15625136 15721840 15873374 15772914 15596136
4738 15596136 15831836 16248324 16478572 16863872 17801936 18671747 19693677 20784686 21899773
4729 21899773 23332437 25191493 27194772 29059370 30809204 33083298 34963266 36291504
4721 36291504 37368756 37787271 38097393 37419199 36660582 35986062 35568220 35721841 36780802
4712 36780802 38162229 40181347 42711852 45809776 49478945 52735677 55890723 59466919
$$ packed form
4776A0238035R1856J43515J55798L88458N6679k55171L82159L98445K25895K45340
4766A2071009K11218J83783P52356P18881P46262P35014J153839R74553Q31734
4757A8378649Q41600R85010J139423R54002K06143p1l61673j081899j160401j125272
4747A8775511j057257r20222p08809k79759j84328R6704J51534j00460j76778
4738A5596136K35700M16488K30248L85300R38064Q69811J021930J091009J115087
4729B1899773J432664J859056K003279J864598J749834K274094J879968J328238
4721C6291504J077252M18515L10122o78194p58617o74520m17842J53621J058961
4712C6780802J381427K019118K530505L097924L669169L256732L155046L576196
$$ plain form
4704 59466919 62681139 64393541 65720651 66406917 65911908 64781029 63206536 61372749
4696 61372749 59479812 57838404 56924635 56627904 56800228 57536221 58787051 60176529 61711563
4687 61711563 63065795 64705392 66213130 67613355 68645748 69079142 68943603 68138471 65822971
4678 65822971 63012605 60074756 57108886 54606002 52155074 49970649 48271098 46488368
4670 46488368 44664817 43078331 41883611 41356105 40740748 40332775 40261142 40088477 39700251
4661 39700251 39503002 39136174 38316863 37771558 37389642 35968802 34841685 34110023 33071268
4652 33071268 32277256 31822669 31599591 31177942 31081096 31018020 30654531 30329287 29860381 29255792
4642 29255792 28939244 28472435 27685775 27109821 26653330 25972343 25752687 25593320 25344512
$$ packed form
4704E9466919L214220J712402J327110O86266m95009j130879j574493j833787
4696F1372749j892937j641408r13769k96731J72324P35993J250830J389478J535034
4687F1711563J354232J639597J507738J400225J032393M33394j35539q05132k315500
4678F5822971k810366k937849k965870k502884k450928k184425j699551j782730
4670D6488368j823551j586486j194720n27506o15357m07973p1633j72665l88226
4661C9700251j97249l66828q19311n45305l81916j420840j127117p31662j038755
4652C3071268p94012m54587k23078m21649r6846o3076l63489l25244m68906o04589
4642B9255792l16548m66809p86660n75954m56491o80987k19656j59367k48808
$$ plain form
4633 25344512 25049291 24670033 24363617 24263302 23968888 23664533 23832437 23685454 23548063
4624 23548063 24029139 24193628 24246891 24869728 25401901 26150645 26659068 26707483 26996740 27540595
4614 27540595 27581038 27972886 28178086 27978548 27595059 27220196 26970050 26992119 27219442 27383724
4604 27383724 27480594 28017662 28624628 29212285 30249652 31391687 32486017 33884227 35089100
4595 35089100 36160601 36940697 37480954 38120272 38616624 38773271 38275080 37649661 37231025
4586 37231025 36908675 36542045 36294489 36361414 36288085 36308303 36434255 36793250 37486528 38140180
4576 38140180 38503596 38733049 39248653 39977096 40683897 40602835 40126984 39984587 40026379 39508944
4566 39508944 38931887 38542215 38362367 38501174 38498538 38075886 37626917 37239147 37057806 37081701
$$ packed form
4633B5344512k95221l79258l06416j00315k94414l04355J67904j46983j37391
4624B3548063M81076J64489N3263O22837N32173P48744N08423M8415K89257N43855
4614B7540595M0443L91848K05200j99538l83489l74863k50146K2069K27323J64282
4604B7383724R6870N37068O06966N87657J037367J142035J094330J398210J204873
4595C5089100J071501P80096N40257O39318M96352J56647m98191o25419m18636
4586C7231025l22350l66630k47556O6925p3329K0218J25952L58995O93278O53652
4576C8140180L63416K29453N15604P28443P06801q1062m75851j42397M1792n17435
4566C9508944n77057l89672j79848J38807k636m22652m48969l87770j81341K3895
$$ plain form
4556 37081701 37130185 37602350 37937933 38414024 39014136 39466618 39439254 39628345 39419323 39655543
4546 39655543 40417833 41191774 42161828 44128664 45701285 47262709 49137773 50910040 52724341
4537 52724341 54626033 56599427 58398815 59863749 61184045 62358930 63071638 63394443
4529 63394443 63633488 64581018 66117147 68007585 70216034 72558014 74910137 77208125
4521 77208125 78107671 78604465 79256066 78451209 75909935 74174359 72439281 71004496 70541381
4512 70541381 70997190 71343883 71519056 71996168 73175405 74644375 76919119 79876246 82841816
4503 82841816 85671126 88885583 91734695 92844622 92142346 90510570 87144322 82185391
4495 82185391 77207626 72170892 67475091 63847998 61227001 59379690 58138554 57579886
$$ packed form
4556C7081701M8484M72165L35583M76091O00112M52482k7364J89091k09022K36220
4546C9655543P62290P73941R70054J966836J572621J561424J875064J772267J814301
4537E2724341J901692J973394J799388J464934J320296J174885P12708L22805
4529F3394443K39045R47530J536129J890438K208449K341980K352123K297988
4521G7208125Q99546M96794O51601q04857k541274j735576j735078j434785m63115
4512G0541381M55809L46693J75173M77112J179237J468970K274744K957127K965570
4503H2841816K829310L214457K849112J109927p02276j631776l366248m958931
4495H2185391m977765n036734m695801l627093k620997j847311j241136n58668
$$ plain form
4487 57579886 57943478 58497108 59106972 60061819 60221958 60026881 60338871 60244891 59604126 57688769
4477 57688769 54897994 52336092 49622629 46288317 43524485 41791034 40259455 38635339
4469 38635339 37262838 36468682 35461587 34395020 33577785 32635583 31576951 30488924 29533118
4460 29533118 28726759 28024248 27483905 26854384 26034261 25543347 25267714 24620885 23898553
4451 23898553 23673631 23299739 22766121 22201081 21725021 21563498 21477410 21350204 21453383 21427512
4441 21427512 21246046 21156743 21062810 21132223 21374153 21401344 21166500 21167758 20956793 20875286 21174171
4430 21174171 21194498 21288776 21868184 21848952 21870122 21813541 21420921 20985192 20218469 19751712
4420 19751712 19579043 19227233 19146468 19583899 19702520 19636273 19643258 19550650 19252926 19103938
$$ packed form
4487E7579886L63592N53630O09864R54847J60139j95077L11990r3980o40765j915357
4477E7688769k790775k561902k713463l334312k763832j733451j531579j624116
4469C8635339j372501p94156j007095j066567q17235r42202j058632j088027r55806
4460B9533118q06359p02511n40343o29521q20123m90914k75633o46829p22332
4451B3898553k24922l73892n33618n65040m76060j61523q6088j27206J03179k5871
4441B1427512j81466q9303r3933O9413K41930K7191k34844J258k10965q1507K98885
4430B1174171K0327R4278N79408j9232K1170n6581l92620m35729p66723m66757
4420A9751712j72669l51810q0765M37431J18621o6247O985r2608k97724j48988
$$ plain form
4410 19103938 19136038 19200774 19176976 19575603 20043908 20353528 20788864 20534311 20217699 19970606
4400 19970606 19476813 18796925 18567968 18650576 18743788 18477772 18229796 18661167 18972464 18788567
4390 18788567 18536973 18583962 18130294 17815498 17735376 17904173 17888072 17677747 17313396 17235412
4380 17235412 16972026 16477667 15822777 15321096 15154071 15084746 15038041 14985180 15271082 15208407
4370 15208407 14669869 14541631 14377467 14256435 14192384 13792546 13530487 13460478 13067465 12994506
4360 12994506 12924753 12683043 12352566 12275102 12236989 12508488 12590961 12231241 12152534 12147333 11920944
4349 11920944 11705656 11880648 11949670 11740773 11424302 11721351 12263912 12172730 12092094 12412942
4339 12412942 12724440 13078852 13086503 12898464 12969294 13163400 13370917 13172870 13200540 13454767
$$ packed form
4410A9103938L2100O4736k3798L98627M68305L09620M35336k54553l16612k47093
4400A9970606m93793o79888k28957Q2608R3212k66016k47976M31371L11297j83897
4390A8788567k51594M6989m53668l14796q0122J68797j6101k10325l64351p7984
4380A7235412k63386m94359o54890n01681j67025o9325m6705n2861K85902o2675
4370A5208407n38538j28238j64164j21032o4051l99838k62059p0009l93013p2959
4360A2994506o9753k41710l30477p7464l8113K71499Q2473l59720p8707n201k26389
4349A1920944k15288J74992O9022k08897l16471K97049N42561r1182q0636L20848
4339A2412942L11498L54412P651j88039P0830J94106K07517j98047K7670K54227
$$ plain form
4329 13454767 13524065 13624270 13759576 13615305 13574462 13496376 13341270 13344624 13328322 13243459 13130780
4318 13130780 13048532 12873785 13067909 13093987 12899080 13058047 12766032 12382817 12612346 12648170
4308 12648170 12760860 12962593 12713705 12647499 13069241 13239480 13393565 13454738 13579527 13621826
4298 13621826 13509044 13259166 13517893 13261937 13108681 13391882 13229479 13186880 13443669 13226594
4288 13226594 13058027 13371655 13623284 13534856 13565237 13806684 13828252 13894686 14105654 14128582
4278 14128582 14133258 14380914 14316934 14171815 14413967 14722141 14674115 14696301 15006765 15157740
4268 15157740 15459794 15704703 15743310 16075519 16579878 16621901 16768402 16993978 16978983 16964281
4258 16964281 17217905 17179513 17526211 18031621 18474845 18740543 18808464 19108271 19652903 19972317
$$ packed form
4329A3454767O9298J00205J35306j44271m0843p8086j55106L354j6302q4863j12679
4318A3130780q2248j74747J94124K6078j94907J58967k92015l83215K29529L5824
4308A2648170J12690K01733k48888o6206M21742J70239J54085O1173J24789M2299
4298A3621826j12782k49878K58727k55956j53256K83201j62403m2599K56789k17075
4288A3226594j68567L13628K51629q8428L0381K41447K1568O6434K10968K2928
4278A4128582M676K47656o3980j45119K42152L08174m8026K2186L10464J50975
4268A5157740L02054K44909L8607L32209N04359M2023J46501K25576j4995j4702
4258A6964281K53624l8392L46698N05410M43224K65698O7921K99807N44632L19414
$$ plain form
4248 19972317 20464875 20821080 20639030 20756188 21472983 22168141 22520716 23182490 23928874
4239 23928874 24335083 24901729 25676029 26351375 27103543 27875754 28607643 29521201 30875374
4230 30875374 32472839 33842288 35478226 37459909 39372307 41806393 44685516 47504793
4222 47504793 50305598 53294373 56388079 59856661 62712844 63912983 64234986 64214208 64508312
4213 64508312 65766065 67806983 70235707 72911615 75605385 78526822 81192582 83342390
4205 83342390 85065601 86482867 87748920 89953232 93159662 96519879 100802825 105948359
4197 105948359 111475103 116789214 122007097 127690498 135175279 144616946 156413565 170329550
4189 170329550 185913071 203204955 222599492 241769002 259944263 278084579 295748073
$$ packed form
4248A9972317M92558L56205j82050J17158P16795O95158L52575O61774P46384
4239B3928874M06209N66646P74300O75346P52168P72211P31889R13558J354173
4230C0875374J597465J369449J635938J981683J912398K434086K879123K819277
4222D7504793K800805K988775L093706L468582K856183J200139L22003k0778K94104
4213F4508312J257753K040918K428724K675908K693770K921437K665760K149808
4205H3342390J723211J417266J266053K204312L206430L360217M282946N145534
4197A05948359N526744N314111N217883N683401P484781R441667J1796619J3915985
4189A70329550J5583521J7291884J9394537J9169510J8175261J8140316J7663494
$$ plain form
4182 295748073 302328565 299822345 295339948 288596281 273988865 254169776 235704507 216474551
4174 216474551 199107573 184786773 172546706 161401311 150141358 138030458 126462513
4167 126462513 116028127 106484223 98547816 92302652 86895527 82247321 78236986 75110446
4159 75110446 72578173 70423316 68762463 67527434 66628641 66389114 66453646 66502397 67045887
4150 67045887 68391129 70621539 73591295 76604080 80193456 84666809 90056343 96205202
4142 96205202 102775045 109514726 115836208 121859277 127301163 129792060 128115003 121962129
4134 121962129 114559174 105758086 96657328 88471934 81283932 75206900 70184188 65570864
4126 65570864 62238649 59143363 56336300 54136442 52110583 50348387 48539038 46684004
$$ packed form
4182B95748073O580492k506220m482397o743667j4607416j9819089j8465269j9229956
4174B16474551j7366978j4320800j2240067j1145395j1259953j2110900j1567945
4167A26462513j0434386r543904p936407o245164n407125m648206m010335l126540
4159G5110446k532273k154857j660853j235029q98793k39527O4532M8751N43490
4150F7045887J345242K230410K969756L012785L589376M473353N389534O148859
4142I6205202O569843O739681O321482O023069N441886K490897j677057o152874
4134A21962129p402955q801088r100758q185394p188002o077032n022712m613324
4126F5570864l332215l095286k807063k199858k025859j762196j809349j855034
$$ plain form
4118 46684004 44921784 43711998 42345886 41149610 40083129 38848045 37477366 36784663
4110 36784663 36215281 35659713 34842447 34355805 34294313 33733879 32915555 32435430 31999275 31135973
4100 31135973 30106493 29262784 28567425 27842331 26986529 25876549 24957917 24585764 24042136
4091 24042136 23384325 22717004 22042838 21566619 21511974 20980789 20473811 20114416 19567837 19158354
4081 19158354 18928556 18378934 18293802 17856593 17295157 17353091 17428961 17154911 17142812 17084574
4071 17084574 16867732 16626364 16417396 16235697 16024174 15766113 15783905 16129792 16231774 16605847
4061 16605847 16924843 17033620 17028403 16982715 17039229 16903555 16712358 16375966 15810327 15406829
4051 15406829 15224174 15091847 14843728 14425585 14133495 13833327 13473655 13577946 13267290
$$ packed form
4118D6684004j762220j209786j366112j196276j066481j235084j370679o92703
4110C6784663n69382n55568q17266m86642o1492n60434q18324m80125m36155q63302
4100C1135973j029480q43709o95359p25094q55802j109980r18632l72153n43628
4091B4042136o57811o67321o74166m76219n4645n31185n06978l59395n46579m09483
4081A9158354k29798n49622q5132m37209n61436N7934P5870k74050j2099n8238
4071A7084574k16842k41368k08968j81699k11523k58061J7792L45887J01982L74073
4061A6605847L18996J08777n217m5688N6514j35674j91197l36392n65639m03498
4051A5406829j82655j32327k48119m18143k92090l00168l59672J04291l10656
$$ plain form
4042 13267290 12840993 12894872 12738133 12367242 12282255 12020860 11851848 11894725 11586579 11292653
4032 11292653 11295890 11234851 11184330 11166648 11265985 11574741 11690894 11135801 11032330 11284127
4022 11284127 11375077 11022946 10935927 10914913 10741265 10568949 10630353 10789668 10933652 10915222
4012 10915222 10939249 11253830 11480197 11253131 10817221 10793599 10646780 10412004 10505999 10742156
4002 10742156 10197570 9792815 9950368 9880438 9672579 9727038 9661378 9905407 10224474 10143299
3992 10143299 10175259 10533838 10937138 11282322 11662910 11608200 11902498 12876051 13552786 13900741
3982 13900741 14599433 15287765 16182622 17140941 17944318 18831133 19527297 19208146 18775726
3973 18775726 18801873 18333287 17557128 16532188 15381987 14150885 13112695 12025374 11035204
$$ packed form
4042A3267290m26297N3879j56739l70891q4987k61395j69012M2877l08146k93926
4032A1292653L237o1039n0521j7682R9337L08756J16153n55093j03471K51797
4022A1284127R0950l52131q7019k1014j73648j72316O1404J59315J43984j8430
4012A0915222K4027L14581K26367k27066m35910k3622j46819k34776R3995K36157
4002A0742156n44586m04755J57553o9930k07859N4459o5660K44029L19067q1175
3992A0143299L1960L58579M03300L45184L80588n4710K94298R73553O76735L47955
3982A3900741O98692O88332Q94857R58319Q03377Q86815O96164l19151m32420
3973A8775726K6147m68586p76159j024940j150201j231102j038190j087321r90170
$$ plain form
3964 11035204 10271623 10071436 9702003 9535070 9187791 8714580 8858070 8950246 8604056 8263651
3954 8263651 8090532 7917781 8074966 8232585 7979799 7502403 7419812 7447001 7489953 7291633
3944 7291633 7237154 7311092 7242190 6886086 7024453 7025903 6721844 6419152 6357617 6554192 6734079
3933 6734079 6731694 6823741 6820212 6735340 6483376 6458929 6536813 6388387 6229718 6254359 6168781
3922 6168781 6025537 6114648 6179316 6119474 6231014 6411931 6531775 6712092 6862135 6943473
3912 6943473 6974387 7116538 7275700 7687204 7975017 8234207 8659033 9141767 9535922 10150488
3902 10150488 10466888 10775574 10846795 10938298 10730189 10395384 10000734 9522535 8769442 8464439
3892 8464439 8178052 8047367 7909735 7786442 7610726 7374122 7100244 6847786 6794027 6890028
$$ packed form
3964A1035204p63581k00187l69433j66933l47279m73211J43490R2176l46190l40405
3954H263651j73119j72751J57185J57619k52786m77396q2591K7189M2952j98320
3944G291633n4479P3938o8902l56104J38367J450l04059l02692o1535J96575J79887
3933F734079k385R2047l529q4872k51964k4447P7884j48426j58669K4641q5578
3922F168781j43244Q9111O4668n9842J11540J80917J19844J80317J50043Q1338
3912F943473L0914J42151J59162M11504K87813K59190M24826M82734L94155O14566
3902A0150488L16400L08686P1221R1503k08109l34805l94650m78199p53093l05003
3892H464439k86387j30685j37632j23293j75716k36604k73878k52458n3759R6001
$$ plain form
3882 6890028 6927572 6986208 6648638 6334344 6268391 6378894 6546916 6431789 6320391 6284782
3872 6284782 6338982 6739486 6755933 6388850 6191441 5994580 5771167 5425883 5257656 5233606
3862 5233606 5250099 5046149 4931254 4917721 5184529 5064757 4972332 5123782 5092764 5060305
3852 5060305 5471571 5797703 5918511 5948095 5866358 5747206 5975951 5996794 5829575 5612974
3842 5612974 5275131 5099730 5038467 4852505 4779213 4560996 4157612 4001481 3931430 3843142
3832 3843142 3998049 4117175 3792894 3590781 3746441 3739524 3690315 3670007 3570029 3344621
3822 3344621 3461565 3618272 3622077 3594520 3353027 3055679 2930236 3063911 3084595 2956436
3812 2956436 2845342 2604043 2650142 2793647 2762876 2837682 2891802 2944470 3000182 2739079 2865536
$$ packed form
3882F890028L7544N8636l37570l14294o5953J10503J68022j15127j11398l5609
3872F284782N4200M00504J6447l67083j97409j96861k23413l45284j68227k4050
3862E233606J6493k03950j14895j3533K66808j19772r2425J51450l1018l2459
3852E060305M11266L26132J20808K9584q1737j19152K28745K0843j67219k16601
3842E612974l37843j75401o1263j85962p3292k18217m03384j56131p0051q8288
3832C843142J54907J19126l24281k02113J55660o917m9209k0308r9978k25408
3822C344621J16944J56707L805k7557k41493k97348j25443J33675K0684j28159
3812B956436j11094k41299M6099J43505l0771P4806N4120N2668N5712k61103J26457
$$ plain form
3801 2865536 3291326 3238400 3139033 3286936 3082786 2815817 2882690 2958380 2944811 2950431 3069592
3790 3069592 3095858 3105819 2987165 2806868 2711665 2518058 2264628 2241590 2272030 2594757 2682998
3779 2682998 2562092 2649043 2711984 2515652 2567433 2813204 2683134 2286427 2564038 2965309
3769 2965309 2816095 2473949 2421811 2335946 1977087 2067144 2348435 2504273 2640997 2640189 2540811
3758 2540811 2716067 2628379 2581978 2688557 2650171 2489239 2306545 2034195 1920635 1970257
3748 1970257 2194807 2184418 2120041 2113880 2031976 2015540 2140064 1932655 1713727 1476874 1617318
3737 1617318 2031971 2229960 1909962 1906955 2072274 2119978 1925730 1958524 1908462 1912427 1812240
3726 1812240 1516786 1367040 1607564 1694884 1546371 1678200 1718466 1434539 1295228 1477692
$$ packed form
3801B865536M25790n2926r9367J47903k04150k66969O6873P5690j3569N620J19161
3790C069592K6266R961j18654j80297r5203j93607k53430k3038L0440L22727Q8241
3779B682998j20906Q6951O2941j96332N1781K45771j30070l96707K77611M01271
3769B965309j49214l42146n2138q5865l58859R0057K81291J55838J36724q08r9378
3758B540811J75256q7688m6401J06579l8386j60932j82694k72350j13560M9622
3748A970257K24550j0389o4377o161q1904j6436J24524k07409k18928k36853J40444
3737A617318M14653J97989l19998l007J65319M7704j94248L2794n0062L965j00187
3726A812240k95454j49746K40524Q7320j48513J31829M0266k83927j39311J82464
$$ plain form
3716 1477692 1365010 1507767 1502039 1406829 1304406 1449156 1525592 1720787 1604911 1431191
3706 1431191 1335021 1467602 1738331 1671226 1613938 1768463 1509931 1449136 1621569 1814582
3696 1814582 1306946 1448153 1719274 1544654 1110229 917468 1031291 1096898 1100260 1464118
3686 1464118 1400493 1139058 1064354 1150149 1115817 1157814 1132911 1069438 1173276 1397569 1625483
3675 1625483 1591173 1468509 1395011 1686832 1551153 1492872 1462647 1475543 1580345 1429478
3665 1429478 1127250 1354006 1365468 1377991 1318106 1152559 1177721 1241587 1179821 1297607 1427129
3654 1427129 1184493 1108466 1399364 1484344 1286605 1312921 1277443 1157856 1169517 1181280 1221449
3643 1221449 1352667 1508493 1374204 1043551 951339 990529 861646 755559 778665 924431
$$ packed form
3716A477692j12682J42757n728r5210j02423J44750P6436J95195j15876j73720
3706A431191r6170J32581K70729o7105n7288J54525k58532o0795J72433J93013
3696A814582n07636J41207K71121j74620m34425j92761J13823O5607L362L63858
3686A464118o3625k61435p4704Q5795l4332M1997k4903o3473J03838K24293K27914
3675A625483l4310j22664p3498K91821j35679n8281l0225J2896J04802j50867
3665A429478l02228K26756J1462J2523n9885j65547K5162O3866o1766J17786J29522
3654A427129k42636p6027K90898Q4980j97739K6316l5478j19587J1661J1763M0169
3643A221449J31218J55826j34289l30653r2212L9190j28883j06087K3106J45766
$$ plain form
3633 924431 984485 775101 873976 1085919 1130592 922961 761014 968446 1088602 877157
3623 877157 792683 1033997 1239818 907447 821037 1005369 1234352 968078 1007642 1260672
3613 1260672 1188621 1145731 1037049 906654 811774 990470 1016815 1081008 942567 1095818
3603 1095818 1048676 696433 587545 1037048 1027413 900215 1130825 1158631 882001 797196
3593 797196 1036564 1258240 1093725 813884 971454 1150044 706502 646475 779382 857165
3583 857165 778317 529175 446879 610521 763544 607868 407174 356056 537596 594369
3573 594369 638781 846001 893991 911839 821623 994060 976462 447824 352416 537237 582030
3562 582030 615450 674754 543195 762431 703338 472621 619448 628494 510913 451002 399728
$$ packed form
3633I24431O0054k09384R8875K11943M4673k07631j61947K07432J20156k11445
3623H77157q4474K41314K05821l32371q6410J84332K28983k66274L9564K53030
3613A260672p2051m2890j08682j30395r4880J78696K6345O4193j38441J53251
3603A095818m7142l52243j08888M49503r635j27198K30610K7806k76630q4805
3593G97196K39368K21676j64515k79841J57570J78590m43542o0027J32907P7783
3583H57165p8848k49142q2296J63642J53023j55676k00694n1118J81540N6773
3573E94369M4412K07220M7990J7848r0216J72437j7598n28638r5408J84821M4793
3562E82030L3420N9304j31559K19236n9093k30717J46827R046j17581n9911n1274
$$ plain form
3551 399728 342492 621299 817972 755731 735242 635710 559076 566802 487631 433977 471578
3540 471578 313960 300452 419669 493284 505781 642610 738614 599514 211168 396696
3530 396696 393688 395212 406386 400029 755678 777361 375763 379885 766070 745251 905851 928940
3518 928940 774010 406346 182814 224520 400468 343431 553181 587522 788144 463648
3508 463648 185883 523976 680848 458970 742890 789230 660423 644222 500638 607730
3498 607730 532407 575283 763708 539858 448095 605710 471026 417085 219559 235165 576824
3487 576824 482682 294143 310438 287003 361587 369953 505719 419751 614052 630362 647062
3476 647062 652442 803111 692888 788592 713092 500792 337832 289521 248731 427762 624678
$$ packed form
3551C99728n7236K78807J96673o2241k0489r9532p6634P726p9171n3654L7601
3540D71578j57618j3508J19217P3615J2497J36829R6004j39100l88346J85528
3530C96696l008J524J1174o357L55649K1683m01598M122L86185k0819J60600K3089
3518I28940j54930l67664k23532M1706J75948n7037K09750L4341K00622l24496
3508D63648k77765L38093J56872k21878K83920M6340j28807j6201j43584J07092
3498F07730p5323M2876J88425k23850r1763J57615j34684n3941j97526J5606L41659
3487E76824r4142j88539J6295k3435P4584Q366J35766q5968J94301J6310J6700
3476F47062N380J50669j10223R5704p5500k12300j62960m8311m0790J79031J96916
$$ plain form
3465 624678 684669 650931 343852 225596 185173 57785 231730 452576 460852 519106 503729
3454 503729 281968 123326 -24800 -54539 -34956 -23835 234754 675271 545264 492454
3444 492454 319825 443393 569298 264462 259828 553206 614506 551839 439839 327375
3434 327375 395110 109854 -73227 -136068 -120439 158869 609256 534441 430610 343906 183837
3423 183837 79489 498205 751254 553566 175481 -42616 294126 407664 279258 275121
3413 275121 358855 440485 592851 432911 401319 272922 91473 248536 231440 -3845
3403 -3845 -20025 143366 275977 292416 318772 173246 218861 10731 -45373 152657 180515
3392 180515 180718 129066 169227 311865 313876 340690 482128 392812 435392 535787 617627 459245
$$ packed form
3465F24678N9991l3738l07079j18256m0423j27388J73945K20846Q276N8254j5377
3454E03729k21761j58642j48126k9739J9583J1121K58589M40517j30007n2810
3444D92454j72629J23568J25905l04836m634K93378O1300o2667j12000j12464
3434C27375O7735k85256j83081o2841J5629K79308M50387p4815j03831q6704j60069
3423A83837j04348M18716K53049j97688l78085k18097L36742J13538j28406m137
3413B75121Q3734Q1630J52366j59940l1592j28397j81449J57063j7096k35285
3403c845j6180J63391J32611J6439K6356j45526M5615k08130n6104J98030K7858
3392A80515K03n1652M0161J42638K011K6814J41438q9316M2580J00395Q1840j58382
$$ plain form
3380 459245 368095 126655 194543 340977 258366 311055 323950 75462 121261 400680 528521
3369 528521 275845 25242 269251 481613 201112 356287 436454 476874 388041 263186
3359 263186 296983 447118 483551 749604 688321 603257 587632 398483 424308 791713 472518
3348 472518 378626 717234 762059 955139 1124099 627787 521942 492245 454671 384570 315971
3337 315971 240963 195747 487781 666456 738599 740366 642854 466381 735152 698079 397492
3326 397492 236341 142091 -94112 103495 40439 67169 239535 329495 311142 603940 773823
3315 773823 660142 389332 242388 245044 208543 348663 157682 154538 270117 386937 610122
3304 610122 827887 416703 447870 939378 910354 814254 935568 792180 495521 526590
$$ packed form
3380D59245r1150k41440O7888J46434q2611N2689J2895k48488M5799K79419J27841
3369E28521k52676k50603K44009K12362k80501J55175Q0167M0420q8833j24855
3359B63186L3797J50135L6433K66053o1283q5064j5625j89149K5825L67405l19195
3348D72518r3892L38608M4825J93080J68960m96312j05845k9697l7574p0101o8599
3337C15971p5008m5216K92034J78675P2143J767r7512j76473K68771l7073l00587
3326C97492j61151r4250k36203J97607o3056K6730J72366Q9960j8353K92798J69883
3315G73823j13681k70810j46944K656l6501J40120j90981l144J15579J16820K23185
3304F10122K17765m11184L1167M91508k9024r6100J21314j43388k96659L1069
$$ plain form
3294 526590 470785 605380 572634 606155 605168 449097 608913 932424 469387 572692 868657
3283 868657 833403 861299 766011 658906 595990 500079 483293 511723 406532 587555 708964
3272 708964 318852 514339 712265 409433 461870 429006 359660 588065 646439 860893
3262 860893 769333 520076 792626 965014 1185161 1556369 1284983 1031779 1141225 1086756
3252 1086756 722567 786589 821152 519792 527405 644483 690347 726186 874358 869279 882432
3241 882432 691211 771037 1020808 1111094 923497 681195 743605 774241 722829 845688 843642
3230 843642 924375 1071910 787617 1065376 1713943 1823715 1346403 1023461 940338 1161768
3220 1161768 1057401 1024129 1084948 1271931 898699 778200 986115 1135320 998605 1031030
$$ packed form
3294E26590n5805J34595l2746L3521r87j56071J59816L23511m63037J03305K95965
3283H68657l5254K7896r5288j07105o2916r5911j6786K8430j05191J81023J21409
3272G08964l90112J95487J97926l02832N2437l2864o9346K28405N8374K14454
3262H60893r1560k49257K72550J72388K20147L71208k71386k53204J09446n4469
3252A086756l64189O4022L4563l01360P613J17078M5864L5839J48172n079J3153
3241H82432j91221P9826K49771R0286j87597k42302O2410L0636n1412J22859k046
3230H43642Q0733J47535k84293K77759O48567J09772m77312l22942q3123K21430
3220A161768j04367l3272O0819J86983l73232j20499K07915J49205j36715L2425
$$ plain form
3210 1031030 957198 659980 457249 729641 851567 574808 686416 686274 589568 385702
3200 385702 282547 511718 1014130 729674 538618 682372 594604 406508 877195 597579
3190 597579 500538 536179 512178 613330 822994 581498 646687 718092 678761 645787 916632
3179 916632 965653 738929 418374 468407 486764 427420 727523 897705 870288 897301 684049
3168 684049 598211 589508 480076 469587 579974 736272 876827 835856 765362 633804 348467
3157 348467 186351 353149 404466 185781 227207 472307 311101 93364 163663 19788
3147 19788 343366 404036 330258 366232 434389 409947 315648 124727 228144 366329 549737
3136 549737 591256 665833 679652 626962 364461 206411 197106 433769 401052 428553 235255
$$ packed form
3210A031030p3832k97218k02731K72392J21926k76759J11608j42r6706k03866
3200C85702j03155K29171N02412k84456j91056J43754q7768j88096M70687k79616
3190E97579r7041L5641k4001J01152K09664k41496O5189P1405l9331l2974K70845
3179I16632M9021k26724l20555N0033J8357n9344L00103J70182k7417K7013k13252
3168F84049q5838q703j09432j0489J10387J56298J40555m0971p0494j31558k85337
3157C48467j62116J66798N1317k18685M1426K45100j61206k17737P0299j43875
3147A9788L23578O0670p3778L5974O8157k4442r4299j90921J03417J38185J83408
3136E49737M1519P4577J3819n2690k62501j58050r305K36663l2717K7501j93298
$$ plain form
3125 235255 173990 285606 346131 241521 258902 55568 67967 128407 86139 62117 157983
3114 157983 43310 -113692 61578 219584 142705 329725 274462 97827 356573 447297
3104 447297 253768 557043 611536 285374 291006 198175 106791 143802 450051 211742 -10537
3093 -10537 126706 576515 513561 449933 68844 28815 -23306 -166454 98740 485412 176050
3082 176050 -77069 -409621 -528808 -192183 190235 272495 339053 520037 383332 226897
3072 226897 127217 -46492 -241719 17580 142275 136234 112351 157925 24110 -27746 183282
3061 183282 304087 -92396 -310754 -84111 -147818 -260438 -117532 115547 126823 163020
3051 163020 207575 71062 -242985 -44597 160967 36921 123234 -91719 -414044 -192137
$$ packed form
3125B35255o1265J11616O0525j04610J7381k03334J2399O0440m2268k4022R5866
3114A57983j14673j57002J75270J58006p6879J87020n5263j76635K58746R0724
3104D47297j93529L03275N4493l26162N632r2831r1384L7011L06249k38309k22279
3093a0537J37243M49809o2954o3628l81089m0029n2121j43148K65194L86672l09362
3082A76050k53119l32552j19187L36625L82418Q2260O6558J80984j36705j56435
3072B26897r9680j73709j95227K59299J24695o041k3883M5574j33815n1856K11028
3061A83282J20805l96483k18358K26643o3707j12620J42906K33079J1276L6197
3051A63020M4555j36513l14047J98388K05564j24046Q6313k14953l22325K21907
$$ plain form
3041 -192137 -307805 -311326 -135248 -140908 -114940 95054 50538 -71068 -247569 -345455 -326144
3030 -326144 -253060 -414763 -297343 -250025 -143227 185378 120839 -67730 -196185 -87391
3020 -87391 -11086 153946 4935 -33135 248101 210977 173723 137108 -238599 -264451 -56856
3009 -56856 -139191 -169165 137125 -154349 -347472 162117 405112 240757 -37112 -423772
2999 -423772 -281215 -170656 -264167 -296531 -183564 -357775 -223680 -137555 26006 67394
2989 67394 121623 42465 165710 367166 231989 -114563 24990 78078 117295 28530 -1294
2978 -1294 329212 443476 273588 112377 -50355 40878 209359 7537 -79937 -18781 50027
2967 50027 -119217 -117239 -119231 -190272 184506 209866 29202 44334 155616 247642 247292 -18792
$$ packed form
3041a92137j15668l521J76078n660K5968K09994m4516j21606j76501r7886J9311
3030c26144P3084j61703J17420M7318J06798L28605o4539j88569j28455J08794
3020h7391P6305J65032j49011l8070K81236l7124l7254l6615l75707k5852K07595
3009e6856q2335k9974L06290k91474j93123N09589K42995j64355k77869l86660
2999d23772J42557J10559r3511l2364J12967j74211J34095Q6125J63561M1388
2989F7394N4229p9158J23245K01456j35177l46552J39553N3088L9217q8765k9824
2978a294L30506J14264j69888j61211j62732R1233J68481k01822q7474O1156O8808
2967E0027j69244J978j992p1041L74778K5360j80664J5132J11282R2026l50k66084
$$ plain form
2955 -18792 281 284972 203961 -122516 -15849 -17485 -16094 157093 -51718 -186984 -18247
2944 -18247 57298 -181787 73378 -51738 -406847 -363299 -145030 -92994 171385 184820 107928
2933 107928 72929 13995 329095 626355 283517 -93375 82174 280326 164714 -92198
2923 -92198 -57119 229749 199480 360014 378479 257508 11938 45063 -159063 -252229 -280186
2912 -280186 -267687 -126895 -9779 27375 348434 512135 364930 265600 345893 200855
2902 200855 -70237 -146246 -221839 -282751 -145020 -59499 -48808 -91646 -82595 -33820 23102
2891 23102 -41788 1607 39617 267358 304184 399857 63888 -32940 391263 200723 -72734
2880 -72734 97668 -119896 -147491 251149 234832 155924 143304 187535 130714 283328 139960
$$ packed form
2955a8792J9073K84691q1011l26477J06667j636J391J73187k08811j35266J68737
2944a8247P5545k39085K55165j25116l55109M3548K18269N2036K64379J3435p6892
2933A07928l4999n8934L15100K97260l42838l76892J75549J98152j15612k56912
2923i2198L5079K86868l0269J60534J8465j20971k45570L3125k04126r3166k7957
2912b80186J2499J40792J17116L7154L21059J63701j47205r9330Q0293j45038
2902B00855k71092p6009p5593o0912J37731Q5521J0691m2838R051M8775N6922
2891B3102o4890M3395L8010K27741L6826R5673l35969r6828M24203j90540k73457
2880g2734J70402k17564k7595L98640j6317p8908j2620M4231n6821J52614j43368
$$ plain form
2869 139960 134877 -39699 -47081 -58905 289994 72775 54526 168429 262618 70088 -13946
2858 -13946 215820 296593 85583 -185379 -169860 211539 377842 74942 -80023 -234021
2848 -234021 114602 293490 57052 -113947 153228 -111829 -29721 101795 61521 -50744
2838 -50744 -55289 41742 187922 179049 203473 190191 173047 219220 54337 -173853 -215104 -130012
2826 -130012 288661 377007 38156 32494 -36991 -236593 -135218 -35781 -213261 -143581 -145636
2815 -145636 179683 338678 18316 -350607 -120217 -78975 -38568 -93032 37656 282081
2805 282081 295438 -157547 -125003 4203 -16136 -95073 -76323 -251184 -5608 -65089 72636
2794 72636 204677 43145 -56567 -98867 -69322 -292113 -204918 -247534 -52878 151761 442703
$$ packed form
2869A39960n083j74576p382j1824L48899k17219j8249J13903R4189j92530q4034
2858a3946K29766Q0773k11010k70962J5519L81399J66303l02900j54965j53998
2848b34021L48623J78888k36438j70999K67175k65057Q2108J31516m0274j12265
2838e0744m545R7031J46180q873K4424j3282j7144M6173j64883k28190m1251Q5092
2826a30012M18673Q8346l38851n662o9485j99602J01375R9437j77480O9680k055
2815a45636L25319J58995l20362l68923K30390M1242M0407n4464J30688K44425
2805B82081J3357m52985L2544J29206k0339p8937J8750j74861K45576n9481J37725
2794G2636J32041j61532r9712m2300K9545k22791Q7195m2616J94656K04639K90942
$$ plain form
2783 442703 251128 60301 102949 41105 -322194 -258959 27466 41843 6297 168965 156300
2772 156300 -124657 -370423 -516401 27005 319720 394792 87039 -263484 -609369 -400659
2762 -400659 -175681 -224439 -280749 -354297 -338320 -370181 -413339 -286176 -355004 -615979 -352682
2751 -352682 5775 5269 -143585 -64042 -122661 -171582 -265407 -81925 -65910 -93171 -81720
2740 -81720 7788 189514 280422 10651 -162508 -252181 76776 1697 -118556 5767 28522
2729 28522 40500 127177 -62219 -142983 -134356 -105567 -153588 -131734 47051 43705 -24716 178454
2717 178454 12340 6688 109804 -222039 -229706 163857 211498 66443 -125062 -217042 73083
2706 73083 47289 -15648 309309 102719 -442077 -77043 80164 -76282 62527 90643
$$ packed form
2783D42703j91575j90827M2648o1844l63299O3235K86425J4377l5546J62668j2665
2772A56300k80957k45766j45978N43406K92715P5072l07753l50523l45885K08710
2762d00659K24978m8758n6310p3548J5977l1861m3158J27163o8828k60975K63297
2751c52682L58457n06j48854P9543n8619m8921r3825J83482J6015k7261J1451
2740h1720Q9508J81726R0908k69771j73159q9673L28957p5079j20253J24323K2755
2729B8522J1978Q6677j89396q0764Q627K8789m8021K1854J78785l346o8421K03170
2717A78454j66114n652J03116l31843p667L93563M7641j45055j91505r1980K90125
2706G3083k5794o2937L24957k06590n44796L65034J57207j56446J38809K8116
$$ plain form
2696 90643 27744 98103 68168 175188 333227 315098 -35823 -225926 -71142 31934 -228397
2685 -228397 -155071 -102236 68610 229500 110940 -28198 -58823 -96567 93036 22995 -276728
2674 -276728 -371562 -153238 -18698 -245564 -159438 -235604 -349905 -271331 -200609 -386696 -451844
2663 -451844 -520611 -278591 -261081 -360278 -270799 -327951 -393252 -339957 -397975 -294644 10748
2652 10748 14682 -132746 -285982 -206780 -74039 -84512 -32080 117105 42758 -13738 -44670
2641 -44670 -108689 -28495 112372 243522 232112 -56848 -416321 -169655 48562 -303126
2631 -303126 -146180 74321 -176859 -335856 -15677 285210 87667 32844 -46226 -366292
2621 -366292 -240579 -86417 -69589 -98078 -317771 -294038 -30110 -129958 -194771 -251038 -149319
$$ packed form
2696I0643o2899P0359k9935J07020J58039j8129l50921j90103J54784J03076k60331
2685b28397P3326N2835J70846J60890j18560j39138l0625l7744J89603p0041k99723
2674b76728r4834K18324J34540k26866Q6126p6166j14301P8574P0722j86087o5148
2663d51844o8767K42020J7510r9197Q9479n7152o5301N3295n8018J03331L05392
2652A0748L934j47428j53236P9202J32741j0473N2432J49185p4347n6496l0932
2641d4670o4019Q0194J40867J31150j1410k88960l59473K46666K18217l51688
2631c03126J56946K20501k51180j58997L20179L00887j97543n4823p9070l20066
2621c66292J25713J54162J6828k8489k19693K3733K63928r9848o4813n6267J01719
$$ plain form
2610 -149319 147491 183092 148921 367594 337014 52229 28375 243816 247648 61271 -86353
2599 -86353 -166358 13799 -11529 -160890 -133004 -177163 -339298 -338868 -388764 -342893 56182
2588 56182 174612 -245957 24343 461755 304421 -6607 65452 274192 251696 166748
2578 166748 124357 277627 329656 327963 246558 104803 -74228 -32856 57784 -140460 -57047
2567 -57047 -93821 -276901 -305344 -237767 -307285 -28468 69662 88596 9533 -248052 -505402
2556 -505402 -568289 -321713 -22506 -28977 -44211 -108639 47495 272404 113149 -72678 -51296
2545 -51296 -112061 -119177 103410 230820 254663 100563 -70163 -244092 -246439 -454305 -42182
2534 -42182 140185 320161 278152 278398 155075 248484 210490 73092 30059 24164 -136059
$$ packed form
2610a49319K96810L5601l4171K18673l0580k84785k3854K15441L832j86377j47624
2599h6353q0005J80157k5328j49361K7886m4159j62135M30m9896M5871L99075
2588E6182J18430m20569K70300M37412j57334l11028P2059K08740k2496q4948
2578A66748m2391J53270N2029j693q1405j41755j79031M1372R0640j98244Q3413
2567e7047l6774j83080k8443O7577o9518K78817R8130J8934p9063k57585k57350
2556e05402o2887K46576K99207o471j5234o4428J56134K24909j59255j85827K1382
2545e1296o0765p116K22587J27410K3843j54100j70726j73929k347k07866M12123
2534d2182J82367J79976m2009K46j23323R3409l7994j37398m3033n895j60223
$$ plain form
2523 -136059 -130999 -251605 -79186 -60025 -469285 -315034 114 -124368 -48078 198706
2513 198706 79796 104576 -92451 -180618 65649 279047 393795 327140 30944 -163031
2503 -163031 -59481 -277116 -298719 -8117 23234 -65782 -31997 -67230 -75840 -42865 -300079
2492 -300079 -314494 20737 45983 -385833 -272435 -126377 -36082 -106764 30820 -180728
2482 -180728 -41734 -61086 27862 -142027 -340931 -273387 -265347 -294564 -142669 66964 -11608
2471 -11608 -9548 156922 -136254 -329579 -133678 -375278 -266707 35364 -126579 -151061
2461 -151061 256798 234243 222396 91167 136418 530780 346408 -69707 -74760 -15429 -117782
2450 -117782 -186346 -73339 197668 137154 61005 247142 254511 118744 -40751 -118603 -245725
$$ packed form
2523a36059N060j20606J72419J9161m09260J54251L15148j24482P6290K46784
2513A98706j18910K4780j97027q8167K46267K13398J14748o6655k96196j93975
2503a63031J03550k17635k1603K90602L1351q9016L3785l5233q610L2975k57214
2492c00079j4415L35231K5246m31816J13398J46058R0295p0682J37584k11548
2482a80728J38994j9352Q8948j69889j98904O7544Q040k9217J51895K09633p8572
2471a1608K060J66470k93176j93325J95901k41600J08571L02071j61943k4482
2461a51061M07859k2555j1847j31229M5251L94362j84372m16115n053N9331j02353
2450a17782o8564J13007K71007o0514p6149J86137P369j35767j59495p7852j27122
$$ plain form
2439 -245725 -340868 -454366 -410854 -213016 -67826 -153266 -292573 -24374 -178184 -368088
2429 -368088 -489531 -494844 -501123 -496019 -447312 -230197 -197101 -44105 176390 182578 -53241
2418 -53241 -196456 36866 142724 96904 152830 -23071 -194433 174949 233500 -5421
2408 -5421 -146528 -2224 -135439 -241758 -2401 232555 23683 112723 248987 221239
2398 221239 21911 -222261 -274996 -326497 -370897 -529456 -527548 -33933 85508 -85072 11010
2387 11010 250903 96225 -219566 77293 237366 -34550 -91887 32262 -246088 -331749
2377 -331749 -242756 -202645 -147274 -202392 -99242 117022 287932 197773 -49966 -329673 -207438
2366 -207438 153301 228230 20727 -252026 -326602 -69390 229963 233546 12056 -31861 20568
$$ packed form
2439b45725r5143j13498M3512J97838J45190q5440j39307K68199j53810j89904
2429c68088j21443n313o279N104M8707K17115L3096J52996K20495O188k35819
2418e3241j43215K33322J05858m5820N5926j75901j71362L69382N8551k38921
2408e421j41107J44304j33215j06319K39357K34956k08872Q9040J36264k7748
2398B21239j99328k44172n2735n1501m4400j58559J908M93615J19441j70580R6082
2387A1010K39893j54678l15791K96859J60073k71916n7337J24149k78350q5661
2377c31749Q8993M0111N5371n5118J03150K16264J70910r0159k47739k79707J22235
2366b07438L60739P4929k07503k72753p4576K57212K99353L583k21490m3917N2429
$$ plain form
2355 20568 -43757 16890 224184 306601 151555 257726 190652 115864 99538 87468 12764
2344 12764 231285 344399 104002 -70346 -5517 -161841 -200310 -235074 -326867 227578 364957
2333 364957 162570 -73242 76210 104945 38255 -27427 130858 48359 75023 116397 154020
2322 154020 -125584 -114190 237077 506715 377972 70740 -134972 -4618 211884 24643
2312 24643 -97202 17827 175600 178082 63926 131925 -129565 -436723 -278804 -67897
2302 -67897 -39274 32322 473031 412217 348016 278952 224335 83042 22174 -283991 -280179
2291 -280179 -442957 -523137 -411797 -70581 -83225 -16968 -34668 -75093 -42522 -21019 92559
2280 92559 238654 83667 -208422 73078 233333 193745 59331 8914 -179431 11544
$$ packed form
2355B0568o4325O0647K07294Q2417j55046J06171o7074p4788j6326j2070p4704
2344A2764K18521J13114k40397j74348O4829j56324l8469l4764r1793N54445J37379
2333C64957k02387k35812J49452K8735o6690o5682J58285q2499K6664M1374L7623
2322A54020k79604J1394L51267K69638j28743l07232k05712J30354K16502j87241
2312B4643j21845J15029J57773K482j14156O7999k61490l07158J57919K10907
2302f7897K8623P1596M40709o0814o4201o9064n4617j41293o0868l06165L812
2291b80179j62778q0180J11340L41216j2644O6257j7700m0425L2571K1503J13578
2280I2559J46095j54987k92089K81500J60255l9588j34414n0417j88345J90975
$$ plain form
2270 11544 78292 23521 -167164 -434155 -473323 -325983 -245787 -213555 -376028 -399550 -231767
2259 -231767 -229254 -202846 -132903 -117175 36499 -353581 -441858 -157918 -317053 -267566 56222
2248 56222 48095 195758 286952 -21750 107895 87895 48456 131783 75673 10772 237628
2237 237628 77480 36303 68415 138365 321882 273917 20178 -66851 -147580 -180249 85656
2226 85656 1140 -267978 -128381 75867 4064 128845 140025 -75749 -168825 30603 381096
2215 381096 177540 8735 207577 88214 -257668 -256288 16553 -167632 -343049 -109138
2205 -109138 -263921 -408718 -189676 -248191 -322085 -148853 -104411 73862 230405 -55988
2195 -55988 -111186 -281533 -395148 -90674 5498 -73408 98595 12527 -75642 -51030 139684
$$ packed form
2270A1544O6748n4771j90685k66991l9168J47340Q0196L2232j62473k3522J67783
2259b31767K513K6408O9943J5728J53674l90080q8277K83940j59135M9487L23788
2248E6222q127J47663R1194l08702J29645k0000l9439Q3327n6110o4901K26856
2237B37628j60148m1177L2112O9950J83517m7965k53739q7029q0729l2669K65905
2226H5656q4516k69118J39597K04248p1803J24781J1180k15774r3076J99428L50493
2215C81096k03556j68805J98842j19363l45882J380K72841j84185j75417K33911
2205a09138j54783j44797K19042n8515p3894J73232M4442J78273J56543k86393
2195e5988n5198j70347j13615L04474R6172p8906J72003q6068q8169K4612J90714
$$ plain form
2184 139684 327779 399121 360406 226601 257468 305081 199738 169592 448409 436380 295453
2173 295453 193815 266465 453113 532406 439850 290553 248155 414588 361665 446175 810676
2162 810676 912803 745749 528399 580718 434767 432641 683282 693808 509689 808858
2152 808858 710691 450171 457321 711047 601249 582875 670053 699093 761215 946093 1037207
2141 1037207 767574 756294 881420 1216299 1322022 1326048 1034973 1110703 1147314 1237247 1198029
2130 1198029 1324189 1398063 1447302 1197406 1354829 1659998 1799946 1340593 1232165 1605147
2120 1605147 1993962 2038384 1976746 2016144 2199160 2369910 2447894 2403581 2543522 3080565
2110 3080565 3544628 3740622 3791358 3769553 4133931 4530309 4636101 5001778 5592571 6629911
$$ packed form
2184A39684J88095P1342l8715j33805L0867M7613j05343l0146K78817j2029j40927
2173B95453j01638P2650J86648P9293r2556j49297m2398J66433n2923Q4510L64501
2162H10676J02127j67054k17350N2319j45951k126K50641J0526j84119K99169
2152H08858r8167k60520P150K53726j09798j8374Q7178K9040O2122J84878R1114
2141A037207k69633j1280J25126L34879J05723M026k91075P5730L6611Q9933l9218
2130A198029J26160P3874M9239k49896J57423L05169J39948m59353j08428L72982
2120A605147L88815M4422o1638L9398J83016J70750P7984m4313J39941N37043
2110C080565M64063J95994N0736k1805L64378L96378J05792L65677N90793J037340
$$ plain form
2100 6629911 7092285 7456800 8517257 9631464 10110314 11146564 12566903 14237521 16303399
2091 16303399 18954859 21571423 24366141 28053890 32038020 36184844 39881952 44107286
2083 44107286 48266134 45575530 39683777 32058804 25210847 20911367 17878170 15580997
2075 15580997 13670589 12228706 11096275 10063528 9226466 8706373 8068637 7615454 7050543
2066 7050543 6587938 6134972 5906756 5490820 5162488 4731284 4447636 4378707 4357144 4032438
2056 4032438 3924743 3964708 3713894 2991983 2887306 3414163 3507107 3113778 2885482 2916460
2046 2916460 2832153 2567488 2349160 1997442 1665671 1755484 1639036 1369455 1628430 1512443
2036 1512443 1307346 1460290 1315983 1474902 1421320 1214298 1404854 1310025 1120371 1164243
$$ packed form
2100F629911M62374L64515J060457J114207M78850J036250J420339J670618K065878
2091A6303399K651460K616564K794718L687749L984130M146824L697108M225334
2083D4107286M158848k690604n891753p624973o847957m299480l033197k297173
2075A5580997j910408j441883j132431j032747q37062n20093o37736m53183n64911
2066G050543m62605m52966k28216m15936l28332m31204k83648o8929k1563l24706
2056D032438j07695L9965k50814p21911j04677N26857R2944l93329k28296L0978
2046B916460q4307k64665k18328l51718l31771Q9813j16448k69581K58975j15987
2036A512443k05097J52944j44307J58919n3582k07022J90556r4829j89654M3872
$$ plain form
2026 1164243 1329544 1262653 1202492 1068708 1068886 1024351 1140239 1284543 1136884 1041046 1082855
2015 1082855 874488 906789 786297 639614 709168 734958 617035 748372 420244 241543
2005 241543 456351 211846 77479 360268 649073 756823 529105 562471 992750 890886
1995 890886 786844 789879 687522 497615 478597 657738 684907 700535 712895 597591 360332
1984 360332 495665 485051 339858 315204 401978 413770 370892 179692 100530 177126 199806
1973 199806 298580 563708 513698 541069 558319 314102 326487 652045 555321 369397 590815
1962 590815 474357 340143 585932 583262 196058 -46987 180178 215394 -63394 -54011 235753
1951 235753 297254 -4881 -23657 320468 448721 162645 202816 341880 356374 420948 639007
$$ packed form
2026A164243J65301o6891o0161j33784J78m4535J15888J44304j47659r5838M1809
2015A082855k08367L2301j20492j46683O9554K5790j17923J31337l28128j78701
2005B41543K14808k44505j34367K82789K88805J07750k27718L3366M30279j01864
1995H90886j04042L035j02357j89907j9018J79141K7169J5628J2360j15304k37259
1984C60332J35333j0614j45193k4654Q6774J1792m2878j91200p9162P6596K2680
1973A99806R8774K65128n0010K7371J7250k44217J2385L25558r6724j85924K21418
1962E90815j16458j34214K45789k670l87204k43045K27165L5216k78788R383K89764
1951B35753O1501l02135j8776L44125J28253k86076M0171J39064J4494O4574K18059
$$ plain form
1940 639007 189160 14540 -1427 202688 319944 295919 140799 192469 8190 -47817
1930 -47817 35036 10174 122433 301764 408652 216032 117104 -544 -25160 -86321 -78272
1919 -78272 -350803 -279845 -55884 -147081 -230900 -236959 -139905 -267235 -276805 -63345 38050
1908 38050 -20746 139661 22446 -38642 -2207 30008 41324 16854 -71673 87337 155754
1897 155754 35595 112265 -47177 -32291 9673 209020 312535 119969 -167630 -143380
1887 -143380 -138957 176756 265701 -114627 -62686 72813 85157 174631 144254 -35755 -9902
1876 -9902 -250784 -229768 -66017 -16414 59683 55963 87700 200542 282418 -101703 -223603
1865 -223603 -81120 -121252 -340355 -241814 -107842 92167 164242 203296 226047 245525 151967
$$ packed form
1940F39007m49847j74620j5967K04115J17256k4025j55120N1670j84279n6007
1930d7817Q2853k4862J12259J79331J06888j92620r8928j17648k4616o1161Q049
1919g8272k72531P0958K23961r1197q3819o059R7054j27330r570K13460J01395
1908C8050n8796J60407j17215o1088L6435L2215J1316k4470q8527J59010O8417
1897A55754j20159P6670j59442J4886M1964J99347J03515j92566k87599K4250
1887a43380M423L15713Q8945l80328N1941J35499J2344Q9474l0377j80009K5853
1876i902k40882K1016J63751M9603P6097l720L1737J12842Q1876l84121j21900
1865b23603J42483m0132k19103R8541J33972K00009P2075L9054K2751J9478r3558
$$ plain form
1854 151967 -102620 -142559 52076 -22153 66785 173226 46625 61456 -199094 -459711
1844 -459711 -107192 324276 107426 314416 167116 212914 217102 -40876 -213569 -103473
1834 -103473 -379547 -108793 223 84598 2784 59038 112238 -121880 -263853 14781
1824 14781 249048 -51549 36336 286181 240171 199844 16929 -220352 12339 232844
1814 232844 108480 -30772 106358 423851 498528 82853 17635 -38765 66862 -103589
1804 -103589 -136014 -45269 99034 48612 121524 140331 287106 275598 249890 -67776 -82077
1793 -82077 8281 184782 160864 111896 -58486 -144184 -127735 294465 323992 126624 -5104
1782 -5104 32051 209459 318196 97905 -147589 30646 285249 229067 108437 -6244
$$ packed form
1854A51967k54587l9939J94635p4229Q8938J06441j26601J4831k60550k60617
1844d59711L52519M31468k16850K06990j47300M5798M188k57978j72693J10096
1834a03473k76074K70754J09016Q4375q1814N6254N3200k34118j41973K78634
1824A4781K34267l00597Q7885K49845m6010m0327j82915k37281K32691K20505
1814B32844j24364j39252J37130L17493P4677m15675o5218n6400J05627j70451
1804a03589l2425R0745J44303n0422P2912J8807J46775j1508k5708l17666j4301
1793h2077R0358J76501k3918m8968j70382q5698J6449M22200K9527j97368j31728
1782e104L7155J77408J08737k20291k45494J78235K54603n6182j20630j14681
$$ plain form
1772 -6244 -64679 68762 -3471 -186280 -303673 -222468 -127653 -38517 25488 -85869 -238170
1761 -238170 -109487 -122196 148317 208987 163140 90388 -63365 -124193 -84810 -181441 -165060
1750 -165060 -17927 43053 -71666 -67119 242088 332131 185863 -19812 -221529 -59011
1740 -59011 167820 128351 7439 -95178 154669 228909 222122 54849 94011 138123 -112282
1729 -112282 27632 66418 360320 397657 85600 -154643 93891 28283 -149934 -123007
1719 -123007 -207215 -181249 -274054 -264418 -43074 45649 -140674 -354188 -362992 -402144 -530368
1708 -530368 -451807 -245063 -31135 13146 9400 -44639 -278452 -175633 35599 173709 84637
1697 84637 149874 67108 40786 59720 124967 30349 -134589 -96651 145127 220077 170
$$ packed form
1772f244n8435J33441p2233j82809j17393Q1205R4815Q9136O4005j11357j52301
1761b38170J28683j2709K70513O0670m5847p2752j53753o0828L9383r6631J6381
1750a65060J47133O0980j14719M547L09207R0043j46268k05675k01717J62518
1740e9011K26831l9469j20912j02617K49847P4240o787j67273L9162M4112k50405
1729a12282J39914L8786K93902L7337l12057k40243K48534o5608j78217K6927
1719a23007q4208K5966r2805R636K21344Q8723j86323k13514q804l9152j28224
1708e30368P8561K06744K13928M4281l746n4039k33813J02819K11232J38110q9072
1697H4637O5237q2766k6322J8934O5247r4618j64938L7938K41778P4950k19907
$$ plain form
1686 170 -256601 -183913 -206958 -311503 -142596 -69170 -119152 110466 237585 133510 153663
1675 153663 -25456 -276997 -6502 -175505 -262748 -112584 -15875 191738 390631 497540
1665 497540 525430 326939 21243 10821 -95867 -98548 -12462 -156853 -390245 -178510 136516
1654 136516 55411 -147056 -26358 120040 -209407 -311996 -160467 -251391 -265293 -121384
1644 -121384 -445959 -543968 -404051 -288547 -160929 -20303 60814 45844 -138125 -292546
1634 -292546 57989 -97189 -222657 58549 174298 -174128 -115586 -103239 69159 31270
1624 31270 -158249 -133199 5538 194283 464527 241410 196990 84487 -63572 -120095
1614 -120095 -183620 -461951 -309376 -54603 140596 51702 130398 -24311 -79056 -50091 12843
$$ packed form
1686A70k56771P2688k3045j04545J68907P3426m9982K29618J27119j04075K0153
1675A53663j79119k51541K70495j69003q7243J50164R6709K07613J98893J06909
1665D97540K7890j98491l05696j0422j06688k681Q6086j44391k33392K11735L15026
1654A36516q1105k02467J20698J46398l29447j02589J51529r0924j3902J43909
1644a21384l24575r8009J39917J15504J27618J40626Q1117j4970j83969j54421
1634b92546L50535j55178j25468K81206J15749l48426N8542J2347J72398l7889
1624C1270j89519K5050J38737J88745K70244k23117m4420j12503j48059n6523
1614a20095o3525k78331J52575K54773J95199q8894P8696j54709n4745K8965O2934
$$ plain form
1603 12843 52165 -43566 -115006 -232059 -484162 -91637 137123 -325004 -320957 -203114 62418
1592 62418 -77763 -397438 -453222 12753 114342 82542 162153 443716 73013 -69339
1582 -69339 20442 91961 -74940 -44166 -30081 -73187 -52804 92470 247369 216100 249773
1571 249773 137609 213267 144502 44829 -42990 -31354 -71138 -175672 -164712 -164533 -270706
1560 -270706 -372287 -120893 161060 -51235 -137387 -156615 -139299 -178406 -108094 -114277 -192115
1549 -192115 18302 68598 -101494 -212618 -262217 -449589 -539776 -475611 -378023 150192 142229
1538 142229 -46412 178717 49428 -172795 -20315 -29972 -258246 -221465 -197582 -160070 -256334
1527 -256334 -289379 -210850 -145310 -127973 49037 -12198 -114225 37028 394760 123884 75
$$ packed form
1603A2843L9322r5731p1440j17053k52103L92525K28760m62127M047J17843K65532
1592F2418j40181l19675n5784M65975J01589l1800P9611K81563l70703j42352
1582f9339Q9781P1519j66901L0774J4085m3106K0383J45274J54899l1269L3673
1571B49773j12164P5658o8765r9673q7819J1636l9784j04534J0960J79j06173
1560b70706j01581K51394K81953k12295q6152j9228J7316l9107P0312o183p7838
1549a92115K10417N0296j70092j11124m9599j87372r0187O4165R7588N28215p963
1538A42229j88641K25129j29289k22223J52480r657k28274L6781K3883L7512r6264
1527b56334l3045P8529O5540J7337J77010o1235j02027J51253L57732k70876j23809
$$ plain form
1516 75 -67277 92113 188660 489862 257662 -56175 -244748 -378615 -335620 89177 164425
1505 164425 -147307 -325913 -249824 -45568 176863 159757 171087 336901 99229 -72031
1495 -72031 -107372 -92131 -131722 -163022 -376160 -368819 -546172 -577615 -538799 -368197 -177595
1484 -177595 -256856 -466541 -147588 -142116 -82787 114000 67338 -118231 21424 390743 287202
1473 287202 -143920 -192538 -163437 -51959 -118927 126967 146547 -115021 -138013 -49998 -161984
1462 -161984 164299 189062 -199201 -344467 56083 172672 27891 -50163 -102828 6984
1452 6984 -119606 123059 437600 300442 -56844 140843 102047 210228 247911 124320
1442 124320 -4759 56082 -72040 38029 -124712 -167494 108678 221011 -234182 -470572
$$ packed form
1516G5o7352J59390R6547L01202k32200l13837j88573j33867M2995M24797P5248
1505A64425l11732j78606P6089K04256K22431j7106J1330J65814k37672j71260
1495g2031l5341J5241l9591l1300k13138P341j77353l1443L8816J70602J90602
1484a77595p9261k09685L18953N472N9329J96787m6662j85569J39655L69319j03541
1473B87202m31122m8618K9101J11478o6968K45894J9580k61568k2992Q8015j11986
1462a61984L26283K4763l88263j45266M00550J16589j44781p8054n2665J09812
1452F984j26590K42665L14541j37158l57286J97687l8796J08181L7683j23591
1442A24320j29079O0841j28122J10069j62741m2782K76172J12333m55193k36390
$$ plain form
1432 -470572 -345282 -407572 -303330 -100410 -63501 -111986 187601 358497 456010 259288
1422 259288 -15446 -331158 -107530 -166325 -350134 -281566 -309775 -307561 -211487 -274100 -177802
1411 -177802 51880 48457 94397 -30763 -72715 -70180 -9753 65536 234335 362298 331993
1400 331993 466409 522965 440415 226779 12189 19765 92922 258880 187690 239198 281458
1389 281458 -99358 -289084 -286313 -355944 -377759 -78043 156845 -117770 -509871 -252188
1379 -252188 -65523 -241629 -491085 -435655 -307988 -40403 142069 -26087 -214569 6047
1369 6047 -43755 -52372 -79722 -441979 -300634 102591 -6423 -299824 32065 197298 78589
1358 78589 26617 224205 -51480 308 9088 121592 120775 -71216 5763 103638 -124897
$$ packed form
1432d70572J25290o2290J04242K02920L6909m8485K99587J70896R7513j96722
1422B59288k74734l15712K23628n8795j83809O8568k8209K214R6074o2613R6298
1411a77802K29682l423M5940j25160m1952K535O0427P5289J68799J27963l0305
1400C31993J34416N6556q2550k13636k14590P576P3157J65958p1190N1508M2260
1389B81458l80816j89726K771o9631k1815K99716K34888k74615l92101K57683
1379b52188J86665j76106k49456N5430J27667K67585J82472j68156j88482K20616
1369F047m9802q617k7350l62257J41345M03225j09014k93401L31889J65233j18709
1358G8589n1972J97588k75685N1788Q780J12504q17j91991P6979R7875k28535
$$ plain form
1347 -124897 -63939 109805 -270958 15759 232571 -117411 -366562 -304598 -386334 -273119
1337 -273119 -253592 -392498 -467005 -200247 127717 -33543 -253506 37820 205304 88313
1327 88313 167721 73606 21239 25739 47306 86723 164198 -32810 23795 27191 -21420 -40418
1315 -40418 14886 116268 248589 -25367 37196 -7638 -107920 -169583 -179608 -331630 -262560
1304 -262560 -314573 -68728 199682 -6737 -120630 -7482 175761 201879 167434 -132246
1294 -132246 -254477 -441007 -350429 -294784 -318429 -373202 -283614 -312100 -186081 -113824 -86078
1283 -86078 -193587 -152964 74365 113516 43236 137127 117195 -207241 -459010 -264247 -135373
1272 -135373 -123292 -185986 -45159 110093 128887 20754 109145 201841 272303 -65220 -12677
$$ packed form
1347a24897O0958J73744l80763K86717K16812l49982k49151O1964q1736J13215
1337b73119J9527j38906p4507K66758L27964j61260k19963K91326J67484j16991
1327H8313P9408r4115n2367M500K1567L9417P7475j97008N6605L396m8611j8998
1315d0418N5304J01382J32321k73956O2563m4834j00282o1663j0025j52022O9070
1304b62560n2013K45845K68410k06419j13893J13148J83243K6118l4445k99680
1294a32246j22231j86530R0578N5645k3645n4773Q9588k8486J26019P2257K7746
1283h6078j07509M0623K27329L9151p0280R3891j9932l24436k51769J94763J28874
1272a35373J2081o2694J40827J55252J8794j08133Q8391R2696P0462l37523N2543
$$ plain form
1261 -12677 218318 237110 -20038 -20992 134348 270389 -32819 -173977 -26319 -98963 -78649
1250 -78649 -115460 -534027 -431438 -412131 -731421 -454968 -69531 108750 68342 161303 234949
1239 234949 160302 -45496 149969 208651 406331 451568 339588 196923 18969 -375312
1229 -375312 -451559 -311204 -131479 -178305 -435237 -411677 127037 -83155 -203367 101879
1219 101879 125740 -15471 93144 -83364 -125034 -281584 -279137 14089 -11037 -416130 -352742
1208 -352742 -194744 -258563 -168886 14771 -47918 4401 12057 -115098 -174491 -140878 65974
1197 65974 -25702 99376 76415 176792 112379 -75214 -310942 -93488 -84086 -72493 111722
1186 111722 162611 66500 237763 295208 593209 474276 59729 80323 214220 -146858
$$ packed form
1261a2677K30995J8792k57148r54J55340J36041l03208j41158J47658p2644K0314
1250g8649l6811m18567J02589J9307l19290K76453L85437J78281m0408R2961P3646
1239B34949p4647k05798J95465N8682J97680M5237j11980j42665j77954l94281
1229c75312p6247J40355J79725m6826k56932K3560N38714k10192j20212L05246
1219A01879K3861j41211J08615j76508m1670j56550K447K93226k5126m05093O3388
1208c52742J57998o3819Q9677J83657o2689N2319P656j27155n9393L3613K06852
1197F5974r1676J25078k2961J00377o4413j87593k35728K17454R402J1593J84215
1186A11722N0889r6111J71263N7445K98001j18933m14547K0594J33897l61078
$$ plain form
1176 -146858 49416 369728 199788 126008 192291 6112 -174965 -250139 -357392 -200163
$$ packed form
1176a46858J96274L20312j69940p3780O6283j86179j81077p5174j07253J57229
$$ [...]
##END NTUPLES=NMR SPECTRUM
##END=
