##TITLE=1H_TG-2330-4
 CDCl3
 8 sc, 
 12.11.2021
##JCAMPDX= 6.0         $$ Bruker NMR JCAMP-DX V2.0
##DATA TYPE= NMR SPECTRUM
##DATA CLASS= NTUPLES
##ORIGIN= UXNMR, Bruker Analytische Messtechnik GmbH
##OWNER= root
$$ XWIN-NMR		Version 3.5
$$ Fri Nov 12 11:31:20 2021 Russian Standard Time (UT+4h)  she@DPX200
##.OBSERVE FREQUENCY= 200.131346
##.OBSERVE NUCLEUS= ^1H
##.ACQUISITION MODE= SIMULTANEOUS
##.ACQUISITION SCHEME= undefined
##.AVERAGES= 8
##.DIGITISER RES= 18
##SPECTROMETER/DATA SYSTEM= spect
##.PULSE SEQUENCE= zg30
##.SOLVENT NAME= Acetone
##.SHIFT REFERENCE= (INTERNAL, Acetone, 0, 15.7403)
##AUDIT TRAIL= $$ (NUMBER, WHEN, WHO, WHERE, WHAT)
$$ ##TITLE= Audit trail, XWIN-NMR		Version 3.5
$$ ##JCAMPDX= 5.01
$$ ##ORIGIN= Bruker BioSpin GmbH
$$ ##OWNER= she
$$ F:/spectra/data/she/nmr/H-F/1/pdata/1/auditp.txt
$$ ##AUDIT TRAIL=  $$ (NUMBER, WHEN, WHO, WHERE, WHAT)
(   1,<2021-11-12 11:30:01.95 +0400>,<she>,<DPX200>,
      <created by zg, POWCHK disabled, PULCHK disabled
       configuration hash MD5:
       00 E9 B6 7A A2 85 ED C7 34 08 36 98 17 FE 4E 26
       data hash MD5: 16K
       12 4C 55 F3 5E B5 41 2B C4 11 FB 96 3E 4F DC 66>)
(   2,<2021-11-12 11:30:05.10 +0400>,<she>,<DPX200>,
      <Start of raw data processing
       efp BC_mod = 2 LB = 0.24 FT_mod = 6 PKNL = 1 PHC0 = -15512.57 PHC1 = 14.00081 SI = 16K 
       data hash MD5: 16K
       CA D7 92 28 37 B7 96 16 65 ED 23 9A 14 30 A6 72>)
(   3,<2021-11-12 11:30:25.70 +0400>,<she>,<DPX200>,
      <pk PHC0 = 0.3078065 PHC1 = 2.2 
       data hash MD5: 16K
       08 F9 76 0A 69 F3 D2 2C E9 C5 E6 ED 5D D6 CE 32>)
(   4,<2021-11-12 11:30:29.01 +0400>,<she>,<DPX200>,
      <abs ABSG = 5 
       data hash MD5: 16K
       F3 3D 30 DD E1 C5 19 50 14 40 49 43 B7 68 47 AA>)
$$ ##END=
$$ 
$$ hash MD5
$$ 7F BC FC 4E 2B AD E3 18 C6 19 8B 96 36 9C 78 C3
##$RELAX= 
##$RELAX= 
##$RELAX= 
##$RELAX= 
##$RELAX= 
##$RELAX= 
$$ Bruker specific parameters
$$ --------------------------
##$DU= <F:/spectra>
##$EXPNO= 1
##$NAME= <H-F>
##$PROCNO= 1
##$TYPE= <nmr>
##$USER= <she>
##$AMP= (0..31)
100 100 100 100 100 100 100 100 100 100 100 100 100 100 100 100 100 100 
100 100 100 100 100 100 100 100 100 100 100 100 100 100 
##$AQSEQ= 0
##$AQ_mod= 1
##$AUNM= <au_zg>
##$AUTOPOS= <>
##$BF1= 200.13
##$BF2= 200.13
##$BF3= 200.13
##$BF4= 200.13
##$BF5= 200.13
##$BF6= 200.13
##$BF7= 200.13
##$BF8= 200.13
##$BYTORDA= 1
##$CFDGTYP= 0
##$CFRGTYP= 5
##$CHEMSTR= <none>
##$CNST= (0..31)
1 1 145 1 1 1 1 1 1 1 1 1 1 1 1 1 1 1 1 1 1 1 1 1 1 1 1 1 1 1 1 1 
##$CPDPRG= <>
##$CPDPRG1= <>
##$CPDPRG2= <>
##$CPDPRG3= <>
##$CPDPRG4= <mlev>
##$CPDPRG5= <mlev>
##$CPDPRG6= <mlev>
##$CPDPRG7= <mlev>
##$CPDPRG8= <mlev>
##$CPDPRGB= <>
##$CPDPRGT= <>
##$D= (0..31)
0 1.2 0 0 0 0 0 0 0 0.06 0 0.03 0 0 0 0 0.0002 0 0 0 0 0 0 0 0 0 0 0 0 
0 0 0 
##$DATE= 1636702201
##$DBL= (0..7)
120 120 120 120 120 120 120 120 
##$DBP= (0..7)
150 150 150 150 150 150 150 150 
##$DBP07= 0
##$DBPNAM0= <>
##$DBPNAM1= <>
##$DBPNAM2= <>
##$DBPNAM3= <>
##$DBPNAM4= <>
$$ [...]
##$SUBNAM2= <"">
##$SUBNAM3= <"">
##$SUBNAM4= <"">
##$SUBNAM5= <"">
##$SUBNAM6= <"">
##$SUBNAM7= <"">
##$SUBNAM8= <"">
##$SUBNAM9= <"">
##$SW= 18.0517287032376
##$SWIBOX= (0..15)
0 0 2 0 0 0 0 0 0 0 0 0 0 0 0 0 
##$SW_h= 3612.71676300578
##$TD= 16384
##$TD0= 1
##$TE= 0
##$TE2= 300
##$TE3= 300
##$TEG= 300
##$TL= (0..7)
0 120 120 120 120 120 120 120 
##$TP= (0..7)
150 150 150 150 150 150 150 150 
##$TP07= 0
##$TPNAME0= <>
##$TPNAME1= <>
##$TPNAME2= <>
##$TPNAME3= <>
##$TPNAME4= <>
##$TPNAME5= <>
##$TPNAME6= <>
##$TPNAME7= <>
##$TPOAL= (0..7)
0.5 0.5 0.5 0.5 0.5 0.5 0.5 0.5 
##$TPOFFS= (0..7)
0 0 0 0 0 0 0 0 
##$TUNHIN= 0
##$TUNHOUT= 0
##$TUNXOUT= 0
##$USERA1= <user>
##$USERA2= <user>
##$USERA3= <user>
##$USERA4= <user>
##$USERA5= <user>
##$V9= 5
##$VALIST= <valist>
##$VCLIST= <CCCCCCCCCCCCCCC>
##$VD= 0
##$VDLIST= <DDDDDDDDDDDDDDD>
##$VPLIST= <PPPPPPPPPPPPPPP>
##$VTLIST= <TTTTTTTTTTTTTTT>
##$WBST= 1024
##$WBSW= 4
##$XGAIN= (0..3)
0 0 0 0 
##$XL= 0
##$YL= 0
##$YMAX_a= 236247
##$YMIN_a= -364641
##$ZGOPTNS= <>
##$ZL1= 120
##$ZL2= 120
##$ZL3= 120
##$ZL4= 120
##$ABSF1= 15.74248
##$ABSF2= -2.309369
##$ABSG= 5
##$ABSL= 3
##$ALPHA= 0
##$AQORDER= 0
##$ASSFAC= 0
##$ASSFACI= 0
##$ASSFACX= 0
##$ASSWID= 0
##$AUNMP= <proc_1d>
##$AZFE= 0.1
##$AZFW= 0.1
##$BCFW= 0
##$BC_mod= 2
##$BYTORDP= 0
##$COROFFS= 0
##$CY= -3
##$DATMOD= 1
##$DC= 0
##$DFILT= <>
##$DTYPP= 0
##$F1P= 0
##$F2P= 0
##$FCOR= 1
##$FTSIZE= 16384
##$FT_mod= 6
##$GAMMA= 0
##$GB= 0
##$INTBC= 1
##$INTSCL= 0
##$ISEN= 128
##$LB= 0.24
##$LEV0= 0
##$LPBIN= 0
##$MAXI= 10000
##$MC2= 0
##$MEAN= 0
##$ME_mod= 0
##$MI= 1.114404
##$NCOEF= 0
##$NC_proc= -7
##$NLEV= 6
##$NOISF1= 3.799351
##$NOISF2= 2.8
##$NSP= 0
##$NTH_PI= 0
##$NZP= 0
##$OFFSET= 15.74028
##$PC= 1
##$PHC0= -15512.26
##$PHC1= 16.20081
##$PH_mod= 1
##$PKNL= yes
##$PPARMOD= 0
##$PSCAL= 0
##$PSIGN= 0
##$REVERSE= no
##$SF= 200.130002255684
##$SI= 16384
##$SIGF1= 3
##$SIGF2= 2
##$SINO= 5.538805
##$SIOLD= 16384
##$SREGLST= <1H.CDCl3>
##$SSB= 0
##$STSI= 16384
##$STSR= 0
##$SW_p= 3612.71676300578
##$SYMM= 0
##$S_DEV= 0
##$TDeff= 16384
##$TDoff= 0
##$TI= <>
##$TILT= no
##$TM1= 0
##$TM2= 0
##$TOPLEV= 0
##$USERP1= <user>
##$USERP2= <user>
##$USERP3= <user>
##$USERP4= <user>
##$USERP5= <user>
##$WDW= 1
##$XDIM= 16384
##$YMAX_p= 440548350
##$YMIN_p= -546025
$$ End of Bruker specific parameters
$$ ---------------------------------
##NTUPLES= NMR SPECTRUM
##VAR_NAME=  FREQUENCY,     SPECTRUM/REAL,   SPECTRUM/IMAG
##SYMBOL=    X,             R,               I
##VAR_TYPE=  INDEPENDENT,   DEPENDENT,       DEPENDENT
##VAR_FORM=  AFFN,          ASDF,            ASDF
##VAR_DIM=   16384,         16384,           16384
##UNITS=     HZ,            ARBITRARY UNITS, ARBITRARY UNITS
##FACTOR=    0.220516191357247, 1,           1
##FIRST=     3150.10230219821, 0,            0
##LAST=      -462.614460807567, 0,           0
##MIN=       -462.614460807567, -546025,     0
##MAX=       3150.10230219821, 440548350,    0
$$ Real data points
##PAGE= N=1
##DATA TABLE= (X++(R..R)), XYDATA
$$ [...]
9121 3889985 3643460 3561678 3621224 3780458 4050329 3834197 3758170 3946775 3893028 3669069
9111 3669069 3653179 3517460 3639812 3614523 3820809 3999805 3920251 3917308 3859839 3915316 3983691
9100 3983691 3980459 4096864 3965193 4015439 4004739 4103686 4085042 4175509 4150557 4139693 4476986
9089 4476986 4461541 4392802 4437569 4567123 4862703 4989313 5024209 4841429 4703561 4753764
9079 4753764 4919441 4894068 4731143 5036132 4983606 4843956 4992314 4799808 4939254 4992752
9069 4992752 5113569 5185617 5087747 5221547 5109903 5247840 5136603 5096687 4968424 5201104
9059 5201104 5226443 4973074 5064544 5175579 5301375 5432670 5368208 5528848 5390987 5212985
9049 5212985 5469253 5516672 5539282 5653183 5460081 5546917 5882154 6018977 5912561 5901579
9039 5901579 5938024 6149462 6111152 6184341 6287594 6338436 6369323 6424895 6495852 6376062 6265639
9028 6265639 6460211 6657658 6880910 6994158 6805340 6776831 6872119 6844990 6769379 6801964
9018 6801964 6923709 7098341 7004090 7062597 7247600 7444884 7365982 7365899 7523991 7522926 7714649
9007 7714649 7654662 7640232 7672533 7666456 7601694 7948975 8189476 8198987 8327983 8236552 8213724
8996 8213724 8456660 8766708 8714399 8774108 8671566 8687930 8895433 9113796 8920457 9028684
8986 9028684 9285885 9289369 9471756 9755278 9768827 10111953 10079157 10135262 10301963 10415288
8976 10415288 10764763 10964215 10969059 11047052 11184110 11337881 11736514 11708403 11798128 12205373
8966 12205373 12225061 12412224 12723339 12915325 13205201 13498050 13620198 13731193 13905731 14313192
8956 14313192 14532420 14924775 15260084 15601400 15727125 15832460 16334201 16637710 16971940
8947 16971940 17371748 17509910 18123478 18764173 19112054 19400569 19860609 20339248 20823681
8938 20823681 21547999 21974791 22578721 23273311 23988375 24680963 25393002 26242709 27202235
8929 27202235 28043237 29219009 30368717 31370833 32814896 34624835 36418169 38470143
8921 38470143 40820670 43439413 46141653 48964427 51293612 53486884 54995123 56480130
8913 56480130 58314358 60090683 60718081 59568929 57603672 56474262 56031153 55778312 55902590
8904 55902590 56122514 56391735 56204587 56139180 56472250 57194983 58234379 59315897 60632142
8895 60632142 62357570 64749411 67433800 70121809 73107164 76094415 79549731 83703732
8887 83703732 89012210 95282402 102232003 109352646 115349143 119767540 122403659 125042114
8879 125042114 128670085 132290377 134521273 133861707 130789889 128337014 126819376 124686850
8871 124686850 120340764 114775788 110029965 106201408 102880589 100124535 98285983 97457075
8863 97457075 97300648 97508043 98506956 100010806 102112636 104761744 108041974 111630636 115141046
8854 115141046 118446995 121079030 123437523 126321644 130192298 135311001 141874171 149941780
8846 149941780 157843185 164173245 166553157 165338628 162383451 158192084 151872377 144025949
8838 144025949 137271325 132300741 128463067 125152481 121616731 118232941 116142505 114938188
8830 114938188 113974150 113806262 114172485 114563804 115365734 116087329 116796629 117246134 118072764
8821 118072764 118778070 119003089 119453055 120016288 121253107 122869172 124917011 127502697 130539297
8812 130539297 134356443 138960381 144368554 150986375 158789960 167750783 177576455 187550911
8804 187550911 197217045 205007075 210012351 212905349 215547758 219138039 225355739 232972873
8796 232972873 238692719 240052111 235572495 224754192 209340676 193385024 180398929
8789 180398929 170793502 164160704 159818018 157220468 156128941 156085805 156364221 155968346 155920402
8780 155920402 156843177 158938521 162467161 167207519 173078771 179949822 187074931 194006474
8772 194006474 200142585 204594590 207833931 210490658 212946711 215855391 218577587 221311087
8764 221311087 224064310 225669985 224381284 220801109 216161765 211232742 206474331 202075581
8756 202075581 198002385 194154640 189754137 185570206 182307330 180407348 179613222 179385532
8748 179385532 178820506 178554793 178776541 179779459 180552460 180162718 179336029 178657561 177902512
8739 177902512 176759871 175552753 174587944 173075230 171632526 170100208 167916562 164815415
8731 164815415 162200686 161085879 161548174 162498237 165335213 171055914 175612681 175689305 175710390
8722 175710390 177891828 182930410 190972579 203847620 213943774 211712269 203481619 189485832
8714 189485832 176832009 169343453 165285742 162466947 160366754 157965711 153874242 147232877
8706 147232877 138963802 132146079 126813766 119901225 112773990 105785786 99485904 94348422
8698 94348422 90112760 86438665 83441791 80791700 78425773 76232138 73984490 71982693
8690 71982693 70056981 67940728 66170132 64708798 63494870 62469742 61104380 59683725
8682 59683725 58262395 56689481 55090089 53778830 52568256 51391159 50103485 48924133
8674 48924133 47848721 46676419 45729571 44831570 44015463 43825813 43225064 42899294 42627859
8665 42627859 42189198 41855598 41900839 41766031 41259644 40958193 41077533 41070722 41241909 41571645
8655 41571645 41660097 41740022 41648880 41066818 39994272 38645209 37313940 35748811 34500278
8646 34500278 33549055 32843111 32106398 31524810 31123447 30735697 30315288 29963003 29500244
8637 29500244 29013493 28277340 27910311 27442447 26935698 26601389 26172968 26017163 25902158
8628 25902158 25660718 25083652 24644306 24552959 24151452 23962799 23889314 23442378 23025296 22295310
8618 22295310 21497499 20878556 20205363 19924264 19452843 18953000 18557214 18243375 17793125
8609 17793125 17322281 16857329 16579404 16027538 15608830 15171439 14897788 14570295 14234614
8600 14234614 14139340 13970961 13723326 13343863 12933504 12544958 12403879 12247357 11859750 11744860
8590 11744860 11558784 11290674 11036030 10759042 10623040 10239552 9943120 9807712 10171179
8581 10171179 9761541 9432248 9262405 9073256 8813757 8569165 8324648 8341824 8083311 8121194
8571 8121194 7909680 7750648 7701527 7627452 7290051 7054405 7311775 7163358 7113247 6848433
8561 6848433 6779791 6985944 6844254 6544475 6486991 6353257 6065472 5986662 5946718 6043062
8551 6043062 5927549 5825049 5689045 5776952 5782243 5562785 5474083 5297802 5072898 5330597
8541 5330597 5445110 5143594 5139556 5096118 5000430 4805774 4807970 4603171 4424555 4354636 4348650
8530 4348650 4467454 4276657 4204530 4109631 4188285 4036729 3763059 3605867 3662628 3633422
8520 3633422 3602375 3446914 3393526 3549328 3334424 3335055 3222039 3258047 3392429 3600455 3709796
8509 3709796 3527246 3437297 3458684 3433228 3520785 3233864 3136563 3024513 3398605 3639492
8499 3639492 3549302 3338407 3187061 2927599 2896701 2776532 2578036 2659401 2726044 2675238
8489 2675238 2573446 2554373 2625234 2666380 2604951 2793962 2905740 2765740 2803651 2746177 2651263
8478 2651263 2608780 2615828 2542217 2612697 2442365 2384710 2466146 2565504 2593782 2672942 2533915
8467 2533915 2275020 2168140 2115049 2089647 2228428 2135375 1956637 2225596 2023039 1986474
8457 1986474 1927599 2059563 2088240 2062326 1989588 2044026 1836001 1860025 1881910 2128501 2128058
8446 2128058 1788318 2004444 2262714 2363233 2354871 2056442 2067774 2267168 2338963 2061835
8436 2061835 2036508 1980524 2001936 2138199 2179656 2198610 2142499 2220155 2202975 1953086 2133318
8425 2133318 2106152 1977980 1883591 1631958 1814995 1763108 1712619 1695030 1682740 1825395 1924002
8414 1924002 1807935 1823136 1818035 1757872 1827019 1795969 1796306 1875099 1853449 1747687 1813984 1783386
8402 1783386 1561109 1737492 1782077 1680738 1862693 1652361 1655539 1521522 1522503 1740065 1633940
8391 1633940 1532766 1691370 1653213 1510721 1630060 1528540 1578696 1602692 1477289 1473268
8381 1473268 1632556 1554033 1480940 1504760 1609744 1742091 1803699 1596291 1583190 1584013 1562084
8370 1562084 1504919 1519737 1464818 1267354 1107337 1027040 1044578 987742 1095916 1141859 1026971
8359 1026971 1156898 1214736 1068793 1141105 1146679 979185 1055882 1316464 1307326 1179231 1233454
8348 1233454 1130200 998514 971297 1068138 1011356 1195391 1265031 1214917 1310441 1368303 1366450
8337 1366450 1345838 1315051 1259732 1291010 1344883 1253190 1174345 943997 832047 851105 1056207
8326 1056207 1013400 1039194 1005248 877839 775094 784829 850635 628532 645192 705176 621347
8315 621347 781121 627504 502682 623324 620211 931934 897809 697025 774703 1007410
8305 1007410 1015390 1071969 956232 965401 1009572 1006867 848141 839791 1000600 1077899 1063861 988676
8293 988676 1214567 1141383 970173 826940 914233 853218 761842 1039801 802907 693608
8283 693608 819167 795781 771827 681874 697042 531004 684612 836595 681676 518692
8273 518692 454645 497371 485589 505280 236477 366879 527555 694941 679287 690635 769667
8262 769667 819089 720730 706737 524402 623622 612014 603004 834297 673681 686220 773468
8251 773468 806778 719793 830348 833190 813187 968009 959078 939574 972504 806251 800166 970237
8239 970237 955333 886561 842790 1046120 885429 816375 822811 784399 776619 771572 745877 608717
8227 608717 687893 597993 566310 560855 528932 655991 592973 477984 384909 394340 633380
8216 633380 556771 610351 483150 451939 417272 372763 130748 257779 338409 251388 327184
8205 327184 521183 576205 475711 296596 180565 499798 371089 230918 236877 197935
8195 197935 277364 280251 509732 1642085 1340876 702697 480106 338362 620825 599449
8185 599449 598948 725412 557246 417262 453730 382283 299912 226523 265970 377614 506108
8174 506108 360493 411127 449719 379058 516541 587603 559466 623034 451838 422624 606767
8163 606767 432772 135482 168340 427234 475382 320557 416955 526587 276728 358132
8153 358132 286048 225034 377894 406388 483607 343917 474054 339867 450991 522946 433781
8142 433781 336870 217192 264409 362310 505705 592540 493261 252628 418510 556307 297959
8131 297959 316574 417542 311849 387031 467811 604047 413474 248056 248379 328746 621727
8120 621727 398547 309172 334010 521431 459127 461805 489757 503735 494749 448390 442152 483152
8108 483152 575254 602916 513481 438530 476866 553378 516515 719691 677892 475165 325392
8097 325392 237496 453754 270849 467339 343439 326940 422457 407084 484781 554078 286646
8086 286646 316882 488849 417159 389137 201406 283587 314298 256041 469361 457301 405495
8075 405495 428671 531979 490552 582034 697056 463035 245853 350827 308288 366645 477490
8064 477490 293006 364954 296114 280701 420759 378288 519115 553833 410982 422114 495865
8053 495865 546293 576310 491914 498155 536215 478455 383206 493322 551845 571368 471089
8042 471089 475797 574174 417315 507002 589403 572074 472813 472324 465809 581475 581477 721153 704068
8029 704068 699870 475477 425322 418752 398969 699715 656392 606426 635093 578487 549836 514852
8017 514852 610025 712504 739275 564767 697119 779911 619601 614311 561755 806247 838621
8006 838621 624378 589833 860961 899464 947150 724838 758105 810560 1078318 1040078 963092
7995 963092 745569 747743 832984 805425 962640 1007168 963107 765211 830120 1038878 1085673
7984 1085673 1063882 958818 1151418 1415635 1237818 1357383 1430376 1410256 1430133 1344677
7974 1344677 1400986 1663122 1560140 1664791 1714463 1952313 1950635 1952553 2037618 1931319 2028532
7963 2028532 2182037 2324009 2409329 2404167 2517726 2642791 2697435 2736258 2916904 3140897
7953 3140897 3279314 3314882 3576634 3880469 4087523 3948842 3940980 4052960 4248105 4618886
7943 4618886 5081211 5389402 5471074 5920077 6212990 6453106 6700158 6799042 6862732 7099534
7933 7099534 7413044 7657578 7704858 7692121 7143037 6718178 6102765 5590078 5336425 5085967
7923 5085967 4877458 4528742 4370945 4169613 3696086 3342965 3258973 2954278 2900345 2744078
7913 2744078 2609712 2671934 2708567 2800369 2732959 2680172 2816215 2678329 2573444 2612321 2790350
7902 2790350 2682498 3089439 3174231 2940308 3066307 3086787 3314899 3415691 3642789 3701976
7892 3701976 3614453 3495557 3601510 3783984 4016056 4277269 4177377 4277306 4645485 4802741
7882 4802741 5133113 5266973 5548441 5684573 5954624 6366833 6843725 7285117 7206860 7191531
7872 7191531 7324661 7584356 7752421 7944942 7964742 7822462 7445539 6810477 6295798 5961259
7862 5961259 5562737 5230954 4828989 4440357 4042910 3852829 3376386 3055166 2925678 2704700
7852 2704700 2540022 2481159 2613931 2573162 2416543 2157570 2019998 2035267 2038381 1881652
7842 1881652 1785471 1745051 1833850 1596988 1528054 1502547 1504833 1489755 1407675 1360629 1299085
7831 1299085 1248485 1153944 1074483 1110978 1067804 1127632 1152801 1224570 1148253 1007296 1116319
7820 1116319 1147766 1179108 958335 994068 1008384 893516 991380 966852 1010077 849512 884393
7809 884393 1045790 1043136 873031 902066 929332 708161 637122 600894 1040463 1301530 1310103
7798 1310103 1315072 1142976 894479 1108377 1278220 1144579 967544 851398 956318 1100256
7788 1100256 1135882 1190889 1064198 1002211 1240356 1298343 1219803 1104192 1214235 1217414 973587
7777 973587 934134 1011205 967182 977478 1014220 895313 957005 963749 1078706 797971 816227
7766 816227 997955 1128374 1292551 1274701 1219515 1241734 1331383 1226795 1329785 1162824
7756 1162824 1255466 1426406 1409738 1382807 1414628 1473866 1480851 1292653 1269710 1422304 1583095
7745 1583095 1690656 1820351 1904919 1974424 1908271 2171080 2550310 2446995 2559748 2545397
7735 2545397 2630161 2811279 2893847 3298539 3387749 3434518 3594002 3565454 3464371 3350559
7725 3350559 3130538 2900778 2838726 2844205 2786219 2616471 2527295 2382925 2290163 2103690 2029765
7714 2029765 2018705 1963032 2016509 2088636 1963657 1786508 1736274 1661055 1470311 1639693 1695916
7703 1695916 1828195 1762342 1768810 1712475 1583858 1549266 1645511 1813261 1820008 1904325 1787817
7692 1787817 1621466 1504381 1786671 1873298 1753879 1789459 1994266 2012343 2084101 2018944
7682 2018944 1956053 1916549 1929288 2127103 2329432 2475125 2775787 2839733 3009444 3253435
7672 3253435 3474808 3559148 3811656 3979527 4017713 4125490 4247609 4208438 3924064 3751499
7662 3751499 3440276 3354699 3102895 2824179 2686694 2681989 2418785 2210958 2151627 2208667
7652 2208667 1899745 1733501 1724338 1675668 1796672 1701933 1500211 1473531 1488056 1535737 1654346
7641 1654346 1558163 1393165 1463985 1672741 1625198 1562296 1649818 1500562 1474070 1477611 1242892
7630 1242892 1202503 1253786 1273281 1463992 1386123 1240411 1381497 1260529 1250961 1302883 1337945
7619 1337945 1334121 990988 792920 956573 872358 1087812 1023401 811610 830576 743610 837713
7608 837713 848887 869993 756270 804210 691734 647201 915124 912644 746328 545766 575553
7597 575553 762325 778909 978877 860728 764189 764684 777733 791171 610397 674025 892370
7586 892370 953724 607369 532358 574138 656833 810761 760525 685492 609612 464852 473458
7575 473458 529582 539787 517171 519471 411034 506796 528744 669800 650183 409520 431970
7564 431970 527946 658050 738158 660729 666982 411896 442240 520705 434153 663607 496117
7553 496117 488180 458116 527916 597950 747106 549665 435974 615430 597529 697531 692409
7542 692409 673900 639984 788743 785911 729832 745503 624391 677409 601334 522178 633659
7531 633659 587321 594116 739785 687380 549808 689297 712067 610409 445701 393441 510536
7520 510536 552293 724854 585958 546933 457887 423883 508936 442442 384526 265178 288779
7509 288779 234365 178041 243148 419752 320691 282945 491697 616376 635716 397319 565551
7498 565551 706844 548484 710348 746257 751980 891035 702220 666114 758572 682753 556605
7487 556605 657006 650340 700890 727036 546894 573481 715744 797567 789000 803716 949959
7476 949959 733123 601229 821780 697809 618663 684457 751628 778148 782425 895192 1192044
7465 1192044 1149996 1202339 1081815 1142397 1019889 1045446 1121640 1346659 1559919 1647037 1504308
7454 1504308 1412575 1551214 1386265 1304556 1196517 1154839 1287721 1247164 1338527 1325115 1190006
7443 1190006 1284780 1228269 1156628 1331757 1140744 1015091 1028271 923582 1075337 1073734 1101675
7432 1101675 1088173 1146524 1207453 1330105 1207153 1151789 1190820 1399005 1124237 1298272
7422 1298272 1569190 1555131 1436392 1558868 1472784 1320658 1139813 1239038 1344611 1470050
7412 1470050 1556190 1475337 1444442 1477956 1121240 1149495 1478747 1316620 1437348 1448511 1485656
7401 1485656 1483162 1743097 1853474 1912313 1866800 1785947 1816896 1925899 1906444 1881901 1868990
7390 1868990 1713034 1645772 1827525 1953215 1717983 1534262 1461801 1449693 1474989 1638174
7380 1638174 1659603 1460286 1541896 1496562 1665664 1762778 1744410 1719514 1728209 1859844 1801010
7369 1801010 1686069 1729996 1955176 2057642 2001051 2111193 2115272 1929854 1894260 1978728 2291924
7358 2291924 2359977 2374189 2462370 2394296 2589249 2613564 2638272 2623373 2649117 2609548 2558054
7347 2558054 2753203 2843246 2694760 2718791 2949590 2964233 3168605 3543142 3674590 3742646
7337 3742646 3737975 3807845 3850747 4033122 3963697 4028805 3954580 3798755 3842039 3809772 3902466
7326 3902466 3844439 3948186 4100118 4236482 4471698 4619646 4495320 4554234 4911650 4870349
7316 4870349 5127532 5280011 5335468 5706582 5767668 5978015 6365925 6791095 7289135 7830681
7306 7830681 8164315 8515763 8914178 9492694 10320231 10941933 11507011 11664824 11936181 12364931
7296 12364931 12551093 12859869 13513633 14444878 15196649 15823163 16447434 17310826 18095262
7287 18095262 18641805 19352775 20301323 21520110 22366134 22222831 21513369 20157008 18107264
7278 18107264 16286659 15071475 13881292 12848799 12311093 11779509 11368635 11053492 10700749
7269 10700749 10548702 10184661 10069059 10169905 10027769 9912888 9971325 9746446 9282251 8777629
7259 8777629 8220592 7992603 7772405 7438394 7282683 7134922 7211088 7340051 7394898 7094745
7249 7094745 7407513 7112899 6740094 6630935 6346153 5818519 5222869 4990393 4529404 4531629
7239 4531629 4532305 4378618 4204451 3934204 3687988 3482623 3524759 3807632 3823588 3944138
7229 3944138 3959678 3914448 3679722 3573884 3429932 3199609 3129971 3260282 3174893 3058554
7219 3058554 3073944 2749800 2733550 2731844 2647853 2793627 2747839 2728659 2696385 2650666 2771557
7208 2771557 2596165 2730897 2586814 2468393 2397258 2509892 2562571 2343744 2358687 2346658
7198 2346658 2249947 2461204 2335602 2353438 2313056 2138179 2211813 2101352 2228698 2328891
7188 2328891 2317671 2125031 2422483 2569820 2494793 2445971 2340777 2415506 2452976 2515151 2399166
7177 2399166 2382156 2574841 2587378 2443727 2515305 2397575 2339091 2365324 2517297 2676321
7167 2676321 2542451 2496661 2362693 2433220 2410054 2520606 2432845 2361013 2467218 2642466
7157 2642466 2434709 2558367 2548836 2589949 2654521 2580843 2597265 2476035 2483860 2670605 2872315
7146 2872315 2815757 2762851 2947485 2988469 2892771 3171788 3270868 3050685 2973957 3117464 3221234
7135 3221234 3602958 3763440 3823266 3903476 3915459 3930110 4029192 4323781 4282064 4257747 4409332
7124 4409332 4660904 4789992 5015574 5051708 5110441 5077219 5265110 5299580 5418285 5721577
7114 5721577 5933634 6192157 6111235 6312426 6431945 6651590 6734113 6865184 7181220 7154253
7104 7154253 7149195 7165279 7257640 7370448 7383861 7603612 7819372 7901292 8005345 8094194 8273007
7093 8273007 8441667 8684501 8892434 9099886 9311379 9367954 9777409 9939325 10127471 10495103
7083 10495103 10620393 10742569 11080318 11379704 11806373 12026528 12334641 12826699 13317641
7074 13317641 14006693 14912757 15312333 16074038 17057910 18109328 19328720 20197450 21772676
7065 21772676 23499660 25568251 27980988 30541283 33602661 37183682 41123686 45792417
7057 45792417 51377181 57413716 63577709 70726218 78648354 86404106 94018964 100682303
7049 100682303 106561594 111217530 113564201 113056596 109939295 105254237 99257814 91517661
7041 91517661 82685585 73422646 64496523 56604732 49791334 43898547 38972581 35055698
7033 35055698 32203503 29601474 27302896 25815857 24330000 23000739 21543920 20456859
7025 20456859 19710822 18982992 18187241 17475907 17141232 16592463 16056212 15871839 15435908
7016 15435908 15048829 15138283 14655276 14306363 14233951 14020243 13703023 13598366 13434768 13246459
7006 13246459 13152961 12859514 12790050 12745739 12591735 12552668 12341694 12499597 12643399 12817713
6996 12817713 13307447 13646346 13990926 14582986 15247601 15765552 16515218 17118098 17698776
6987 17698776 18781044 19777735 20617386 21286418 22045537 22390848 22606054 22850248 22250744
6978 22250744 21694273 21118403 20494312 19713525 18966962 18251781 17972683 17793098 17627124
6969 17627124 17568734 17566845 17627087 17350082 16921437 16637291 15903530 14949155 14173244 13325736
6959 13325736 12553069 11890967 11551845 11108081 10686459 10496557 10266560 10047292 9875335
6950 9875335 9771455 9739614 9789939 9861550 9972682 10134856 10297872 10587402 10946665 11045386
6940 11045386 11454734 11860069 12132174 12354995 12162400 11742821 11087210 10531439 9942827
6931 9942827 9485615 9243612 9078238 8950354 8603507 8646837 8395501 8156344 8035274 7919929
6921 7919929 7845423 7744482 7715577 7542466 7438962 7402838 7555290 7778147 7583568 7556757
6911 7556757 7758046 7854300 8029183 8245080 8226644 8523302 8718610 8820187 8759492 8936253
6901 8936253 8894222 8876532 8740244 8578209 8540892 8505796 8699226 8869051 9139767 9547034
6891 9547034 9886983 10326986 11252895 11923830 12656585 13465437 14438837 15507921 16727418
6882 16727418 17908417 18843575 19683456 20437597 20931580 21007057 20554854 20196683 19149737
6873 19149737 18024656 16842512 15589809 14373809 13217588 12296845 11330889 10524530 9766214
6864 9766214 9185438 8447577 7989617 7838709 7404941 7185318 6856997 6935845 6592783 6028010
6854 6028010 6050271 5889751 5872176 5917090 5847079 5835834 5458590 5329776 5321634 5465946 5451497
6843 5451497 5281815 5076814 5219181 5428762 5488251 5556006 5727406 5930141 6038005 6325010
6833 6325010 6730763 6843519 6669120 6372037 6083084 5931043 5921653 5785614 5652173 5654016
6823 5654016 5597734 5749896 5808568 5962087 6106244 6041130 6362963 6543145 6708610 6933837
6813 6933837 7171898 7456820 7741412 8212458 8679925 9054821 9258313 9188578 8298314 7636132
6803 7636132 7121370 6664350 6412952 6307110 6291785 6491731 6471747 6315330 6523354 6451962
6793 6451962 6614931 6590956 6407470 6442872 6455639 6498569 6465514 6815265 7021971 7206678
6783 7206678 7260964 7383820 7203569 7142133 6903345 6896279 6792094 6527246 6614505 6747846
6773 6747846 6755729 6917971 7109888 7143750 7249619 7264171 7274667 6830947 6493877 6176142
6763 6176142 6043674 5932919 5848725 5916924 5998810 5972462 6034366 6163089 6062602 6203471
6753 6203471 6390894 6505734 6626610 7010834 7453542 7811422 8252089 8643917 9023765 8935607
6743 8935607 8347664 7905704 7391365 6814067 6337289 5989918 6165199 6199511 6005080 5945480
6733 5945480 5890795 6088787 6159329 6011689 5896703 5919844 5962056 6082653 6146637 6215413 6229356
6722 6229356 6347861 6413939 6415509 6334227 6085371 5752325 5537579 5265205 5131961 5084245
6712 5084245 4930667 4837907 4774509 4695117 4729787 4548269 4595602 4513830 4530717 4603206 4401555
6701 4401555 4180983 4181952 4242377 3973513 3683818 3592345 3795368 3715884 3809904 3758375 3621501
6690 3621501 3505360 3498300 3427695 3786690 3744921 3467881 3505757 3478580 3483292 3461190 3485474
6679 3485474 3604045 3435360 3580838 3652554 3448958 3368050 3269081 3417345 3376385 3199221
6669 3199221 3452512 3457380 3224186 3232154 3169091 3231719 3313149 3290201 3173116 3121720 3373836
6658 3373836 3373436 3322019 3407741 3403735 3372264 3163891 3228053 3352324 3407570 3274015 3163006
6647 3163006 3458755 3488686 3579711 3420949 3269533 3168044 3228283 3410594 3464668 3296617
6637 3296617 2988905 3147999 3297808 3419831 3350094 3228149 3356995 3320520 3117520 2946528
6627 2946528 2919980 2858336 2688999 2420858 2509076 2516520 2480297 2516864 2696705 2655599 2432415
6616 2432415 2387159 2448654 2322958 2218861 2283943 2470862 2581923 2537016 2600541 2406748
6606 2406748 2265138 2135954 2124148 2167002 2414984 2351885 2427695 2399633 2341519 2269513 2211333
6595 2211333 2250302 2227324 2370465 2206369 2111364 2242185 2424630 2235522 2019486 2123150
6585 2123150 2117325 2192644 2213030 2431527 2340147 2158896 2197156 2314672 2384767 2276223 2306493
6574 2306493 2305679 2187940 2136013 2021570 2021544 2192401 2176515 2235748 2050872 1972258 1979495 1949503
6562 1949503 1988879 2164214 1960990 1780933 1691184 1870706 2144629 2282864 2292266 2106597
6552 2106597 2088802 2148861 2233609 2133190 1892188 1856487 1954340 2006222 1888799 1934122 2059779
6541 2059779 1874020 1772303 1799796 1873883 2079951 2114877 1873487 1945244 1992870 2090379 1773332
6530 1773332 1640627 1728600 1820335 1858581 1966373 2068108 1813647 1611081 1794333 1872059
6520 1872059 2050161 1877972 1738630 1697701 1496303 1497921 1636741 1810690 1743732 1762797
6510 1762797 1715286 1574112 1604409 1623388 1866234 1739185 1810972 1596057 1514645 1484123 1586530
6499 1586530 1694970 1642297 1596040 1717559 1757751 1801400 1665819 1578031 1665710 1707093 1820703
6488 1820703 1826088 1838329 1793912 1818738 1807275 1702027 1632818 1761873 1673349 1622593 1581683
6477 1581683 1741890 1743489 1817281 2011941 1830582 1495529 1514241 1568073 1645944 1544816 1531192
6466 1531192 1613664 1666135 1549416 1549896 1522869 1450335 1444221 1535911 1414034 1439354 1424336 1463405
6454 1463405 1548888 1643416 1383242 1429282 1483153 1662343 1542914 1529412 1522839 1586708 1569415
6443 1569415 1616944 1534758 1434013 1285810 1414060 1316594 1350211 1483392 1203863 1293641
6433 1293641 1374396 1303679 1322865 1250622 1349976 1487099 1400794 1298232 1357742 1449039 1263960
6422 1263960 1246491 1488632 1566414 1475786 1507447 1404757 1409046 1559446 1653127 1642308 1455336
6411 1455336 1392990 1635404 1737015 1700184 1654992 1594750 1446247 1492616 1419792 1368232 1395136
6400 1395136 1538735 1428917 1527909 1378916 1371343 1459654 1558834 1544864 1429012 1490415 1651582
6389 1651582 1644552 1648287 1612385 1639055 1688321 1678833 1550985 1624357 1688876 1703783 1514456 1587078
6377 1587078 1621415 1597064 1605191 1655938 1710693 1571455 1633931 1671270 1567075 1713797 1639829
6366 1639829 1541036 1627190 1615888 1698314 1731404 1598655 1715999 1612445 1470919 1526908 1637876
6355 1637876 1498337 1455291 1411829 1345835 1517073 1407757 1471160 1591213 1516834 1551597 1650058
6344 1650058 1404900 1407121 1775689 1830293 1798546 1747536 1840597 1952203 1806784 1951834 1604221
6333 1604221 1639187 1774513 1912329 1897987 1827921 1667705 1647969 1826617 1716680 1711750 1716932
6322 1716932 1433116 1362350 1613869 1465118 1407095 1523276 1609528 1841063 1794229 1709858
6312 1709858 1709455 1678581 1684280 1774498 1820215 1668466 1830774 1758900 1760539 1797737 1895581 1766432
6300 1766432 1676726 2047484 2010116 2050318 2025819 1746550 1723979 1700908 1705935 1732581 1746032
6289 1746032 1573480 1423522 1543092 1728954 1693847 1592609 1537556 1518704 1638870 1826102
6279 1826102 1810287 1806594 1662101 1608079 1811874 1975030 1777842 1551282 1874409 1926144
6269 1926144 1867639 1799725 1927424 1893083 1750298 1701809 1721305 1868501 1734861 1766095 1868514
6258 1868514 1778207 1751622 1592503 1629476 1784323 1931427 1834838 1771319 1662557 1762810
6248 1762810 1759932 1771654 1747134 1782933 1873633 2005859 1759986 1654257 1709231 1738997 1852712
6237 1852712 1807224 1755862 1707251 1735367 1712850 1929040 2042786 1943527 1988714 2032878 2062459
6226 2062459 2093012 2256187 2269267 2126525 2112324 2089596 1995241 1872907 2030477 2121141 2081689
6215 2081689 2319596 2486981 2252898 2228841 2069630 1990318 2188427 2299810 2279330 2207573
6205 2207573 2231654 2212302 2125275 2154641 2036373 2078635 2204719 2372217 2202336 1997323
6195 1997323 2185593 2300641 2238173 2193361 2105857 2297974 2152417 2110698 2278177 2078274
6185 2078274 1965873 2029443 2070614 2195749 2308130 2398562 2368609 2268437 2206128 2344836
6175 2344836 2305095 2281287 2318760 2217971 2405932 2356971 2417717 2442516 2495562 2436514 2360542
6164 2360542 2434411 2513784 2377247 2308882 2201872 2236507 2436306 2454051 2483851 2560837 2508154
6153 2508154 2510729 2418799 2155801 2388187 2397855 2384490 2540467 2370058 2327297 2404101 2499257
6142 2499257 2595987 2696658 2590302 2557902 2588140 2613422 2668475 2565778 2509200 2404632 2444344
6131 2444344 2665079 2720841 2642514 2759086 2700451 2641815 2635105 2544156 2634113 2583082 2379407
6120 2379407 2355020 2606528 2768657 2830745 2931991 3050265 2976899 2842244 2830832 2968933
6110 2968933 2996419 2870644 3071933 3010649 3157538 3250937 3249587 3161008 3131850 3024626 3034867
6099 3034867 3157761 3227730 3251557 3210865 3087122 3196136 3221919 3308413 3310436 3099057 2899457
6088 2899457 2914600 3000328 3109816 3131019 3005349 3060874 3119938 3267965 3278035 3397329 3234910
6077 3234910 3098464 3188842 3236300 3267074 3250682 3046949 3200999 3152719 3279821 3160860
6067 3160860 3240591 3498087 3342686 3163055 3224041 3293237 3379377 3439468 3369500 3599823 3566974
6056 3566974 3488308 3498670 3666155 3733184 3724702 3710849 3743471 3800129 3764108 3841452 3949923
6045 3949923 3889600 4090929 4213629 4193826 4192962 4352857 4538484 4647754 4564912 4469830 4683816
6034 4683816 4846555 5059044 5247124 5377057 5382393 5499090 5657922 5735854 5585559 5769446
6024 5769446 5943019 6078529 6043548 6154114 6152861 6276517 6471772 6558543 6533905 6700061
6014 6700061 6895781 6912417 7038349 7301869 7388810 7645575 7595915 7682707 7929748 8193240
6004 8193240 8456853 8367298 8435761 8688141 8856245 8851693 8970334 9018020 9270250 9507140
5994 9507140 9576036 9621185 9792657 9925527 10239456 10434877 10435835 10628730 10813762 11035610
5984 11035610 11255104 11479980 11912514 12021308 12380369 12563552 12925732 13305712 13494665
5975 13494665 13552045 13826823 14070768 14396071 14643057 14768677 15064016 15199518 15276758 15186268
5965 15186268 15268299 15298280 15432927 15561408 15634887 15852019 15905485 16108578 16344429 16462879
5955 16462879 16392337 16381575 16405662 16467825 16448276 16490811 16297065 15984546 15688310 15502643
5945 15502643 15203104 14863789 14567100 14296767 13977073 13872552 13910494 13553776 13196928 12941068
5935 12941068 12889035 12718478 12510824 12020975 11880229 11613641 11418229 11294057 10785292 10494578
5925 10494578 10274789 10116411 9784852 9456536 9214114 8903078 8676293 8568163 8480453 8312057
5915 8312057 8007598 8037950 8219164 8092713 7976698 7847754 7753104 7625279 7520118 7467716
5905 7467716 7621694 7644414 7696340 7687046 7778596 7739787 7620741 7604142 7554152 7677625 7715718
5894 7715718 7542691 7592106 7774733 7602156 7807798 7913691 7917366 7792082 7871796 7991999
5884 7991999 8115546 8054873 7956588 8058050 8286830 8434012 8303072 8327090 8349220 8461059
5874 8461059 8613603 8649546 8499770 8358581 8279948 8375258 8351067 8347485 8311305 8395493 8223897
5863 8223897 8190070 8332405 8314187 8114807 7958913 8152405 8249377 8185526 8273437 8507601
5853 8507601 8219818 8235382 8307426 8219902 8472505 8634544 8534941 8368938 8371144 8392077 8635455
5842 8635455 8717785 8596335 8638157 8552217 8657892 8763560 8734929 8923344 8960024 8945091 8953410
5831 8953410 9239174 9188279 9286646 9599930 9677577 9616862 9867484 10206494 10154898 10072173 10423907
5820 10423907 10499636 10728556 11160542 11415539 11763948 11934429 12375003 12701930 13136192 13638116
5810 13638116 14412658 15351911 16333041 17048153 17992772 19398245 21318537 23323885 25668492
5801 25668492 28388797 30814796 32690934 32864010 30559963 26936406 23696244 21455802
5793 21455802 19716686 18210552 17359879 16612044 16077041 15935220 15381960 15003538 15017132
5784 15017132 14872895 14946127 14891587 14657835 14384086 14203065 14130282 14136695 14187148 14208955 14540530
5773 14540530 14744651 15076001 15197461 14785828 14594409 14309235 13954754 13730852 13398316
5764 13398316 13334432 13124525 12742969 12763611 12753625 12718178 12702984 12785293 12866675 12945726 12994798
5753 12994798 13000195 12981306 13302928 13028395 13189548 13475412 13334954 13478518 13758380 13914949
5743 13914949 14219800 14405826 14610437 14891416 15009976 15328739 15373309 15667738 15896951 16052313
5733 16052313 16437528 16626664 16893838 17239214 17413972 17766269 17993047 18178949 18534203
5724 18534203 19052020 19304959 19563264 19839862 20451213 21144089 21633869 21723438 21918957 22390192
5714 22390192 22825830 23301874 23703102 24018466 24353625 24717683 25384962 25642778 25870354
5705 25870354 25872522 26303240 26527291 26450990 26582233 26836290 27235992 27411874 27579600 27871133
5695 27871133 28036875 28189326 28591367 28830917 28884507 28893552 29119229 29138928 29246383 28939358
5685 28939358 28941579 28914187 28877367 28499618 28217822 28062878 27690489 27547916 27100481 26905047
5675 26905047 26789987 26487176 26485278 26414364 26280434 26119443 26148528 26113620 25952912 26144597
5665 26144597 26007730 25787082 25751458 25727781 25762075 25706118 25744899 25552234 25391189 25307086
5655 25307086 25262473 24960067 24798663 24603607 24668349 24603956 24452249 24468813 24480767 24684515
5645 24684515 24894033 25075991 25370691 25399625 25400780 25560479 25816226 26047775 26234169 26627498
5635 26627498 26603393 26865089 27012851 27447500 27932674 28005198 28275591 28846794 28955073 29148290
5625 29148290 29467848 29936927 30237730 30546489 30917252 31301459 31836665 32778552 33377382
5616 33377382 34001902 34925479 35666524 37026259 38326348 39729353 41558357 43365473 45401721
5607 45401721 47385336 49280721 51128171 52412520 53553307 53964900 53839026 53338150 52891223
5598 52891223 52813198 52747349 53212201 53831080 54664551 55703003 56695145 58224527 59678177
5589 59678177 60710464 61162452 60948259 60113189 58990379 57634623 56096530 55099075 54450297
5580 54450297 53729792 52930004 52173355 51741019 51227323 50995684 50973695 50885931 50451233 50234132
5570 50234132 50067289 49980264 50125544 49964031 49844934 49786414 49919886 49935254 50122967 50274653
5560 50274653 50692457 51180524 51601071 52192056 52981915 53920573 54835268 56072022 57608903
5551 57608903 59190728 61159271 63659580 66486559 69855184 73752143 78486994 83527103
5543 83527103 87209318 87758921 84969209 80871273 77917172 76459977 76537601 77454537 78909874
5534 78909874 80627619 82279584 83489770 83500681 82580893 80861296 78787243 77008227 76057039
5525 76057039 75385929 75229441 75480693 75989543 76720881 77982256 79431213 81013236 81800566
5516 81800566 81395878 79753289 76876672 73022898 68888944 65314145 62239352 59465559
5508 59465559 56418801 53861562 51517378 49752833 48086052 46537945 45214350 43875671
5500 43875671 42801981 41572552 40642183 39781916 39072061 38567801 38116511 37679106 37334690
5491 37334690 37264082 36940204 36596227 36435170 36310397 36524278 36838118 37038372 37418857 37875095
5481 37875095 38642397 39264607 39898194 40568902 41442550 42227093 42848573 43552116 44198818
5472 44198818 44787021 44925662 44930872 44502335 43961691 43211840 42413638 41607076 40921549 40547011
5462 40547011 40054922 39853312 39624593 39416233 39354617 39409697 39625136 39669408 39761053 40237423
5452 40237423 40681700 40866844 41396396 41761290 42232820 42647934 42678760 42936229 43006974 42837327
5442 42837327 42648238 42465810 42149043 41637272 41224792 40789574 40113737 39537085 39261637
5433 39261637 38903787 38811260 38523123 38406356 38278402 37936035 37995864 37918610 37873364 37800005
5423 37800005 37760043 38035767 38253555 38331519 38760401 39269201 39794042 40536103 41298571 41988591
5413 41988591 42771665 43162539 43473692 44183098 45017440 45855659 46336286 47261338 48284541
5404 48284541 49517591 50623402 50906499 51139390 51596580 51871659 51569409 50887402 50311964
5395 50311964 49704645 49450332 49788747 50319758 50720092 51001588 51368741 51602116 52138933
5386 52138933 52620410 53130541 53788700 54595670 55453809 56230818 56755395 57360965 57597781
5377 57597781 57747307 57807103 57603991 56926633 56347916 55883323 55455339 55322158 55080307 55364221
5367 55364221 55988814 56486596 56937352 57566968 58317926 59424520 60588620 61893699 63422567
5358 63422567 65301433 67303026 69633150 72197470 75070341 78401616 81237212 82527283
5350 82527283 81047125 76972448 71812598 67173766 63399774 60496440 58428263 56986063
5342 56986063 55744942 54837215 54196961 53943086 53811060 53732568 53965654 54532841 55273794
5333 55273794 56375392 57598492 58847435 60499384 62385640 64859741 67460293 70835512
5325 70835512 74473556 78125348 80304618 79872814 76765478 71794967 66468077 61890065
5317 61890065 58611720 56142867 53940323 52419627 51206618 50366370 50029325 49519858 49481629
5308 49481629 49013454 48530086 47957552 47012219 46004307 45496758 44960895 44573194 44255410
5299 44255410 44039378 43802367 43485231 43476271 43660410 44139026 44487185 44602579 44886816 44993219
5289 44993219 45100820 45157079 45444639 46133471 47186410 48961359 50613926 52214792 54116470
5280 54116470 55222443 54994338 53156234 50130130 46938980 43888685 41117008 39006629
5272 39006629 37464556 36206814 35546922 34790468 34647676 34500114 34286688 33996329 34115752
5263 34115752 34172754 34153644 33928757 34067259 34412233 35269632 36156085 37407118 39148513
5254 39148513 40733139 42867061 45002014 46070025 45565414 43434794 40098764 36759575
5246 36759575 34150585 32359491 30536848 29141182 28175858 27343704 26592908 26014780 25498835
5237 25498835 25033788 24639485 24305894 24174477 24315415 24352555 24347946 24557523 24686593 25187583
5227 25187583 25482876 25324360 24897970 24156612 23510642 23062141 22648400 22361919 22434847 22620633
5217 22620633 22826599 22949933 23332119 23503452 24008566 24172256 24207424 23994439 23646800 23486338
5207 23486338 23282284 23219419 23495021 23548607 23511970 23663615 23849388 23981961 24100185 24360082
5197 24360082 24769919 24965904 25200333 25699932 26218189 26424340 26662881 26804044 26894126 27042425
5187 27042425 27157592 27036554 27048803 26911611 26798140 26752958 26462164 26184145 25876036 25525154
5177 25525154 25232334 24775254 24143540 23832392 23555160 23385582 22917191 22309928 21689035
5168 21689035 21226453 20646347 20216774 19767379 19447998 18979661 18444009 18030692 17854678
5159 17854678 17319688 16750724 16363196 15931787 15669692 15316313 15161505 15241806 14918387 14757341
5149 14757341 14504481 14433120 14512355 14515709 14490023 14313477 14296911 14303882 14478835 14641101 14468730
5138 14468730 14131818 13923058 13820898 13684125 13522660 13563778 13408398 13210323 13111925 13136586
5128 13136586 13019190 12961850 12783013 12605738 12525210 12452459 12489825 12421879 12513263 12323151
5118 12323151 12305725 12412705 12419498 12484624 12622874 12640356 12767770 12797904 13033865 12962869 12919453
5107 12919453 12921657 12771287 12645814 12440958 12316761 12299519 12379406 12315285 12392688 12560714
5097 12560714 12494209 12447035 12724118 12845091 12965632 13289927 13493060 13584417 13732313 14312557
5087 14312557 14861454 15338645 15890178 16435333 17091367 17632244 18280322 18643480 19174041
5078 19174041 19561524 19976006 20606003 21047487 21677464 22297303 22617602 22957327 22994530 23027424
5068 23027424 22844332 22775427 22549744 22501662 22352248 22146844 22018498 22010135 22031331 22098138
5058 22098138 22092919 22380847 22394889 22332697 22267636 22265387 22336560 22399350 22252148 21915344 21578387
5047 21578387 21115529 20469957 19719862 18869124 18010334 17229014 16503467 15891671 15322663
5038 15322663 15036706 14627335 14469289 14158426 13632641 13197270 13263814 13033402 12873129 12866019
5028 12866019 12610277 12491038 12478674 12193684 12005216 12018416 12012393 11879716 11931731 11991502
5018 11991502 11821221 11648587 11656370 11834881 11763853 11764445 11857942 11897731 12027167 11932626 12051607
5007 12051607 11999409 12121165 12135240 12016851 12269714 12203630 12198608 12467181 12432068 12138878
4997 12138878 11811576 11841744 11762685 11850465 11916175 12001432 12325756 12539971 12458778 12524500 12523448
4986 12523448 12661282 12858697 13040117 13252468 13313334 13379817 13648317 13858560 13920032 13950863
4976 13950863 14176957 14679517 14931168 15252785 15918550 16379555 16719396 16953024 16972053 17248373
4966 17248373 17715892 18196367 18553761 19166983 19936096 20754674 21344083 21889101 22435837
4957 22435837 22989255 23415535 23606749 23968490 24613420 25318711 26056042 26425673 26937516
4948 26937516 27611009 28406093 29041273 29695166 30439674 30912326 31281894 31921111 32450504
4939 32450504 32667481 32916385 33007224 32833658 32607099 32699041 32697813 32635075 33054489 33443332
4929 33443332 33674264 33903031 34142667 34264749 33837233 33453738 33043683 32516691 32200134
4920 32200134 31483714 30814066 30290964 29810638 29109577 28534462 27906835 27162135 26681633
4911 26681633 26492600 26091039 25916991 25445552 24480513 23770842 23164518 22828464 22142556
4902 22142556 21111563 20083412 19302534 18932932 18492473 17853202 17448582 17130520 16782729
4893 16782729 16438336 16252407 15843021 15303061 14978692 14457867 13882874 13484260 13277451
4884 13277451 13017590 12683382 12535483 12303387 12251811 11961918 11691832 11606562 11527066 11392272
4874 11392272 11399431 11410699 11328281 10999535 10883236 11072500 10834663 10938057 10871553 10569737
4864 10569737 10552916 10565127 10492845 10335357 10326282 10513085 10288654 10291839 10452977 10507535 10528923
4853 10528923 10557662 10549506 10259153 10273044 10523642 10546332 10408610 10540065 10626057 10899663
4843 10899663 11023106 11165214 11235615 11595668 11729426 11937171 12202559 12412478 12663183 12982426
4833 12982426 13418635 13626102 13910274 14027858 14064264 14093494 14194944 14175942 14281870 14056617
4823 14056617 13872829 13795632 13582153 13548266 13492120 13204305 12940251 12713130 12532433 12601878
4813 12601878 12714934 12729861 12797975 12847334 12915731 13221586 13563368 13752485 13964440 14061951
4803 14061951 14216264 14324780 14647476 14948217 15097986 15446687 15547608 15535056 15233874 15160531
4793 15160531 15098305 14995609 14929281 14750409 14624789 14489542 14247859 14031460 13957033 13932513
4783 13932513 13767995 13775152 13883569 13973323 14013429 14487206 14637554 14749433 14968781 15196057
4773 15196057 15536088 15798281 15852731 15390628 15102903 14981261 14903828 14800991 14852805 14853866
4763 14853866 15088061 15064132 15190843 15086539 15270832 15585860 15797421 15909061 16272884 16777176
4753 16777176 17089415 17438818 17986456 18552193 19107663 19706413 20737881 21829595 22653832
4744 22653832 23927847 25197005 25928723 26466758 26544720 26477729 26524934 27002784 27734938 28663100
4734 28663100 30063482 31767770 33816830 35590497 37468428 38836027 39847368 40538211
4726 40538211 41151228 41400232 41642917 41870055 41560947 41214608 41433800 42172683 43686007
4717 43686007 45523499 47664513 49801617 51402436 52512970 52701824 51988482 51130704 50527738
4708 50527738 49999795 49057099 48329526 48184617 48791490 49995998 51199188 51897004 52234356
4699 52234356 52812779 53161691 53288698 52658815 51340307 49327641 46870034 44954214 43666975
4690 43666975 42894949 42950036 43471189 44151158 44515332 44490198 44312055 44226467 43538136 42398861
4680 42398861 41171210 39586172 37863485 35859624 34514725 33686504 32787270 32445395 32438064
4671 32438064 32307583 32534088 32636199 32552725 31795863 30645083 29424658 28141726 27256983
4662 27256983 26510902 25858837 25337666 25049449 24757610 24680810 24366330 24143995 24140762 24100589
4652 24100589 24114205 24447122 24556163 24883031 25571947 26183140 26722238 27305208 27758212 27745872
4642 27745872 28033755 28405590 28988219 29417930 30145561 30963073 31884237 32557044 32802137
4633 32802137 33216229 33666602 33739765 33510535 33460398 34007822 34684701 35428148 36331903 37508731
4623 37508731 39258231 40390203 41149806 41900503 42766133 44071683 45434935 46412191 47734565
4614 47734565 49272258 50450447 50151762 49580933 49518587 49200137 47945945 46593442 45471414
4605 45471414 44742077 44589097 43959830 43209694 42923249 42747466 43148377 43607853 44420084
4596 44420084 45434745 46584564 46917994 46598411 46595089 46566073 45898231 44499590 42844400
4587 42844400 41378706 40139770 39001106 38447513 38021942 38024657 38151047 38788688 39598937
4578 39598937 40327631 40928194 41479211 41479159 41701128 42200929 42771632 43436005 44294664 45264685
4568 45264685 46438265 47347749 48544980 49808162 50832145 51420304 51708398 51971667 52527049
4559 52527049 53222260 53775905 54115548 54426909 54634325 54448518 54318944 54672267 55227805
4550 55227805 55933878 56940547 58359384 60033718 61835720 64005760 66374195 68841882
4542 68841882 71455471 74190565 77210272 80260717 82341588 81954558 78510906 73406802
4534 73406802 68851603 65952458 64070455 63300952 63106041 63826555 65239125 67196884 69640106
4525 69640106 72948201 77112349 81848635 87050117 92505405 97880363 101955193 103417010
4517 103417010 101775178 97277380 90089426 81437582 73485422 67755718 63898278 61201003
4509 61201003 59407548 58355981 58259943 58322195 59280750 60639131 62373883 64414505 66974445
4500 66974445 69933578 72681385 73940200 71833262 66648085 60722700 55687858 51661027
4492 51661027 48357239 45693261 43687997 41903404 40461678 38921213 37748841 36891855
4484 36891855 36228834 35876832 35685406 35292767 34893553 34435256 34108807 33424579 32941030
4475 32941030 32332452 31447590 30753990 29882070 29138431 28621981 28158939 27784374 27468851
4466 27468851 27094054 26952232 26980335 26870526 26783020 26992025 27123851 27553922 27664697 27443113
4456 27443113 27025734 26448536 26152424 26043615 25820546 25391029 25017218 24874992 24752977
4447 24752977 24518862 24239414 23929030 23817904 23753871 23563201 23390917 23278969 23218775 23202995
4437 23202995 22890305 22745798 22608356 22544473 22565680 22420763 22353407 22305968 22009788 21911657
4427 21911657 21992540 22079720 22154874 22102757 22159725 22089700 22212478 22080301 21715287 21398742
4417 21398742 21157416 20826600 20264990 20050441 20177584 20231442 20086067 20046072 19934638 19525791
4407 19525791 19078641 18596300 18348166 18053222 17896110 18015097 17880303 17884873 17999281 17689373
4397 17689373 17638974 17730224 17273889 17103634 17000033 16819454 16878868 16705640 16599152 16682255
4387 16682255 16596593 16508069 16408513 16487158 16461013 16354239 16369349 16165564 15971453 15974823 15908405
4376 15908405 15681151 15826480 16045846 15943602 15823246 15998538 16157980 16340567 16635028
4367 16635028 16636969 16397099 16575320 16913898 16926616 16979723 17004640 17046519 17074612 17042092 17185095
4356 17185095 17314140 17200851 17337644 17463872 17438182 17610373 17462256 17273391 17271078 16940182
4346 16940182 16855919 16932387 16791252 16655781 16511905 16540944 16632791 16574379 16720384 16756426
4336 16756426 16778055 16984594 17156384 16987886 16904129 17249539 17369769 17291015 17418911 17605992
4326 17605992 17510014 17547668 17623401 17636964 17710466 17871333 17802935 17997669 18106549 18138705 18319105
4315 18319105 18621747 18798761 18794407 19058669 19172632 19335921 19511192 19667719 19710138 19906815
4305 19906815 20221138 20365364 20359074 20746255 20922473 21296020 21567687 21562297 21741759 22149923
4295 22149923 22561023 22893201 23001570 23336484 23592544 23803803 24228632 24495843 24746340
4286 24746340 25102337 25610518 25990014 26191757 26581721 27010989 27526110 28023951 28299140
4277 28299140 28862807 29320245 29877403 30471479 30833294 31560662 32360322 32840257 33356013
4268 33356013 33877692 34632744 35611465 36303468 36935066 37717282 38400065 39124591 39894474
4259 39894474 40978329 42059161 43029734 44051168 45597527 46835354 48418942 50280227
4251 50280227 52157316 54054920 56259764 58834008 61957381 65372503 69014537 73304922
4243 73304922 78274240 83658888 89679209 95009554 98440789 98644229 96236506 94189031
4235 94189031 93868402 94953145 97210185 100824104 105260692 111042391 117532687 123409373
4227 123409373 127480484 128839335 128925149 130272858 133416639 138764431 146042100 154891535
4219 154891535 164563174 173642710 180860612 186472243 192572300 199527102 207288822 215906397
4211 215906397 226159219 237410532 250705781 266772455 285386427 306297520 328966254
4204 328966254 355203137 387275234 420373278 440443396 440548350 430462272 421555397
4197 421555397 404472110 369720589 324074720 283469536 252756100 229447770 211365185
4190 211365185 196368918 183509347 171758892 160552978 149617119 140158722 131849586
4183 131849586 124851152 118919776 113916462 109861430 106176819 102864727 99968269 97327908
4175 97327908 95415356 94057332 93035690 92648359 92735323 93207416 93950328 94846512 95722480
4166 95722480 96968805 98303417 99690887 100807848 101485151 101868808 102681752 104114570 105568562
4157 105568562 106881763 108028448 108606523 107554997 105905384 103524312 99797319 95341297
4149 95341297 91172031 86478725 81154255 76624278 73082513 70379795 68236073 66306493
4141 66306493 65079844 64028977 63078980 62540683 62546633 62668605 63404806 64343015 65021306
4132 65021306 65428431 65039517 64541049 63691545 62315936 60587510 58446365 56408207 54637351
4123 54637351 53293226 52017177 51282058 50470638 50001424 49951647 50452102 50686744 50446368
4114 50446368 49655703 48231650 46300589 44121101 42424537 40804437 39534173 38473929
4106 38473929 37491254 36611380 36027775 35510731 35001627 34309509 33678405 33215431 32926160
4097 32926160 32594570 32139647 31948984 31401386 30868302 30509704 30111874 29746934 29483273
4088 29483273 29116353 28878633 28566945 28523339 28457487 28306290 28330021 28294836 28359158 28115037
4078 28115037 28067424 27774985 27644580 27517846 27375344 26758484 26267510 25554069 24878227 24307787
4068 24307787 23900385 23287964 22781113 22387083 22131490 22057346 21719864 21484236 21397754 21345419
4058 21345419 21055943 20889311 20998328 20839239 20773371 20838382 20586604 20522119 20425105 20305523
4048 20305523 20267467 20294965 20273084 20101718 20080584 20102027 20252662 20183800 20215137 20318225 20127012
4037 20127012 20076220 20345364 20490353 20784919 20834912 21108941 21080410 21241866 21684176 21972011
4027 21972011 22030886 22090138 22134497 22074947 22147127 22052939 22267201 22595659 23037744 23137554 23420681
4016 23420681 24023946 24577779 25117063 25679303 26387562 27379806 28398142 29782275 31258988
4007 31258988 33051107 34952638 37409929 40095690 42972351 45577515 48319927 51621164
3999 51621164 55156099 58805354 61821007 63468900 64254180 64014262 62837441 61130763
3991 61130763 58334845 53943794 48350846 43096216 38768607 35269823 32601905 30252494
3983 30252494 28345769 26702895 25386670 24210022 23350974 22751907 22006301 21281967 20759204
3974 20759204 20166201 19957339 19454627 19037143 18653295 18288833 18106020 17602596 17155583
3965 17155583 16901283 16406954 16217007 15948700 15735167 15592377 15357167 15271785 15119240 15154011
3955 15154011 14905177 14751116 14622681 14575665 14349104 14409880 14608627 14625743 14738982 14711895
3945 14711895 14562372 14601493 14663325 14786664 14949601 15021890 15182929 15335905 15355489 15690183
3935 15690183 16177705 16741424 17273658 17967754 18759251 19641845 20467870 21798414 23064498
3926 23064498 24480722 26262257 27916350 29425174 30980400 31869133 31956969 30692882 28177920
3917 28177920 25624031 23465255 21592783 20119540 18840851 17888525 17078751 16226908 15781152
3908 15781152 15630242 15187462 14935016 14828318 14552381 14146261 13928502 13620685 13276297
3899 13276297 12916051 12714827 12251579 12088924 12208441 11975394 11805077 11416813 11093499
3890 11093499 10665646 10405046 10096412 10092169 9859639 9489193 9301885 9109483 9002607 8806879
3880 8806879 8708623 8651646 8773567 8755325 8646565 8797904 8820626 8828851 8796424 8989372 9185125
3869 9185125 9195622 9137968 9178277 9403334 9250012 8642710 8237848 8011946 7926828 7836172
3859 7836172 7834100 7661351 7508756 7368742 7529285 7465342 7301554 7227668 7103637 7089004
3849 7089004 7049700 6868125 7004422 7266176 7043188 6829334 7012104 7000016 6807698 6864654
3839 6864654 6752969 6673680 6686293 6899727 6742561 6643045 6660357 6448700 6561785 6467565
3829 6467565 6352269 6461793 6427939 6435617 6356144 6440108 6386922 6410472 6556323 6370875 6188293
3818 6188293 6209320 6334703 6161759 5843983 5707360 5619312 5941540 6053698 5954423 5789750
3808 5789750 5696751 5775212 5645215 5743299 5631948 5513057 5319798 5537056 5504887 5448424
3798 5448424 5221305 5139487 5256046 5270462 5092619 5126871 5176118 5046062 5042525 4983961 4929790
3787 4929790 4891924 5005802 4757015 4694516 4611313 4809909 4847532 4954367 4903964 4699751
3777 4699751 4830774 4753195 4482691 4563334 4688357 4674636 4808783 4812860 4590337 4668836 4612119
3766 4612119 4463164 4351875 4261483 4323774 4117417 3924762 4127197 4117538 4109794 4079897 4053835
3755 4053835 4133951 4147204 4085588 4064127 3930128 4064832 4260739 4138011 4044804 4117427 4071621
3744 4071621 4002939 4023397 3831491 3746962 3780454 3913063 4015383 4075879 3972567 4123684
3734 4123684 4065463 4130253 3958962 3993474 4009992 3670316 3808810 3888146 3915975 3786782 3607544
3723 3607544 3662531 3662393 3499362 3303251 3380599 3579252 3669230 3558839 3522015 3537713 3489993
3712 3489993 3442929 3418235 3281134 3360445 3413001 3433055 3335426 3408138 3598474 3704359 3751505
3701 3751505 3746248 3863718 3902648 3684561 3702693 4099393 4144343 4101439 4078137 3885646 3886229
3690 3886229 3784719 3542340 3625160 3512033 3466799 3338865 3201029 3090454 3005717 3269337
3680 3269337 3215430 3147163 3264197 3323088 3250024 3301434 3317317 3207944 3148261 3088765 3154329
3669 3154329 2902018 2941893 3030529 3032797 2881111 2956727 2901401 2654401 2618395 2901971 2928949
3658 2928949 2966094 2799492 2924513 2864254 2805466 2749421 2654794 2746651 2743002 2767790 2829898
3647 2829898 2801348 2659029 2635557 2696477 2631808 2628041 2855958 2443518 2492249 2600921 2498924
3636 2498924 2466837 2476010 2514118 2653048 2701529 2817112 2658140 2556330 2478619 2477160 2543654
3625 2543654 2522518 2522605 2432237 2374575 2275724 2409284 2501789 2425591 2324092 2278121 2324277 2319450
3613 2319450 2271955 2312953 2270455 2433679 2360895 2270698 2372244 2366482 2350215 2425311 2320309
3602 2320309 2369811 2342864 2271360 2329272 2237968 2141524 2267951 2468342 2400702 2238803 2249077
3591 2249077 2181745 2388870 2505896 2357733 2145805 2085073 2180247 2023699 2137912 1971015
3581 1971015 1809641 1947646 2226894 2191859 2344975 2228393 1981038 2030797 2073406 1858831
3571 1858831 1974948 2146211 2144410 1959955 1783528 1811289 1802161 1870684 1949559 1842895 1836299
3560 1836299 1744330 1843173 1747580 1728142 1730369 1722709 1622366 1611938 1764235 1877526 1926432
3549 1926432 1889055 1819269 1718646 1844972 1793522 1777383 1710588 1838412 1939538 1962247 1713494
3538 1713494 1700794 1818976 1687324 1559474 1524581 1612514 1627145 1589366 1522688 1470024 1409705
3527 1409705 1586038 1454917 1389211 1350186 1376815 1418193 1483734 1367351 1502925 1538225 1522253
3516 1522253 1550183 1456787 1616096 1604581 1597398 1523753 1685466 1491180 1402465 1552420 1537417
3505 1537417 1356359 1353866 1413483 1495839 1274153 1416588 1443380 1530645 1591957 1545654 1596589
3494 1596589 1508414 1241841 1336260 1260936 1322820 1416177 1574255 1620572 1306650 1168863 1372834
3483 1372834 1437218 1310151 1358889 1414108 1481896 1583393 1413062 1325891 1473214 1527475 1430170
3472 1430170 1506309 1553107 1494679 1465320 1331237 1177116 1212255 1298230 1233193 1361208 1395712
3461 1395712 1373603 1435508 1351177 1395512 1433558 1504447 1297907 1287581 1418502 1207799 1143723
3450 1143723 1161544 1267639 1282832 1385434 1253379 1351055 1299187 1278136 1283045 1117392 1135050
3439 1135050 1198192 1201010 1455743 1410354 1504446 1594586 1642988 1498338 1306287 1310435 1519993
3428 1519993 1457944 1360824 1420036 1473920 1503468 1691148 1680594 1439084 1509445 1468616 1364147
3417 1364147 1228495 1201926 1287181 1257994 1348928 1133321 1175519 1356019 1297932 1324290 1297967
3406 1297967 1325676 1316985 1373184 1295588 1394197 1393149 1224330 1285992 1367239 1414176 1599752
3395 1599752 1528840 1502527 1614062 1751303 1721718 1579488 1641182 1552356 1524619 1524130 1475176
3384 1475176 1222100 1321657 1224715 1164421 1378443 1408236 1345238 1352712 1501321 1321071 1370192
3373 1370192 1425217 1523636 1429110 1629206 1545730 1343874 1155638 1125107 1191587 1356071 1502314
3362 1502314 1378728 1531576 1534939 1364723 1178671 1278042 1214931 1479178 1507058 1285134
3352 1285134 1397114 1584449 1366234 1342150 1460943 1346607 1529323 1640177 1618587 1643597
3342 1643597 1519027 1543128 1598541 1706521 1789146 1662554 1912329 1672153 1685367 1807175
3332 1807175 1733309 1742937 1623443 1761324 1827679 1722206 1497514 1660069 1843293 1667565
3322 1667565 1845664 2080747 2114485 2085387 1903892 2052805 2164350 2193406 2226319 2122951
3312 2122951 2062521 2222345 2372196 2245925 2075451 2050156 1948139 2048791 2423713 2522169
3302 2522169 2440300 2378845 2290632 2260716 2242920 2064471 2251845 2378302 2412060 2525422 2419507
3291 2419507 2353149 2608220 2826333 2824681 2898579 2836988 2963150 3213250 3397736 3561177
3281 3561177 3597681 3481038 3219168 3241208 3514105 3467657 3206923 3137842 3185778 3192365 3307151
3270 3307151 3443352 3408879 3356748 3213217 3207203 3289157 3634586 3631040 3741489 3644138 3645404
3259 3645404 3755583 3964262 4019912 4091071 4242620 4438234 4584678 4764359 4801086 4903118
3249 4903118 5187463 5197723 5408418 5491612 5508318 5576861 5791718 6109754 6108622 6191048 6400199
3238 6400199 6540650 6610554 6783990 7011905 7288541 7699519 8135133 8650970 9373986 10199678
3228 10199678 10887727 11963063 12439203 12761093 12837282 12985075 13570613 14467052 15142531
3219 15142531 16328679 16738787 16381704 16289447 16071999 15096075 13700429 12509474 11469938
3210 11469938 10760720 10186616 9971634 9752727 9414197 9411223 9615312 10011764 10528178 11141423
3200 11141423 11904197 13023820 14308740 16077236 18004657 19631152 20589877 20635238 21085169
3191 21085169 21628731 22545578 24158013 25926727 27834137 28412009 27150111 26864633 26521359
3182 26521359 24001767 21150526 18419990 16078304 14422985 13126636 12090691 11238686
3174 11238686 10607096 10190371 9955968 9721120 9488035 9622213 9945464 10125110 10584543
3165 10584543 11230523 11978150 12838639 13048106 13022150 13098870 13242149 13640169 14365012 15248269
3155 15248269 15991691 16159574 15364047 15139088 14567909 13096284 11546092 10159577 9063392
3146 9063392 8286780 7531697 6780545 6140250 5937664 5602805 5242019 4880880 4466120 4190882
3136 4190882 3994721 4054466 3883982 3714855 3586233 3545476 3349835 3223794 3218182 3248887
3126 3248887 3183827 2984275 2788096 2848181 2712344 2526066 2436786 2512358 2709183 2516950
3116 2516950 2270686 1987118 2173225 2276349 2236370 2045549 2035980 2102398 2059846 2014649 1934853
3105 1934853 1766306 1693737 1568160 1608234 1527278 1700478 1726347 1540949 1535547 1729427 1596826
3094 1596826 1454267 1487671 1132015 1247180 1374130 1291844 1309993 1379895 1454594 1419176 1188204
3083 1188204 1309574 1315049 1329085 1175017 1021269 1155963 1360134 1369542 1230385 1333133
3073 1333133 1283677 1292017 1262175 1189598 1109814 1087888 1175099 1167497 990645 861366 1128987
3062 1128987 965860 993721 1051434 854119 858989 1090533 1103301 945527 825499 946740
3052 946740 745672 857258 890388 814462 1061366 936964 786073 860393 963255 1067944
3042 1067944 892981 831351 1060879 982831 867609 866259 827979 736777 739670 689844 659991
3031 659991 685330 687632 396958 388153 726133 727261 763150 704671 822520 898630 811335 773421
3019 773421 807885 862114 949279 789698 651568 580086 477795 659107 595915 655652 688623
3008 688623 752986 794198 901140 628206 592154 640650 613520 804403 816365 625907 602152
2997 602152 582521 571495 578892 779013 718756 490780 791393 674501 268003 506073 765962
2986 765962 686772 649941 839126 740417 517188 656941 711071 716097 420538 562402 641770
2975 641770 458727 604586 537515 675912 704956 423079 434786 540280 532906 504186 722603
2964 722603 649635 445069 319271 421699 649936 656775 529461 737316 468724 380335
2954 380335 510239 607379 777494 497703 568873 691370 581228 489976 470094 511947 745005
2943 745005 756963 739859 843030 884583 685863 578960 586069 696706 646769 704831 765960
2932 765960 533519 516207 881971 791916 865540 972161 982255 726931 503037 701521
2922 701521 704025 794568 845213 898335 1058297 1006363 767886 897335 974848 928992 822626
2911 822626 870507 809970 995775 1043718 1069875 1176114 1077058 1146130 1174368 1230516 1134873
2900 1134873 1080672 1157823 1151926 945022 997234 1119559 1166490 1043307 1007168 824221 736249
2889 736249 877221 888379 859384 1078773 1146704 764537 619603 698888 866656 941646 886161
2878 886161 916426 798906 564100 808573 839124 950025 969565 944236 976742 895150 944551
2867 944551 921228 773035 816905 915800 1061060 986308 895389 825933 687982 552685 561298
2856 561298 630573 499506 585409 634767 510376 436827 520754 518657 552100 475050 614664
2845 614664 897021 679777 433829 469200 502743 356985 334264 511044 654877 677220
2835 677220 450858 436133 723064 652854 468122 593258 465030 522742 360253 328632
2825 328632 333502 296029 466384 438243 433166 549833 534092 476919 498890 464695 487168 333697
2813 333697 439645 471583 734853 568275 385126 497949 428793 185838 435726 305462
2803 305462 404916 448195 292700 148766 294071 529041 542204 422896 368549 427660 222137
2792 222137 317643 255860 379956 195528 54202 165447 119218 147524 61456 -171857 -44985
2781 -44985 -150315 -78237 108032 -3187 -43007 196368 16945 151882 175649 272344 313561
2770 313561 251722 262909 273085 289816 339313 274043 212496 275601 340154 411930 389414 288334
2758 288334 247513 379431 338849 361693 123721 132811 107808 284409 339824 386558 565616
2747 565616 343568 319557 444763 449230 222496 170734 210717 320487 247392 260457 372853
2736 372853 76735 59796 161630 214013 240339 326874 581422 317015 244897 362133 350053
2725 350053 256409 264242 215576 87295 174617 360736 240757 191284 268695 112696 235455
2714 235455 465496 400364 303007 269638 280732 271887 159754 13270 99095 447677 467146
2703 467146 372854 275104 323222 386023 420373 426574 483440 274636 272333 178070 216565 310598
2691 310598 165971 178297 310215 278643 397308 469075 434840 420103 268119 309431 212689
2680 212689 343983 387970 312707 339721 249144 456187 352439 213517 301942 228611 216868
2669 216868 198081 356348 335850 285603 414867 282486 173339 77620 142968 110708 67226
2658 67226 315975 408742 231134 32105 18042 51381 -9659 -94382 97449 251387 186437
2647 186437 103651 84037 -22662 47664 191744 41473 -4795 62591 -11500 -84796 20896
2636 20896 117417 79174 123572 85631 230879 130606 -9670 78155 146604 -95086 -107084
2625 -107084 -17033 -64283 -122643 8644 98209 86314 104481 72700 87202 47701 104097
2614 104097 151797 180191 189397 10731 -131414 -180929 -8066 157266 86603 57495 207783
2603 207783 328925 -132514 -48867 21141 110009 -31817 248247 439987 312164 159155
2593 159155 142667 214426 120358 -35086 -84204 71795 -13070 255472 98005 6146 11622
2582 11622 53413 5968 -77071 62849 -33665 1715 -268245 -139870 -98246 -98845 38578
2571 38578 104325 117587 24167 5720 8813 17247 -4700 109105 155292 182962 221957 91363
2559 91363 63406 216673 -3424 126499 189358 25475 -36556 76280 112133 113725 7800
2548 7800 -36435 131284 115770 129104 100233 -21177 -938 108217 359577 324523 163262
2537 163262 57161 39716 337121 277126 143047 406268 295605 133627 145016 206469
2527 206469 136142 -6241 52269 66325 -37797 -35228 51020 264867 86399 -51483 102199
2516 102199 199088 84751 -95894 8075 150975 184502 218644 155650 35392 123474 251359
2505 251359 123464 99581 65941 126350 149979 43654 137619 301429 144257 57078 23700
2494 23700 187379 195959 24608 -114972 -122732 130923 142132 60932 -68747 -54756 -35571
2483 -35571 -159336 -123611 30466 199547 162994 -39469 -3460 -125056 -24087 260536
2473 260536 214466 -55252 -129316 -80019 34640 -164396 -184906 -98826 -148710 -127500 75364
2462 75364 160192 108168 74463 126120 20399 165472 86233 -38645 -82805 189725 228930
2451 228930 126533 60798 170659 82435 31782 211320 270312 178685 185567 157803 40755
2440 40755 160083 17344 11495 148757 244074 -120514 -160694 -210581 -207275 -116667 -31457
2429 -31457 89339 240716 162062 98902 153323 74478 -1994 84600 103310 -58685 -197052
2418 -197052 -177161 -3808 -4141 22805 99552 -76652 -202175 -95727 -334794 -337462 -119972
2407 -119972 11737 148075 80280 -30889 -65104 241256 69971 12357 25950 -58024 103343
2396 103343 93096 -73357 -262860 -132227 27464 133954 152093 139239 374117 173356
2386 173356 -129062 -32678 66539 31394 -11241 86335 116306 114742 35004 9570 29817 168093
2374 168093 355536 260211 228533 237988 390923 430134 563053 500139 586071 729335 544556
2363 544556 536137 284731 301798 340951 381502 182926 320172 211702 52547 10205 -39190
2352 -39190 136630 121114 217360 217077 -8334 55935 63836 -25636 223953 377230 278439 36620
2340 36620 108279 -97606 -88071 21750 -59624 122985 111557 235849 432069 134309 156836
2329 156836 273301 212525 89130 21373 254537 279069 209447 65027 -13663 57641 31234
2318 31234 51975 163544 238764 299118 48343 -109188 147125 24816 98726 150328 145725
2307 145725 339439 258228 149893 24389 -13762 35192 151853 224205 97854 22950 195440
2296 195440 205740 65377 104314 -24421 183510 158229 210699 175573 133736 166728 284145
2285 284145 448109 274700 239814 391203 476436 403677 425674 340375 279013 314665 420702
2274 420702 393805 242026 -1362 -11207 51416 278412 365711 439982 341959 260167 253881
2263 253881 198600 219937 160071 -6129 229346 343768 192310 212166 169678 230782 372887
2252 372887 377364 448323 410849 443616 473735 374803 381967 316255 290735 529539 569439 601194
2240 601194 572098 308161 206460 218793 322572 448724 377419 404461 405329 325624 318107
2229 318107 336818 446660 261759 359445 504941 606661 339234 343853 486147 734555
2219 734555 612533 424871 671900 669740 564026 623200 630707 458961 478464 352172 454003
2208 454003 544303 637926 847898 704753 649273 572775 531970 592186 633332 701856 864253
2197 864253 901675 976690 944806 941096 813102 759526 798786 1064889 930726 896082 1065622
2186 1065622 1146042 1192301 1182402 1057853 1087584 1076341 875860 1037843 1047237 1386911 1470241
2175 1470241 1580718 1564377 1553412 1753350 1572263 1621103 1830401 1674482 1638208 1691144
2165 1691144 1950471 2094478 2101939 1976128 2226077 2429827 2349704 2425845 2637692 2537837
2155 2537837 2596294 2785149 2937527 2816119 2807754 2912495 2972694 2972133 3045930 3213273 3242855
2144 3242855 3174160 3238801 3377047 3517020 3395089 3537320 3587550 3741354 3917760 3930237
2134 3930237 4180095 4484701 4596158 4721984 5170888 5444927 5884741 6261528 6397589 6890397
2124 6890397 7414974 8097846 8746999 9184200 9607794 10397965 11265231 12477366 13765816
2115 13765816 14749629 16135173 17549220 18992719 20744325 23065754 25789925 28810729
2107 28810729 32734997 37897973 43964661 50067696 57557766 67537032 77449871 86051539
2099 86051539 97360696 101304541 88815741 76914867 68442155 59356931 50355148 43002457
2091 43002457 37795010 33516975 29676315 26609602 24278865 22279130 20605216 19557539
2083 19557539 18697214 17458098 16114911 15054933 14234940 13498970 12634739 11734188 11128561
2074 11128561 10409236 9962857 9435817 8979874 8509094 8293271 8080562 7692040 7304849
2065 7304849 7160930 6915655 6685561 6360849 6231481 6003691 5811360 5444460 5214993 5051559
2055 5051559 4718446 4744919 4728522 4498911 4154074 4040646 3796090 3821054 3820698 3772272 3716892
2044 3716892 3383423 3397346 3262590 3003618 2959165 2841977 2953984 2939333 2942102 2951470 2767835
2033 2767835 2729041 2411058 2337902 2486373 2583784 2496151 2449501 2388528 2465872 2530118 2218469
2022 2218469 2352341 2256340 2286326 2304906 2097424 2064217 1895666 1844935 1956395 2084585
2012 2084585 2007909 1757987 1617884 1839516 1713971 1522329 1566533 1575067 1553229 1641613 1628748
2001 1628748 1458656 1203465 1234832 1236986 1355357 1440153 1567899 1384457 1086245 1022914
1991 1022914 1206026 1159949 1062226 1247732 1346784 1174647 1003260 936971 1062135 1175708
1981 1175708 1055681 1010330 910429 932984 819453 656873 680275 691451 692419 652408 738547
1970 738547 744699 827195 813259 824766 633872 492089 728606 529779 301391 593245 797962
1959 797962 838300 763477 599956 644040 630800 721186 900953 838534 872010 620344 487863
1948 487863 588618 506275 523871 487152 455588 384645 372786 281289 350491 453025 597627
1937 597627 615172 605298 584039 647389 539541 504659 428352 491314 412533 331951 233295 410236
1925 410236 463134 354148 290095 335176 331857 332864 428508 234450 381672 274243 243935
1914 243935 264198 403341 409317 475742 502899 471173 518821 683242 540107 368359 393617
1903 393617 346677 423090 364852 248988 338154 392328 544870 516028 397167 370972 213574
1892 213574 374731 182628 224304 306568 252058 236991 234903 295522 284699 218183 416824
1881 416824 234113 316757 464404 362466 437921 382350 340632 376779 265901 251742 128491
1870 128491 177842 360983 307943 279980 327169 370972 473314 334173 360339 428877 207222
1859 207222 316054 325797 533540 337843 158803 75201 98010 -39360 11681 140469 298455
1848 298455 301263 237204 364984 325885 401110 295964 360199 404651 497955 457461 478107
1837 478107 383838 90426 264438 328060 280331 300780 510412 716172 676285 697120 612763
1826 612763 578762 594413 415151 238690 337500 314572 488096 469119 473160 349584 431600
1815 431600 293008 271354 318765 307494 36859 41169 129171 41883 47944 125981 307942
1804 307942 439569 355584 201873 213379 95984 72060 208175 120955 32180 179544 105030
1793 105030 161228 246321 293559 179554 244869 257148 330270 211276 212124 92456 74766
1782 74766 24004 110345 53021 202567 357753 338700 268448 332281 323009 242779 -29687
1771 -29687 227626 355812 398424 439420 394118 175219 38211 43865 72305 108066 159873
1760 159873 24562 109169 100498 166398 137105 198151 232720 190486 234474 29463 -195427
1749 -195427 -170440 -53212 7666 149938 -11949 46739 36006 -5709 34292 157343 237353
1738 237353 285486 148747 195415 231614 241877 246275 290142 156781 56300 35798 12933
1727 12933 -55013 6772 -56909 55274 -7332 -22688 72587 -69807 -32462 137262 75694
1716 75694 115935 77105 206668 172746 197009 183736 158166 -48433 -223515 -164655 -6975
1705 -6975 -6513 -191968 -192646 -133170 26173 51938 200253 110557 61789 -78010 -205430 -49722
1693 -49722 118845 148455 192332 300439 135545 286157 247199 134429 92465 -37029 92863
1682 92863 187362 200316 116944 -150920 -5892 -56352 -33983 52321 24154 -39631 4683
1671 4683 48803 138288 184109 30588 -147274 -159083 -52879 130614 63436 195396 333237
1660 333237 150562 -56765 -87821 49518 139234 54933 -22876 -2400 -7497 30733 80012
1649 80012 -33293 -208604 9104 68078 180255 177217 32193 84907 43609 -95502 -39070
1638 -39070 -80229 38541 110329 186733 201823 148561 -31078 -29889 -113202 -47878 141818
1627 141818 104956 9728 13337 66394 188086 157930 108211 49813 71949 -128553 -164468
1616 -164468 -21660 127552 92350 -106590 -29496 -28624 -80791 -23233 -59927 -75243 -6622
1605 -6622 102434 -56175 -62809 116133 248172 162681 48513 155702 152628 -39682 99953
1594 99953 174027 42636 26442 45545 51198 22143 83698 104242 139178 144829 114623 211824
1582 211824 173116 -4610 -15091 12941 19014 -103341 -93684 92792 248595 35137 -182695
1571 -182695 -140314 -137833 96848 184147 -21841 -58197 -39488 63863 161379 142583 -33865
1560 -33865 -125580 -318126 -255346 -98890 44444 -20162 -3851 -187686 -296040 -24156 12338
1549 12338 65749 -85904 29866 58951 -37276 41185 53198 87447 118440 175763 -72876
1538 -72876 -95598 25273 81698 -32214 27780 112331 199195 171380 210367 41349 -96395
1527 -96395 -120496 -33935 128812 23459 10498 -91429 -84513 -31629 67539 46175 39814 41263
1515 41263 -29885 136680 113938 -159313 59610 14029 -38418 -9351 15813 84824 103137
1504 103137 15657 -144284 -123117 84843 118546 47285 -25438 63042 134033 -88584 -184888
1493 -184888 -101845 136111 -74451 -164844 -82963 192967 203363 -1910 -175125 -11877
1483 -11877 11216 -130637 -132757 18152 126803 -178305 -201877 104139 155906 -6209 87707
1472 87707 225735 93557 -91898 75042 238494 68603 -70031 117018 148985 248653
1462 248653 212063 208263 235571 62094 99971 98831 42004 -46959 45573 122441 104138 132210
1450 132210 -81144 -80524 -5849 -81803 -312624 -244167 -227087 -92483 5282 -51539 -59306 5984
1438 5984 75100 185300 -55204 112372 -15632 77153 -13271 -70476 -95163 -103963 37364
1427 37364 2179 196988 134620 150424 31471 16608 61039 187226 136694 128461 199859
1416 199859 128852 -216146 -89821 106986 55717 37721 108555 -7449 84084 37002 75809
1405 75809 200550 174486 59262 160040 102968 -16005 78394 53585 56759 34050 -170919
1394 -170919 -29114 41061 12972 -32477 26216 -31021 -93033 -108170 -246406 -173094 -167969
1383 -167969 -74935 16960 -260326 -250896 -123488 -10642 -41043 23312 126850 13912 24977
1372 24977 -20975 51829 100252 119572 128165 126625 14996 -91906 -129211 -52659 75238 144608
1360 144608 64573 -1105 -89813 37688 72731 51283 -42884 -159428 -38563 -95360 -7327
1349 -7327 -58847 44571 -2239 44752 23357 -143731 -32762 -182047 -77450 -156764 -122179
1338 -122179 -2911 -112050 -62841 12493 -66012 45194 104295 136110 -91781 -51449 -172088
1327 -172088 -105243 114349 -45165 -183816 -113591 -57573 -112710 -63791 -3476 12334 70396
1316 70396 -114354 -281096 -269276 -174203 -197500 -278819 -212602 -190063 -176665 -145174 -264389
1305 -264389 -274692 -546025 -183209 -61189 -96626 -55364 -66164 51285 -66722 33918
1295 33918 -91041 78918 120702 290165 299445 246080 247292 269324 259117 85776 -148279
1284 -148279 -166654 -155989 -144734 100153 174941 -41407 17991 31668 -97762 -230319 -188017
1273 -188017 19361 50772 8909 105699 -46327 -47850 -124676 -8396 21531 163847 90641
1262 90641 -173011 -400887 -321521 -205607 -239955 -120012 -150641 -11722 -12450 18684 63543
1251 63543 260755 -15978 -131968 -50668 -205134 -168741 -112485 45897 86589 73260 61078
1240 61078 -110828 -64183 37371 158812 61028 193655 256922 89555 226786 90419
1230 90419 8858 -55910 155771 236619 123063 70351 27688 -36493 -94123 -97394 -28581 29945
1218 29945 -32198 -12811 -175872 -102675 -79759 -81332 63243 160766 171372 306014 279796
1207 279796 28805 -181263 -208323 -133101 -91833 -108784 -111360 -104654 -31570 -119151 -21124 65563
1195 65563 -13797 31959 57750 24800 38444 -76598 91694 -105043 -301673 -95203 -19174
1184 -19174 125075 12482 -2018 -67441 -166912 -45775 -139217 -248501 -160993 -34410 -111517
1173 -111517 12213 120091 37847 -55252 -125753 -262706 -313775 -186637 -166776 -98567 -251296
1162 -251296 -314048 -93674 -45160 -166214 -61405 -91799 157414 130623 16464 -66123 26344
1151 26344 -7928 -271453 -10317 81416 -72257 -288029 -330837 -82477 -38283 -107833 49362
1140 49362 -116219 -143829 -64949 -199610 -264791 -114227 152379 74505 -48831 -58288 156502
1129 156502 -26039 -4313 -185115 -73340 -917 58449 221872 257313 117368 13856
1119 13856 172580 14506 -21290 95905 -51731 -6548 141836 209079 132736 84962 70364
1108 70364 168528 252563 46586 89621 -60741 -46827 46271 70563 -101050 -52138 -85608
1097 -85608 -47410 52954 47053 41656 65707 -274702 -235747 -287187 -62106 105519 30557
1086 30557 156637 -27655 -81954 -248576 -301953 -124108 -145991 -98179 -222866 -93661 -26573
1075 -26573 -155821 -4731 203668 335559 45730 -106991 -134501 -77923 -11359 5229 -119062
1064 -119062 -179431 19148 33344 -207121 -212539 -234622 -153800 -157913 -73146 57766 39891
1053 39891 -201948 -250568 -114327 -83685 54856 208266 -27406 32368 -215204 -292640 69025
1042 69025 101190 -72465 -136395 -12770 75081 379329 159092 3540 -77990 85 -98356
1031 -98356 -23731 16361 80050 -36874 -22073 114119 -88481 139693 164044 2083 25119
1020 25119 -39775 69779 -74090 50222 -68448 -73928 -38213 -90881 36864 -88738 -118231
1009 -118231 20976 191266 70650 77850 183923 252356 314076 162934 128380 25431 -40430
998 -40430 115749 234865 -78554 -191693 -75005 -77191 -13739 -308982 -17710 124543 107950
987 107950 68629 58679 97568 87700 29486 114656 38962 -137962 -318124 -47964 247791
976 247791 144594 165219 219360 40593 -68023 -22987 -48120 -140954 -109966 21251 8141
965 8141 155723 55230 153846 161167 72516 -106507 -336823 -245316 -155617 -28117 -26970 -52076
953 -52076 -153877 -133186 -81514 -80277 -237428 -222142 33172 165189 257103 355972 197975
942 197975 159575 -18603 -56247 -155973 -123994 -62430 43735 44417 -88520 -226761 -147555
931 -147555 137990 -20166 -86191 -112990 -182115 -149610 -87105 -123815 12355 36922 -58789
920 -58789 60595 -15040 -91141 84960 62362 63269 189791 124784 113070 226674 -194360
909 -194360 -165324 -264164 -238295 -22691 58430 -130467 -202246 -43600 -145858 -192375 -297428
898 -297428 -114807 -135904 -19536 6381 -17553 16850 25137 6002 -37224 79281 109299
887 109299 47626 118580 5983 29964 14756 -98909 -134870 -123484 -96432 -95375 -171703 -134360
875 -134360 -34012 -125162 -70004 37504 29779 -35696 16785 -97319 -58090 -13041 -8541 -213526
863 -213526 -82104 14916 -55284 -133538 -211726 7140 145564 321696 381427 191527 198425
852 198425 407231 306324 89445 4674 -4354 -96643 -301439 -215672 -241556 -8538 247862
841 247862 31682 -87311 21583 177165 257119 206689 84729 10126 73982 -72921 -79041
830 -79041 -96300 -89036 -141134 -159700 -60486 8507 -185315 -61564 -187653 -132759 -68123 -149227
818 -149227 -135224 -109468 99280 -36503 199118 196795 174102 251960 50542 -82735 -62705
807 -62705 -73843 -155788 -405911 -247272 -280961 -148284 184661 41631 37850 80612 -49420
796 -49420 24294 51056 -86836 183632 148017 52606 -36890 93708 207581 -99273 -301835
785 -301835 -108379 -20812 12184 39871 -36654 -455 -68508 -49036 -127004 64902 10439
774 10439 -130372 -246846 -256628 -125806 -78788 -227682 -158745 -121170 -77443 -33062 104099
763 104099 52467 -152622 -201569 -192216 -78483 96599 -7949 -78526 -140317 -92450 -20173
752 -20173 99559 -53873 -170848 -115065 -42886 67427 79149 63760 57343 -55904 -231501
741 -231501 -99570 8659 -139623 -108235 -98480 -35646 62832 109627 48318 119082 190141
730 190141 -18891 113812 146803 -98644 -151746 -164448 -122746 -21033 -52137 22700 -109351
719 -109351 -179258 -219231 111202 208019 39433 -47621 -1203 39818 88980 -42861 -76881
708 -76881 -101560 -178370 -141344 -106613 89983 98229 5243 62890 44966 56311 -197178 -178604
696 -178604 4052 11583 -49959 -165072 -18450 -139261 6928 199582 78641 22415 69977
685 69977 24710 -48426 -150592 -106722 -336209 -241677 -48255 50027 -24490 -80959 -138390
674 -138390 -187591 -60138 27419 68237 112255 44674 -259843 -203540 31137 226626 170378
663 170378 28683 37666 131419 25051 147445 192113 97282 203321 51941 3535 49534
652 49534 -106335 -72423 -34224 73703 153235 202381 101933 191584 110847 105279 239167
641 239167 106080 -124249 -49210 -59755 -33840 -13294 -53637 -189260 -142242 -311353 -188045
630 -188045 -317369 -246690 -49680 38512 -7698 37948 206403 159688 35309 -8949 41057
619 41057 -143956 -271489 -111390 -57323 -185331 -133653 -137827 -61190 -53662 31493 -150618
608 -150618 -308070 -21869 114314 6475 26302 69343 86648 -59889 -54699 -129159 68462
597 68462 -108344 -6768 -4664 -4300 -97352 -141138 63527 -4310 -28611 -123290 -384440 -169363
585 -169363 -21887 -50599 -16827 68765 -166720 -186481 55060 136483 123212 22564 -124449
574 -124449 -30684 -16888 72266 -75233 -208656 -141506 -133531 -177417 -231201 -15745 -200718
563 -200718 -45758 -24086 -16207 -71818 -268988 -211607 -152735 -18674 -205837 -221636 -116875
552 -116875 -218730 -12385 38878 -228210 -264439 -92056 3792 -173695 -106107 -50815 -104701
541 -104701 -217689 -164884 -155074 -20043 -40917 -34203 122731 -10183 88941 -13000 -90294
530 -90294 -168721 -86928 -192612 -178191 -153491 -123276 10367 10059 67921 123596 -55811 -181372
518 -181372 -152861 150460 78408 -66634 77543 -97057 4341 190336 147551 207035 33105
507 33105 -139319 -141612 -133608 21696 126244 -95729 -118149 -21414 152451 -13986 -41188
496 -41188 -95679 -128438 -50792 -117531 -9235 -29871 -3205 -32759 34274 155985 96758 -50725
484 -50725 -113787 -24382 29383 65884 -3152 -153189 -167333 -111346 -49684 -120912 -142470 -61557
472 -61557 -10097 102998 -90820 -75461 -618 31482 84046 -149091 -199883 -132077 -61670
461 -61670 -12365 -32331 -36297 -69636 -109046 21075 215705 104643 36301 70097 34139 -77504
449 -77504 -109186 -253253 -295054 77194 75280 47478 -120328 -123842 -22146 264298 114986
438 114986 10686 -145056 -119839 22953 -43529 -82925 -52431 -224447 -193479 -185492 -95463
427 -95463 -40974 -181013 -100265 -82704 -124962 -85816 -221044 -253275 96346 6352 -25760
416 -25760 -29323 150881 98443 46811 -112162 -64916 40629 39649 29015 -120290 -157100 -135909
404 -135909 25277 -16893 -54341 77472 101310 -57849 -144751 -31909 145909 136499 60224
393 60224 125324 135945 40887 65610 -103787 -96216 185772 138015 -127311 -257668 -34996
382 -34996 -55791 -70483 -2866 -74549 79817 84396 -28160 -7162 79174 68219 -53734 45638
370 45638 192233 149243 47003 10618 -50765 81306 176510 197529 153320 80082 53335
359 53335 85583 -8988 -202514 -137301 -88379 -50255 18015 -36406 77730 57305 93990 -14359
347 -14359 57148 178926 183311 120285 29344 74604 7311 55560 3979 174537 3941 -19325
335 -19325 162836 -27596 167911 126375 -89575 -116012 -5202 130943 289128 137847
325 137847 46781 -132887 -125261 -67226 14201 -39559 -310656 -277088 -239577 -287245 -330075 -233869
313 -233869 -214194 -35739 -129913 -67370 165488 113242 -21255 51238 218692 86948 108922
302 108922 73146 -85661 44001 141620 116213 -15778 134271 19060 -102295 -36937 176152
291 176152 116012 -94917 -99379 -161224 -274005 -164637 31680 21512 -144669 18025 3082
280 3082 -339791 -203024 -70216 -74150 91485 -53329 -296065 -190664 -65187 -20919 144419
269 144419 190568 137701 275591 433193 448953 232353 -9209 -115110 -65241 -96764 105520
258 105520 268536 -76346 -82984 -44619 -9955 -191839 -54433 97744 -34575 19045 56082
247 56082 25321 106414 -24580 37382 -9436 100276 148173 -103597 -223072 -138967 -38715
236 -38715 2678 132942 11529 5127 139899 26654 -136257 -130084 25540 134526 -78973
225 -78973 45477 54927 -75385 -83984 -40004 -173995 -104762 -81874 -60538 145184 115703 -69749
213 -69749 82335 175668 91170 -97526 -44204 -44947 -24073 -7032 -87169 -53636 34639 -85111
201 -85111 -38891 110794 158114 245913 219890 160175 250784 194851 286205 42106 -44314 65113
189 65113 15296 -126399 -231519 -236362 -109361 125495 157900 135746 174228 308539 122587
178 122587 107296 217159 70424 -104486 -173095 -223654 -170851 -154631 -395446 -232919 -95001
167 -95001 -31681 -67082 -115800 5199 30376 -88553 -188662 -105334 13305 48287 21709
156 21709 15729 -54378 31701 186680 75722 -61161 116876 44378 -5019 53424 96414
145 96414 44923 188702 91331 -37249 -76599 -99693 -13038 59315 -81421 -141661 -65561
134 -65561 -75244 -125775 -181888 -225514 -231443 -75233 96829 150224 297721 123045 47977 13735
122 13735 65505 -2684 -62646 -54108 -28804 -86447 -64058 -27215 6969 -56485 -9479 -71099
110 -71099 63214 115356 -55215 -72914 -228869 -32945 -91533 -33456 29381 -27429 -10731
99 -10731 60847 -7172 -7138 25317 92197 -9708 -18124 104214 -22998 -96741 18151 34866
87 34866 38797 21155 71859 -17921 21641 74446 125958 34179 47202 80246 -172876 -98352
75 -98352 10999 57634 -15383 -41428 41068 -116792 -123522 -29409 102804 210256 20487
64 20487 -12710 -41058 31495 -19236 -83229 18389 -76707 -60819 47050 18536 39960 202276
52 202276 121861 -100026 -181717 -218289 -58524 -80632 -85273 15338 35191 52632 9847 -19229
40 -19229 -77176 -33385 -120353 -100586 -74692 -106115 41316 -137846 -99150 1150 -121974
29 -121974 -64193 -14948 74017 98040 66064 -50410 -53439 -64872 -148048 -89777 92405 81429
17 81429 90987 124338 129080 -16123 -148398 -109881 -49794 -35863 -5296 -27494 48653 47853 -83676
4 -83676 38963 13851 1937 20033
0 20033
$$ Imaginary data points
##PAGE= N=2
##DATA TABLE= (X++(I..I)), XYDATA
16383 -1582665 -1509427 -1435356 -1292468 -1277289 -1292215 -1387301 -1258484 -1256469 -1233096 -1296046 -1193295
16372 -1193295 -1047413 -1040284 -975827 -1066237 -880584 -747272 -895207 -934218 -800690 -687034
16362 -687034 -645365 -556733 -477811 -458912 -543818 -556616 -415006 -407572 -361193 -422928 -383905
16351 -383905 -404838 -287941 -284653 -250302 -147935 -105178 -24090 -6544 -28736 53771 48305
16340 48305 15617 102725 40610 214689 327843 180189 243508 403671 397216 315172 424721
16329 424721 411096 423287 464245 426112 531967 643414 791047 864962 779311 787784 798901
16318 798901 961072 1041991 1054044 1101087 1054361 1036719 1121829 1076953 1154625 1117199 1076214
16307 1076214 1186845 1118468 1309074 1327579 1284037 1248121 1175476 1302669 1411570 1425079
16297 1425079 1564279 1712128 1695115 1661725 1745444 1690478 1795813 1571239 1549077 1745764
16287 1745764 1953752 1891945 1863788 1890857 1752195 1777594 1805334 1911562 1928513 2003707 2022574
16276 2022574 2059070 2124023 2165124 2186853 2201819 2308587 2311164 2230188 2170966 2232985 2392956
16265 2392956 2545911 2541647 2551850 2514019 2706871 2575047 2367614 2612566 2592454 2584952 2616512
16254 2616512 2770402 2824518 2786378 2699475 2734541 2658994 2775916 2764432 2790249 2886007 2795958
16243 2795958 2838980 2804936 2767258 2884333 2895225 3070135 3139081 3304624 3249351 3184868 3140082
16232 3140082 3218934 3350741 3220492 3117241 3171944 3209757 3290967 3345689 3329819 3291811 3326910
16221 3326910 3480867 3431051 3483140 3361826 3316124 3258142 3517203 3371718 3375417 3593683
16211 3593683 3644996 3478683 3426698 3507406 3483655 3551124 3653020 3701295 3574095 3511480 3517789
16200 3517789 3586926 3597338 3510183 3615227 3579884 3635377 3781910 3825737 3769429 3686158 3864351
16189 3864351 3996231 3935041 3860781 3755076 3891528 3875659 3874493 3806847 3713576 3938914 4037599
16178 4037599 4160761 4078543 4076760 4010063 3938762 3892636 4079987 3988278 3793763 3904581 3989291
16167 3989291 4066853 3967535 4105402 4194051 4194551 4086328 4086278 4095193 3933805 4091493 4159077 4108223
16155 4108223 4037255 3975909 3998078 4153857 4170958 4158688 4219376 4287305 4274735 4224110 4301694
16144 4301694 4287611 4241407 3993878 3868293 4159167 4314206 4423478 4563740 4619539 4497181
16134 4497181 4169351 4200301 4202217 4361744 4426302 4308145 4284246 4264305 4257886 4353833 4447125
16123 4447125 4309943 4312320 4297103 4215821 4256256 4375056 4456655 4436941 4276353 4280568 4438857
16112 4438857 4379751 4505960 4543238 4416475 4270023 4225559 4378311 4329558 4356663 4349177 4571586
16101 4571586 4534231 4466238 4429121 4204744 4229590 4330468 4320088 4405974 4503067 4370246 4169205
16090 4169205 4383320 4638297 4717392 4552450 4524897 4622304 4557405 4428831 4451492 4622674
16080 4622674 4636177 4843882 4840296 4516935 4504849 4512452 4375472 4330840 4469434 4349692 4481919
16069 4481919 4498875 4437676 4323583 4382887 4467251 4515956 4547190 4490565 4553979 4507780 4612119
16058 4612119 4565044 4400872 4494063 4647634 4715269 4784687 4631328 4597548 4708301 4524359
16048 4524359 4729359 4722097 4701474 4662853 4551042 4544951 4506894 4580697 4357534 4371399 4401997
16037 4401997 4528407 4490087 4661475 4634886 4747268 4699735 4404617 4338011 4404468 4508460
16027 4508460 4444157 4354599 4545062 4620509 4553854 4470873 4545702 4371245 4396270 4539084 4516318
16016 4516318 4511582 4427985 4483722 4590278 4619621 4527537 4428841 4610026 4748333 4742903 4408024
16005 4408024 4373153 4554382 4472532 4415382 4502070 4532348 4469254 4504366 4479392 4315090 4406826
15994 4406826 4634530 4638827 4422835 4486086 4401687 4559026 4655515 4454017 4594480 4585624 4480809
15983 4480809 4595146 4632718 4790869 4826033 4672529 4563649 4460935 4393634 4356378 4333412
15973 4333412 4342932 4391141 4465976 4448905 4412511 4545915 4447944 4475849 4649971 4905518 4682615
15962 4682615 4511752 4359242 4435102 4453322 4505627 4741965 4653873 4430284 4536795 4598405
15952 4598405 4377461 4430802 4506035 4515461 4629187 4683915 4717453 4619394 4519380 4683753 4694432
15941 4694432 4567056 4396232 4398517 4482017 4429451 4532587 4553247 4551878 4617346 4721255 4776107
15930 4776107 4692935 4410764 4413793 4658613 4627853 4464645 4420989 4419330 4536762 4519023 4530315
15919 4530315 4371013 4449683 4469525 4513915 4410145 4407035 4567038 4733248 4633998 4628865 4528042
15908 4528042 4574824 4414316 4597987 4630957 4636247 4500017 4438670 4446036 4455358 4716585 4524189
15897 4524189 4370461 4439658 4503735 4452161 4290557 4419274 4690324 4526546 4545546 4535839
15887 4535839 4670962 4556568 4590660 4301098 4472554 4529090 4474517 4491024 4519643 4598435
15877 4598435 4582432 4556775 4556657 4632724 4730411 4852368 4842089 4703096 4659613 4615536 4323238
15866 4323238 4267426 4615740 4631657 4657976 4775339 4910666 4661107 4600222 4575315 4552941
15856 4552941 4588800 4622628 4614429 4648066 4600274 4587795 4808315 4562201 4442095 4575728 4524532
15845 4524532 4598044 4587922 4376148 4292035 4460864 4583148 4657273 4588024 4563926 4608535 4540258
15834 4540258 4544260 4622265 4389087 4257435 4409054 4547573 4653146 4729637 4805137 4809673 4920151
15823 4920151 4873666 4726788 4575618 4458802 4632274 4634530 4552827 4455105 4353788 4544808
15813 4544808 4664860 4622669 4359369 4489701 4647225 4707841 4624676 4537393 4597248 4635653
15803 4635653 4563695 4502567 4423568 4540855 4527614 4474466 4458140 4583946 4619374 4527643 4602491
15792 4602491 4518377 4450584 4619863 4656406 4786294 4848733 4612376 4640704 4680573 4634415 4684223
15781 4684223 4895758 4821413 4692611 4835594 4715280 4551919 4395697 4503268 4724952 4657298
15771 4657298 4431185 4337330 4473297 4438913 4589972 4710517 4722544 4689808 4859090 4872317
15761 4872317 4855148 4767197 4695025 4751911 4935598 4899045 4680236 4677197 4800244 4712740 4657243
15750 4657243 4721184 4599805 4487370 4432043 4604073 4749860 4828492 4840068 4753703 4535650
15740 4535650 4564101 4609218 4688023 4596020 4699263 4883457 4705305 4806437 4950065 4858495
15730 4858495 4636686 4643567 4839059 4702170 4721757 4559121 4495831 4502517 4479747 4541268 4554441
15719 4554441 4675206 4629484 4545427 4812863 4704544 4512682 4714176 4871903 4682234 4745581
15709 4745581 4657940 4541455 4648227 4650710 4607526 4694768 4630268 4684503 4777072 4695391 4912002
15698 4912002 4851275 4809245 4918435 4881231 4925705 4932723 4881061 4701479 4685951 4910617 4832929
15687 4832929 4851656 4798659 4753278 4610578 4736567 4786401 4717094 4724368 4854716 4784179 4771094
15676 4771094 4827461 4718462 4649214 4857853 4811118 4721800 4707610 4538438 4680117 4572435
15666 4572435 4471651 4765030 4682508 4742578 4695197 4638125 4563444 4724518 4805741 4635170
15656 4635170 4684085 4598241 4668484 4740209 4842616 4806392 4728841 4919292 4829237 4508942 4727983
15645 4727983 4936390 4760499 4760267 4734127 4735867 4719824 4548975 4694816 4791373 4853216 4817712
15634 4817712 4768428 4744585 4791731 4715972 4712841 4704343 4794493 4748644 4819889 4898456 4966585 4941406
15622 4941406 4736662 4702669 4673525 4776752 4836501 4827835 4557159 4531224 4881548 4829215 4581794
15611 4581794 4551970 4803744 4865887 4741998 4711745 4532601 4552785 4629871 4679426 4904217
15601 4904217 4688733 4564764 4611259 4681721 4941014 4979527 4943279 4843247 4855076 5040553
15591 5040553 4833867 4785572 4656097 4751782 4949820 4767354 4793870 4733848 4848752 4718891
15581 4718891 4819573 4812899 4711805 4578215 4728508 4790280 4830896 4833372 4730242 4750773 4899407
15570 4899407 4889269 4752377 4775062 4709214 4724653 4780772 4755879 4618357 4709683 4644680 4794668
15559 4794668 4803723 4731339 4902824 4870290 4888609 4870411 4844155 4696576 4510222 4705768 4847492
15548 4847492 4726339 4668778 4812710 4946424 4896793 4685106 4735726 4633520 4737367 4905122
15538 4905122 4726050 4845634 4920979 4784101 4617100 4733177 4585139 4646830 4721006 4741186
15528 4741186 4889254 4772967 4657879 4549996 4632177 4719499 4837568 4619529 4560460 4587433
15518 4587433 4749728 4829085 4879254 4754885 4712950 4702792 4649306 4767714 4909135 4772503
15508 4772503 4662271 4636720 4691064 4865997 5102514 5188072 4843228 4825585 4938399 4850364
15498 4850364 4643284 4509598 4647629 4807115 4945895 4968899 4775529 4745422 4704795 4739761
15488 4739761 4674946 4745993 4675875 4682733 4914972 4991174 4890882 4886345 4841626 4911823 4828460
15477 4828460 4675396 4852803 4786453 4650546 4850095 4843689 4817858 4616803 4647657 4828095
15467 4828095 4762897 4911342 4799869 4793166 4561754 4508582 4841015 4810550 4775667 4924683
15457 4924683 4912606 4872534 4908942 4994852 4883309 4682758 4689561 4747931 4826559 4686602 4771936
15446 4771936 4684053 4677247 4725946 4601286 4753756 4887731 4843220 4852647 4971809 4926922 4870226
15435 4870226 4669407 4757037 4937219 4934340 4935807 4938723 5032754 5128759 4917358 4847684 4951088
15424 4951088 5112188 4958992 4827412 4949627 4973020 5016199 4944259 4925850 5002126 5023068
15414 5023068 4972707 4997502 4831752 4758573 4866308 4869294 4900902 4972440 4990895 4820054 4884096
15403 4884096 4912252 4854678 5002467 4873879 4845957 4726386 4565648 4497591 4728988 4874290
15393 4874290 4739880 4557590 4688523 4807062 4790568 4722870 4641767 4817393 4963362 4958062
15383 4958062 4890227 4856045 4841672 4787140 4698997 4792144 4747530 4761122 4842781 4968807 4926741
15372 4926741 4765391 4702359 4765044 4825569 4673506 4774151 4948661 4791079 4642789 4754505
15362 4754505 4707352 4758233 4672020 4499995 4604266 4647155 4862388 4786764 4871164 5097642
15352 5097642 5032731 4911471 5061704 5034392 4787666 4711214 4864220 4916807 4891789 4758697
15342 4758697 4815858 4905161 4761485 4795045 4898472 4898797 4840319 4968434 4958393 4945702 5088558
15331 5088558 5129295 5245192 5181416 5042355 4862949 5109712 5125228 4710784 4775754 4798157
15321 4798157 4872093 5142279 5033793 4879318 4889827 4943187 4944688 4992193 4943872 4986334 4830926
15310 4830926 4646018 4761363 5049945 5186247 5039977 5108439 5190950 4902605 4690697 4739894
15300 4739894 4650901 4789520 4959721 4937394 4998906 5093556 5004813 4911177 4812595 4972636 4893608
$$ [...]
##END NTUPLES=NMR SPECTRUM
##END=
