##TITLE=1H_TG-2330-3
 CDCl3
 8 sc, 
 12.11.2021
##JCAMPDX= 6.0         $$ Bruker NMR JCAMP-DX V2.0
##DATA TYPE= NMR SPECTRUM
##DATA CLASS= NTUPLES
##ORIGIN= UXNMR, Bruker Analytische Messtechnik GmbH
##OWNER= root
$$ XWIN-NMR		Version 3.5
$$ Fri Nov 12 11:40:45 2021 Russian Standard Time (UT+4h)  she@DPX200
##.OBSERVE FREQUENCY= 200.131346
##.OBSERVE NUCLEUS= ^1H
##.ACQUISITION MODE= SIMULTANEOUS
##.ACQUISITION SCHEME= undefined
##.AVERAGES= 8
##.DIGITISER RES= 18
##SPECTROMETER/DATA SYSTEM= spect
##.PULSE SEQUENCE= zg30
##.SOLVENT NAME= Acetone
##.SHIFT REFERENCE= (INTERNAL, Acetone, 0, 15.7866)
##AUDIT TRAIL= $$ (NUMBER, WHEN, WHO, WHERE, WHAT)
$$ ##TITLE= Audit trail, XWIN-NMR		Version 3.5
$$ ##JCAMPDX= 5.01
$$ ##ORIGIN= Bruker BioSpin GmbH
$$ ##OWNER= she
$$ F:/spectra/data/she/nmr/H-F/1/pdata/1/auditp.txt
$$ ##AUDIT TRAIL=  $$ (NUMBER, WHEN, WHO, WHERE, WHAT)
(   1,<2021-11-12 11:39:28.92 +0400>,<she>,<DPX200>,
      <created by zg, POWCHK disabled, PULCHK disabled
       configuration hash MD5:
       00 E9 B6 7A A2 85 ED C7 34 08 36 98 17 FE 4E 26
       data hash MD5: 16K
       D3 8A DF 3D 47 A9 F7 5D B0 41 DF 32 25 51 A3 E4>)
(   2,<2021-11-12 11:39:31.60 +0400>,<she>,<DPX200>,
      <Start of raw data processing
       efp BC_mod = 2 LB = 0.24 FT_mod = 6 PKNL = 1 PHC0 = -15511.76 PHC1 = 14.00081 SI = 16K 
       data hash MD5: 16K
       C8 66 D6 69 FD 86 E7 E9 37 14 02 0B D2 F2 F6 B8>)
(   3,<2021-11-12 11:39:53.85 +0400>,<she>,<DPX200>,
      <pk PHC0 = 1.931167 PHC1 = -3 
       data hash MD5: 16K
       E5 7A 19 89 46 C6 F0 9C C9 7A 80 B1 5F 6E 76 82>)
(   4,<2021-11-12 11:39:57.89 +0400>,<she>,<DPX200>,
      <abs ABSG = 5 
       data hash MD5: 16K
       A5 FD C7 53 34 17 A4 9B EC 7F 9F B2 91 53 F7 60>)
$$ ##END=
$$ 
$$ hash MD5
$$ 39 FC 1E 45 C2 FA 5A 20 B8 FC 95 B8 88 6D 1B F1
##$RELAX= 
##$RELAX= 
##$RELAX= 
##$RELAX= 
##$RELAX= 
##$RELAX= 
$$ Bruker specific parameters
$$ --------------------------
##$DU= <F:/spectra>
##$EXPNO= 1
##$NAME= <H-F>
##$PROCNO= 1
##$TYPE= <nmr>
##$USER= <she>
##$AMP= (0..31)
100 100 100 100 100 100 100 100 100 100 100 100 100 100 100 100 100 100 
100 100 100 100 100 100 100 100 100 100 100 100 100 100 
##$AQSEQ= 0
##$AQ_mod= 1
##$AUNM= <au_zg>
##$AUTOPOS= <>
##$BF1= 200.13
##$BF2= 200.13
##$BF3= 200.13
##$BF4= 200.13
##$BF5= 200.13
##$BF6= 200.13
##$BF7= 200.13
##$BF8= 200.13
##$BYTORDA= 1
##$CFDGTYP= 0
##$CFRGTYP= 5
##$CHEMSTR= <none>
##$CNST= (0..31)
1 1 145 1 1 1 1 1 1 1 1 1 1 1 1 1 1 1 1 1 1 1 1 1 1 1 1 1 1 1 1 1 
##$CPDPRG= <>
##$CPDPRG1= <>
##$CPDPRG2= <>
##$CPDPRG3= <>
##$CPDPRG4= <mlev>
##$CPDPRG5= <mlev>
##$CPDPRG6= <mlev>
##$CPDPRG7= <mlev>
##$CPDPRG8= <mlev>
##$CPDPRGB= <>
##$CPDPRGT= <>
##$D= (0..31)
0 1.2 0 0 0 0 0 0 0 0.06 0 0.03 0 0 0 0 0.0002 0 0 0 0 0 0 0 0 0 0 0 0 
0 0 0 
##$DATE= 1636702768
##$DBL= (0..7)
120 120 120 120 120 120 120 120 
##$DBP= (0..7)
150 150 150 150 150 150 150 150 
##$DBP07= 0
##$DBPNAM0= <>
##$DBPNAM1= <>
##$DBPNAM2= <>
##$DBPNAM3= <>
##$DBPNAM4= <>
$$ [...]
##$SUBNAM2= <"">
##$SUBNAM3= <"">
##$SUBNAM4= <"">
##$SUBNAM5= <"">
##$SUBNAM6= <"">
##$SUBNAM7= <"">
##$SUBNAM8= <"">
##$SUBNAM9= <"">
##$SW= 18.0517287032376
##$SWIBOX= (0..15)
0 0 2 0 0 0 0 0 0 0 0 0 0 0 0 0 
##$SW_h= 3612.71676300578
##$TD= 16384
##$TD0= 1
##$TE= 0
##$TE2= 300
##$TE3= 300
##$TEG= 300
##$TL= (0..7)
0 120 120 120 120 120 120 120 
##$TP= (0..7)
150 150 150 150 150 150 150 150 
##$TP07= 0
##$TPNAME0= <>
##$TPNAME1= <>
##$TPNAME2= <>
##$TPNAME3= <>
##$TPNAME4= <>
##$TPNAME5= <>
##$TPNAME6= <>
##$TPNAME7= <>
##$TPOAL= (0..7)
0.5 0.5 0.5 0.5 0.5 0.5 0.5 0.5 
##$TPOFFS= (0..7)
0 0 0 0 0 0 0 0 
##$TUNHIN= 0
##$TUNHOUT= 0
##$TUNXOUT= 0
##$USERA1= <user>
##$USERA2= <user>
##$USERA3= <user>
##$USERA4= <user>
##$USERA5= <user>
##$V9= 5
##$VALIST= <valist>
##$VCLIST= <CCCCCCCCCCCCCCC>
##$VD= 0
##$VDLIST= <DDDDDDDDDDDDDDD>
##$VPLIST= <PPPPPPPPPPPPPPP>
##$VTLIST= <TTTTTTTTTTTTTTT>
##$WBST= 1024
##$WBSW= 4
##$XGAIN= (0..3)
0 0 0 0 
##$XL= 0
##$YL= 0
##$YMAX_a= 608770
##$YMIN_a= -835567
##$ZGOPTNS= <>
##$ZL1= 120
##$ZL2= 120
##$ZL3= 120
##$ZL4= 120
##$ABSF1= 15.74028
##$ABSF2= -2.311569
##$ABSG= 5
##$ABSL= 3
##$ALPHA= 0
##$AQORDER= 0
##$ASSFAC= 0
##$ASSFACI= 0
##$ASSFACX= 0
##$ASSWID= 0
##$AUNMP= <proc_1d>
##$AZFE= 0.1
##$AZFW= 0.1
##$BCFW= 0
##$BC_mod= 2
##$BYTORDP= 0
##$COROFFS= 0
##$CY= -3
##$DATMOD= 1
##$DC= 0
##$DFILT= <>
##$DTYPP= 0
##$F1P= 0
##$F2P= 0
##$FCOR= 1
##$FTSIZE= 16384
##$FT_mod= 6
##$GAMMA= 0
##$GB= 0
##$INTBC= 1
##$INTSCL= 0
##$ISEN= 128
##$LB= 0.24
##$LEV0= 0
##$LPBIN= 0
##$MAXI= 10000
##$MC2= 0
##$MEAN= 0
##$ME_mod= 0
##$MI= 1.114404
##$NCOEF= 0
##$NC_proc= -5
##$NLEV= 6
##$NOISF1= 3.799351
##$NOISF2= 2.8
##$NSP= 0
##$NTH_PI= 0
##$NZP= 0
##$OFFSET= 15.78656
##$PC= 1
##$PHC0= -15509.83
##$PHC1= 11.00081
##$PH_mod= 1
##$PKNL= yes
##$PPARMOD= 0
##$PSCAL= 0
##$PSIGN= 0
##$REVERSE= no
##$SF= 200.12999299484
##$SI= 16384
##$SIGF1= 3
##$SIGF2= 2
##$SINO= 5.538805
##$SIOLD= 16384
##$SREGLST= <1H.CDCl3>
##$SSB= 0
##$STSI= 16384
##$STSR= 0
##$SW_p= 3612.71676300578
##$SYMM= 0
##$S_DEV= 0
##$TDeff= 16384
##$TDoff= 0
##$TI= <>
##$TILT= no
##$TM1= 0
##$TM2= 0
##$TOPLEV= 0
##$USERP1= <user>
##$USERP2= <user>
##$USERP3= <user>
##$USERP4= <user>
##$USERP5= <user>
##$WDW= 1
##$XDIM= 16384
##$YMAX_p= 395126775
##$YMIN_p= -192014
$$ End of Bruker specific parameters
$$ ---------------------------------
##NTUPLES= NMR SPECTRUM
##VAR_NAME=  FREQUENCY,     SPECTRUM/REAL,   SPECTRUM/IMAG
##SYMBOL=    X,             R,               I
##VAR_TYPE=  INDEPENDENT,   DEPENDENT,       DEPENDENT
##VAR_FORM=  AFFN,          ASDF,            ASDF
##VAR_DIM=   16384,         16384,           16384
##UNITS=     HZ,            ARBITRARY UNITS, ARBITRARY UNITS
##FACTOR=    0.220516191357247, 1,           1
##FIRST=     3159.36415393899, 0,            0
##LAST=      -453.352609066792, 0,           0
##MIN=       -453.352609066792, -192014,     0
##MAX=       3159.36415393899, 395126775,    0
$$ Real data points
##PAGE= N=1
##DATA TABLE= (X++(R..R)), XYDATA
$$ [...]
7092A305929M5819O5339L5314L3050K8221J20679R6375L6478L9065K5482k173
7081A829578K6323O7777m1318N2499O0454P3777M6123M5106R0632J10782R6949
7070B458682J12082Q5143J00341J54319J25838J32488J77910J81433K40544K84248
7060D053028L05928K03314Q3340m556m9312j09621j05875r7891q2827m281q4441
7049D106806l112L1902K892L1529P1107J01754L1020K203J25662J06792Q4590
7038D693145N9884R2799Q2753J62075J36500J65200J32697J77524J75543K06826
7028F084946K32643K10053K43104K63790K65941K76323L51314L37893L46139L98957
7018I011103M37560M12572N22731N41320N80705O26455P29534Q45791R15023R85217
$$ y = [1305929, 1351748, 1417087, 1452401, 1485451, 1513672, 1634351, 1730726, 1767204, 1806269, 1831751, 1829578, 1855901, 1923678, 1882360, 1934859, 1995313, 2069090, 2115213, 2160319, 2250951, 2361733, 2458682, 2570764, 2655907, 2756248, 2910567, 3036405, 3168893, 3346803, 3528236, 3768780, 4053028, 4358956, 4562270, 4645610, 4641054, 4591742, 4482121, 4376246, 4278355, 4195528, 4191247, 4106806, 4103694, 4135596, 4138488, 4170017, 4241124, 4342878, 4373898, 4376101, 4501763, 4608555, 4693145, 4753029, 4845828, 4928581, 5090656, 5227156, 5392356, 5525053, 5702577, 5878120, 6084946, 6317589, 6527642, 6770746, 7034536, 7300477, 7576800, 7928114, 8266007, 8612146, 9011103, 9448663, 9861235, 10383966, 10925286, 11505991, 12132446, 12861980, 13707771, 14622794, 15608011]
7008A5608011J120283J280873J416359J662582J867929K206780K630967L049390
7000C0843174L518289M157655M918903N672231O487142P141449P442792P654354
6992G7835989P375544O463632M628853J998552l76938k243443l900703o079697
6984H5701789p885658q872798q660580p916405p064995o156746n114569m113887
6976B9916151l253416k601561k126838j750503j531459j207253j155349j028162
6968A5261610q35628p09112o28752n19846m32188m11891l98224l40458l02862
6959A0682649k81669j68279j60752j98706j84564j66909k88111k64859k33429
6950H735371k47804k82312l02000k95281k24702k76252k63931k82417k45954j94379
$$ y = [15608011, 16728294, 18009167, 19425526, 21088108, 22956037, 25162817, 27793784, 30843174, 34361463, 38519118, 43438021, 49110252, 55597394, 62738843, 70181635, 77835989, 85211533, 91675165, 96304018, 98302570, 97925632, 95682189, 91781486, 85701789, 77816131, 68943333, 60282753, 52366348, 45301353, 39144607, 34030038, 29916151, 26662735, 24061174, 21934336, 20183833, 18652374, 17445121, 16289772, 15261610, 14425982, 13716870, 13088118, 12568272, 12136084, 11724193, 11325969, 10985511, 10682649, 10400980, 10232701, 10071949, 9873243, 9688679, 9521770, 9233659, 8968800, 8735371, 8487567, 8205255, 7903255, 7607974, 7383272, 7107020, 6843089, 6560672, 6314718, 6120339]
6940F120339k23244j51041j81845j73172j46672j42878j33744q8845q6470o8313
6930D724115j07474l4655r5244j4256Q713m4131J5691J61j4130o688K3607J2474
6918D468183p653o6693m7531o6832q0454j23105p4450j09956j59494j77928j96132
6907C357955j38668q6819j34401j23922p3026n7975o2955j11007p4046q1673k8189
6896B385274k1262o2143o2811l30l6807p3721n2658N2789k8477l7688p4715m2954
6884A944497j9351m0405R473J4560n6909k4101J0918j1947l0767m7053l233k6461
6872A719221k5353N567J6256j7489l8068m3574j6328O3772p7008l4208K6265k782
6860A576271M9965K6372r372m5540l0000o2990m1803J7609j7675R522k0270k9853
$$ y = [6120339, 5897095, 5746054, 5564209, 5391037, 5244365, 5101487, 4967743, 4878898, 4792428, 4724115, 4616641, 4581986, 4486742, 4472486, 4481199, 4437068, 4452759, 4452920, 4438790, 4432102, 4455709, 4468183, 4460530, 4393837, 4346306, 4279474, 4199020, 4075915, 4001465, 3891509, 3732015, 3554087, 3357955, 3219287, 3132468, 2998067, 2874145, 2801119, 2743144, 2680189, 2569182, 2495136, 2413463, 2385274, 2364012, 2301869, 2239058, 2238728, 2201921, 2128200, 2075542, 2128331, 2099854, 2062166, 1987451, 1944497, 1925146, 1884741, 1894214, 1908774, 1851865, 1827764, 1838682, 1826735, 1795968, 1748915, 1745682, 1719221, 1693868, 1699435, 1715691, 1698202, 1660134, 1616560, 1600232, 1664004, 1586996, 1552788, 1579053, 1576271, 1626236, 1652608, 1643236, 1597696, 1567696, 1504706, 1462903, 1480512, 1462837, 1472359, 1452089, 1422236]
6848A422236j3604J470K7693j0506L0675m0302Q19l1534L67K0497n5644l0392
6836A321775p203k6762q1747k5753M394k3183J5355L4039r664k9259n0181k1823
6824A099988j1478r0020M50M4754N1390j20363l0975j6166l246q871m8126j6860
6812H50477J8992K5068J8249J7638n6608J4680l921M9889Q13l1072L507l4467
6800H73245P3503j8267n2774O459O211o332j5133K3012j9449l3563k3231P5522
6788H89203M8568N321j92j8765R124j5960o9041N9402O435J030Q906m8222M1725
6775I17534J6013o289J6046J5292K5187M7290L1768j9058L475J5691k4523J0412
6763A048838K5444O762J6554k5042L916J5736K357k2506K3661N441J3637M2912
$$ y = [1422236, 1408632, 1410102, 1437795, 1427289, 1457964, 1417662, 1418481, 1386947, 1387314, 1407811, 1352167, 1321775, 1314572, 1287810, 1206063, 1180310, 1184704, 1161521, 1176876, 1210915, 1201251, 1171992, 1121811, 1099988, 1088510, 998490, 998940, 1043694, 1095084, 974721, 943746, 927580, 924334, 915463, 867337, 850477, 869469, 894537, 912786, 930424, 873816, 888496, 884575, 934464, 935277, 904205, 907712, 873245, 946748, 928481, 875707, 882166, 888377, 882045, 866912, 889924, 870475, 836912, 813681, 889203, 937771, 943092, 942900, 924135, 933259, 917299, 848258, 907660, 914095, 915125, 924031, 875809, 917534, 933547, 927258, 943304, 958596, 983783, 1031073, 1062841, 1043783, 1047258, 1062949, 1038426, 1048838, 1074282, 1081044, 1097598, 1072556, 1076472, 1092208, 1094565, 1072059, 1095720, 1101161, 1114798, 1157710]
6751A157710j8263L7197P351n0909M1922L4245K1818J7021J7961q528m5021K0891
6739A233395j1044J0908P1983q599q445M878J8083Q1408M7011p058n0279J4786
6727A397027Q1472L6189p1245m4581N2711K4512K4684l6629m6513L1761M9325
6716A498713k6408k2501M0829M8731J800l7599N508N2878J12967M5966k5373K8628
6704A724139J4064K0277J4537K6161K8032Q6395L3430k4160M4622o7598L363J8945
6692A922207K4600n464j3281N135L3152J46091O0372l465P6376J9035M0403Q616
6680B313777M9985L4528M2169Q8959k2272K066N0817J6470n6035J9231Q6795O3444
6668B689934L5850K6686R299k9125j7646J18503L7163n7266M9765L5867J9864
$$ y = [1157710, 1139447, 1176644, 1183995, 1133086, 1175008, 1209253, 1231071, 1248092, 1266053, 1257525, 1212504, 1233395, 1222351, 1233259, 1305242, 1296643, 1288198, 1293076, 1311159, 1392567, 1439578, 1432520, 1382241, 1397027, 1478499, 1514688, 1443443, 1398862, 1451573, 1476085, 1500769, 1464140, 1417627, 1449388, 1498713, 1472305, 1449804, 1490633, 1539364, 1541164, 1503565, 1509073, 1561951, 1674918, 1720884, 1695511, 1724139, 1738203, 1758480, 1773017, 1799178, 1827210, 1913605, 1947035, 1922875, 1967497, 1899899, 1903262, 1922207, 1946807, 1941343, 1928062, 1933197, 1966349, 2112440, 2172812, 2169347, 2245723, 2264758, 2305161, 2313777, 2363762, 2398290, 2440459, 2529418, 2507146, 2509212, 2560029, 2576499, 2520464, 2539695, 2626490, 2689934, 2725784, 2752470, 2761769, 2732644, 2714998, 2833501, 2870664, 2813398, 2863163, 2899030, 2918894]
6657B918894N480M6871P4539K230K953O4212N7466M6692L412m458k9737O3201
6645C251755J01953R8282O4378J8673n555K6840M854P855N6685M3463N0098j4
6633C719267n5431k9412J9886K6130j8007L3754N8260N549L3296K0756J5636O2574
6621C892258J15017L7085k69L9330O7309N4384K4833l4022j3686J2612l6229q9216
6609D069406K422k8967n7102k1253k5247l2722l06L780L0679M327K2241L3791
6597D001049L0108j1249J2695L3871P3345L2298j1694N0690P7000L9394L9198
6586D366705j4969L0621J6745L2021K0276O0505L571j1030J5721q5600n4699o8219
6574D311648o6553o8933j5101r4558o0551l3612k1466k7936L24O599j03722k4871
$$ y = [2918894, 2924374, 2971245, 3045784, 3048014, 3050967, 3115179, 3172645, 3219337, 3222749, 3218291, 3188554, 3251755, 3353708, 3451990, 3516368, 3535041, 3529486, 3556326, 3561180, 3569035, 3625720, 3669183, 3719281, 3719267, 3663836, 3634424, 3654310, 3680440, 3662433, 3696187, 3754447, 3759996, 3793292, 3814048, 3829684, 3892258, 4007275, 4044360, 4044091, 4083421, 4150730, 4205114, 4229947, 4195925, 4182239, 4194851, 4158622, 4069406, 4071828, 4042861, 3985759, 3964506, 3939259, 3906537, 3906231, 3910011, 3940690, 3945017, 3967258, 4001049, 4031157, 4019908, 4032603, 4066474, 4139819, 4172117, 4160423, 4211113, 4288113, 4327507, 4366705, 4351736, 4382357, 4399102, 4431123, 4451399, 4511904, 4515475, 4504445, 4520166, 4434566, 4379867, 4311648, 4245095, 4176162, 4161061, 4066503, 4005952, 3972340, 3950874, 3922938, 3923262, 3929861, 3826139, 3801268]
6562C801268L29n955m4288J0537l3944n2131n6136j03949l3576n0159l5969m2232
6550C353795o1219l8411k1362j26219o1841j6620n4134j03204j2830m3018q5785
6539B729152r5524l0945r4834n5654j3281m8030j8924o9879m9144l4350l5803
6528B182784m0205n8944r3781r8411p285k6196o0716m0256k662l2018n2254q834
6516A661222M0548j2070o0794m2254l1734K0973l757n1756K002k0955l9638j9954
6504A441833l2372o816M6062n8869o8301O266p1444n7158K8186m342q085N5350
6492A270310N692k6340p9507m1081K9895L3081n8889K9303j0111N040J9150m7072
6480A129471m0854P286l0804l4609o540j6884m6635M325N3851J8292K4180n1280
$$ y = [3801268, 3801597, 3795642, 3751354, 3761891, 3727947, 3675816, 3619680, 3515731, 3482155, 3431996, 3396027, 3353795, 3292576, 3254165, 3232803, 3106584, 3044743, 3028123, 2973989, 2870785, 2857955, 2814937, 2729152, 2633628, 2602683, 2507849, 2452195, 2438914, 2390884, 2371960, 2302081, 2252937, 2218587, 2182784, 2142579, 2083635, 1989854, 1891443, 1884158, 1857962, 1797246, 1756990, 1754328, 1722310, 1670056, 1661222, 1701770, 1689700, 1628906, 1586652, 1554918, 1575891, 1572134, 1520378, 1522380, 1501425, 1461787, 1441833, 1409461, 1402645, 1448707, 1389838, 1321537, 1327803, 1256359, 1199201, 1227387, 1223045, 1214960, 1270310, 1276002, 1249662, 1170155, 1129074, 1158969, 1192050, 1133161, 1162464, 1152353, 1157393, 1176543, 1129471, 1088617, 1095903, 1065099, 1030490, 1023950, 1007066, 960431, 964756, 1018607, 1036899, 1061079, 1009799]
6468A009799q008j9101j3104K4612k9503l4074q1079m476o226l8557P399l5315
6456G72367k9807K6992J7228o5301q944j24L1198j3916j190P2529J600N4328j7967
6443H38993o6416M7415K0988M111p7585j3396Q551J2538m1926o1786j2635O768
6431F65620J4838L6041r172K3032J4602p9736J1611m5754l7917j0117K606P123
6419E92777J5298o338j9159L4449J7740k7866K352p0610K9445L9234j6893k4825
6407E65604j713J8706L407M486m3041J1640J3635j3487l9433P716P528K4623J3533
6394E73204m3213o728J3155m472O464K7766K0125m0451K228k5348J2767N2848
6382E88345N743l6308J5184N3024k3870L8702o4080m1059j368L3482J2336P3880
$$ y = [1009799, 1001791, 982690, 969586, 994198, 964695, 930621, 849542, 845066, 838840, 800283, 807682, 772367, 742560, 769552, 786780, 721479, 712535, 712411, 743609, 729693, 728503, 801032, 802632, 856960, 838993, 772577, 819992, 840980, 845091, 767506, 754110, 762661, 775199, 733273, 671487, 658852, 665620, 680458, 716499, 707327, 730359, 744961, 665225, 676836, 631082, 593165, 583048, 585654, 592777, 608075, 601737, 582578, 617027, 634767, 606901, 609253, 538643, 568088, 607322, 590429, 565604, 563891, 582597, 586004, 590490, 547449, 559089, 572724, 559237, 519804, 527520, 535048, 559671, 573204, 529991, 523263, 536418, 531946, 538410, 566176, 586301, 545850, 548078, 522730, 535497, 588345, 594088, 557780, 572964, 625988, 602118, 640820, 576740, 535681, 534313, 567795, 580131, 654011]
6370F54011n1574o6734m955O0281K8721K8990o351l0543r282K4362M762m4114
6358E87574J7333m414L3792n5948J4324l0121J6121M065q289J340N7781M0142
6346F73700P053n3259k9177Q2742K3289l1461k8794L2146J7402k2492k8137J9475
6334F62487J3998M1848J6862j1007J9266j5373Q964j6906L0176j6064o454K6106
6322G53903M383l3911P237N579J0733K2538L5144q857j779l2911K6265M1172k9194
6309H00302J7846M2445M8053p2398o357J9962K6482L8271l778K9293K7428j2880
6297I54669M439l0371K5676K0091m2615m06j7249J3045N3682p982r930k0736J01038
6284A043351k6253k9560J125j1407O801K3547J9393j0809K6972m3253O4667l090
$$ y = [654011, 602437, 535703, 530748, 591029, 619750, 648740, 642389, 611846, 602564, 626926, 631688, 587574, 604907, 600493, 634285, 578337, 592661, 562540, 578661, 582726, 574437, 575777, 633558, 673700, 680753, 627494, 598317, 681059, 704348, 672887, 644093, 676239, 693641, 671149, 643012, 662487, 676485, 718333, 735195, 724188, 743454, 728081, 737045, 720139, 750315, 734251, 727797, 753903, 758286, 724375, 731612, 737191, 747924, 770462, 805606, 796749, 794970, 762059, 788324, 829496, 800302, 818148, 860593, 908646, 836248, 829891, 849853, 876335, 914606, 910828, 940121, 967549, 954669, 959108, 928737, 954413, 974504, 931889, 931483, 914234, 927279, 980961, 972979, 963049, 942313, 1043351, 1017098, 987538, 988663, 977256, 984057, 1007604, 1026997, 1016188, 1043160, 999907, 1064574, 1061484]
6272A061484P965N4081q292k2247J0483M4874n3809j8355P97M5787l284m9282
6260A070202L0713K1075k5891L4078l0967m786L4395J474J7208m6875L012K1262
6248A124900K5106o539J7586L6106K7191O466k7457l3226j1507l898L9440j0610
6236A183558O692M7559K5220l5184L6456N7415p408k5830J591k4015j5705N709
6224A256058l3104l0103L7317l902R099L5095j6317O873K2516n1282m162M0944
6212A269032K5451K2350L617J5109j9473J79O1270j8234k6581L9447j2852j8215
6200A341100n2342L7635M9215p574m7687K1656L533J5258K5827k0606K4398n8168
6188A332245m7786Q002K2934K7624K8764Q285k3107M0084k4743m6982M1746K4385
$$ y = [1061484, 1069449, 1123530, 1115238, 1092991, 1103474, 1148348, 1094539, 1076184, 1076981, 1122768, 1119484, 1070202, 1100915, 1121990, 1096099, 1130177, 1099210, 1094424, 1128819, 1130293, 1147501, 1100626, 1103638, 1124900, 1150006, 1143467, 1161053, 1197159, 1224350, 1230816, 1203359, 1170133, 1158626, 1154728, 1194168, 1183558, 1190250, 1237809, 1263029, 1227845, 1264301, 1321716, 1314308, 1288478, 1290069, 1266054, 1250349, 1256058, 1222954, 1192851, 1230168, 1226266, 1235365, 1270460, 1254143, 1261016, 1283532, 1232250, 1228088, 1269032, 1294483, 1316833, 1320450, 1335559, 1316086, 1316265, 1377535, 1359301, 1332720, 1372167, 1359315, 1341100, 1288758, 1326393, 1375608, 1368034, 1320347, 1342003, 1345536, 1360794, 1386621, 1366015, 1390413, 1332245, 1284459, 1292461, 1315395, 1343019, 1371783, 1380068, 1356961, 1397045, 1372302, 1325320, 1367066, 1391451]
6176A391451k826L676K385l067N1778O1602k5069N0626O3469M675m1465m5758
6164A511477J1263r881l7916m0981l4620p0000m3659l112N230P986k9944k3916
6152A241927N3010Q890M676N399p7535K3610L7661r629l4675M7207J8639j6264
6140A302916l2163K6878K4724J591m8341J0868N2050M1486L8492L9587j2457N5123
6128A500754K2366J2557J7905o996j17840p0749p6977q2285l2449k6845L263n3883
6116A088821j0815j2244J2943n9171J0135M6526M0314o9496K1273k4194j3762
6105A030330j217O4705L5118r576m845N0557j3656R616P2515R137k4565L6595
6093A254714r195o2692P4835M5250m8100O6739k624r962p0027m6811o1611r8881
$$ y = [1391451, 1388625, 1392301, 1394686, 1391619, 1443397, 1504999, 1479930, 1530556, 1594025, 1598700, 1557235, 1511477, 1522740, 1512859, 1474943, 1433962, 1399342, 1329342, 1285683, 1282571, 1287801, 1295787, 1265843, 1241927, 1294937, 1303827, 1308503, 1313902, 1236367, 1259977, 1297638, 1288009, 1253334, 1300541, 1319180, 1302916, 1270753, 1297631, 1322355, 1323946, 1275605, 1286473, 1338523, 1380009, 1418501, 1458088, 1445631, 1500754, 1523120, 1535677, 1553582, 1546586, 1428746, 1357997, 1281020, 1198735, 1166286, 1139441, 1142704, 1088821, 1078006, 1065762, 1078705, 1019534, 1029669, 1076195, 1116509, 1047013, 1068286, 1044092, 1030330, 1029113, 1093818, 1128936, 1119360, 1114515, 1165072, 1151416, 1161032, 1233547, 1242684, 1218119, 1254714, 1245519, 1182827, 1257662, 1302912, 1254812, 1321551, 1318927, 1308965, 1238938, 1192127, 1130516, 1031635]
6081A031635K532k3227k865o0004k2421J7069j1104l9026L3787J1586J0228j4627
6069I33563K3753k4918j0082J0549j8022J0139k9067l9190K6326Q079o0893J3528
6057H43765j3684L1584O6713N884j2271J5661J8604Q285J2837O1859L9064l5091
6045A043210K4472O6248l2550l4717J5348k1550l4263Q472K8662m3436k3772L064
6033I99188K3012K945P4581j1717j4357j0630n3731k5327j1504j0242k4240n9711
6021H78267k6672p376L6611L5907J0270M0324r475l9043m6326N1444K9825J1918
6009I65674K7200K6224J8615l4212k4901O501N2370O2646j4840L9001J1262J0631
5997A146171K0841N2050L8672O7122J7981L7845J0913o7261n9220l9994J1659
$$ y = [1031635, 1034167, 1010940, 1008075, 948071, 925650, 942719, 931615, 892589, 926376, 937962, 948190, 933563, 957316, 932398, 922316, 932865, 914843, 924982, 895915, 856725, 883051, 891130, 830237, 843765, 830081, 861665, 928378, 934262, 921991, 937652, 956256, 964541, 977378, 1039237, 1078301, 1043210, 1067682, 1133930, 1101380, 1066663, 1082011, 1060461, 1026198, 1034670, 1063332, 1019896, 996124, 999188, 1022200, 1025145, 1099726, 1088009, 1073652, 1063022, 1009291, 983964, 972460, 962218, 937978, 878267, 851595, 844219, 880830, 916737, 927007, 967331, 957856, 918813, 872487, 923931, 953756, 965674, 992874, 1019098, 1037713, 1003501, 978600, 985101, 1037471, 1100117, 1085277, 1124278, 1135540, 1146171, 1167012, 1219062, 1257734, 1324856, 1342837, 1380682, 1391595, 1324334, 1265114, 1225120, 1236779]
5986A236779l9312m0560k0656l1159J7660L7600l4126O0985l579n419N253M3928
5974A227394M8017P3261L7284M5565K7800M1549M3516O0025O6714R893l0859m0095
5962A610064l9095n2395Q128R15M1153j2316L8025L4722l9543J5278L9526K070
5950A646532l8849n7689l2876M825m8941j092L1418R886l1177K0020k3483j109
5938A477465M4351J9825m9234L0396L3845R370M3046L9521K7703R472k8968J1646
5926A668438N8511m0727n476j9685k7280l2097m8937n5643j4344o5862L1195L5155
5914A483248O6721k6800J171j833L1004l5484n5535M3277J1817l2728M0008k112
5902A522754l2503N0139L0208n1865K7875p234o7704l561j7507l1927L058K7752
$$ y = [1236779, 1197467, 1156907, 1136251, 1105092, 1122752, 1160352, 1126226, 1187211, 1183632, 1178213, 1183466, 1227394, 1275411, 1348672, 1385956, 1431521, 1459321, 1500870, 1544386, 1604411, 1671125, 1681018, 1650159, 1610064, 1570969, 1518574, 1526702, 1527617, 1568770, 1556454, 1594479, 1629201, 1589658, 1604936, 1644462, 1646532, 1607683, 1549994, 1517118, 1521943, 1473002, 1471910, 1503328, 1513214, 1482037, 1502057, 1478574, 1477465, 1521816, 1541641, 1492407, 1522803, 1556648, 1566018, 1609064, 1648585, 1676288, 1685760, 1656792, 1668438, 1726949, 1686222, 1680746, 1661061, 1633781, 1601684, 1552747, 1497104, 1482760, 1416898, 1448093, 1483248, 1549969, 1523169, 1524340, 1522507, 1553511, 1518027, 1462492, 1505769, 1517586, 1484858, 1524866, 1522754, 1490251, 1540390, 1570598, 1518733, 1546608, 1539374, 1471670, 1468109, 1450602, 1418675, 1421733, 1449485]
5890A449485j6152q160j4186M3918M1006M7174N3956j101k9215N4282l8795l3018
5878A549194J7757j8819q383n2447P7338O0577m1525L6786k8866K6152J9959L0027
5866A667750j3244m706J0697K6248Q226L891N0815l829j7800M4928M3101R444
5854A825521O934J7770J8388J7991P13m919o674M0877J3499M2591L5069m8144
5842A959616M2546L2846L5430O3892N1600L4555j2678J16574K6063N555L6262
5831B392261K0983M6842L9496J06698M2301M8213P1987Q1564R2245N5732J08556
5820C106878Q7486L4802J10736P5181Q7033R7940J08980J06488J45313J77727
5810D138564J66050J53705J86516J40270J18766J14831J57468J90788J52805J36951
$$ y = [1449485, 1433333, 1425173, 1410987, 1454905, 1495911, 1543085, 1597041, 1595940, 1566725, 1621007, 1582212, 1549194, 1566951, 1548132, 1539749, 1487302, 1564640, 1625217, 1583692, 1620478, 1591612, 1617764, 1637723, 1667750, 1654506, 1649800, 1660497, 1686745, 1694971, 1698862, 1749677, 1745848, 1728048, 1772976, 1816077, 1825521, 1832455, 1850225, 1868613, 1886604, 1887317, 1882398, 1875724, 1916601, 1930100, 1972691, 2007760, 1959616, 2002162, 2035008, 2070438, 2134330, 2185930, 2220485, 2207807, 2324381, 2350444, 2355999, 2392261, 2413244, 2460086, 2499582, 2606280, 2648581, 2696794, 2768781, 2850345, 2942590, 2998322, 3106878, 3194364, 3229166, 3339902, 3415083, 3502116, 3600056, 3709036, 3815524, 3960837, 4138564, 4304614, 4458319, 4644835, 4785105, 4903871, 5018702, 5176170, 5366958, 5519763, 5656714]
5800E656714K15190J69710K10416J33345J06739O8719J4901n4859p5387j63520
5790F281968k54573k80279k46702j58022k05336j25436j56960o5446m5168l6525
5780D707521o1448o6596J1752L9406j8480K1945p28r198K1927p8014j984L0741
5768D596844q056L7175O4165R2594J05576J26727J06603J70317K72673K07609
5758E772227K53553L27492L45967M51970N70591N96040O53204M28286P3174k66816
5748I205688n84060o63342o05887n29160m29594k16814j06573r4017q7829q0742
5738E807670k9798J8726j7632j1705M6109N3895N3131J34870J80645K61651J57286
5727F654848J85581J70211N3638R251L72p6584j63896k02782k91853k76905k18299
$$ y = [5656714, 5871904, 6041614, 6252030, 6385375, 6492114, 6560833, 6575734, 6520875, 6445488, 6281968, 6027395, 5747116, 5500414, 5342392, 5137056, 5011620, 4854660, 4789214, 4744046, 4707521, 4646073, 4579477, 4591229, 4630635, 4612155, 4634100, 4633372, 4624174, 4646101, 4568087, 4566103, 4596844, 4588788, 4625963, 4690128, 4782722, 4888298, 5015025, 5121628, 5291945, 5564618, 5772227, 6025780, 6353272, 6699239, 7151209, 7721800, 8317840, 8971044, 9399330, 9472504, 9205688, 8621628, 7958286, 7352399, 6823239, 6393645, 6176831, 6070258, 5976241, 5888412, 5807670, 5777872, 5796598, 5778966, 5767261, 5813370, 5867265, 5920396, 6055266, 6235911, 6497562, 6654848, 6840429, 7010640, 7064278, 7073529, 7073901, 6997317, 6833421, 6630639, 6338786, 6061881, 5843582]
5716E843582k06099r2027j36652o2161n1547k3841J1254M1454M4544M6635J31616
5705E546758J24865J22012J90335K02517J76057J02159o0704j54440k02697j08134
5695E938728j66962j13792j18860j13941r3152m5410o9454r397K1709L4612M2514
5684E306595N0970N2787O2774N3306N848O4562O1374N7868J21672J18150Q2003
5673F037909K3093L1095k2346n405K5618Q2648J26937J77299J38357J65966J62567
5662F943738J60719K03708J61901J48499R8962J07742k5088N9979Q512k3606l8481
5651G806585m4826Q10O846P6320J40377J24894K18891K62028K50911K73123K70456
5640I386415L26847L88869L79441L14954K39415K48971J70830P1614k4447n0044
$$ y = [5843582, 5637483, 5545456, 5408804, 5346643, 5295096, 5271255, 5282509, 5323963, 5368507, 5415142, 5546758, 5671623, 5793635, 5983970, 6186487, 6362544, 6464703, 6403999, 6249559, 6046862, 5938728, 5771766, 5657974, 5539114, 5425173, 5332021, 5286611, 5217157, 5207760, 5229469, 5264081, 5306595, 5357565, 5410352, 5473126, 5526432, 5532280, 5596842, 5658216, 5716084, 5837756, 5955906, 6037909, 6061002, 6092097, 6069751, 6064346, 6089964, 6172612, 6299549, 6476848, 6615205, 6781171, 6943738, 7104457, 7308165, 7470066, 7618565, 7717527, 7825269, 7800181, 7860160, 7868672, 7845066, 7806585, 7761759, 7762569, 7769415, 7845735, 7986112, 8111006, 8329897, 8591925, 8842836, 9115959, 9386415, 9713262, 10102131, 10481572, 10796526, 11035941, 11284912, 11455742, 11527356, 11502909, 11452865]
5630A1452865r7022q5384r7285j98079m2789m5136K5713K4628P4582J53759K13210
5619A1379062K12383K44768L22656K95533L53539L31642L09768K12442J07677
5610A3769470K8351j01981j40370l04278k78649k11371k35626k46455j22055l8967
5600A2118069k1675j6597j3280J0833K2961R8120J30974J82124J57792K17087
5590A2886408J89740J04166J84473J22102J42313J10744J33341J41735J45806
5581A4160828K18555L01913L12476L99839L82094K83845L46333N02573O80313
5572A7588769Q45344J078854J307369J553090J681472K025641K224379K392349
5564C0697267K502375K169201J254163K47809n77178j199814j349431j131932
$$ y = [11452865, 11355843, 11270459, 11173174, 10975095, 10932306, 10887170, 10912883, 10937511, 11012093, 11165852, 11379062, 11591445, 11836213, 12158869, 12454402, 12807941, 13139583, 13449351, 13661793, 13769470, 13797821, 13695840, 13555470, 13251192, 12972543, 12761172, 12525546, 12279091, 12157036, 12118069, 12096394, 12079797, 12066517, 12077350, 12100311, 12198431, 12329405, 12511529, 12669321, 12886408, 13076148, 13180314, 13364787, 13486889, 13629202, 13739946, 13873287, 14015022, 14160828, 14379383, 14681296, 14993772, 15393611, 15775705, 16059550, 16405883, 16908456, 17588769, 18434113, 19512967, 20820336, 22373426, 24054898, 26080539, 28304918, 30697267, 33199642, 35368843, 36623006, 36870815, 36293637, 35093823, 33744392, 32612460]
5556C2612460q08388l30027J34460O18292J016347J354697J560665J402363Q70390
5547C8431259j0971j057594j907583k464761k502095k226620j921767j580657
5539B4759211j289688j107660q92006p25178n43736l16193k09288j45521l5326
5530A9494615N2789K26894L50039N14850M30585R7740k12394k96000j65030q8884
5520B0405204m4014J8610J23313J51206K27431K93814M32241N29692N14006O00183
5510B3251686O60809O84802P23055P21016Q36533R04878J025963J253235J521883
5501C1583860J683794J994184K086326K061031K193175K643805L149427L581917
5493E0977519M024828M161602L517303K324208P38468p43832j669828j909115
$$ y = [32612460, 31804072, 31474045, 31608505, 32226797, 33243144, 34597841, 36158506, 37560869, 38431259, 38420288, 37362694, 35455111, 32990350, 30488255, 28261635, 26339868, 24759211, 23469523, 22361863, 21469857, 20744679, 20200943, 19884750, 19675462, 19529941, 19494615, 19547404, 19774298, 20124337, 20639187, 21069772, 21167512, 20955118, 20659118, 20494088, 20405204, 20361190, 20379800, 20503113, 20654319, 20881750, 21175564, 21607805, 22137497, 22651503, 23251686, 23912495, 24597297, 25320352, 26041368, 26877901, 27782779, 28808742, 30061977, 31583860, 33267654, 35261838, 37348164, 39409195, 41602370, 44246175, 47395602, 50977519, 55002347, 59163949, 62681252, 65005460, 65743928, 65000096, 63330268, 61421153]
5485F1421153j498521p41306o3684M21817N57805O93306J183072J572221J697756
5476F5243619J018836l36792j909800l282370m092000m155375l782690l276717
5468D5426711k829884k247536j782395j474516j185670q76563o49184l66142j91051
5459C3823770l53925n99978r44416j035321r30297q62293p36683n97874n19820
5450B7243163m71928m56770m42686m12809k72678j98338j85559j57596q3403j17626
5440B4443770r7027o2800j12488j70716j57401j76006k37609l23544o60084r27130
5430B1518965r84858q71678p65856n96411n36417m68701l35532l02812l05584
5421A6351116j86326j41988j00528q6140j5646J9942Q1609J06736J13872J36561
$$ y = [61421153, 59922632, 59181326, 59117642, 59539459, 60097264, 60790570, 61973642, 63545863, 65243619, 66262455, 65925663, 64015863, 60733493, 56641493, 52486118, 48703428, 45426711, 42596827, 40349291, 38566896, 37092380, 35906710, 35030147, 34380963, 34014821, 33823770, 33469845, 32869867, 31925451, 30890130, 29959833, 29097540, 28360857, 27762983, 27243163, 26771235, 26314465, 25871779, 25458970, 25186292, 24987954, 24802395, 24644799, 24561396, 24443770, 24346743, 24283943, 24171455, 24000739, 23843338, 23667332, 23429723, 23106179, 22446095, 21518965, 20534107, 19662429, 18896573, 18300162, 17763745, 17295044, 16959512, 16656700, 16351116, 16164790, 16022802, 15922274, 15836134, 15820488, 15840430, 15922039, 16028775, 16142647, 16279208]
5411A6279208P2136J3620J9982P2184j898k7002j44143j21531o3271P1005J61609
5400A6331899K64464K57377k9785k65351l80707l59715k97795k01657p5561j30121
5390A5113048j47793n1221O3116J22933J71371K15284J58520J07380R1410K8435
5380A5872483l9194j06707j11456m6676n3310o3439m2728j32238n8338k2242N9378
5369A5255533Q9147Q8072R9874J74344J58714J80064K87262J75849K30134J99750
5359A6938743K36027K63262K92113K94054L80246M80877M96620O24547O57913
5350B0664402O65106P54755R13307J076840J207180J548014J812702K097592K408053
5341C3147951K726834L226048L828844M344706M996425N914355O592310N850845
$$ y = [16279208, 16351344, 16364964, 16384946, 16457130, 16455232, 16428230, 16284087, 16162556, 16099285, 16170290, 16331899, 16596363, 16853740, 16823955, 16558604, 16177897, 15818182, 15520387, 15318730, 15243169, 15113048, 14965255, 14914034, 14977150, 15100083, 15271454, 15486738, 15645258, 15752638, 15844048, 15872483, 15833289, 15726582, 15615126, 15568450, 15515140, 15451701, 15408973, 15276735, 15218397, 15196155, 15255533, 15344680, 15432752, 15532626, 15706970, 15865684, 16045748, 16333010, 16508859, 16738993, 16938743, 17174770, 17438032, 17730145, 18024199, 18404445, 18885322, 19381942, 20006489, 20664402, 21329508, 22084263, 22997570, 24074410, 25281590, 26829604, 28642306, 30739898, 33147951, 35874785, 39100833, 42929677, 47274383, 52270808, 58185163, 64777473, 70628318]
5333G0628318L109848j062923n369341p401931o851778n253524l565279k374730
5325D1858660j481391q94621l87331k725M19728P91265J139619J547775J972220
5316D4963199K515224K997617L598939M396139N110139N121398M277328K093513
5308G5073496q23462l210778m561808m556110l584592k274681j047473r8083O91974
5299E5608483J396821K094948K671010L096561K716182J212454j169125l350847
5291F4276487m378285m380408l763603k880002k097013j450252r80821p11712
5283D3634391n34111m24473l32993k19069j64599j33484N2577K13493M73131P42601
5273D3307464J096923J357694J807899K053609K512075L098857L425322K905506
$$ y = [70628318, 73738166, 72675243, 67305902, 59903971, 53052193, 47798669, 44233390, 41858660, 40377269, 39482648, 39095317, 39092592, 39512320, 40303585, 41443204, 42990979, 44963199, 47478423, 50476040, 54074979, 58471118, 63581257, 68702655, 72979983, 75073496, 74250034, 71039256, 66477448, 61921338, 58336746, 56062065, 55014592, 54916509, 55608483, 57005304, 59100252, 61771262, 64867823, 67584005, 68796459, 67627334, 64276487, 59898202, 55517794, 51754191, 48874189, 46777176, 45326924, 44346103, 43634391, 43100280, 42675807, 42342814, 42123745, 41959146, 41825662, 41878239, 42091732, 42564863, 43307464, 44404387, 45762081, 47569980, 49623589, 52135664, 55234521, 58659843, 61565349]
5265F1565349J180414j337281l571019m626198m634128l978365l233430k588097
5257C8777245k059433j615205j460606j258532j086774r16053q88324p23233o34713
5248B8134372o37376n96409n45919m92991k88981k50688k49019k41549l47306
5239B4484134l50319j34399m4614M0749K72846L44873L83510N15006M98745O37797
5229B6648328Q22099R42110J207924J415849J812461J995191J693876Q04222o13602
5220C6728458k080816k713566k662247k239982j715632j336114r95692p01317
5212B2283092n32078l47662j58092m7336O4966J01661J07549J09468L11758M11073
5202B2304399O48299Q18691R56887J093451J310055J561806J917839K124243J858546
$$ y = [61565349, 62745763, 61408482, 57837463, 53211265, 48577137, 44598772, 41365342, 38777245, 36717812, 35102607, 33642001, 32383469, 31296695, 30380642, 29492318, 28769085, 28134372, 27496996, 26900587, 26354668, 25861677, 25572696, 25322008, 25072989, 24831440, 24484134, 24133815, 23999416, 23954802, 23995551, 24268397, 24613270, 24996780, 25511786, 26010531, 26648328, 27470427, 28412537, 29620461, 31036310, 32848771, 34843962, 36537838, 37342060, 36728458, 34647642, 31934076, 29271829, 27031847, 25316215, 23980101, 22984409, 22283092, 21751014, 21403352, 21245260, 21197924, 21262890, 21364551, 21472100, 21581568, 21893326, 22304399, 22952698, 23771389, 24728276, 25821727, 27131782, 28693588, 30611427, 32735670, 34594216]
5193C4594216P58275r64570k484569l172214l208416k783424k153046j656036
5185A8930216j227615r90061o93120n54861m92027m12789k86625j64152j75427
5176A3933539k81322k37142k35567j14174n7270j55900k38733l05731l18287l44748
5166A1644665l59790k55256k92205k75715l54789l05724k91628l09256k49137
5157H951165k05023k12560k22569k04880k12459j51925j71558j55189k01394k44894
5147F968714j93126j08938j55666j37230j52299k51649o9121r0111j0778l1754
5137E768042n9276p1972p0962j3401j3587K1666j8871j9529L6158M6611K9013
5126E633892J43480J30204Q6175J03095O9637k689p5803q5844k39438k02868j54373
$$ y = [34594216, 35352491, 34387921, 31903352, 28731138, 25522722, 22739298, 20586252, 18930216, 17702601, 16712540, 16019420, 15464559, 14972532, 14559743, 14273118, 14108966, 13933539, 13652217, 13415075, 13179508, 13065334, 13008064, 12852164, 12613431, 12307700, 11989413, 11644665, 11284875, 11029619, 10737414, 10461699, 10106910, 9801186, 9509558, 9200302, 8951165, 8746142, 8533582, 8311013, 8106133, 7893674, 7741749, 7570191, 7415002, 7213608, 6968714, 6775588, 6666650, 6510984, 6373754, 6221455, 5969806, 5900685, 5810574, 5799796, 5768042, 5708766, 5636794, 5565832, 5552431, 5538844, 5560510, 5541639, 5522110, 5558268, 5604879, 5633892, 5777372, 5907576, 5993751, 6096846, 6166483, 6163794, 6087991, 6002147, 5762709, 5559841, 5405468]
5115E405468k17096k31545j08861j00451j32718j30170o4098l3213o3809M8931
5105D372438o8922q1836q1559j6483n7518p5710l0780l8037l7304m299k6170M3995
5093C897815j871r892m825J7053O927k9461K354P727M0616k6068o1962j35138
5081C703275q7783r2657j14246Q65j14051n3097k6880m2928k1020k360J4355j202
5069C162271m5680l4788Q528M8475n6513K0153j2977q1400j0675r4248o6982o718
5057B829446m5088j05859j7341l5555l5365l8822k5679m7472j07725m8854k4077
5046B297609J3330k3847j6016J4282J9615j7426n8366M7748l7417j03302J1181
5035B147391j8915l5836k9098r744j2344M4038j7847j0873J0327j2028K6243m7043
$$ y = [5405468, 5188372, 4956827, 4847966, 4747515, 4614797, 4484627, 4420529, 4387316, 4323507, 4372438, 4303516, 4221680, 4140121, 4123638, 4066120, 3990410, 3959630, 3921593, 3884289, 3879990, 3853820, 3897815, 3895944, 3886052, 3881227, 3898280, 3905207, 3875746, 3878100, 3885827, 3926443, 3900375, 3838413, 3703275, 3615492, 3522835, 3408589, 3409454, 3295403, 3242306, 3215426, 3172498, 3151478, 3149118, 3163473, 3162271, 3116591, 3081803, 3090331, 3138806, 3082293, 3102446, 3089469, 3008069, 2997394, 2903146, 2836164, 2829446, 2784358, 2678499, 2661158, 2625603, 2590238, 2551416, 2525737, 2478265, 2370540, 2321686, 2297609, 2310939, 2287092, 2271076, 2285358, 2304973, 2287547, 2229181, 2276929, 2239512, 2136210, 2147391, 2128476, 2092640, 2063542, 2053798, 2041454, 2085492, 2067645, 2056772, 2067099, 2055071, 2081314, 2034271]
5023B034271j5229J8013Q851n6841p730n636k8805k8131q016m937K253j155L6080
5010A942988j2021j1094Q011J9374J1945K7129K5183J3515P0584L2524N2126M5984
4998B226248Q596n087N6515L1011N9228Q0765J1407O5343Q9152P0844P4209N4490
4986B822721J4681N802k1739J254p5944J1224M3145O2916N7789q4P5514J11386
4974C108665O8575K7057L1030J00625R2632R2594M7044O3181Q8705R3859k276
4963C811691M7419L527j1163L668O0226J19670J11225J62031J31261J81134J48312
4952D769001J35163J54260K00457J63100K17756L03871M26822M68433K95457M1704
4942G176024j21826k11302j99476j14752j4428k4333K764L8105J6009m2214O5465
$$ y = [2034271, 2019042, 2037055, 2045906, 1989065, 1981335, 1975699, 1946894, 1918763, 1910747, 1905810, 1908063, 1906908, 1942988, 1930967, 1919873, 1927884, 1947258, 1959203, 1986332, 2011515, 2025030, 2095614, 2128138, 2180264, 2226248, 2234844, 2229757, 2286272, 2317283, 2376511, 2457276, 2468683, 2534026, 2623178, 2694022, 2768231, 2822721, 2837402, 2843204, 2821465, 2822719, 2746775, 2757999, 2801144, 2864060, 2921849, 2921765, 2997279, 3108665, 3177240, 3204297, 3235327, 3335952, 3428584, 3521178, 3568222, 3631403, 3720108, 3813967, 3811691, 3859110, 3862637, 3851474, 3855142, 3915368, 4035038, 4146263, 4308294, 4439555, 4620689, 4769001, 4904164, 5058424, 5258881, 5421981, 5639737, 5943608, 6370430, 6838863, 7134320, 7176024, 7054198, 6842896, 6643420, 6528668, 6514240, 6489907, 6492671, 6530776, 6546785, 6504571, 6570036]
4931F570036N1183K0336r1218j9381O3530K6603J19878J39834J88182J79743K27159
4920G475885K20419J75050J00796J02765J02800Q2227P6671M7294Q40q0013j22465
4909H182269q5043n1752o2128Q6903P8030J16036J69236K26534J85414N3590o0218
4898H838871p9428l7192r8958n1776m6655k9794o1927P271P8633n8692N8913P5329
4886H594595J04098J77588J91383J73843K56939K20837J94748K26729K7850k27900
4876I940710k47136j44740n4026J27961J40559J69009K49981L87443M06512M86642
4866A1462915M42038L19320J80648J13959J81642J27333J02397J08784q6631k13614
4856A2738791j97496j48025M9979K08189K87921L85611L36690K81059L15344K92887
$$ y = [6570036, 6621219, 6641555, 6550337, 6530956, 6594486, 6621089, 6740967, 6880801, 7068983, 7248726, 7475885, 7696304, 7871354, 7972150, 8074915, 8177715, 8259942, 8336613, 8383907, 8384747, 8304734, 8182269, 8097226, 8045474, 7983346, 8070249, 8148279, 8264315, 8433551, 8660085, 8845499, 8899089, 8838871, 8759443, 8722251, 8623293, 8571517, 8524862, 8495068, 8433141, 8440412, 8519045, 8460353, 8519266, 8594595, 8698693, 8876281, 9067664, 9241507, 9498446, 9719283, 9914031, 10140760, 10168610, 9940710, 9693574, 9548834, 9494808, 9622769, 9763328, 9932337, 10182318, 10569761, 10976273, 11462915, 11904953, 12224273, 12404921, 12518880, 12700522, 12827855, 12930252, 13039036, 12952405, 12738791, 12541295, 12393270, 12443249, 12651438, 12939359, 13324970, 13661660, 13942719, 14258063, 14550950]
4846A4550950O6002r6082m13416n75313n32514l38942k55814j27831j88143k65654
4836A1823243k27756n4714K8528j6187n5884k14426k58619j99476j53379q3303
4826A0588027k48273o11546p41483p07246n11171l81949l09948k03862j17806
4817F754743j61044j36029q4596j11193j45805k13933l04286k96428k92644j77207
4807D831578j81874j04797j01191j10079j00234m8826p7024m1044p1444r6862
4797C898203J6098n6768j3547j2405n7392K2901L0218K0913R415N7689K1184j8247
4785C918262L0570J9020J7175M490Q174k0286K9445K3862k8936l1175l0309k7509
4773C912783j3937j369o0068r601p181k6077L854j0007j0748N1243K5195j8301
$$ y = [14550950, 14616952, 14520870, 14107454, 13532141, 12999627, 12660685, 12404871, 12277040, 12088897, 11823243, 11595487, 11540773, 11569301, 11553114, 11497230, 11282804, 11024185, 10824709, 10671330, 10588027, 10339754, 9728208, 8986725, 8279479, 7768308, 7386359, 7076411, 6872549, 6754743, 6593699, 6457670, 6373074, 6261881, 6116076, 5902143, 5597857, 5301429, 5008785, 4831578, 4649704, 4544907, 4443716, 4333637, 4233403, 4184577, 4107553, 4066509, 3995065, 3898203, 3914301, 3857533, 3843986, 3831581, 3774189, 3797090, 3827308, 3848221, 3857636, 3915325, 3936509, 3918262, 3948832, 3967852, 3985027, 3989517, 3997691, 3977405, 4006850, 4030712, 4001776, 3970601, 3940292, 3912783, 3898846, 3897477, 3837409, 3827808, 3820627, 3794550, 3798404, 3788397, 3777649, 3828892, 3854087, 3835786]
4761C835786N69K7548O5908L5754N9248Q6620N1178L0999N8438O4756K0439L8497
4749D375740J7176O7926P002M9827J2203J4624L6630J6856N3471O1084J4628J7086
4737D744253J5123Q8355J03731J36640J34508O4818J38852K01713J43887J48742
4727E920622K11372K45415K20264L08111L45247L87925M79737N74611O05626O71480
4717I970410P86721Q70565J170510J297732J260518R40941J98676o35956j198259
4708A4661858j502015j249760r00239n79352l98283j86136j02606k9411l0066
4699I683990P3253J23421K31006K88859L58318L42756N35372N84667N82735O85666
4689A3490043Q21975R39369J030013J228752J180138R48882O17986J58096l655
$$ y = [3835786, 3836355, 3863903, 3929811, 3965565, 4024813, 4111433, 4162611, 4193610, 4252048, 4316804, 4337243, 4375740, 4392916, 4460842, 4467844, 4517671, 4529874, 4544498, 4581128, 4597984, 4651455, 4712539, 4727167, 4744253, 4759376, 4847731, 4951462, 5088102, 5222610, 5287428, 5426280, 5627993, 5771880, 5920622, 6131994, 6377409, 6597673, 6905784, 7251031, 7638956, 8118693, 8693304, 9298930, 9970410, 10757131, 11627696, 12798206, 14095938, 15356456, 16297397, 16496073, 15860117, 14661858, 13159843, 11910083, 11009844, 10430492, 10032209, 9846073, 9743467, 9714056, 9683990, 9757243, 9880664, 10111670, 10400529, 10758847, 11101603, 11636975, 12221642, 12804377, 13490043, 14312018, 15251387, 16281400, 17510152, 18690290, 19639172, 20257158, 20415254, 20411599]
4680B0411599J38434M12990O82305R63584J314168J614001J867513J969134J857634
4671C1231362J504282J000413O60575L72490K85523L72304K77338n5794K1916
4662C5670409L22681P33331J419806J917154K175102K133126J861458J448146
4654D7681213R81903K74700j02600m03643n43436n01389K3171P28245J333682
4645D9471846J746641J541686J105919M27317m70965p87325j030438j406032j809198
4636D8789451k059120k282626k195712j656354j090712l16056K47618L76370L74506
4627D0187365K94834K16475J14037j49005p40033j363168j821205k041857k026431
4618C2671012j744977j233507q90601n38753j82025M9553K04227J93184j62568
$$ y = [20411599, 20550033, 20963023, 21645328, 22608912, 23923080, 25537081, 27404594, 29373728, 31231362, 32735644, 33736057, 34396632, 34769122, 35054645, 35426949, 35704287, 35648493, 35670409, 35993090, 36726421, 38146227, 40063381, 42238483, 44371609, 46233067, 47681213, 48663116, 48937816, 48835216, 48431573, 47888137, 47386748, 47409919, 48138164, 49471846, 51218487, 52760173, 53866092, 54293409, 53822444, 53035119, 52004681, 50598649, 48789451, 46730331, 44447705, 42251993, 40595639, 39504927, 39188871, 39436489, 39812859, 40187365, 40482199, 40698674, 40812711, 40663706, 39923673, 38560505, 36739300, 34697443, 32671012, 30926035, 29692528, 28801927, 28263174, 28081149, 28130702, 28334929, 28528113, 28365545]
4609B8365545o80983j136091j299160j198586j105946r90711q28688p71582o91554
4600A9662244n19709n17647m49106l53285k76273k33438k01475j65902j19372
4591A6826037k42147k30998k29632k12500j65184k32025k24985j60194j28661
4582A4999711p7625k0919J8049N0458J00987J02534J53186J56574J23482M0583
4572A5647020J18583J66672J89876L12339M47541L67254L77967L94830L34238
4563A8356320M81029N38432P62304R77420J046566R68485R29271O60742L7555
4554B4758124o69498p87394m81920q8470K32126M13471N38068N93490O68208P43251
4544B5919456P58054P51793P81904J022816J216523J297595J346057J147741N52103
$$ y = [28365545, 27684562, 26548471, 25249311, 24050725, 22944779, 21954068, 21125380, 20353798, 19662244, 19142535, 18624888, 18175782, 17822497, 17546224, 17312786, 17111311, 16945409, 16826037, 16583890, 16352892, 16123260, 15910760, 15745576, 15513551, 15288566, 15128372, 14999711, 14922086, 14901167, 14919216, 14969674, 15070661, 15173195, 15326381, 15482955, 15606437, 15647020, 15765603, 15932275, 16122151, 16434490, 16882031, 17249285, 17627252, 18022082, 18356320, 18837349, 19375781, 20138085, 21115505, 22162071, 23130556, 24059827, 24720569, 24758124, 24088626, 23301232, 22819312, 22730842, 22962968, 23376439, 23914507, 24507997, 25176205, 25919456, 26677510, 27429303, 28211207, 29234023, 30450546, 31748141, 33094198, 34241939, 34794042]
4535C4794042p1097j52693l91739j279877k227789k235094j551455r20058n44752
4526B5419488m14243l19589k25577j9314K25058M99674O64636R22688J005253
4517B7758074Q87017N85253L13790m10421j631661k231818j871014j367045j013161
4508B1019014o96059m32327l45409k48328j39743q299P0903O8851J60497K33126
4498A9682226L47290L30413L78904M51623N28662N82484O25558P13554Q22322
4489B4463036J024719J220786J428962J648128J940053K211088K538696K942021
4481C9417489L536988M041870M651051N224628N834193O054574M983055K636491
4473G6380339r68288l725446m073619k820077j134155J67715J080860J669246
$$ y = [34794042, 34722945, 34570252, 34178513, 32898636, 30670847, 28435753, 26884298, 25964240, 25419488, 25005245, 24685656, 24460079, 24440765, 24665823, 25165497, 25830133, 26752821, 27758074, 28645091, 29230344, 29544134, 29133713, 27502052, 25270234, 23399220, 22032175, 21019014, 20322955, 19890628, 19545219, 19296891, 19157148, 19148849, 19219752, 19288603, 19449100, 19682226, 20029516, 20359929, 20738833, 21190456, 21719118, 22301602, 22927160, 23640714, 24463036, 25487755, 26708541, 28137503, 29785631, 31725684, 33936772, 36475468, 39417489, 42954477, 46996347, 51647398, 56872026, 62706219, 68760793, 73743848, 76380339, 75412051, 71686605, 67612986, 64792909, 63658754, 63826469, 64907329, 66576575]
4465F6576575J852123K149218K561827K893314K918419K977543L302647M179310
4457H9410976M978582M794752L419760P15160k132967m803108o676216o828238
4449H2878701n596670m040792k375188j053782k53080J72122K68603L02841L29816
4440G0632571N21029O40972R04337J283606J129017k13066k326968m964247o369728
4431F1237523n988622m853846l669581k720151k051817j605158j112678p89477
4423C8446193n72665o50774q98185j075615r63317p58844m44286l11715j84572
4414C2586220k10571l57486o18560q83997j032436j088384r71621q26132o42823
4405B5954210m69344m45719k28572j03995j32765j87441l15909l33003l01911
$$ y = [66576575, 68428698, 70577916, 73139743, 76033057, 78951476, 81929019, 85231666, 89410976, 94389558, 99184310, 102604070, 103319230, 101186263, 96383155, 89706939, 82878701, 77282031, 73241239, 70866051, 69812269, 69559189, 69731311, 69999914, 70302755, 70632571, 71153600, 71794572, 72698909, 73982515, 75111532, 74898466, 72571498, 67607251, 61237523, 55248901, 50395055, 46725474, 44005323, 41953506, 40348348, 39235670, 38446193, 37873528, 37222754, 36324569, 35248954, 34285637, 33526793, 33082507, 32770792, 32586220, 32375649, 32018163, 31399603, 30515606, 29483170, 28394786, 27423165, 26597033, 25954210, 25484866, 25039147, 24810575, 24706580, 24573815, 24386374, 24070465, 23737462, 23435551]
4396B3435551k72977j77830p6960l5472k0867j04585k65930m99134m94536n38104
4386B0949156l99667l29196k12894j76048P24L9684M2962j27464m03269o46575
4376A8737413p02945o90841o12689m19925l58927k51985k00389j81352j59833
4367A5158527j88194m02632n05269m19917l82880l12701k42956j21908o9851J6570
4357A2528789q1529k47455l42645k94827k76759k12801j46277j18176n2093j872
4347A0754355J01834O3215n3167k10929l33027l71499m14372k99447k00588j88833
4337H847542j98090j88589j36183j3226k2834o5552o5050k5118J02n4305l0526
4326H048171r816n779p27q762L4191K0010P4576P1340M8000R2093K6238N2660
$$ y = [23435551, 23162574, 22984744, 22907784, 22872312, 22851445, 22746860, 22480930, 21981796, 21487260, 20949156, 20549489, 20220293, 20007399, 19831351, 19832075, 19871759, 19914721, 19787257, 19383988, 18737413, 18034468, 17343627, 16730938, 16311013, 15952086, 15700101, 15499712, 15318360, 15158527, 14970333, 14567701, 14062432, 13642515, 13259635, 12946934, 12703978, 12582070, 12512219, 12528789, 12447260, 12199805, 11857160, 11562333, 11285574, 11072773, 10926496, 10808320, 10756227, 10754355, 10856189, 10919404, 10866237, 10655308, 10322281, 9950782, 9536410, 9236963, 9036375, 8847542, 8649452, 8460863, 8324680, 8311454, 8288620, 8223068, 8158018, 8132900, 8133002, 8078697, 8048171, 8038355, 8032576, 8031849, 8023087, 8057278, 8077288, 8151864, 8223204, 8271204, 8363297, 8389535, 8442195]
4314H442195P6898J37109J31496J51499r371j47279k10633j06379j41325q2201
4304H242009k3757j9311N1167M4815N5430J8160j49719j97322k33869j98483k44622
4293G344498j75758j19886j27262j03844o0313n5173p4740L0553m6762L4536l7755
4282F608094j7539N2697L3290N7310L9318M9999M9670R0422J09341L5124m68N7982
4270G165240M7026P4161R6152J10266P2781J10676J18528J17834N0157J21522
4260H084343Q8030P3515N1768J19941J22609J40578K01838K14181J41772J21707
4250I360282J55197J42699N0103J10040R8761J67743J07530J20149J34509J71067
4240A0618080J75977J91410J80464K13038K70071J75046J92181K58555K80253
$$ y = [8442195, 8519093, 8656202, 8787698, 8939197, 8929826, 8782547, 8571914, 8465535, 8324210, 8242009, 8218252, 8198941, 8250108, 8294923, 8350353, 8368513, 8218794, 8021472, 7787603, 7589120, 7344498, 7168740, 7048854, 6921592, 6817748, 6757435, 6702262, 6627522, 6658075, 6611313, 6645849, 6608094, 6590555, 6643252, 6676542, 6733852, 6773170, 6823169, 6872839, 6963261, 7072602, 7107726, 7107258, 7165240, 7212266, 7286427, 7382579, 7492845, 7565626, 7676302, 7794830, 7912664, 7962821, 8084343, 8172373, 8245888, 8297656, 8417597, 8540206, 8680784, 8882622, 9096803, 9238575, 9360282, 9515479, 9658178, 9708281, 9818321, 9917082, 10084825, 10192355, 10312504, 10447013, 10618080, 10794057, 10985467, 11165931, 11378969, 11649040, 11824086, 12016267, 12274822, 12555075]
4231A2555075L02744K83767L07214L38718L13290L88671L69490L96370M73949
4222A5729288M22534M27819M38658N21134N05189N80419N77428N27395O14138
4213B0344002P47325O90720P32148Q01270Q11457Q58364Q26069R16516J045625
4204B7773496J141933J347755J514222J701607J973432K130321K419469K666616
4196D2668851L086829L538628L958648M562828N342842N886641N234674K712171
4188G6992112n33268k097517j768753q92684M18761J771561K788430L650330M345479
4179H4674451M550490L857982J313755j382200k105787j194970Q6019J610650
4171I1410390L084320M415623M422461K908536K11101j271041j042871O2068J388708
$$ y = [12555075, 12857819, 13141586, 13448800, 13787518, 14100808, 14489479, 14858969, 15255339, 15729288, 16151822, 16579641, 17018299, 17539433, 18044622, 18625041, 19202469, 19729864, 20344002, 21091327, 21782047, 22514195, 23315465, 24126922, 24985286, 25811355, 26727871, 27773496, 28915429, 30263184, 31777406, 33479013, 35452445, 37582766, 40002235, 42668851, 45755680, 49294308, 53252956, 57815784, 63158626, 69045267, 74279941, 76992112, 76458844, 74361327, 72592574, 71699890, 72118651, 73890212, 76678642, 80328972, 84674451, 89224941, 93082923, 94396678, 93014478, 90908691, 89713721, 89799740, 91410390, 94494710, 98910333, 103332794, 106241330, 106452431, 105181390, 104138519, 104200587, 105589295]
4162A05589295K951233M324756N476204O601620P758652Q150745P615310O162245
4154A54630060O475170Q343743J1249875J4512430J8422857K2078708K5948400
4147B61661243L0875867L6524189L5214551K4056977O793948r43748l195701j2615968
4139C78371358k7590776l6489005l4470291l1961285k7835070k4672499k1454936
4132A73897496j8789949j5956005j3642289j1433236r767793q259713p001382
4125H9047129n912796n276934m514759l990622l415036k966489k650641k365098
4117E7954754j965754j775281j559887j427701j222810j048914r20577p89961
4109D7243869o94394n98834m75647n47357l76398l78928n85289r21567j169040
$$ y = [105589295, 108540528, 112865284, 118341488, 124943108, 132701760, 140852505, 148467815, 154630060, 161105230, 169448973, 180698848, 195211278, 213634135, 235712843, 261661243, 292537110, 329061299, 364275850, 388332827, 395126775, 394183027, 390987326, 378371358, 350780582, 314291577, 279821286, 247860001, 220024931, 195352432, 173897496, 155107547, 139151542, 125509253, 114076017, 104308224, 96048511, 89047129, 83134333, 77857399, 73342640, 69352018, 65936982, 62970493, 60319852, 57954754, 55989000, 54213719, 52653832, 51226131, 50003321, 48954407, 48033830, 47243869, 46549475, 45950641, 45474994, 44927637, 44551239, 44172311, 43587022, 42665455, 41496415]
4100D1496415j287458j203083j219015j074395r60502r02261r42775q46178p77246
4091C2283502p31201o97578o97068n44135o21769o58671o76650p29014p09428
4082B6217988p69125r16524q58364q63550p32861o13898n71467n62645n14339
4073A9815215m30243l95135l17838l54029l06355l36872l29014m24323m92767
4064A6428639m57778m82202m67767m51104l26062l43338k73485k53941k17920
4055A3155042r6963j75546k66769j92497k69210k26360k56614j86832k25486j92833
4045A1065932j60769j48016j36586j59017j19671q0146j54179q1672P437K9162
4035A0062475J4504Q9667J12173K21837J75760K74238K46120J97480K16794K46889
$$ y = [41496415, 40208957, 39005874, 37786859, 36712464, 35751962, 34849701, 33906926, 33060748, 32283502, 31552301, 30854723, 30157655, 29613520, 28991751, 28333080, 27656430, 26927416, 26217988, 25448863, 24532339, 23673975, 22810425, 22077564, 21463666, 20892199, 20329554, 19815215, 19384972, 18989837, 18671999, 18317970, 18011615, 17674743, 17345729, 16921406, 16428639, 15970861, 15488659, 15020892, 14569788, 14243726, 13900388, 13626903, 13372962, 13155042, 13058079, 12882533, 12615764, 12423267, 12154057, 11927697, 11671083, 11484251, 11258765, 11065932, 10905163, 10757147, 10620561, 10461544, 10341873, 10261727, 10107548, 10025876, 10033313, 10062475, 10076979, 10166646, 10278819, 10500656, 10676416, 10950654, 11196774, 11394254, 11611048, 11857937]
4025A1857937J14920O6068j50011n24841p24161o17883n39293m78872l14387k87168
4015H402309k29238k08024j47697j40971q5048J2233j6000K9683m7142L719r132
4004G564692j14363j90769j63982j60967j08353j46700j29426j09291q3451j16897
3994F240493j12547p1098j08807m7896k8717l5948k881n3946p294M8824K9477
3983E849660M3810j2540m72L1934L7448k8435l4643J1131p5643q0190j14616j18460
3971E508984j40553j11061j11416j45717q7293k7346j03281q3361J176J0222J6922
3960D727276J9520N2902R398r5488q7311j0255j7054L219l4560n830Q2802O9629
3948D714248J1290p2421p7796l137k7809l4527o66K9949O151N9133L7565K8519
$$ y = [11857937, 11972857, 12038925, 11888914, 11364073, 10639912, 10022029, 9482736, 9003864, 8689477, 8402309, 8173071, 7965047, 7817350, 7676379, 7591331, 7603564, 7587564, 7617247, 7570105, 7573824, 7564692, 7450329, 7259560, 7095578, 6934611, 6826258, 6679558, 6550132, 6440841, 6357390, 6240493, 6127946, 6056848, 5948041, 5900145, 5871428, 5835480, 5832599, 5778653, 5771359, 5820183, 5849660, 5893470, 5880930, 5880458, 5912392, 5949840, 5921405, 5886762, 5897893, 5822250, 5742060, 5627444, 5508984, 5368431, 5257370, 5145954, 5000237, 4912944, 4885598, 4782317, 4698956, 4700132, 4710354, 4727276, 4746796, 4799698, 4809096, 4713608, 4626297, 4616042, 4598988, 4602207, 4567647, 4561817, 4644619, 4714248, 4725538, 4653117, 4575321, 4572184, 4544375, 4509848, 4509182, 4539131, 4545282, 4604415, 4641980, 4670499]
3936D670499N5696J7378k1820n3685r0952j20176j43442j76508q6659n1058r9468
3925C899805p9934l3731N9373k4033L1931K7388N2637l565q6065M5276J3983N266
3913C908331j1827m9665J1264L2868N6728K0360M9922l6429K154k2989l8114k905
3901C919698k1471O461o1035l5564P547l5682M4121K6778N691K5415J9787P4353
3889C976099J31622R1000P0020J12032J53377K12609K20519K20808K68350K66310
3879E722746K58089K06824K41417J62043K9745k40448l30267m37605m27526l98476
3869D786542l41606k93111k26129j25368j31111j16648j20097r8869j6867k0964
3859C295772j3623j08681j9259J05592L8944J03688J11649P2873J74126K03854
$$ y = [4670499, 4726195, 4743573, 4721753, 4668068, 4577116, 4456940, 4313498, 4136990, 4050331, 3999273, 3899805, 3819871, 3786140, 3845513, 3821480, 3853411, 3880799, 3933436, 3929871, 3843806, 3889082, 3903065, 3908331, 3896504, 3846839, 3858103, 3890971, 3947699, 3968059, 4017981, 3981552, 3983706, 3960717, 3922603, 3919698, 3898227, 3904688, 3843653, 3808089, 3815636, 3779954, 3824075, 3850853, 3856544, 3881959, 3901746, 3976099, 4107721, 4198721, 4268741, 4380773, 4534150, 4746759, 4967278, 5188086, 5456436, 5722746, 5980835, 6187659, 6429076, 6591119, 6620864, 6380416, 6050149, 5612544, 5185018, 4786542, 4444936, 4151825, 3925696, 3800328, 3669217, 3552569, 3432472, 3333603, 3316736, 3295772, 3282149, 3173468, 3154209, 3259801, 3298745, 3402433, 3514082, 3586955, 3761081, 3964935]
3849C964935J08411M6019r500k7657p930j41590k01848j93179j82383j43918j65737
3838C045623j32852j19610j18001m1087o2334m8491n7587m4516k8405o4173j5746
3827B312821M142p26q004k4444Q0289N6130l6260N6218M9567Q3039K8135O0443
3815B661350O8411Q3355Q1306J07996R5102R8779J60335K48393K90129L06989
3805D202145L05252L33891L79389K33796j6851l12277n51759m78518l90153k62739
3795C442176k68456j45605j05767p9703J1290j7514q8961o0778o4667o5129r6624
3784B460262m4233o7203J6568o0134o6451r2242R764l2939q8118P708J7351q916
3772B051417p4589l4274M8996P550k298Q321J5632o524k4833J0580K010n7045
$$ y = [3964935, 4073346, 4119365, 4109865, 4082208, 4074278, 3932688, 3730840, 3537661, 3355278, 3211360, 3045623, 2912771, 2793161, 2675160, 2634073, 2571739, 2523248, 2465661, 2421145, 2392740, 2328567, 2312821, 2316963, 2316237, 2308233, 2283789, 2364078, 2420208, 2383948, 2440166, 2489733, 2572772, 2600907, 2661350, 2729761, 2813116, 2894422, 3002418, 3097520, 3196299, 3356634, 3605027, 3895156, 4202145, 4507397, 4841288, 5220677, 5454473, 5437622, 5125345, 4573586, 4095068, 3704915, 3442176, 3173720, 3028115, 2922348, 2842645, 2853935, 2836421, 2747460, 2686682, 2622015, 2556886, 2460262, 2416029, 2348826, 2365394, 2305260, 2238809, 2146567, 2156331, 2123392, 2035274, 2042982, 2060333, 2051417, 1976828, 1942554, 1991550, 1999100, 1996802, 2005123, 2020755, 2014231, 1989398, 1999978, 2001988, 1944943]
3760A944943o5063l432n0741l7747k7391j18032L64k7858p4226J8206m4077j6569
3748A498377l8991L5950J5216K3584j3541k151k910l1816N6832J0469k9255j8843
3736A502921N4254J3046N747m0889p335J8119J3677k1292o7569k5351m4168k6600
3724A374560k3549n8220k409l3423n9627l2040m246k4988l777j5303l5095J6838
3712A098721m0094j5279J3008J2978k8993n4976o1505R6046k4139m0572j4593
3701I40602J3467n242J5226m055L9421l8674m288l292k7408n5904k48r112m1783
3688H18710O5030k5660J504j8421J4158j2442o0635k2378L0253K8195k6452j8573
3676G73289j1025l712o3528R784l7207J6086j5907L00k4090l2084k1569R078Q923
$$ y = [1944943, 1879880, 1876448, 1825707, 1787960, 1760569, 1642537, 1642901, 1615043, 1540817, 1559023, 1514946, 1498377, 1459386, 1495336, 1510552, 1534136, 1520595, 1518444, 1515534, 1483718, 1540550, 1551019, 1521764, 1502921, 1557175, 1570221, 1575968, 1535079, 1527744, 1545863, 1559540, 1538248, 1470679, 1445328, 1401160, 1374560, 1351011, 1292791, 1290382, 1256959, 1197332, 1165292, 1161046, 1136058, 1132281, 1116978, 1081883, 1098721, 1058627, 1043348, 1056356, 1069334, 1040341, 985365, 923860, 1019906, 995767, 955195, 940602, 954069, 948827, 964053, 959998, 999419, 960745, 956457, 953165, 925757, 869853, 869605, 860493, 818710, 883740, 858080, 859584, 841163, 855321, 842879, 782244, 759866, 790119, 818314, 791862, 773289, 762264, 758552, 695024, 704808, 667601, 683687, 667780, 668080, 643990, 611906, 590337, 599415, 608338]
3663F08338l3166L3398M6311o0957l4578M174m5867j1031L1070Q124K2076J066
3651E68958j1858j763K5526N0509j941j1362O803J1759j6171l514L9425k0751
3639F35620M465M0747j0922p7715j3581M252j6270J4079J5983J9563j428j8489
3627E96304M009j1918m5840j7786j1414M8463P028n8307M277M3303j8586k1387
3615E18146J9401M5339k5472K9280m3030Q0224K0573r2462K3735M671l3006r92
3603E46407m2621K8937k0407o9313J8949M7456R218N82N6133j0892l7989K3274
3591E49734J273l2165k0918n1064M0234K5673K2430j2183n0813K5430Q014L7375
3579E43020j3861N049k9466k3603J4031l822j2931k5604o661M0100k398j1955
$$ y = [608338, 575172, 608570, 654881, 593924, 559346, 563520, 517653, 506622, 537692, 545816, 567892, 568958, 557100, 555337, 580863, 631372, 629431, 618069, 624872, 636631, 620460, 616946, 656371, 635620, 640085, 680832, 669910, 592195, 578614, 582866, 566596, 580675, 596658, 616221, 614793, 596304, 600313, 588395, 542555, 524769, 513355, 561818, 568846, 510539, 514816, 558119, 539533, 518146, 537547, 582886, 557414, 586694, 543664, 623888, 644461, 551999, 575734, 580405, 547399, 546407, 503786, 532723, 512316, 443003, 461952, 509408, 518626, 519208, 575341, 564449, 526460, 549734, 551007, 518842, 497924, 446860, 487094, 512767, 535197, 523014, 472201, 497631, 505645, 543020, 529159, 534208, 504742, 481139, 495170, 491348, 478417, 452813, 446152, 486252, 483854, 471899]
3567D71899j6924L470N2040n7985k3529O0134q007L9028k3987K2064Pj8632j6679
3554D82899M7514K9717j1129o362L4308N613k66j276K2146q124J0620R441L5561
3541F50662K7990N4624O806o224L9458n3437J4312k2885L9481L567k8395J1104
3529G37063l0153j5685l3285r4412k2940m7058M0934j1045l3961K8288k8046n9021
3517D30679j3798J4970J2705K2291r3218l7723N3049j8689K9967l6712N36N6383
3505D20440j3529j6941o3610P701J7177o2659l3899J4331Q137k2398K0122K6841
3493C01713q793j3466O251L97k3169O12j6631J1678K7593J707K3478j4514p8594
3480B18262M2423o3191l7008M9141j3692J5331J244j5678J8643J6892K4306J3725
$$ y = [471899, 454975, 458445, 510485, 452500, 428971, 489105, 481098, 520126, 496139, 518203, 518210, 499578, 482899, 530413, 560130, 549001, 542639, 576947, 582560, 582294, 581018, 603164, 595040, 605660, 615101, 650662, 678652, 733276, 740082, 733858, 773316, 719879, 734191, 711306, 750787, 754354, 725959, 737063, 706910, 691225, 657940, 563528, 540588, 493530, 534464, 523419, 489458, 517746, 489700, 430679, 416881, 431851, 444556, 466847, 373629, 335906, 388955, 370266, 400233, 363521, 364057, 420440, 406911, 389970, 326360, 334061, 351238, 288579, 254680, 269011, 277148, 254750, 274872, 301713, 292920, 279454, 285705, 286102, 262933, 263545, 246914, 258592, 286185, 287892, 311370, 296856, 218262, 260685, 197494, 160486, 209627, 195935, 211266, 212510, 196832, 215475, 232367, 256673, 270398]
3468B70398l1072j2694k5952K4610n8454J6214L1533J9043M1819l4956n6317Q081
3456A92253j5486J39m3078L9309K1252M637l4714K3883k581M0273k1672j014k9096
3443A74105j7220q032N4911j4048l3974L7524L5660R577j1628r84J4157k113p8360
3430A59575N6553J4086k4345J5213n372n9556k3377N3126O6677l8998m3309n9314
3418A10959P2092L1447M665k333J5972l6231L2165O597k4196L4796p2701K7735
3406B00967P1522j6940k9115k6411N1533n037j8283n2024M2K4285j5492K9809
3394B14856J6322j4256R199n194j7590O813K9378k5938N400L8852k9531l4319
3382A93992M6302P5471n3371l4891K7586K6455n8561L3117j289l1012L9999N0919
$$ y = [270398, 239326, 226632, 200680, 225290, 166836, 183050, 214583, 233626, 275445, 240489, 184172, 192253, 176767, 176906, 133828, 173137, 194389, 199026, 164312, 188195, 185614, 225887, 204215, 203201, 174105, 156885, 148853, 203764, 189716, 155742, 193266, 228926, 238503, 226875, 225891, 240048, 237935, 159575, 216128, 230214, 205869, 221082, 215710, 156154, 132777, 185903, 252580, 213582, 170273, 110959, 183051, 214498, 219163, 216830, 232802, 196571, 228736, 235333, 211137, 245933, 173232, 200967, 272489, 255549, 226434, 200023, 251556, 246519, 228236, 176212, 176254, 200539, 185047, 214856, 231178, 216922, 226121, 220927, 203337, 210150, 239528, 213590, 218990, 257842, 228311, 193992, 240294, 315765, 262394, 227503, 255089, 281544, 222983, 256100, 254811, 223799, 263798, 314717]
3370C14717n910k9341J7380r540n6110n058K4663J8007k3831m092l7072P659K7310
3357B38782j092J1724K4901k0351k7066k8422O1152M6963l4957j8739L780N9770
3345C16445J7256n6028r8013j2642K1424K4135l7758K2461j2030P798N8933P4323
3333C26304k952q0828J8456Q333l714m9876n9211M1299j5355O5089O892J946r792
3320B46591K343k3461M8597L319R521j0915J1635k1583Q164j4830m6576N5357
3308B68162p978j5673j3852K2110K7730k3725M4076K7719J3167n890j7822Q793
3296C26817j1397m6101L2389j0115k9031m6675q538O4386M5322l6862k0965M8731
3284C07961L9579j0618j7385J4255J9890O5060j837m7322k1627L2028j5467k0107
$$ y = [314717, 308807, 279466, 296846, 287306, 231196, 226138, 250801, 268808, 244977, 240885, 203813, 211472, 238782, 237690, 249414, 274315, 253964, 226898, 198476, 259628, 306591, 271634, 252895, 256675, 316445, 333701, 277673, 179660, 167018, 188442, 212577, 174819, 197280, 185250, 193048, 251981, 326304, 323352, 242524, 260980, 269313, 265599, 215723, 156512, 197811, 182456, 247545, 254437, 256383, 246591, 248934, 225473, 274070, 277389, 286910, 275995, 287630, 266047, 274211, 259381, 212805, 268162, 260184, 244511, 230659, 252769, 280499, 256774, 300850, 328569, 341736, 335846, 318024, 326817, 315420, 269319, 301708, 291593, 262562, 215887, 207349, 271735, 317057, 280195, 259230, 307961, 347540, 336922, 319537, 333792, 353682, 418742, 416905, 369583, 347956, 379984, 364517, 344410]
3272C44410j5749O6750k4492J1819j3157K1384L0221K0449N989m1995k4423o289
3260C74917L7442N5622k9618m5279k4828P0919p172K1118m0927J1403j4852J5696
3248D24441K1181j7548P724M871l0351M8157J7015j1115L8992J7273j0909J2538
3236E22269K8727K2708K6274J106M9160Q2885L8423j1647n3458q465P4812k9175
3224G43619j1071M9496l6621R358O9657L4389J8218m8215N681M3472L3050L0425
3212I41458J9033L1585R5123L5357J0066L9252M6653O6319K1681L4532M5875M560
3200A391494l6095r6760l2769m0846j8646j6778m2933q7327n4781l9633n2659
3189H72267j6681k3455l2827l4374l0221k6212l4008n7070j6835l3101O393L0280
$$ y = [344410, 328661, 395411, 370919, 382738, 369581, 390965, 421186, 441635, 447624, 405629, 381206, 374917, 412359, 467981, 438363, 393084, 368256, 439175, 432003, 453121, 412194, 423597, 408745, 424441, 445622, 428074, 435798, 440669, 410318, 458475, 475490, 464375, 503367, 520640, 509731, 522269, 550996, 573704, 599978, 601084, 650244, 733129, 771552, 759905, 706447, 697982, 772794, 743619, 732548, 782044, 745423, 754781, 824438, 858827, 877045, 828830, 834511, 877983, 911033, 941458, 960491, 992076, 1087199, 1122556, 1132622, 1171874, 1218527, 1284846, 1306527, 1341059, 1386934, 1391494, 1355399, 1258639, 1225870, 1185024, 1166378, 1149600, 1106667, 1019340, 964559, 924926, 872267, 855586, 832131, 799304, 764930, 734709, 708497, 674489, 617419, 600584, 567483, 573876, 604156]
3177F04156l6126l465j7393k8296O557n1709m5711M46l883J4902K9103J289o359
3164D63511J4082n7206k5745K6693n017k572j7981j3391k6221P41J1945l101j4723
3151C51015J1773l152j8132N602j372n1134P254M9054j3458l5279k3815j7271
3139B61085l9824M198o445J3121M9121M821j0857J4224J8340J1203q443p4629
3127B35915l231P7946k4264J999p556J8365m5998K0149N9356N0760m4153k328
3115C36960K187o3648q887J5028n4289o422j9428P902J3775J1559j1615m7721
3103A75401P253m5031j2244N8079N5701Q1411j7899m1121j5166K1397K5748m5052
3091B48477J7229J8375k2205J0837j5788m4462Q477q236r137J0100j8905j9389
$$ y = [604156, 568030, 564565, 547172, 518876, 525433, 473724, 428013, 428459, 424576, 439478, 468581, 469870, 463511, 477593, 420387, 394642, 421335, 416318, 413746, 395765, 382374, 356153, 356894, 368839, 365738, 351015, 362788, 359636, 341504, 347106, 345734, 294600, 301854, 350908, 337450, 302171, 278356, 261085, 221261, 225459, 219014, 232135, 281256, 286077, 275220, 289444, 307784, 318987, 310544, 235915, 232684, 310630, 286366, 288365, 280809, 299174, 253176, 273325, 332681, 383441, 339288, 336960, 339147, 275499, 266612, 281640, 227351, 220929, 201501, 209403, 223178, 234737, 223122, 175401, 182654, 137623, 125379, 183458, 239159, 320570, 302671, 261550, 246384, 267781, 293529, 248477, 265706, 284081, 261876, 272713, 256925, 212463, 220940, 212704, 203567, 213667, 194762, 175373]
3079A75373o640M1103k977m9146K7891L7723Q955k8076k4785q757M5384K9801
3067B45849k7143m6233K4383k066n6970K4488O969j0847L1846j5254k0817j7808
3055A36397k3246l3434N5095l4333j6628j4786N0118j4620J2183L0756l1074k4356
3043I2072R192K1407K2501J1626P548r0017Q731K6065J4212M4704p8241L5836
3031A25636k8518O704L4460j3110J6769m6132l2668J1053k8277k4763L0104J3971
3019F5229N5313J029j2183m0189M19l4841K5738j1186o376J5865R386k7824j9842
3006B0538M602K3525M4496m5713J9053J4086J3534m7479k6065m5062o191O6800
2994C6124l8930J7284N6780l2384P298j1184m125N7389q616n9731n990j6272J7262
$$ y = [175373, 168733, 209836, 206859, 157713, 185604, 223327, 232282, 204206, 179421, 170664, 216048, 245849, 218706, 172473, 196856, 194790, 137820, 162308, 169277, 158430, 190276, 175022, 154205, 136397, 113151, 79717, 134812, 100479, 83851, 69065, 119183, 104563, 116746, 147502, 116428, 92072, 101264, 122671, 145172, 156798, 164346, 74329, 83060, 109125, 123337, 168041, 89800, 125636, 97118, 103822, 138282, 125172, 141941, 95809, 63141, 74194, 45917, 21154, 51258, 65229, 120542, 121571, 109388, 69199, 69618, 34777, 60515, 49329, 42953, 58818, 68204, 40380, 20538, 25140, 48665, 93161, 47448, 66501, 80587, 94121, 46642, 20577, -24485, -30676, 36124, -2806, 14478, 71258, 38874, 46172, 34988, 30863, 88252, 79636, 19905, 13915, -2357, 14905]
2981A4905m4506L2807Q907J8781L5392k214k269r352L353K3390j3945k7197M1841
2968G9893P40j1694L2515j8768n3656q787l625N9883j7696m4468N1353m3769N0918
2955G2839J8637j0658j3317l3098k4112J9864k5188J9737L5226M543n2558n646
2943F269K7978M7039m7488l1856J5450j2542K7474J327j4689l4843J305K7137
2931A2561J5812k703J7091k0571K8073p4820L5022N9189j221n1333j1278K8897
2919C4719L9884L9119J6306n5010m0536L588k7933L5295n00L6048n4822j0592
2907A5566K3858m74J530k291K6458q6k4117q664m139k4887N1636L0242j6985K6317
2893I3964N3497j7515r348J3975o3331j5076N5556l1103K0613Q0811L734k2428
$$ y = [14905, -29601, 3206, 12113, 30894, 66286, 64072, 61803, 52451, 55804, 79194, 65249, 38052, 79893, 80633, 68939, 101454, 82686, 29030, 20243, 16618, 76501, 58805, 14337, 65690, 21921, 72839, 91476, 80818, 67501, 34403, 10291, 30155, 4967, 24704, 59930, 64473, 11915, 6269, 34247, 81286, 33798, 1942, 17392, 4850, 32324, 33651, 18962, -15881, -14576, 12561, 28373, 25670, 42761, 22190, 50263, -24557, 10465, 69654, 68433, 17100, 5822, 34719, 74603, 113722, 130028, 75018, 34482, 38070, 10137, 45432, 44932, 80980, 26158, 15566, 39424, 38950, 40480, 38189, 64647, 64561, 40444, 31780, 27641, 2754, 54390, 84632, 67647, 93964, 147461, 129946, 120598, 134573, 71242, 56166, 111722, 80619, 101232, 182043, 185777, 163349]
2881A63349K7172J1252m6296J6364j5197l2252O6092j4627L5360l3840J7469L826
2869A98672k984k6104k0075O9442N8511k1352k6093M0952M3506J9075m6176k7832
2857B59542J4448j6290M1457N5907q215L917j4673j5470k5951J663k0378L1417
2845C07374j5716m5453j3126q010K945K1538o841j0465M071K4769l1837j6456
2833B12793o71l0190R011O714K6633M464J0177J7342k312j5524k7220l2356k0584
2820A58277J2482N1095l2276m2279L3196O960Q844K4264K218m0904j2124j2565
2808A57188J045j3117J4037n667l1797K9354N082m9064m268j9767O368k7093K0860
2795H3161k376k2756L8456L1842n3730k6207N983L2408L0887r041p140l1444l3855
$$ y = [163349, 190521, 201773, 155477, 171841, 156644, 124392, 190484, 175857, 211217, 177377, 194846, 198672, 195688, 169584, 149509, 218951, 277462, 256110, 230017, 270969, 314475, 333550, 287374, 259542, 273990, 257700, 299157, 355064, 346849, 350766, 336093, 320623, 294672, 296335, 275957, 307374, 291658, 246205, 233079, 225069, 228014, 249552, 242711, 232246, 236317, 261086, 229249, 212793, 212122, 181932, 190943, 197657, 224290, 228754, 238931, 256273, 253961, 238437, 211217, 178861, 158277, 170759, 221854, 189578, 147299, 180495, 187455, 196299, 220563, 222781, 181877, 169753, 157188, 158233, 145116, 159153, 153486, 121689, 151043, 156125, 107061, 102793, 83026, 89394, 62301, 83161, 80785, 58029, 96485, 128327, 74597, 48390, 54373, 86781, 117668, 108627, 101487, 70043, 36188]
2782C6188N4283N941k7525K4550p414m0146l1585k5013l5120M2708N4699m198
2770D7368l4508M5511j4760L281l5130m7328M3781L0976p0961L5997q246O834
2758B815R210j7150J8053l4772L2764J3836j5003j2989j0842O2414m5874j8482
2746a6020R160n502k8280n245M3966L7749j522m3474l608M8044n3629m889M0217
2733A6967k7275l9289J4558j7023j8640N3540k4429j2302o959J7037k124K5344
2721b0595L0919p601k3058K6685k2152R841j2333L0696K8916m1763M664J32j9938
2708a5587j2892m4343O2221J5783J222N4257Q544q3937j9497r682j3101K4007
2696c3005P865k2599N461J4105J1678L1931l0285M7444l4695o1013k0780N2681
$$ y = [36188, 90471, 96412, 68887, 93437, 86023, 45877, 14292, -10721, -45841, -3133, 51566, 47368, 12860, 58371, 43611, 46892, 11762, -35566, 8215, 39191, -31770, 4227, -4019, 2815, 12025, -5125, 12928, -21844, 10920, 24756, 9753, -3236, -14078, 48336, 2462, -16020, -6860, -12362, -40642, -45887, -1921, 35828, 34306, -9168, -12776, 35268, -18361, -23250, 16967, -10308, -49597, -35039, -52062, -70702, -17162, -41591, -53893, -60852, -43815, -45939, -20595, 10324, 2723, -20335, 6350, -15802, -5961, -18294, 12402, 41318, -445, 4219, 4351, -15587, -28479, -72822, -10601, 5182, 6404, 60661, 69205, -14732, -34229, -43911, -57012, -33005, -25140, -47739, -42278, -28173, -16495, 15436, -14849, 32595, -2100, -63113, -83893, -31212]
2684c1212J2283P155j1541l5633K3093K0431j2103j7606N2598n1013K1106J4511
2672g931j8661l992m0961N4382L489l9597J1519L1032n4011L9525M1791m7350
2660c0765j6740Q940K345N7750M387m6802J7189J2986j1485P131J4994m7579k5687
2647e3336J6781j6694J7666r381j3039l0856L7123K5700J702Q898p2678J4681
2635g3433N7093j2707J4007r363J1205L087m092k9865q487o898l3520K9141K4242
2622c9590M401n6453N0485K5134l4743K1442m87j8023K9435K776l599j4362p292
2609d0876j8478M483r079J8570p566o573l111J9723K6808j368P955n9746j3837
2596h3095K9342n4501L5365K4577k8070O858j5979K2608r138N409J3245K7925
$$ y = [-31212, -18929, -11774, -23315, -58948, -35855, -15424, -27527, -45133, 7465, -43548, -22442, -7931, -26592, -30584, -71545, -17163, -13674, -53271, -41752, -10720, -64731, -25206, 16585, -30765, -47505, -38565, -36220, 21530, 25917, -20885, -3696, 9290, -2195, 4936, 19930, -27649, -53336, -36555, -53249, -35583, -44964, -58003, -88859, -51736, -26036, -24334, -15436, -88114, -73433, -16340, -29047, -15040, -24403, -13198, -10111, -14203, -44068, -52555, -59453, -92973, -63832, -39590, -35189, -91642, -41157, -16023, -50766, -29324, -29811, -47834, -18399, -15623, -19222, -33584, -40876, -59354, -54871, -63950, -45380, -52946, -59519, -62630, -42907, -16099, -17467, -9512, -69258, -83095, -53753, -108254, -72889, -48312, -76382, -69524, -85503, -62895, -72033, -66624, -53379, -25454]
2584b5454M7758k3044n350j8625m7398J6122K3788j8971J1392p685o6921Q7402
2572b6986J1776m0483J339J1180m159K6531j0074k0686q806n304N1480k5871k1797
2559f1860L0752k6735J1206k3084l4279l0960k753M8123L3986q90k3446o117M852
2546h1205L1681l9037P0203l4242j8586L9161N368k422K1400o3385n7081L5326
2534i2819Q619j0880k8732R5440N3174j2097p8769r8438K1588J2651L8107J6617
2522g5539M8184K8290j5352n9189n727j3178k4553P4467J900k0790L1722o2138
2510i1903L274L6226J6351m389j1700K0759M256m0396p2660K3527M4886P540k3530
2497h7759L356k8997m698N3218k709K2259Q361j5533l0361n0613k4969N2518N2903
$$ y = [-25454, 22304, -740, -6090, -24715, -72113, -55991, -32203, -51174, -39782, -47467, -114388, -26986, -15210, -55693, -54354, -43174, -47333, -20802, -30876, -51562, -60368, -65672, -14192, -40063, -61860, -31108, -57843, -46637, -69721, -104000, -134960, -137713, -89590, -55604, -56494, -79940, -86057, -81205, -49524, -88561, -18358, -52600, -71186, -32025, -26657, -29079, -7679, -71064, -128145, -92819, -84200, -95080, -123812, -28372, 24802, 12705, -66064, -164502, -142914, -130263, -92156, -75539, -27355, 935, -14417, -73606, -79333, -92511, -117064, -42597, -40697, -61487, -29765, -91903, -88629, -52403, -36052, -40441, -52141, -31382, -27126, -67522, -140182, -116655, -71769, -64229, -87759, -84403, -113400, -118098, -64880, -67589, -45330, -36969, -52502, -82863, -133476, -158445, -105927, -53024]
2484e3024N8240P334n1551o1686p3142j8185M1615P1126n2148J8943j1424K8212
2472i5690P487O1676J0617n112K2367m1711k8070k1061K3398j112L3469j7419
2460e1161l4954K0218m793M2366K6527o407k1099R757k3184N792m8900q176O10
2447i3404M8612l8303n524L0537M0848l3987k5454k9411N638L9807j2598K0162
2435e3077N012M4994J2707m6121j5289K3815L353L19K7242j7868m9126q348K9474
2422d2913r080p5230J2355K3727K6932j0834K0092K8504J2071k3673j4595m7202
2410i9846l3214N8509L3948o141p5411J4882L8219j3595P509J3044j1956k521
2398g6573J730l4948J7284J2919L4691k0926J992k1417J6604K7438k251l3750
$$ y = [-53024, 5216, 12550, -39001, -100687, -173829, -192014, -150399, -79273, -131421, -112478, -123902, -95690, -88203, -26527, -15910, -21022, 1345, -40366, -68436, -89497, -66099, -67211, -33742, -51161, -86115, -65897, -70690, -28324, -1797, -8204, -29303, -19546, -42730, -36938, -85838, -94014, -93404, -44792, -83095, -88619, -58082, -17234, -51221, -76675, -106086, -100448, -60641, -73239, -53077, -48065, -3071, 9636, -36485, -51774, -27959, -24606, -24287, 2955, -14913, -64039, -72387, -42913, -51993, -127223, -114868, -91141, -64209, -75043, -54951, -26447, -14376, -38049, -52644, -99846, -133060, -74551, -40603, -46744, -122155, -107273, -69054, -82649, -75140, -62096, -74052, -76573, -74843, -109791, -92507, -79588, -44897, -65823, -63831, -85248, -68644, -41206, -43457, -77207]
2386g7207K5802J7613K1378n5005j3481K3101K5785j0453J7048m4885J2396k2859
2374h0767J3311L1300L912n715j6921k864K9809J672k2765L9150l5655j9482K7033
2361c7982Q64L7711j4930J4974k3207k6862J6514K4495m0019R391j7111m0830
2349i6992M2564P518l497k9523j5108N0900Q055l6022j9311J7525k6461j2976
2337a13328O0626L1304M9118j5128o2952m4568M7629L4184j8534j6377L5058K5518
2325A2550M2932J5533J0391j12829L562J8080n943j2539k3459l952L5452K4215
2313C993M6283j9607l3226m6674M5954J2179k1039O047m5343j1453K3493j719
2301d1112j1982j4989J0681j2924M1385L529n5667K5015L970j4910j8412M5352
$$ y = [-77207, -51405, -33792, -12414, -67419, -80900, -57799, -32014, -42467, -25419, -70304, -57908, -80767, -67456, -36156, -32244, -37959, -54880, -57744, -27935, -26263, -49028, -9878, -45533, -65015, -37982, -37118, 593, -14337, 637, -22570, -49432, -32918, -8423, -48442, -39051, -56162, -96992, -54428, -46910, -50407, -79930, -95038, -44138, -36083, -72105, -91416, -73891, -100352, -113328, -52702, -21398, 27720, 12592, -50360, -94928, -47299, -13115, -31649, -48026, -12968, 12550, 55482, 71015, 81406, -31423, -27861, -9781, -15724, -28263, -51722, -55674, -20222, 3993, 50276, 30669, -2557, -49231, -3277, 8902, -12137, -6090, -51433, -62886, -39393, -41112, -53094, -68083, -57402, -70326, -28941, -25412, -81079, -56064, -52094, -67004, -85416, -40064]
2289d0064O506j8081L1445Q298K9056L334j4388j4229k7609N0291l6724k2487
2277d4652K196J4098j8456m7010M4762O1462j7370o3972L0684K5291K2687m867
2265D853k4674k9335k2498P6182K120j9543k9140k6166K9782R417k7321L435K9883
2252b3005m2452j3331L0388J05552k8230p2205K1440L2898M5022n5237k7194K4882
2240a472j8670N1850n300m8040J1010m087j0369k104J351K4632j8903K4462j3413
2227i053j9067J9033M470j3035J0852q1448M3570O8983J9239q8188l053L0469
2215a7228O41L4671l7682M6814j2230m2071k8641j7559o1791N8642j7831M5199
2203d9066N0962J1183J1290m1843K5082J4508k5482J0970l1410m7344M7031K0651
$$ y = [-40064, -33558, -51639, -20194, -11896, 17160, 20494, 6106, -8123, -35732, 14559, -22165, -44652, -42456, -28358, -46814, -93824, -49062, 12400, -4970, -68942, -38258, -12967, 9720, 4853, -19821, -49156, -71654, 4528, 6648, -12895, -42035, -68201, -38419, -29002, -56323, -52888, -23005, -65457, -78788, -48400, 57152, 28922, -43283, -21843, 11055, 56077, 840, -26354, -1472, -20142, 31708, 26408, -21632, -10622, -14709, -25078, -27182, -25831, -1199, -20102, 4360, -9053, -28120, -9087, -4617, -17652, -6800, -88248, -44678, 24305, 43544, -44644, -47697, -17228, -16587, 18084, -19598, 27216, 14986, -27085, -55726, -73285, -135076, -76434, -94265, -49066, 1896, 13079, 24369, -17474, 7608, 22116, -3366, 7604, -23806, -71150, -24119, -3468]
2191c468j8907K181o693J5837L565K6728j649p280j644M7376K2273Q322o9264
2178A7377j5209m1785P963O1434N1762R528q8424k6876M1855J5030J5809m324
2166D4140K2081o6993P972P4124k4696L3215K2675p2628q098L0780J3153k6741
2154D8984J2147J8594M0770j27j190p484J2134M5542K4133J4473j7982n5080k3181
2141A11733N4929j6238N8734P002q625k2760J2090R160q437J1575K8888L8449
2129B76500J359j2509m3480J2411j3517O9968J6442J5005l764J241j3804J0289
2117C16141M8935R389m3049p105K7012J1462K0918K2743M5475l1277J9746K8092
2105D68482K2841r83j4397l850N7761L3749M1136N489J5866N7458K3277k1908
$$ y = [-3468, -22375, -20194, -26887, -11050, -7485, 19243, 17594, 10314, 8670, 56046, 78319, 86641, 17377, 2168, -39617, -31654, 29780, 81542, 91070, 2646, -24230, 17625, 32655, 48464, 44140, 66221, -772, 7200, 81324, 56628, 89843, 112518, 39890, 31792, 62572, 75725, 48984, 61131, 79725, 120495, 120368, 119178, 111694, 123828, 169370, 193503, 207976, 189994, 134914, 111733, 166662, 150424, 209158, 216160, 207535, 184775, 196865, 206025, 197588, 209163, 238051, 276500, 277859, 265350, 221870, 234281, 220764, 290732, 307174, 322179, 318415, 319656, 305852, 316141, 365076, 374465, 331416, 324311, 351323, 362785, 383703, 406446, 451921, 420644, 440390, 468482, 491323, 490340, 475943, 472093, 529854, 563603, 604739, 610228, 626094, 683552, 706829, 684921]
2093F84921O1353O5890O1770L7792o08O5686N3993O8194J02227K9689N7932P6297
2081A365136J22129Q4815J49431R2213J72835J64859J30160J77214J80822K32377
2071B871991K49250L03669L25196M48074N35445N43641P07702Q29935R86649J156397
2061H957949J447379J760913J976855J876825J690618o80746k609312k093313
2053A2327168j822285j909026j576737j167083q67453o01206m92892l54215l45929
2044C190342j86354k26043j23061j47431k43783j76718j83173q2924j16642j55439
2034A548774n0870j00273r0183p987m0683o3821j6295m1153o6869r4908l0713
2023I45019J0626n0997l3080l7737j6158k8482m4084k0498j3180J2636n3191l4680
$$ y = [684921, 746274, 812164, 873934, 911726, 911118, 976804, 1030797, 1098991, 1201218, 1230907, 1288839, 1365136, 1487265, 1572080, 1721511, 1813724, 1986559, 2151418, 2281578, 2458792, 2639614, 2871991, 3121241, 3424910, 3750106, 4198180, 4733625, 5277266, 5984968, 6814903, 7801552, 8957949, 10405328, 12166241, 14143096, 16019921, 17710539, 17029793, 14420481, 12327168, 10504883, 8595857, 7019120, 5852037, 4984584, 4383378, 3890486, 3536271, 3190342, 3003988, 2777945, 2654884, 2507453, 2263670, 2086952, 1903779, 1820855, 1704213, 1548774, 1497904, 1397631, 1307448, 1299461, 1258778, 1194957, 1178662, 1137509, 1070640, 975732, 945019, 955645, 904648, 871568, 833831, 817673, 789191, 745107, 724609, 711429, 724065, 670874, 636194]
2011F36194q074L1043l8537l7062l5230K2925j5239l9678m8398O170n7808o3301
1999C53005J6461N6947o4513k0583J1286K286l287O116N807k995l3708l1015r27
1986B94880r421L773Q479m737j8671m9707j5073l430R039o399j7806j150K6957
1973B16734j255j8929J3583K4321J1427k9073l0218j6335J0864l7998l4207J5132
1961A24046K5418K679J5327l7605j4732k1034J5045J3009l0647L118N42n723l2476
1948E6967l1224J6330j1538L1071J9592K4609n6250M6009O586o2691p936o174
1936B5351p599K1419r000n5560M5508O5195O2047j2064o1081k2838P871n6805
1924B444l445K6916L3389p785J8910K0381K6586m2590l3010L4758K3757k2870
$$ y = [636194, 628120, 659163, 620626, 583564, 548334, 571259, 556020, 516342, 467944, 474114, 416306, 353005, 369466, 426413, 361900, 341317, 352603, 354889, 351602, 357718, 363525, 360530, 326822, 295807, 294880, 285459, 289232, 297711, 292974, 274303, 224596, 209523, 206093, 215132, 208733, 190927, 189777, 216734, 215479, 196550, 210133, 234454, 245881, 216808, 186590, 170255, 181119, 143121, 108914, 124046, 149464, 152143, 167470, 129865, 115133, 94099, 109144, 122153, 91506, 94624, 95166, 89443, 56967, 25743, 42073, 30535, 61606, 81198, 105807, 49557, 95566, 102152, 39461, 31525, 25351, 17752, 39171, 30171, -25389, 20119, 85314, 147361, 135297, 74216, 51378, 59249, 2444, -1001, 25915, 59304, 51519, 70429, 90810, 117396, 74806, 41796, 76554, 100311, 77441]
1912G7441l5965M6696j0839j6518k3118J1179l5518K087O212k6642R047N7466
1900F1528n2737j1178N0567J7897J8426p2733m0749K9175L3102J4516j7091k0298
1888A0425J603j1885l4772L7183P206K0254K0977j5095k6506K0654j6084j9866
1876e906K4108j5226J1002m883n577Q79J7099m6873N997L1180J7501p339J2980
1863C4942L378j3040n079j5479N576m139k7906J2801j9516j408l6537O3912K3452
1850B0957k5390Q884J1579j6373n3987N98j632N1876k5015J4066L0695l8813J7664
1837d891j19l3279j5821k875K8507r085J6319k6543l2222P596J1190J4069J9403
1824b7751o331N939L3162P745p238p486n6352K1144J7964k0545K1784j0539K7080
$$ y = [77441, 41476, 88172, 77333, 60815, 37697, 48876, 13358, 15445, 21657, -4985, 4062, 61528, 8791, -2387, 48180, 66077, 84503, 11770, -28979, 196, 33298, 47814, 30723, 10425, 12028, 143, -34629, 2554, 9760, 30014, 50991, 35896, 9390, 30044, 13960, -5906, 18202, 2976, 13978, 9095, 3518, 4397, 21496, -25377, -19380, 11800, 29301, 21962, 34942, 38320, 25280, 20201, 4722, 10298, 6159, -21747, -8946, -28462, -29870, -66407, -2495, 20957, -4433, 4451, 16030, -343, -54330, -53732, -55364, -3488, -28503, -14437, 16258, -22555, -4891, -5010, -38289, -54110, -56985, -28478, -37563, -21244, -47787, -80009, -72413, -61223, -47154, -27751, -34082, -28143, 5019, 12764, 5526, -1960, -58312, -37168, -19204, -39749, -17965, -28504, -1424]
1811a424l4058l356J5988l8621L643n774P6061l2109m720p244N1133k1139k4509
1798b6129K3058R9760l281k0567n3039k9960L8591J2184K7168m8168M8990j1336
1786E7271j7689j845k7897K3360j2867k0764J959k9708M0279r171j9128O747N1321
1773D1868m4876K6947M1576n0848q6321O0228k4859K6538K8089J6180m6297j3812
1761b5587K4043n3092K5000k5000K239j3528K7236k3321K7834K9961K6295K867
1749B4947j7781k2M2431j5915n8126J7550n1068J9715k3545p129L1124n00l1430
1736f9749N5973j5540m1622J7489j519K8384K3846k2721o953J7283J0333l4897
1724c9693k230l380j8508K0812J1198O5585k8670l2415j4901J818l496J9003K187
$$ y = [-1424, -35482, -38838, -22850, -61471, -57828, -63602, 12459, -19650, -24370, -31614, 19519, -1620, -26129, -3071, 96689, 93408, 72841, 19802, -10158, 28433, 40617, 67785, 19617, 68607, 57271, 39582, 37737, 9840, 33200, 20333, -431, 1528, -28180, 12099, 2928, -16200, -9453, 41868, -3008, 23939, 65515, 14667, -71654, -11426, -36285, -9747, 18342, 34522, -11775, -25587, -1544, -54636, -29636, -54636, -52397, -65925, -38689, -62010, -34176, -4215, 22080, 24947, 7166, 7144, 49575, 33660, -24466, -6916, -57984, -38269, -61814, -68943, -37819, -38319, -69749, -13776, -29316, -70938, -53449, -54968, -26584, -2738, -25459, -32412, -15129, -4796, -39693, -41923, -45303, -63811, -42999, -31801, 33784, 5114, -27301, -42202, -40384, -43880, -24877, -22690]
1711b2690k0141n0523M9791P1422Q0K8186m5674l0940j1686k6545j0407K720N9679
1698f728N659J3645Q1046p801r1217j1960P532m269p52N3523N246j8880P392m5677
1684a3241n6300J8456M6173j453l5346o0393P0934L5096j0843j2523L5227P513
1672B3300k6679l4034q052l6826J1407K3963M5308O782p623l1403l9102O185M3017
1659b3757K9756n2403J5399r492r059k0861j6368J4470N5919K7355q751K7253
1647B9461n9268K1289O388k9815P278m4941J7539M8202k2505p100O5432j4617
1635A7343n2278l2216M0959K1765M1135k9248j984M3029p5612q790M821k9622
1623f0698k1767k741M1547k279J6193j7867k44n353L7994J3877o8394M6655M1771
$$ y = [-22690, -42831, -93354, -43563, 27859, 27939, 56125, 10451, -20489, -32175, -58720, -69127, -66407, -6728, -1069, 12576, 93622, 85821, -5396, -17356, -9824, -14093, -14845, 38678, 43924, 25044, 32436, -13241, -69541, -51085, -4912, -6365, -41711, -102104, -31170, 3926, -6917, -19440, 15787, 23300, -3379, -37413, -45465, -82291, -70884, -46921, -1613, 5169, -2454, -33857, -72959, -66774, -23757, 5999, -46404, -31005, -40497, -49556, -70417, -86785, -72315, -16396, 10959, 2208, 29461, -29807, -8518, -2130, -31945, -24667, -69608, -52069, -3867, -26372, -33472, 31960, 17343, -34935, -67151, -26192, -4427, 36708, 7460, 5476, 48505, -27107, -35897, -31076, -60698, -82465, -85206, -43659, -45938, -29745, -47612, -47856, -53209, -15215, -1338, -69732, -23077, 18694]
1610A8694m3098m4400K4266L2627j4199K0404l6576J4983K4408r997j5771j1080
1598c9739K9328j6467n3640N9192M7898n9235n0434j5541N2189M528l1800L1577
1586d2144J6588R537j5547L1832k3330L127L7422K602n2180j6918L4559l93k8163
1573d3008L8281M5195l2723m7808N9550K1541k753m9963k9755K8157k714l9196
1561e5196l4821J05216m8870m4795j715M5347N6315l0937Q205l1528O074j9230
1549d5935K381J697j1863J9291k3238L6006L2169j4574L7002J835q7903k6156
1537g9288p298L0329K5377J9465p028j8312k5019K6450r496j25k933p062L939
1524e1001L4384k6910R818L7514q879k5826j6539n593J1616L3832l0199o2850
$$ y = [18694, -24404, -68804, -44538, -11911, -26110, -5706, -42282, -27299, -2891, -12888, -28659, -39739, -10411, -26878, -80518, -21326, 26572, -32663, -83097, -98638, -46449, -41921, -73721, -42144, -25556, -16019, -31566, 266, -23064, -19937, 17485, 20087, -32093, -49011, -14452, -14845, -43008, -4727, 40468, 7745, -40063, 19487, 41028, 38275, -11688, -41443, -13286, -16000, -55196, -90017, 15199, -33671, -78466, -80181, -34834, 21481, -9456, -1251, -32779, -26705, -45935, -43554, -41857, -53720, -34429, -57667, -21661, 10508, -4066, 32936, 34771, -53132, -79288, -86586, -56257, -30880, -11415, -18443, -36755, -61774, -35324, -44820, -44945, -47878, -54940, -51001, -16617, -43527, -33709, 3805, -5074, -30900, -47439, -53032, -41416, -7584, -37783, -100633]
1512a00633M8942L1652j059j7310m3911K2700L339k1687P3258k0007j2773K1365
1500a6124J9114J695P082k4241r107n362j2445J3688L5533m9231P78O494j7561
1487d9687j2213K4485N2632J4479k3733n3030L2650K0081L6484m7488r486K2092
1475G266J8374l927L3541n0384m1785l2295j433M6250P906N49k5j9977J4711M8992
1461B7763n7159m1144L2230K5953L1569Q817l2160j00K2427J6375m8305J2014
1449a720L945p908K0084k8095J9533P148r775r426n8408q342M3809J2728k3122
1436c9549J3307M3936j3838J9645N456l8600K1734j9255j2457L4835N2612l8569
1424B9257j4393K2836l3234j9688k0188L3686p721m1603j5471P5111k4837J29
$$ y = [-100633, -51691, -20039, -21098, -38408, -82319, -59619, -56280, -77967, -4709, -24716, -37489, -16124, 2990, 4685, 11767, -12474, -21581, -26943, -39388, -25700, 9833, -39398, -38620, -32126, -49687, -61900, -37415, 15217, 29696, 5963, -47067, -14417, 5664, 42148, -5340, -14826, 7266, 25640, 21713, 55254, 4870, -36915, -69210, -70643, -24393, -16487, -15938, -15963, -35940, -21229, 27763, -29396, -70540, -38310, -12357, 19212, 28029, -4131, -4231, 18196, 34571, -13734, -1720, 2225, -5683, 14401, -13694, 5839, 12987, 3212, -6214, -64622, -72964, -29155, -16427, -39549, -26242, 17694, 3856, 23501, 28957, -9643, 12091, -7164, -19621, 15214, 67826, 29257, 14864, 37700, 4466, -15222, -35410, -1724, -9445, -51048, -66519, 8592, -16245, -16116]
1412a6116J0373J733k2687O939K8013K3556l3120k5975M6899n746q3513J4900
1400e4744M091N1567J4240j1074J2478j1302j3118j5271k4819j5474N3078n147
1388a5495q63M5848m2044L1686k0468J7928J3347q2155k5625M4179J8126k2272
1376c7808R560m6627j5820L8496L2582l821M416J9079Q166l6751k4096M0635J0299
1363a690j6130o4395K8887L7791k5324K1509l4968o554O672M2549j4303K6454
1351D98m7251M1609n1204K9154J0854m4667K3428j8665K9952K329k8360Q979N966
1338c7378J6293j5165L3458k7563j8994N053J7562J0688m9405J0477l727K6000
1326c2701l6431K1339K4O428p736O9533p289k4048o998k8897M7059l9484p740
$$ y = [-16116, -5743, -4010, -26697, -19758, 8255, 31811, -1309, -27284, 19615, 13869, -69644, -54744, -50653, 914, 15154, 4080, 16558, 5256, -7862, -23133, -47952, -63426, -10348, -15495, -16358, 29490, -12554, 19132, -1336, 16592, 29939, -52216, -77841, -33662, -15536, -37808, -28248, -74875, -90695, -52199, -19617, -23438, -19022, 57, 8223, -28528, -52624, -11989, -1690, -17820, -82215, -53328, -15537, -40861, -19352, -54320, -60874, -54202, -11653, -25956, 498, -46753, -5144, -56348, -27194, -16340, -61007, -37579, -56244, -26292, -23963, -52323, -43344, -37378, -21085, -36250, -2792, -30355, -49349, -44296, -26734, -16046, -65451, -54974, -58701, -32701, -69132, -47793, -47769, -41341, -49077, 20456, 13167, -10881, -17879, -46776, 283, -39201, -46941]
1313d6941K2083J2349J3102J9460K835k4631m750k4328J3199N5957l6781l6687
1301c5133J8889q164J1377m173k1154J5231K069K3240j7599j6793M2904L8785
1289D9479o6468k4129k2527M014J6239L2497j5843k5345K4557L5024m4316J3212
1277b3606K9346j1517K3772j7806p9430L5587L8391j9245k6169L6711L0028n3912
1265c7850J9845l155K5818j8850k5185j5219J8803M1323o371k9679q247n332M3158
1252i41J7375M0949j0692k1110j5401l0245r86N3932p8776l0469J9375M4204L1655
1239A8870l5029q489K2318M5235P127m4666l5837J3109K5509o956l558L9080m0978
1226d265k6922K4144L3009l0676L7944J4221n7864j9483M1768J5761j3696l0334
$$ y = [-46941, -24858, -12509, 593, 20053, 22888, -1743, -6493, -30821, -17622, 38335, 1554, -35133, -16244, -24408, -13031, -17204, -38358, -23127, -21058, 2182, -15417, -32210, 10694, 49479, -16989, -41118, -63645, -59631, -43392, -10895, -26738, -52083, -27526, 7498, -36818, -23606, 5740, -5777, 17995, 189, -79241, -43654, -5263, -24508, -50677, -13966, 16062, -37850, -18005, -21160, 4658, -14192, -39377, -54596, -35793, 5530, -841, -30520, -38767, -44099, -941, 16434, 57383, 46691, 25581, 10180, -20065, -21051, 32881, -45895, -76364, -56989, -12785, 18870, -16159, -24648, -2330, 42905, 50032, 5366, -30471, -17362, 8147, 1191, -2367, 36713, -4265, -31187, -7043, 25966, -4710, 33234, 47455, -10409, -29892, 11876, 27637, 13941, -16393]
1214a6393l7863l9762n010O324O9723L3070o9775M4261N7733k6960n3770K8208
1202a0214J9947l2758M4294O1090o0249j5824j7295l650M996m5612K7170K8110
1190EJ5376R721j4199j6467k708k1316m0328k100J3108j3229L6497P9354k8594
1177A5120M9644k2128o9275k3226N4180k7706k3745J9519J4735p817l5556L3417
1165b2838l0628J1595K3801J7034n397k9216K0293j9916J8662M6893l9246J9195
1153A0232o5469j2649M9503J7628l9346J3861K3442r982K7994K5348n6829k6429
1141d2696J6159n236K1482q700j506k1624R109O5830l51l3346k1208j0890L5506
1128B529M1582l5272l3666K6674p362q041j9332j1707L622O0492k2375L0094k805
$$ y = [-16393, -54256, -94018, -99028, -92704, -22981, 10089, -59686, -15425, 42308, 15348, -38422, -10214, 9733, -23025, 21269, 82359, 22110, 6286, -11009, -14659, -9663, -55275, -28105, 5, 15381, 25102, 10903, -5564, -8272, -29588, -69916, -72016, -58908, -72137, -35640, 43714, 15120, 64764, 42636, -26639, -49865, 4315, -23391, -47136, -27617, -12882, -20699, -56255, -22838, -53466, -41871, -18070, -1036, -6433, -35649, -15356, -35272, -16610, 30283, -8963, 10232, -55237, -67886, -18383, -755, -40101, -26240, -2798, -12780, 15214, 40562, -16267, -42696, -26537, -31773, -10291, -18991, -20497, -42121, -33012, 32818, 32467, -879, -22087, -32977, 2529, 44111, 8839, -24827, 1847, -5515, -13556, -32888, -44595, -40973, 19519, -2856, 27238, 24433]
1115B4433k0440o656j2889J5909j54M2235L50k6027j9367j3921j2548L0714n325
1102c686l4769P693j4298j2406J7254O928M3297K0409l5742m4453J8374m0788
1090g2187K0116M0005J3821R924L2376j0766m2446N2324J5604k0122p0617P887
1078b4081K6644K1228K3310o0957j1313l117O3035K2587l6084m3888n687J5551
1066a2772K0347K1444L4997j8052m7037k1597M0858K8147r594k3564k2749M9455
1054C9883m0739j470K2697p6833M9202j3692m656K4420l4007L6860J568l9968
1042c6735R847K6406N0209K4328n8959m8384J3478N2953m9817J3153P052l7769
1030c4238l6968M8807L4067j5145J0224L0261l1198K2444k2278j0890J5134k20
$$ y = [24433, 3993, -2663, -15552, 357, 203, 42438, 42788, 16761, -2606, -16527, -29075, 1639, -3686, -38455, -30762, -45060, -57466, -40212, -33284, 10013, 30422, -5320, -49773, -31399, -72187, -52071, -12066, 1755, 11679, 44055, 33289, -9157, 43167, 58771, 38649, -31968, -24081, 2563, 23791, 47101, -13856, -25169, -28286, 34749, 57336, 21252, -22636, -28323, -12772, 7575, 29019, 64016, 45964, -1073, -22670, 18188, 46335, 36741, 13177, -9572, 39883, -856, -2326, 20371, -56462, -7260, -20952, -25608, -1188, -35195, 1665, 3233, -36735, -26888, -482, 49727, 74055, 15096, -33288, -19810, 33143, -16674, -3521, 3531, -34238, -71206, -22399, 11668, -3477, 6747, 37008, 5810, 28254, 5976, -4914, 10220, 10000]
1018A0000L5498n7453J6579j5560k0399J5790p644J9003j1568R342J2842j807
1006D623L0647m5908k8656M6126L3410J0684P657n8348k4036L8232N153j8152
994A432l5560o353j8153J9746M8282k8221m8983O1105L4981m8721J3418K2357
982A5330p1403L2777L0671l2749K8719J5014k231n8884j509L6702q303k7364o797
969e0027K0704J3822N4982L1864m0141k4826K4685J8042l6697m0405M1378J3201
957B6582Q533j3819R200J3105L0921n4078j3986j3634K6148P6820l9159j8402
945C8231j9708p572p832j7064N2323R254j9011j9579j7293J9566j8521L6026l5574
932f754o506K6345L899k0005j1897j342l691k2005O8939m949k8135K7957K8650
$$ y = [10000, 45498, -11955, 4624, -10936, -31335, -15545, -23189, -4186, -15754, -6412, 6430, 4623, 35270, -10638, -39294, 6832, 40242, 50926, 58583, 235, -23801, 14431, 19584, 1432, -34128, -40481, -58634, -38888, 9394, -18827, -67810, -6705, 28276, -20445, -7027, 15330, -56073, -23296, 7375, -25374, 3345, 18359, 16128, -42756, -44265, -7563, -15866, -43230, -50027, -29323, -15501, 39481, 71345, 31204, 6378, 31063, 49105, 12408, -27997, 13381, 26582, 35115, 21296, 30496, 43601, 74522, 20444, 6458, -7176, 18972, 95792, 56633, 38231, 18523, 10951, 3119, -13945, 38378, 47632, 28621, 9042, -8251, 11315, -7206, 28820, -6754, -13260, 13085, 16984, -3021, -14918, -16260, -19951, -41956, 26983, 22034, -6101, 21856, 50506]
919E0506n1757k7599K9392l6752k060J4966l2460J1084n034l92P0164J6348m4268
906g862J7077M9328k569n535k8984k9448L268l655M7474L4716k5906n6622K0606
893A1888j1454j8416j1500J3542j2862M2404K785k0469j948N059M841n504L8131
880C6497n1823L2247n5333l0473J5080J64j1222L4584O0162N5025n8386J1965
868C8487J7607l2417l3391l8614M2655M5459m1829n41M9000k4118l2292N4064
856D4070Q086J8448k8751k3113k9678J7729L7036j9363m324J9222n1771k7104
844c9513j4747P8101Q323J3708O738p6272L6739J8980L273o025J7299o4627m0767
831e8790J2630J8648N5810J9708r7003L9620J1007n732M2514l2610q743j7771
$$ y = [50506, -1251, -28850, 542, -36210, -38270, -23304, -55764, -44680, -49714, -50106, 20058, 36406, -7862, 9215, 58543, 55974, 50439, 21455, -7993, -4725, -8380, 39094, 73810, 47904, -8718, 11888, 434, -17982, -29482, -15940, -28802, 13602, 16387, -4082, -6030, -971, 3870, -1634, 36497, -15326, 16921, -38412, -68885, -53805, -53641, -64863, -30279, 29883, 84908, 26522, 38487, 56094, 23677, -9714, -48328, -5673, 39786, -2043, -2584, 46416, 22298, -9994, 44070, 52156, 70604, 41853, 18740, -10938, 6791, 43827, 24464, 20140, 39362, -12409, -39513, -54260, 23841, 32164, 45872, 52610, -23662, 13077, 32057, 35330, 29305, 46604, -18023, -58790, -46160, -27512, 28298, 48006, -48997, -9377, 1630, -4102, 38412, 5802, -2941, -20712]
819b0712j8666K9998j9969K4923L2904k019q001R355K7011k3768l4600M8055p108
806C7403R240P732m1585j1820m233j9833J4967k7919N2511K1207j1921J0899l6295
793C53m0079J8497J8127K9879N097N709k3316K9589L8223p9512j2058J0264K3066
780B3839k4003j6583K8076j7512L9949J2472j5831J5880J4979l7130L203K7102
768E4441L7854n244n9974R634l138q24J3256m9976k2046K3108M0779J5740l4841
755A8769j8014J1292l7474K912L5608m5774q415N0875K8460l5125p102k6907J1247
742a9648k7385O4601O154j4978k0081n0727k2828K2180J6032J9732M3173j514
$$ y = [-20712, -39378, -9380, -29349, -4426, 28478, 26459, 18458, 27813, 54824, 31056, -3544, 44511, 37403, 46643, 54375, 12790, 970, -3263, -23096, -8129, -36048, 16463, 37670, 25749, 36648, 353, -39726, -21229, -3102, 26777, 31874, 37583, 14267, 43856, 82079, 2567, -9491, 773, 23839, -164, -16747, 11329, -6183, 33766, 46238, 30407, 46287, 61266, 24136, 27339, 54441, 92295, 87051, 27077, 36711, 33573, 32749, 46005, -3971, -26017, -2909, 37870, 53610, 18769, 755, 12047, -25427, -22515, 13093, -32681, -41096, 9779, 38239, 3114, -3988, -30895, -19648, -47033, 17568, 23722, 8744, -11337, -62064, -84892, -62712, -46680, -26948, 16225, 14711]
$$ [...]
##END NTUPLES=NMR SPECTRUM
##END=
