##TITLE=1H_TG-2330-2
 CDCl3
 8 sc, 
 12.11.2021
##JCAMPDX= 6.0         $$ Bruker NMR JCAMP-DX V2.0
##DATA TYPE= NMR SPECTRUM
##DATA CLASS= NTUPLES
##ORIGIN= UXNMR, Bruker Analytische Messtechnik GmbH
##OWNER= root
$$ XWIN-NMR		Version 3.5
$$ Fri Nov 12 10:37:45 2021 Russian Standard Time (UT+4h)  she@DPX200
##.OBSERVE FREQUENCY= 200.1313468511
##.OBSERVE NUCLEUS= ^1H
##.ACQUISITION MODE= SIMULTANEOUS
##.ACQUISITION SCHEME= undefined
##.AVERAGES= 8
##.DIGITISER RES= 18
##SPECTROMETER/DATA SYSTEM= spect
##.PULSE SEQUENCE= zg30
##.SOLVENT NAME= D2O
##.SHIFT REFERENCE= (INTERNAL, D2O, 0, 15.759)
##AUDIT TRAIL= $$ (NUMBER, WHEN, WHO, WHERE, WHAT)
$$ ##TITLE= Audit trail, XWIN-NMR		Version 3.5
$$ ##JCAMPDX= 5.01
$$ ##ORIGIN= Bruker BioSpin GmbH
$$ ##OWNER= she
$$ F:/spectra/data/she/nmr/H-F/1/pdata/1/auditp.txt
$$ ##AUDIT TRAIL=  $$ (NUMBER, WHEN, WHO, WHERE, WHAT)
(   1,<2021-11-12 10:36:07.54 +0400>,<she>,<DPX200>,
      <created by zg, POWCHK disabled, PULCHK disabled
       configuration hash MD5:
       00 E9 B6 7A A2 85 ED C7 34 08 36 98 17 FE 4E 26
       data hash MD5: 16K
       BD 54 51 FC 38 68 8F AF 58 03 5E C8 96 D5 25 BB>)
(   2,<2021-11-12 10:36:11.28 +0400>,<she>,<DPX200>,
      <Start of raw data processing
       efp BC_mod = 2 LB = 0.24 FT_mod = 6 PKNL = 1 PHC0 = -15516.31 PHC1 = 12.20081 SI = 16K 
       data hash MD5: 16K
       7E 27 2E 2F 79 38 47 DE 03 13 7E 31 74 01 F9 88>)
(   3,<2021-11-12 10:36:36.75 +0400>,<she>,<DPX200>,
      <pk PHC0 = 1.973451 PHC1 = 4 
       data hash MD5: 16K
       F2 F1 EB 5D 65 7C 0B 5F E8 D1 9E B1 5A 13 7C D2>)
(   4,<2021-11-12 10:36:40.35 +0400>,<she>,<DPX200>,
      <abs ABSG = 5 
       data hash MD5: 16K
       CA 0F 91 6C 29 DE E0 A5 BE 1F A8 C0 37 9B FF E0>)
$$ ##END=
$$ 
$$ hash MD5
$$ CA 3C 43 35 31 B2 EB 3E 91 C7 5B 0E BD 87 45 EF
##$RELAX= 
##$RELAX= 
##$RELAX= 
##$RELAX= 
##$RELAX= 
##$RELAX= 
$$ Bruker specific parameters
$$ --------------------------
##$DU= <F:/spectra>
##$EXPNO= 1
##$NAME= <H-F>
##$PROCNO= 1
##$TYPE= <nmr>
##$USER= <she>
##$AMP= (0..31)
100 100 100 100 100 100 100 100 100 100 100 100 100 100 100 100 100 100 
100 100 100 100 100 100 100 100 100 100 100 100 100 100 
##$AQSEQ= 0
##$AQ_mod= 1
##$AUNM= <au_zg>
##$AUTOPOS= <>
##$BF1= 200.13
##$BF2= 200.13
##$BF3= 200.13
##$BF4= 200.13
##$BF5= 200.13
##$BF6= 200.13
##$BF7= 200.13
##$BF8= 200.13
##$BYTORDA= 1
##$CFDGTYP= 0
##$CFRGTYP= 5
##$CHEMSTR= <none>
##$CNST= (0..31)
1 1 145 1 1 1 1 1 1 1 1 1 1 1 1 1 1 1 1 1 1 1 1 1 1 1 1 1 1 1 1 1 
##$CPDPRG= <>
##$CPDPRG1= <>
##$CPDPRG2= <>
##$CPDPRG3= <>
##$CPDPRG4= <mlev>
##$CPDPRG5= <mlev>
##$CPDPRG6= <mlev>
##$CPDPRG7= <mlev>
##$CPDPRG8= <mlev>
##$CPDPRGB= <>
##$CPDPRGT= <>
##$D= (0..31)
0 1.2 0 0 0 0 0 0 0 0.06 0 0.03 0 0 0 0 0.0002 0 0 0 0 0 0 0 0 0 0 0 0 
0 0 0 
##$DATE= 1636698966
##$DBL= (0..7)
120 120 120 120 120 120 120 120 
##$DBP= (0..7)
150 150 150 150 150 150 150 150 
##$DBP07= 0
##$DBPNAM0= <>
##$DBPNAM1= <>
##$DBPNAM2= <>
##$DBPNAM3= <>
##$DBPNAM4= <>
$$ [...]
##$SUBNAM2= <"">
##$SUBNAM3= <"">
##$SUBNAM4= <"">
##$SUBNAM5= <"">
##$SUBNAM6= <"">
##$SUBNAM7= <"">
##$SUBNAM8= <"">
##$SUBNAM9= <"">
##$SW= 18.0517286264689
##$SWIBOX= (0..15)
0 0 2 0 0 0 0 0 0 0 0 0 0 0 0 0 
##$SW_h= 3612.71676300578
##$TD= 16384
##$TD0= 1
##$TE= 0
##$TE2= 300
##$TE3= 300
##$TEG= 300
##$TL= (0..7)
0 120 120 120 120 120 120 120 
##$TP= (0..7)
150 150 150 150 150 150 150 150 
##$TP07= 0
##$TPNAME0= <>
##$TPNAME1= <>
##$TPNAME2= <>
##$TPNAME3= <>
##$TPNAME4= <>
##$TPNAME5= <>
##$TPNAME6= <>
##$TPNAME7= <>
##$TPOAL= (0..7)
0.5 0.5 0.5 0.5 0.5 0.5 0.5 0.5 
##$TPOFFS= (0..7)
0 0 0 0 0 0 0 0 
##$TUNHIN= 0
##$TUNHOUT= 0
##$TUNXOUT= 0
##$USERA1= <user>
##$USERA2= <user>
##$USERA3= <user>
##$USERA4= <user>
##$USERA5= <user>
##$V9= 5
##$VALIST= <valist>
##$VCLIST= <CCCCCCCCCCCCCCC>
##$VD= 0
##$VDLIST= <DDDDDDDDDDDDDDD>
##$VPLIST= <PPPPPPPPPPPPPPP>
##$VTLIST= <TTTTTTTTTTTTTTT>
##$WBST= 1024
##$WBSW= 4
##$XGAIN= (0..3)
0 0 0 0 
##$XL= 0
##$YL= 0
##$YMAX_a= 421020
##$YMIN_a= -658314
##$ZGOPTNS= <>
##$ZL1= 120
##$ZL2= 120
##$ZL3= 120
##$ZL4= 120
##$ABSF1= 15.76011
##$ABSF2= -2.291739
##$ABSG= 5
##$ABSL= 3
##$ALPHA= 0
##$AQORDER= 0
##$ASSFAC= 0
##$ASSFACI= 0
##$ASSFACX= 0
##$ASSWID= 0
##$AUNMP= <proc_1d>
##$AZFE= 0.1
##$AZFW= 0.1
##$BCFW= 0
##$BC_mod= 2
##$BYTORDP= 0
##$COROFFS= 0
##$CY= -3
##$DATMOD= 1
##$DC= 0
##$DFILT= <>
##$DTYPP= 0
##$F1P= 0
##$F2P= 0
##$FCOR= 1
##$FTSIZE= 16384
##$FT_mod= 6
##$GAMMA= 0
##$GB= 0
##$INTBC= 1
##$INTSCL= 0
##$ISEN= 128
##$LB= 0.24
##$LEV0= 0
##$LPBIN= 0
##$MAXI= 10000
##$MC2= 0
##$MEAN= 0
##$ME_mod= 0
##$MI= 1.114404
##$NCOEF= 0
##$NC_proc= -6
##$NLEV= 6
##$NOISF1= 3.799351
##$NOISF2= 2.8
##$NSP= 0
##$NTH_PI= 0
##$NZP= 0
##$OFFSET= 15.75901
##$PC= 1
##$PHC0= -15514.34
##$PHC1= 16.20081
##$PH_mod= 1
##$PKNL= yes
##$PPARMOD= 0
##$PSCAL= 0
##$PSIGN= 0
##$REVERSE= no
##$SF= 200.129999359297
##$SI= 16384
##$SIGF1= 3
##$SIGF2= 2
##$SINO= 5.538805
##$SIOLD= 16384
##$SREGLST= <1H.CDCl3>
##$SSB= 0
##$STSI= 16384
##$STSR= 0
##$SW_p= 3612.71676300578
##$SYMM= 0
##$S_DEV= 0
##$TDeff= 16384
##$TDoff= 0
##$TI= <>
##$TILT= no
##$TM1= 0
##$TM2= 0
##$TOPLEV= 0
##$USERP1= <user>
##$USERP2= <user>
##$USERP3= <user>
##$USERP4= <user>
##$USERP5= <user>
##$WDW= 1
##$XDIM= 16384
##$YMAX_p= 502830934
##$YMIN_p= -1309925
$$ End of Bruker specific parameters
$$ ---------------------------------
##NTUPLES= NMR SPECTRUM
##VAR_NAME=  FREQUENCY,     SPECTRUM/REAL,   SPECTRUM/IMAG
##SYMBOL=    X,             R,               I
##VAR_TYPE=  INDEPENDENT,   DEPENDENT,       DEPENDENT
##VAR_FORM=  AFFN,          ASDF,            ASDF
##VAR_DIM=   16384,         16384,           16384
##UNITS=     HZ,            ARBITRARY UNITS, ARBITRARY UNITS
##FACTOR=    0.220516191357247, 1,           1
##FIRST=     3153.85072423238, 0,            0
##LAST=      -458.866038773402, 0,           0
##MIN=       -458.866038773402, -1309925,    0
##MAX=       3153.85072423238, 502830934,    0
$$ Real data points
##PAGE= N=1
##DATA TABLE= (X++(R..R)), XYDATA
$$ [...]
$$ plain form
8381 938701 980447 1062713 1042283 1089914 1125972 1288292 1264592 1085450 1069314 1070284 1026918 944669
8369 944669 1078796 1131187 1141169 1198760 1185508 1036110 1045296 974039 867510 835850 782134
8358 782134 764414 759458 721555 717127 641332 634040 566820 518294 608708 552127 487898 475835
8346 475835 490392 471273 525221 489356 466656 501474 382456 340836 299381 313682 379232
8335 379232 390597 393421 391633 271854 291941 274936 263357 169691 207638 330739 268494 252498
8323 252498 259510 231786 214288 159291 187612 240922 292042 277494 344482 293208 218519 281218
8311 281218 257110 232622 258516 224317 231481 221128 184086 256457 223986 182939 195536 143927
8299 143927 171825 277531 264237 315279 303464 285966 309700 306756 302935 190189 194589 123229
$$ packed form
8381I38701M1746Q2266k0430M7631L6058J62320k3700j79142j6136R70m3366q2249
8369I44669J34127N2391R982N7591j3252j49398R186p1257j06529l1660n3716
8358G82134j7720m956l7903m428p5795p292o7220m8526R0414n6581o4229j2063
8346D75835J4557j9119N3948l5865k2700L4818j19018m1620m1455J4301O5550
8335C79232J1365K824j788j19779K0087j7005j1579r3666L7947J23101o2245j5996
8323B52498P012k7724j7498n4997K8321N3310N1120j4548O6988n1274p4689O2699
8311B81218k4108k4488K5894l4199P164j0353l7042P2371l2471m1047J2597n1609
8299A43927K7898J05706j3294N1042j1815j7498K3734k944l821j12746M400p1360
$$ plain form
8287 123229 139556 267971 295346 291297 379256 359450 371176 466264 473042 398421 433017 381085
8275 381085 319834 352138 299678 243086 401706 428967 404028 413513 366228 476457 455328
8264 455328 459725 530618 571879 623549 617579 606258 583697 691605 765192 714337 711977 810049
8252 810049 780573 688224 699365 648566 545252 544183 477364 564453 533704 432610 415622
8241 415622 398764 346312 138861 147489 171038 259679 311649 346142 371146 435867 326771
8230 326771 329433 295844 334696 304686 306259 329855 353211 266695 292877 297921 217021 319674
8218 319674 338616 340945 339318 230831 295615 295610 238448 231090 222040 165844 232425 136272 199258
8205 199258 256693 264791 262667 191971 98308 104384 53418 166062 68303 27875 711 41693
$$ packed form
8287A23229J6327J28415K7375m049Q7959j9806J1726R5088O778p4621L4596n1932
8275C81085o1251L2304n2460n6592J58620K7261k4939R485m7285J10229k1129
8264D55328M397P0893M1261N1670n970j1321k2561J07908P3587n0855k360R8072
8252H10049k9476r2349J1141n0799j03314j069o6819Q7089l0749j01094j6988
8241D15622j6858n2452k07451Q628K3549Q8641N1970L4493K5004O4721j09096
8230C26771K662l3589L8852l0010J573K3596K3356q6516K6182N044q0900J02653
8218C19674J8942K329j627j08487O4784nn7162p358r050n6196O6581r6153O2986
8205A99258N7435Q098k124p0696r3663O076n0966J12644r7759m0428k7164M0982
$$ plain form
8193 41693 -298181 -1309925 -449349 9112 96165 190930 198262 170772 281409 199457 163662
8182 163662 207817 115244 11181 -6957 118349 138161 113298 40000 89643 26696 88152
8171 88152 153113 198096 160901 46780 27237 41031 41083 20675 45692 101969 95902 176792
8159 176792 -6848 -10199 17591 -107237 -90764 -61103 -3332 40905 -28744 -35139 -86647 -52808
8147 -52808 -27011 6737 29358 41440 -41123 -61119 -76270 -84411 -130193 -107430 -41556 -66467
8135 -66467 -123784 -113618 -77247 -30976 26737 -33730 -33623 -57579 -37387 109240 -39975 -94703
8123 -94703 -37886 10842 6241 -40343 48422 70393 -9797 -69888 -55551 83900 35294 70103
8111 70103 55301 12604 131446 36907 40559 96884 89295 98136 111998 93226 81137 92152
$$ packed form
8193D1693l39874j011744Q60576M58461Q7053R4765P332k7490J10637q1952l5795
8182A63662M4155r2573j04063j8138J25306J9812k4863p3298M9643o2947O1456
8171H8152O4961M4983l7195j14121j9543J3794N2k0408K5017N6277o067Q0890
8159A76792j83640l351K7790j24828J6473K9661N7771M4237o9649o395n1508L3839
8147e2808K5797L3748K2621J2082q2563j9996j5151q141m5782K2763O5874k4911
8135f6467n7317J0166L6371M6271N7713o0467J07k3956K0192J46627j49215n4728
8123i4703N6817M8728m601m6584Q8765K1971q0190o0091J4337J39451m8606L4809
8111G0103j4802m2697J18842r4539L652N6325p589Q841J3862j8772j2089J1015
$$ plain form
8099 92152 104042 61962 91689 -32770 35079 37045 31469 -11610 -48884 -8109 67205 9778
8087 9778 86754 20830 94913 154950 186671 196899 137372 119786 184726 158340 137056 168353
8075 168353 190411 265525 280949 180929 335272 377822 289591 188194 179699 292573 303478
8064 303478 383582 335524 261565 205791 150010 181447 257786 299295 327627 230561 245051 244500
8052 244500 277634 224849 280022 239793 277103 265472 264584 300980 362932 317709 285776 333918
8040 333918 304164 317511 366271 305171 443561 542028 470346 450028 476927 520971 586214
8029 586214 521415 549554 539161 438005 459950 409035 407042 383575 337014 342750 261565 291616
8017 291616 294461 229010 214665 294637 308199 362735 366735 349484 338074 377435 446220 362893
$$ packed form
8099I2152J1890m2080K9727j24459O7849J966n576m3079l7274M0775P5314n7427
8087I778P6976o5924P4083O0037L1721J0228n9527j7586O4940k6386k1284L1297
8075A68353K2058P5114J5424j00020J54343M2550q8231j01397q495J12874J0905
8064C03478Q0104m8058p3959n5774n5781L1437P6339M1509K8332r7066J4490n51
8052B44500L3134n2785N5173m0229L7310j1631q88L6396O1952m5223l1933M8142
8040C33918k9754J3347M8760o1100J38390R8467p1682k0318K6899M4044O5243
8029E86214o4799K8139j0393j01156K1945n0915j993k3467m6561N736q1185L0051
8017B91616K845o5451j4345P9972J3562N4536M000j7251j1410L9361O8785q3327
$$ plain form
8005 362893 370797 482083 424946 446521 451632 532556 587689 528510 451375 428270 477404 502984
7993 502984 538572 502861 432624 293762 306052 293600 381383 392263 363508 370861 409917 297477
7981 297477 428185 475010 422847 478212 465516 501207 559887 462284 505055 512884 431337 512755
7969 512755 486261 590593 543554 616878 748872 741261 772077 857927 936582 1039078 1034448
7958 1034448 1023182 1086619 1185209 1182970 1172361 1199400 1160409 1260726 1247609 1308629 1199314
7947 1199314 1261997 1186026 1174986 1082164 1074223 1129502 1050127 1036077 1015598 1022554 1122998 1056383
7935 1056383 1077450 993628 1040185 1081754 1008987 1008496 1032100 1173193 1333082 1458641 1480646
7924 1480646 1527607 1596906 1720099 1643373 1750263 1837158 1814881 1700543 1681676 1622509 1603297
$$ packed form
8005C62893P904J11286n7137K1575N111Q0924N5133n9179p7135k3105M9134K5580
7993E02984L5588l5711p0237j38862J2290j2452Q7783J0880k8755P353L9056j12440
7981B97477J30708M6825n2163N5365j2696L5691N8680r7603M2771P829q1547Q1418
7969E12755k6494J04332m7039P3324J31994p611L0816Q5850P8655J02496m630
7958A034448j1266O3437R8590k239j0609K7039l8991J00317j3117O1020j09315
7947A199314O2683p5971j1040r2822p941N5279p9375j4050k0479O956J00444o6615
7935A056383K1067q3822M6557M1569p2767m91K3604J41093J59889J25559K2005
7924A480646M6961O9299J23193p6726J06890Q6895k2277j14338j8867n9167j9212
$$ plain form
7913 1603297 1475835 1375532 1311660 1382569 1413254 1309131 1299237 1327432 1277255 1203143 1226733
7902 1226733 1256850 1209313 1215925 1268071 1364475 1387226 1260428 1267687 1366650 1398949 1435517 1475917
7890 1475917 1485040 1554305 1414608 1327191 1362249 1382486 1460011 1357334 1253951 1243995 1238854
7879 1238854 1082146 1045048 1095569 1042706 987729 1073065 1097189 1022835 1075653 1122795 1080702
7868 1080702 1133801 1206776 1318001 1513976 1562940 1603809 1660954 1738873 1869481 1936780 2061751
7857 2061751 2092167 2030287 1991600 1882599 1713912 1679428 1590229 1503274 1507390 1412336 1373187
7846 1373187 1291990 1235663 1198235 1226421 1248041 1199286 1201610 1223344 1240550 1207666 1200404 1145101
7834 1145101 1040609 1041629 1150138 1170197 1093897 1149607 1131357 1149213 1013020 825006 881252
$$ packed form
7913A603297j27462j00303o3872P0909L0685j04123r894K8195n0177p4112K3590
7902A226733L0117m7537O612N2146R6404K2751j26798P259R8963L2299L6568M0400
7890A475917R123O9265j39697q7417L5058K0237P7525j02677j03383r956n141
7879A238854j56708l7098N0521n2863n4977Q5336K4124p4354N2818M7142m2093
7868A080702N3099P2975J11225J95975M8964M0869N7145P7919J30608O7299J24971
7857B061751L0416o1880l8687j09001j68687l4484q9199q6955M116r5054l9149
7846A373187q1197n6327l7428K8186K1620m8755K324K1734J7206l2884p262n5303
7834A145101j04492J020J08509K0059p6300N5710j8250J7856j36193j88014N6246
$$ plain form
7823 881252 903817 844150 861200 855107 858560 813065 640920 695679 678050 593812 495340 512210
7811 512210 518525 511525 457178 386306 454255 553737 449729 444004 433733 280248 355498 376511
7799 376511 416160 424769 387186 443248 445415 369304 384685 310157 359274 292166 298755 372404
7787 372404 414953 432321 484340 476909 459278 575218 489938 450337 514345 436684 431554 469968
7775 469968 365532 310399 342054 403227 414048 374935 419640 418654 349035 418072 386756 331140
7763 331140 406423 331649 333127 293645 260818 343794 422040 340961 262988 283303 322451 369729
7751 369729 316078 290434 318873 319785 241981 314096 346047 297812 343494 358145 395690 448578
7739 448578 362669 250209 263635 259604 306662 328845 295701 280384 203734 328381 417223
$$ packed form
7823H81252K2565n9667J7050o093L453m5495j72145N4759j7629q4238r8472J6870
7811E12210O315p000n4347p0872O7949R9482j04008n725j0271j53485P5250K1013
7799C76511L9649Q609l7583N6062K167p6111J5381p4528M9117o7108O589P3649
7787C72404M2549J7368N2019p431j7631J15940q5280l9601O4008p7661n130L8414
7775D69968j04436n5133L1655O1173J0821l9113M4705r86o9619O9037l1316n5616
7763C31140P5283p4774J478l9482l2827Q2976P8246q1079p7973K0315L9148M7278
7751C69729n3651k5644K8439R12p7804P2115L1951m8235M5682J4651L7545N2888
7739D48578q5909j12460J3426m031M7058K2183l3144j5317p6650J24647Q8842
$$ plain form
7728 417223 426787 408941 385610 379822 538330 559823 426106 298269 420984 478065 480149
7717 480149 451149 418817 359679 402271 537224 502853 529892 577116 569227 411351 447040
7706 447040 529300 637312 579375 488159 471968 539430 494470 528451 681962 680509 581383
7695 581383 491864 399725 345602 402330 483621 549433 462270 385248 394973 395307 400596 383821
7683 383821 463623 517751 447426 319967 385924 405499 362134 345655 356376 365766 441458 434997
7671 434997 362001 370288 391130 412167 299399 282957 395848 460235 417611 394660 443210
7660 443210 472774 489716 547919 502361 446967 527819 444695 447896 384364 345331 583917 585786
7648 585786 461028 543357 592876 560373 637370 608025 700306 687873 630904 562473 546677
$$ packed form
7728D17223R564j7846k3331n788J58508K1493j33717j27837J22715N7081K084
7717D80149k9000l2332n9138M2592J34953l4371K7039M7224p889j57876L5689
7706D47040Q2260J08012n7937r1216j6191O7462m4960L3981J53511j453r9126
7695E81383q9519r2139n4123N6728Q1291O5812q7163p7022R725L34N289j6775
7683C83821P9802N4128p0325j27459O5957J9575m3365j6479J0721R390P5692o461
7671D34997p2996Q287K0842K1037j12768j6442J12891O4387m2624k2951M8550
7660D43210K9564J6942N8203m5558n5394Q0852q3124L201o3532l9033K38586J869
7648E85786j24758Q2329M9519l2503P6997k9345R2281j2433n6969o8431j5796
$$ plain form
7637 546677 469765 463767 507955 507766 538016 456648 390850 376339 382124 390359 398172 322396 322945
7624 322945 377394 427019 482501 418853 322024 280077 316255 342183 361830 344019 363704 410759
7612 410759 442285 446490 510727 429799 524653 518352 558086 426093 393098 416729 376081 362297
7600 362297 347414 485903 486037 385756 373823 475626 392552 419333 483225 585997 623900
7589 623900 577529 563597 546079 462228 532298 495950 376609 375411 372496 334765 345544 319368
7577 319368 349966 365791 325202 311326 296950 421276 541333 391441 369730 350526 317682
7566 317682 416052 343108 372093 502178 366193 245248 174935 343158 523977 569034 577465
7555 577465 579593 612295 644633 740068 746591 730452 693568 575568 548438 626522 629522 610015
$$ packed form
7637E46677p6912n998M4188j89L0250q1368o5798j4511N785Q235P813p5776N49
7624C22945N4449M9625N5482o3648r6829m1947L6178K5928J9647j7811J9685M7055
7612D10759L1526M205O4237q0928R4854o301L9734j31993l2995K3631m0648j3784
7600C62297j4883J38489J34j00281j1933J01803q3074K6781O3892J02772L7903
7589F23900m6371j3932j7518q3851P0070l6348j19341j198k915l7731J0779k6176
7577C19368L0598J5825m0589j3876j4376J24326J20057j49892k1711j9204l2844
7566C17682R8370p2944K8985J30085j35985j20945p0313J68223J80819M5057Q431
7555E77465K128L2702L2338R5435O523j6139l6884j18000k7130P8084L000j9507
$$ plain form
7543 610015 550276 594830 600728 538799 453074 535546 704869 799047 770479 775609 783760 813723
7531 813723 804290 757777 794450 792360 759356 789733 740464 712042 660812 662902 753169 672654
7519 672654 658122 670826 703728 642707 609824 578226 597890 566527 631167 605990 506827 496900
7507 496900 540454 562104 702780 619686 560454 520984 490855 536541 560556 522640 484999
7496 484999 457396 459194 544195 455307 397772 498113 462159 469571 578789 490000 405172 372334
7484 372334 361978 275056 208454 233385 299740 413967 397120 346000 421545 459322 361875
7473 361875 359718 383990 262606 316343 307850 312266 390531 357191 338080 363610 401729 386872
7461 386872 315541 351186 323205 340544 304938 360073 314944 340182 434171 515020 562492 513387
$$ packed form
7543F10015n9739M4554N898o1929q5725Q2472J69323R4178k8568N130Q151K9963
7531H13723r433m6513L6673k090l3004L0377m9269k8422n1230K090R0267q0515
7519F72654j4532J2704L2902o1021l2883l1598J9664l1363O4640k5177r9163r927
7507D96900M3554K1650J40676q3094n9232l9470l0129M5686K4015l7916l7641
7496D84999k7603J798Q5001q8888n7535J00341l5954P412J09218q8789q4828l2838
7484C72334j0356q6922o6602K4931O6355J14227j6847n1120P5545L7777r7447
7473C61875k157K4272j21384N3737q493M416P8265l3340j9111K5530L8119j4857
7461C86872p1331L5645k7981J7339l5606N5135m5129K5238R3989Q0849M7472m9105
$$ plain form
7449 513387 494703 425648 478875 461592 451423 537336 465639 390271 461421 444428 364237 422747
7437 422747 453582 398199 403544 386138 286559 270229 376727 332445 365224 272807 245752 320903
7425 320903 302849 434529 395292 327127 351106 393139 430753 288648 294468 252875 248855 277603
7413 277603 293747 314703 240443 285688 347975 261120 261902 302961 204299 280297 163786 213868
7401 213868 287596 330786 305685 296415 248106 347676 358131 341613 256101 338876 311877 296578
7389 296578 222704 220059 285840 244339 323016 241319 152589 131837 179562 159561 129643 249284
7377 249284 292408 275193 296523 331809 349945 297546 275085 284261 406395 366599 399314 319872
7365 319872 430041 407656 445658 464381 400604 424997 486356 503491 473904 606891 597345
$$ packed form
7449E13387j8684o9055N3227j7283j0169Q5913p1697p5368P1150j6993q0191N8510
7437D22747L0835n5383N345j7406r9579j6330J06498m4282L2779r2417k7055P5151
7425C20903j8054J31680l9237o8165K3979M2033L7614j42105N820m1593m020K8748
7413B77603J6144K0956p4260M5245O2287q6855P82M1059r8662P5998j16511N0082
7401B13868P3728M3190k5101r270m8309R9570J0455j6518q5512Q2775k6999j5299
7389B96578p3874k645O5781m1501P8677q1697q8730k0752M7725k0001k9918J19641
7377B49284M3124j7215K1330L5286J8136n2399k2461R176J22134l9796L2715p9442
7365C19872J10169k2385L8002J8723o3777K4393O1359J7135k9587J32987r546
$$ plain form
7354 597345 545760 626598 593048 574435 576433 491904 502407 655296 555067 491894 633652
7343 633652 632458 752797 830516 845399 867897 759428 692959 742745 762145 709093 759890
7332 759890 800407 654293 641877 650030 649886 639556 647014 718411 727286 820137 739517 720804
7320 720804 788288 856114 782383 832368 826405 842534 907203 888236 901919 870490 905311 879775
7308 879775 777546 840102 898995 858263 816430 810593 830269 852422 749591 725893 826232
7297 826232 854621 891875 885362 866221 874277 942620 989188 948613 938240 958000 1004781 1166150
7285 1166150 1182024 1135138 1111938 1037961 918786 913465 890544 945661 963994 945780 870192
7274 870192 809660 922007 865888 873719 912296 870571 936686 1005037 1050003 1001738 1066620 1119390
$$ packed form
7354E97345n1585Q0838l3550j8613J998q4529J0503J52889j00229o3173J41758
7343F33652j194J20339P7719J4883K2498j08469o6469M9786J9400n3052N0797
7332G59890M0517j46114j2416Q153j44j0330P458P1397Q875R2851q0620j8713
7320G20804O7484O7826p3731M9985n963J6129O4669j8967J3683l1429L4821k5536
7308H79775j02229O2556N8893m0732m1833n837J9676K2153j02831k3698J00339
7297H26232K8389L7254o513j9141Q056O8343M6568m0575j0373J9760M6781J61369
7285A166150J5874m6886k3200p3977j19175n321k2921N5117J8333j8214p5588
7274H70192o0532J12347n6119P831L8577m1725O6115O8351M4966m8265O4882N2770
$$ plain form
7262 1119390 1091425 1101969 1051127 1077381 955261 977156 962142 1053173 1025776 956008 931641
7251 931641 942632 885352 861060 920222 883050 834283 817097 880167 855348 757057 715117 656497
7239 656497 639054 665657 661419 643713 564131 598537 605525 676533 670787 683844 642450 705618
7227 705618 737453 658803 632967 620018 592279 594768 594801 543931 543144 653109 706929 655341 629891
7214 629891 642970 563773 607496 642480 736699 793716 825151 733363 737365 804432 871286 821791
7202 821791 822770 824819 924837 939729 935298 916561 943464 962470 913480 926839 876161 879260
7190 879260 906339 902586 959586 1020794 973477 971912 1058397 1154923 1120282 1151698 1194199 1203539
7178 1203539 1223027 1130815 1151571 1267666 1254378 1326264 1329589 1347602 1281001 1393647 1366322
$$ packed form
7262A119390k7965J0544n0842K6254j22120K1895j5014R1031k7397o9768k4367
7251I31641J0991n7280k4292N9162l7172m8767j7186O3070k4819r8291m1940n8620
7239F56497j7443K6603m238j7706p9582L4406O988P1008n746J3057m1394O3168
7227G05618L1835p8650k5836j2949k7739K489L3n0870p87J09965N3820n1588k5450
7214F29891J3079p9197M3723L4984R4219N7017L1435r1788M002O7067O6854m9495
7202H21791R79K049J00018J4892m431j8737K6903J9006m8990J3359n0678L099
7190H79260K7079l753N7000O1208m7317j565Q6485R6526l4641L1416M2501R340
7178A203539J9488r2212K0756J16095j3288P1886L325J8013o6601J12646k7325
$$ plain form
7167 1366322 1371709 1395990 1425640 1450482 1488303 1570826 1661952 1781219 1733910 1765267 1835970
7156 1835970 1890783 1912923 1954684 1908907 2030730 2092347 2155464 2229564 2330727 2498402 2666632
7145 2666632 2674673 2826061 2952867 3036375 3212843 3351444 3533009 3547553 3666374 3753482
7135 3753482 3891987 4053714 4315353 4574725 4843219 5063367 5351526 5691936 5929817 6336182
7125 6336182 6679681 7103878 7640776 8158942 8808797 9575176 10603691 11932343 13552858
7116 13552858 15618484 18153366 21195111 24850228 29155679 34273813 40244649 46541164
7108 46541164 52096153 55771921 56216399 52961252 47043664 39706536 32617625 26954897
7100 26954897 22581843 19370651 17027860 15314960 14098397 12961178 12061567 11358722
$$ packed form
7167A366322N387K4281K9650K4842L7821Q2523R1126J19267m7309L1357P0703
7156A835970N4813K2140M1761m5777J21823O1617O3117P4100J01163J67675J68230
7145B666632Q041J51388J26806Q3508J76468J38601J81565J4544J18821Q7108
7135C753482J38505J61727K61639K59372K68494K20148K88159L40410K37881M06365
7125F336182L43499M24197N36898N18166O49855P66379J028515J328652J620515
7116A3552858K065626K534882L041745L655117M305451N118134N970836O296515
7108D6541164N554989L675768M44478l255147n917588p337128p088911n662728
7100B6954897m373054l211192k342791j712900j216563j137219q99611p02845
$$ plain form
7092 11358722 10646813 10120781 9575681 9385559 9328946 9272720 9419417 9757511 10006117 10436553
7082 10436553 10698329 10867812 10810204 10450895 9730265 8970488 8266795 7697304 7249015 6861691
7072 6861691 6592353 6483585 6393300 6246669 6228877 6046966 5979946 6073564 6089022 6147830 6115265
7061 6115265 6171983 6403584 6419827 6546181 6677859 6801768 6948412 7142233 7352984 7674970
7051 7674970 8080612 8422330 8989446 9576808 10251178 11275759 12574998 14235863 16108789
7042 16108789 18317819 20976909 23776599 26675027 29845802 32835300 35441696 37462661
7034 37462661 38877544 39531244 39009888 37647323 35889150 33448375 30304215 26839139
7026 26839139 23612616 20889425 18402994 16257861 14535668 13211898 12137207 11188474
$$ packed form
7092A1358722p11909n26032n45100j90122n6613n6226J46697L38094K48606M30436
7082A0436553K61776J69483n7608l59309p20630p59777p03693n69491m48289l87324
7072F861691k69338j08768r0285j46631j7792j81911o7020R3618J5458N8808l2565
7061F115265N6718K31601J6243J26354J31678J23909J46644J93821K10751L21986
7051G674970M05642L41718N67116N87362O74370J024581J299239J660865J872926
7042A6108789K209030K659090K799690K898428L170775K989498K606396K020965
7034C7462661J414883O53700n21356j362565j758173k440775l144160l465076
7026B6839139l226523k723191k486431k145133j722193j323770j074691r48733
$$ plain form
7018 11188474 10613770 10055824 9496649 9120058 9032320 8861685 8600647 8423333 8452173 8562314
7008 8562314 8667028 8619566 8661572 8655179 8515880 8220848 8050675 7707315 7263430 6864571
6998 6864571 6457939 6096056 5754859 5449509 5267623 4981834 4770301 4701072 4488234 4478562
6988 4478562 4410863 4232808 4143834 4071298 3937623 3903541 3914661 3842239 3731078 3786897 3849896
6977 3849896 3825714 3822896 3831162 3695394 3624660 3698107 3606053 3455502 3344234 3287796 3140518
6966 3140518 3092735 3141435 3080231 2937452 2849221 2712579 2720853 2803462 2817068 2825282 2800139
6955 2800139 2900008 2864742 2759554 2698751 2683948 2677356 2631214 2550991 2510398 2357876 2396631
6944 2396631 2326264 2262762 2299990 2210549 2087777 2066833 1959654 1950687 1949416 1895004 1824546
$$ packed form
7018A1188474n74704n57946n59175l76591q7738j70635k61038j77314K8840J10141
7008H562314J04714m7462M2006o393j39299k95032j70173l43360m43885l98859
6998F864571m06632l61883l41197l05350j81886k85789k11533o9229k12838r672
6988D478562o7699j78055q8974p2536j33675l4082J1120p2422j11161N5819O2999
6977C849896k4182k818Q266j35768p0734P3447r2054j50551j11268n6438j47278
6966C140518m7783M8700o1204j42779q8231j36642Q274Q2609J3606Q214k5143
6955B800139R9869l5266j05188o0803j4803o592m6142q0223m0593j52522L8755
6944B396631p0367o3502L7228q9441j22772k0944j07179q967j271n4412p0458
$$ plain form
6933 1824546 1715590 1762242 1762615 1678103 1646448 1607288 1732044 1741563 1773276 1750977 1760298 1832941
6921 1832941 1721965 1633891 1675327 1609929 1570123 1658753 1537515 1580920 1669112 1586185 1534895
6910 1534895 1472711 1379192 1413674 1388631 1383793 1279757 1262351 1435861 1394265 1306541 1373409
6899 1373409 1392657 1404555 1262402 1240104 1299034 1251276 1219368 1339403 1333246 1242807 1189362
6888 1189362 1083239 1061615 1096528 1214764 1165511 1239322 1258152 1194769 1163608 1280318 1176817
6877 1176817 1222213 1399748 1325225 1278062 1266493 1246552 1228430 1202614 1227737 1248961 1230571
6866 1230571 1213068 1164751 1130044 1173859 1240835 1236813 1176955 1182585 1236192 1280013 1464384 1454046
6854 1454046 1477696 1528059 1514960 1578623 1624341 1606667 1606122 1531852 1598206 1543805 1483687 1426360
$$ packed form
6933A824546j08956M6652L73q4512l1655l9160J24756R519L1713k2299R321P2643
6921A832941j10976q8074M1436o5398l9806Q8630j21238M3405Q8192q2927n1290
6910A534895o2184r3519L4482k5043m838j04036j7406J73510m1596q7724O6868
6899A373409J9248J1898j42153k2298N8930m7758l1908J20035o157r0439n3445
6888A189362j06123k1624L4913J18236m9253P3811J8830o3383l1161J16710j03501
6877A176817M5396J77535p4523m7163j1569j9941j8122k5816K5123K1224j8390
6866A230571j7503m8317l4707M3815O6976m022n9858N630N3607M3821J84371j0338
6854A454046K3650N0363j3099O3663M5718j7674n45p4270O6354n4401o0118n7327
$$ plain form
6842 1426360 1409274 1389602 1320127 1188114 1117523 1146946 1097697 1025414 887191 848394 776024
6831 776024 824370 828792 830523 780871 703481 614218 817468 853774 776304 832053 841895 857423
6819 857423 869449 840400 793050 726569 710282 746233 802130 732132 827691 903731 836663 861203
6807 861203 809462 894594 749557 638567 773722 750018 699529 628014 636823 804665 848647
6796 848647 862578 924332 956206 976662 985561 1035550 930163 947223 1021806 991526 1100853
6785 1100853 1123090 1215736 1155450 1054187 951984 874254 993491 996664 913879 910717 905643
6774 905643 884493 860080 953945 962079 1013349 1026516 1058981 1068774 1173053 1226740 1306500 1380542
6762 1380542 1480691 1420572 1546186 1598250 1556851 1587930 1515748 1551118 1520756 1350632 1218915
$$ packed form
6842A426360j7086j9672o9475j32013p0591K9423m9249p2283j38223l8797p2370
6831G76024M8346M422J731m9652p7390q9263K03250L6306p7470N5749R842J5528
6819H57423J2026k9049m7350o6481j6287L5951N5897o9998R5559P6040o7068K4540
6807H61203n1741Q5132j45037j10990J35155k3704n0489p1515Q809J67842M3982
6796H48647J3931O1754L1874K0456Q899M9989j05387J7060P4583l0280J09327
6785A100853K2237R2646o0286j01263j02203p7730J19237L173q2785l162n074
6774I05643k1150k4413R3865Q134N1270J3167L2465R793J04279N3687P9760P4042
6762A380542J00149o0119J25614N2064m1399L1079p2182L5370l0362j70124j31717
$$ plain form
6751 1218915 1186931 1090187 1185473 1152737 1044030 1104210 1155018 1118381 1065441 943178 1011386
6740 1011386 1186572 1293257 1425528 1424667 1420696 1432616 1436997 1465430 1487753 1423929 1367514 1447047
6728 1447047 1438086 1437413 1419136 1343922 1367061 1471282 1408064 1339913 1369274 1411913 1435575 1438079
6716 1438079 1386723 1461848 1493861 1501232 1554152 1573567 1614040 1581880 1574941 1630079 1651622 1712096
6704 1712096 1793571 1769931 1761063 1750162 1811319 1800006 1794537 1918806 1989761 1934509 1903667 1806017
6692 1806017 1772328 1701728 1579598 1512495 1453470 1470507 1435227 1335882 1296895 1249471 1292378
6681 1292378 1435375 1437252 1360407 1409346 1516373 1514081 1579147 1598626 1619718 1645588 1513681
6670 1513681 1494001 1511040 1517008 1480036 1354854 1298114 1285689 1281375 1180539 1160487 1122619
$$ packed form
6751A218915l1984r6744R5286l2736j08707O0180N0808l6637n2940j22263O8208
6740A011386J75186J06685J32271q61l971J1920M381K8433K2323o3824n6415P9533
6728A447047q961o73j8277p5214K3139J04221o3218o8151K9361M2639K3662K504
6716A438079n1356P5125L2013P371N2920J9415M0473l2160o939N5138K1543O0474
6704A712096Q1475k3640q868j0901O1157j1313n469J24269P0955n5252l0842r7650
6692A806017l3689p0600j22130o7103n9025J7037l5280r9345l8987m7424M2907
6681A292378J42997J877p6845M8939J07027k292O5066J9479K1092K5870j31907
6670A513681j9680J7039N968l6972j25182n6740j2425m314j00836k0052l7868
$$ plain form
6659 1122619 1171027 1128014 1143695 1114207 1122313 1184188 1226017 1212256 1308844 1216937 1204545 1267029
6647 1267029 1251325 1247097 1267173 1291042 1188434 1237741 1153435 1174492 1279555 1222483 1232077
6636 1232077 1224247 1161946 1176353 1314733 1259361 1190620 1247729 1230597 1217620 1289171 1261296
6625 1261296 1212312 1275411 1165226 1176536 1191146 1227792 1316454 1341144 1206962 1183304 1248851
6614 1248851 1257493 1234392 1156775 1176083 1145822 1093491 1032530 1035997 1032321 1027675 973685 982557
6602 982557 923639 971423 1049303 1089597 1005090 942683 933057 1017625 1042231 956266 938908 847371
6590 847371 814279 779218 792213 912601 980130 908952 910707 919141 914067 865353 863960 879170
6578 879170 903632 885427 850120 896928 925568 963502 973631 914890 966694 1005682 978276 953629
$$ packed form
6659A122619M8408m3013J5681k9488Q106O1875M1829j3761R6588r1907j2392O2484
6647A267029j5704m228K0076K3869j02608M9307q4306K1057J05063n7072R594
6636A232077p830o2301J4407J38380n5372o8741N7109j7132j2977P1551k7875
6625A261296m8984O3099j10185J1310J4610L6646Q8662K4690j34182k3658O5547
6614A248851Q642k3101p7617J9308l0261n2331o0961L467l676m646n3990Q872
6602I82557n8918M7784P7880M0294q4507o2407r626Q4568K4606q5965j7358r1537
6590H47371l3092l5061J2995J20388O7529p1178J755Q434n074m8714j393J5210
6578H79170K4462j8205l5307M6808K8640L7934J0129n8741N1804L8988k7406k4647
$$ plain form
6566 953629 1001629 952984 926023 919212 927847 924411 1066063 1098006 973725 914998 907975 865155
6554 865155 857567 910452 935876 956412 950950 840738 903163 944825 922963 891129 842769 924780
6542 924780 1039161 1085948 1014752 947497 1033233 995045 981445 849921 806451 770245 799883
6531 799883 910079 904152 835416 824841 810958 838978 951197 976262 961960 1087814 1110455
6520 1110455 1093400 1154433 1124429 1106196 1140442 1196229 1194286 1325350 1311512 1252154 1262637
6509 1262637 1235562 1336269 1336891 1239930 1255955 1290851 1204917 1126695 1177597 1087927 986315
6498 986315 1014012 1164523 1042728 1042014 1110255 1018483 1002557 1097238 1229764 1104324 1053180
6487 1053180 1154882 1257822 1312328 1329078 1376536 1461014 1518567 1533459 1587208 1616877 1584425
$$ packed form
6566I53629M8000m8645k6961o811Q635l436J41652L1943j24281n8727p023m2820
6554H65155p588N2885K5424K0536n462j10212O2425M1662k1862l1834m8360Q2011
6542I24780J14381M6787p1196o7255Q5736l8188j3600j31524m3470l6206K9638
6531G99883J10196n927o8736j0575j3883K8020J12219K5065j4302J25854K2641
6520A110455j7055O1033l0004j8233L4246N5787j943J31064j3838n9358J0483
6509A262637k7075J00707O22r6961J6025L4896q5934p8222N0902q9670j01612
6498I86315K7697J50511j21795p14O8241r1772j5926R4681J32526j25440n1144
6487A053180J01702J02940N4506J6750M7458Q4478N7553J4892N3749K9669l2452
$$ plain form
6476 1584425 1502992 1350908 1270109 1239059 1275184 1318552 1170563 1236106 1258796 1251213 1222414
6465 1222414 1219250 1113904 1118232 1095994 1045310 1091508 1230529 1171888 1156957 1207569 1412630
6454 1412630 1427260 1321111 1331505 1352657 1374895 1464587 1456897 1430264 1384343 1213068 1167068
6443 1167068 1100449 1126397 1076776 1033143 1094737 1023370 998174 1054385 1074400 1025561 1006467
6432 1006467 1159425 1162070 1103221 1141828 1103206 1100721 1209321 1247460 1321888 1372572 1438571
6421 1438571 1413332 1380151 1279551 1254201 1182575 1134424 1098595 1026184 1068474 1153900 1114417
6410 1114417 1129592 1115468 955032 934356 1120310 1195577 1118003 1040056 955138 1079113 1100800
6399 1100800 1027681 999513 1114915 1090047 971674 1046525 1251504 1334393 1189945 1230953 1254641
$$ packed form
6476A584425q1433j52084q0799l1050L6125M3368j47989O5543K2690p583k8799
6465A222414l164j05346M328k2238n0684M6198J39021n8641j4931N0612K05061
6454A412630J4630j06149J0394K1152K2238Q9692p690k6633m5921j71275m6000
6443A167068o6619K5948m9621m3633O1594p1367k5196N6211K0015m8839j9094
6432A006467J52958K645n8849L8607l8622k485J08600L8139P4428N0684O5999
6421A438571k5239l3181j00600k5350p1626m8151l5829p2411M2290Q5426l9483
6410A114417J5175j4124j60436k0676J85954P5267p7574p7947q4918J23975K1687
6399A100800p3119k8168J15402k4868j18373P4851K04979Q2889j44448M1008K3688
$$ plain form
6388 1254641 1145502 1103156 1036486 945925 978208 1153468 1178846 1098082 1058179 982050 972543
6377 972543 1030042 1127850 1113634 1126711 1126647 1159771 1175494 1131237 1190697 1242319 1104270 1154402
6365 1154402 1136235 1165070 1147340 1082818 1183981 1075752 1121802 1159541 1166233 1188979 1192764
6354 1192764 1287946 1435328 1540905 1633805 1604586 1496840 1442475 1433019 1367850 1291499 1317899
6343 1317899 1345800 1387407 1408625 1337514 1264916 1402420 1467864 1457129 1318557 1302052 1318105
6332 1318105 1331282 1331425 1436067 1484205 1508263 1464730 1416744 1412044 1417805 1505383 1587817 1697924
6320 1697924 1655739 1846098 2027301 2196901 2190182 2294005 2492235 2709282 3036342 3428656
6310 3428656 3655299 3881903 3941078 3805796 3552352 3155236 2899282 2606173 2447687 2192057
$$ packed form
6388A254641j09139m2346o6670r0561L2283J75260K5378q0764l9903p6129r507
6377I72543N7499R7808j4216J3077o4L3124J5723m4257N9460N1622j38049N0132
6365A154402j8167K8835j7730o4522J01163j08229M6050L7739O692K2746L785
6354A192764R5182J47382J05577R2900k9219j07746n4365r456o5169p6351K6400
6343A317899K7901M1607K1218p1111p2598J37504O5444j0735j38572j6505J6053
6332A318105J3177J43J04642M8138K4058m3533m7986m700N761Q7578Q2434J10107
6320A697924m2185J90359J81203J69600o719J03823J98230K17047L27060L92314
6310C428656K26643K26604N9175j35282k53444l97116k55954k93109j58486k55630
$$ plain form
6300 2192057 2115716 2107567 1958067 1939120 1895354 1772508 1805431 1819658 1770269 1748928 1740471
6289 1740471 1654434 1645227 1614681 1460685 1421699 1513377 1503574 1430426 1486397 1499555 1515398 1525624
6277 1525624 1485746 1460605 1401005 1448023 1484041 1448664 1473746 1448897 1502543 1427176 1442023
6266 1442023 1427505 1404637 1455890 1468304 1487026 1572609 1629666 1562751 1603799 1636540 1576806
6255 1576806 1579304 1580445 1759091 1928510 1895309 1929931 1870956 1732382 1652641 1590947 1636012
6244 1636012 1665737 1522020 1589865 1627408 1688413 1669614 1675496 1603957 1621560 1592818 1521461
6233 1521461 1550874 1579008 1618823 1565308 1678902 1699241 1800029 1847783 1876805 1876434 1912340
6222 1912340 1887346 1800919 1777262 1759162 1773512 1842250 1983819 1904453 1859930 1889199 1917999
$$ packed form
6300B192057p6341q149j49500j8947m3766j22846L2923J4227m9389k1341q457
6289A740471q6037r207l0546j53996l8986R1678r803p3148N5971J3158J5843J0226
6277A525624l9878k5141n9600M7018L6018l5377K5082k4849N3646p5367J4847
6266A442023j4518k2868N1253J2414J8722Q5583N7057o6915M1048L2741n9734
6255A576806K498J141J78646J69419l3201L4622n8975j38574p9741o1694M5065
6244A636012K9725j43717O7845L7543O1005j8799N882p1539J7603k8742p1357
6233A521461K9413K8134L9815n3515J13594K0339J00788M7754K9022l71L5906
6222A912340k4994q6427k3657j8100J4350O8738J41569p9366m4523K9269K8800
$$ plain form
6211 1917999 2054549 2087164 2105900 2110124 2148073 2267511 2288770 2220129 2187412 2234123 2175979
6200 2175979 2274523 2253427 2103398 2195256 2218741 2299359 2321986 2442288 2418379 2381228 2470388
6189 2470388 2535309 2543854 2524676 2555943 2526456 2559159 2531929 2457079 2507279 2563375 2686688
6178 2686688 2669302 2683931 2698253 2717991 2614390 2670748 2806341 2776064 2834595 2793849 2801993
6167 2801993 2742507 2812742 2864193 2804832 2880189 2800019 2796636 2870333 2794428 2852524 2982077
6156 2982077 2960411 3078786 3087051 3045820 3217265 3113357 3054372 3129512 3232253 3296533 3282751
6145 3282751 3390732 3411077 3552354 3643531 3639895 3754626 3701661 3627823 3701813 3676062 3658433
6134 3658433 3756621 3753751 3750018 3781080 3823641 3702603 3715544 3784910 3788610 3842984 3977177 3981507
$$ packed form
6211A917999J36550L2615J8736M224L7949J19438K1259o8641l2717M6711n8144
6200B175979R8544k1096j50029R1858K3485Q0618K2627J20302k3909l7151Q9160
6189B470388O4921Q545j9178L1267k9487L2703k7230p4850N0200N6096J23313
6178B686688j7386J4629J4322J9738j03601N6358J35593l0277N8531m0746Q144
6167B801993n9486P0235N1451n9361P5357q0170l383P3697p5905N8096J29553
6156B982077k1666J18375Q265m1231J71445j03908n8985P5140J02741O4280j3782
6145C282751J07981K0345J41277R1177l636J14731n2965p3838P3990k5751j7629
6134C658433R8188k870l733L1062M2561j21038J2941O9366L700N4374J34193M330
$$ plain form
6122 3981507 4023622 4044729 4031035 4033040 3994961 4046102 4169889 4234871 4333105 4435405 4457479
6111 4457479 4548190 4557817 4582663 4726256 4826177 4818682 4812759 4896092 5026338 5121496 5258666
6100 5258666 5302481 5422271 5646420 5632424 5767030 5820361 5917524 6089666 6108376 6212066
6090 6212066 6527242 6666341 6935006 7132371 7273347 7676386 8183637 8734661 9315974 10113439
6080 10113439 11044200 12093490 13261629 14728692 16381863 18013898 19310365 19849090
6072 19849090 19464245 18567590 17470328 16748624 16574568 16791605 17325955 18141099 19248169
6063 19248169 20213352 20828978 20715813 19585299 17698717 15827136 14348149 13233274 12417976
6054 12417976 11757943 11290106 10934940 10765572 10502479 10321757 10366699 10355111 10336676 10243644
$$ packed form
6122C981507M2115K1107j3694K005l8079N1141J23787O4982R8234J02300K2074
6111D457479R0711R627K4846J43593R9921p495n923Q3333J30246R5158J37170
6100E258666M3815J19790K24149j3996J34606N3331R7163J72142J8710J03690
6090F212066L15176J39099K68665J97365J40976M03039N07251N51024N81313P97465
6080A0113439R30761J049290J168139J467063J653171J632035J296467N38725
6072A9849090l84845q96655j097262p21704j74056K17037N34350Q15144J107070
6063A9248169R65183O15626j13165j130514j886582j871581j478987j114875q15298
6054A2417976o60033m67837l55166j69368k63093j80722M4942j1588j8435r3032
$$ plain form
6044 10243644 10345776 10429266 10453805 10526704 10671330 10864013 11106052 11332655 11560377 11972683
6034 11972683 12399363 12893873 13542791 14322947 15246428 16326271 17542453 19066849 20725983
6025 20725983 22649212 24784061 26869374 28255692 28631376 27927002 26425875 25080400
6017 25080400 24405626 24218769 24592558 25499281 26810843 28318056 29637145 30177788 29580606
6008 29580606 27820423 25472667 23145646 21386835 20043182 18962862 18165876 17532604
6000 17532604 17140632 16900754 16535299 16319391 16408278 16257874 16149955 16211340 16182549 16197927
5990 16197927 16263224 16364531 16507374 16621281 16849358 16992599 17185048 17392591 17555135 17796451
5980 17796451 18067817 18319240 18530553 18639816 18865547 18970066 19223312 19394554 19684219
$$ packed form
6044A0243644J02132Q3490K4539P2899J44626J92683K42039K26603K27722M12306
6034A1972683M26680M94510O48918P80156R23481J079843J216182J524396J659134
6025B0725983J923229K134849K085313J386318L75684p04374j501127j345475
6017B5080400o74774j86857L73789R06723J311562J507213J319089N40643n97182
6008B9580606j760183k347756k327021j758811j343653j080320p96986o33272
6000A7532604l91972k39878l65455k15908Q8887j50404j07919O1385k8791J5378
5990A6197927O5297J01307J42843J13907K28077J43241J92449K07543J62544K41316
5980A7796451K71366K51423K11313J09263K25731J04519K53246J71242K89665
$$ plain form
5971 19684219 19902432 20134669 20382525 20696861 20990272 21374777 21591751 21644927 21899561 22112048
5961 22112048 22313660 22498455 22768461 23051860 23367649 23750596 24276290 24558727 24953841
5952 24953841 25289759 25772965 26225236 26719898 27014381 27383235 27835776 28286864 28781604
5943 28781604 29455629 29979901 30661483 31293245 32047735 32743191 33383419 33952653 34242369
5934 34242369 34444170 34302952 34265479 34333768 34452207 34582422 34797557 35009654 35258372 35531691
5924 35531691 35772239 35803183 36088726 36194936 36256973 36497747 36554999 36665683 36813905 36956225
5914 36956225 37009006 36978967 37052330 37051280 37057841 37048893 37083998 36993294 36792178 36756460 36693332 36498122
5902 36498122 36395695 36250289 36075537 35851993 35656157 35457436 35305607 35154738 34814203
$$ packed form
5971A9684219K18213K32237K47856L14336K93411L84505K16974N3176K54634K12487
5961B2112048K01612J84795K70006K83399L15789L82947N25694K82437L95114
5952B4953841L35918M83206M52271M94662K94483L68854M52541M51088M94740
5943B8781604O74025N24272O81582O31762P54490O95456O40228N69234K89716
5934C4242369K01801j41218l7473O8289J18439J30215K15135K12097K48718K73319
5924C5531691K40548L0944K85543J06210O2037K40774N7252J10684J48222J42320
5914C6956225N2781l0039P3363j050O561q948L5105r0704k01116l5718o3128j95210
5902C6498122j02427j45406j74752k23544j95836j98721j51829j50869l40535
$$ plain form
5893 34814203 34513777 34255160 34024242 33860581 33611892 33385614 33024406 32728367 32493518
5884 32493518 32210537 31905268 31622373 31384268 31097533 30813956 30632174 30453302 30281204
5875 30281204 30056459 29692637 29427918 28937119 28638386 28565674 28344032 28160244 28000807 27816286
5865 27816286 27398065 27209189 26911139 26447570 26177680 25891456 25561732 25214214 25040780
5856 25040780 24804499 24663857 24643597 24485726 24155730 23703195 23452388 23274880 23154915 23085226
5846 23085226 22805583 22833419 22851724 22773462 22788421 22772667 22657994 22556048 22433397 22363024
5836 22363024 22349515 22395743 22441339 22372864 22531342 22834175 23081750 23446931 23948821 24561082
5826 24561082 25142274 25487558 25966748 26355119 26701797 26900637 27169751 27478553 27861877
$$ packed form
5893C4814203l00426k58617k30918j63661k48689k26278l61208k96039k34849
5884C2493518k82981l05269k82895k38105k86735k83577j81782j78872j72098
5875C0281204k24745l63822k64719m90799k98733p2712k21642j83788j59437j84521
5865B7816286m18221j88876k98050m63569k69890k86224l29724l47518j73434
5856B5040780k36281j40642k0260j57871l29996m52535k50807j77508j19965o9689
5846B3085226k79643K7836J8305p8262J4959j5754j14673j01946j22651p0373
5836B2363024j3509M6228M5596o8475J58478L02833K47575L65181N01890O12261
5826B4561082N81192L45284M79190L88371L46678J98840K69114L08802L83324
$$ plain form
5817 27861877 28009092 28045416 27842732 27357247 26611253 25976918 25275509 24379100 23626676 22928019
5807 22928019 22336122 21934624 21838901 21753644 21694731 21579828 21483996 21293521 21082191 21103525
5797 21103525 21150965 21102347 21059611 20921537 20812323 20488968 20250927 20059358 19984675 19974191
5787 19974191 20001098 20152449 20320201 20355421 20473069 20667823 20938729 21396813 21930622 22557485
5777 22557485 23462945 24174882 24624237 24817250 24711736 24327715 24015788 23725385 23517857
5768 23517857 23340057 23139699 22965806 22833606 22581574 22259360 21921368 21681337 21407360
5759 21407360 21218815 21073371 20847267 20697128 20579158 20607769 20688425 20888965 20989242 21169189
5749 21169189 21507438 21815906 21982770 22262254 22569494 22776896 22623241 22539524 22477980 22201635
$$ packed form
5817B7861877J47215L6324k02684m85485p45994o34335p01409q96409p52424o98657
5807B2928019n91897m01498r5723q5257n8913j14903r5832j90475k11330K1334
5797B1103525M7440m8618m2736j38074j09214l23355k38041j91569p4683j0484
5787A9974191K6907J51351J67752L5220J17648J94754K70906M58084N33809O26863
5777B2557485R05460P11937M49355J93013j05514l84021l11927k90403k07528
5768B3517857j77800k00358j73893j32200k52032l22214l37992k40031k73977
5759B1407360j88545j45444k26104j50139j17970K8611Q0656K00540J00277J79947
5749B1169189L38249L08468J66864K79484L07240K07402j53655q3717o1544k76345
$$ plain form
5739 22201635 21897924 21804330 21631744 21723426 21986879 22301287 22758928 23492258 24605201 25849074
5729 25849074 27420668 29249111 31415676 33653704 35840784 38166101 40441937 42343082
5721 42343082 43631969 44131505 43775005 42319388 40088100 37744573 36061070 34945891
5713 34945891 34348850 34193842 34490434 35281839 36548316 38541680 40928421 43824583 47318230
5704 47318230 51372907 55802212 60443956 64928238 68847418 72074037 74515317 75840447
5696 75840447 75922238 74660349 72481939 70108653 67766826 65225342 62278461 59374991
5688 59374991 57317875 56277128 55962570 56259083 57607277 60137238 63496081 67792740
5680 67792740 72702673 78132595 83724677 88760399 93021183 96121171 97887855 97685331
$$ packed form
5739B2201635l03711r3594j72586R1682K63453L14408M57641P33330J112943J243873
5729B5849074J571594J828443K166565K238028K187080K325317K275836J901145
5721D2343082J288887M99536l56500j455617k231288k343527j683503j115179
5713C4945891n97041j55008K96592P91405J266477J993364K386741K896162L493647
5704D7318230M054677M429305M641744M484282L919180L226619K441280J325130
5696G5840447Q1791j261889k178410k373286k341827k541484k946881k903470
5688E9374991k057116j040747l14558K96513J348194K529961L358843M296659
5680F7792740M909933N429922N592082N035722M260784L099988J766684k02524
$$ plain form
5672 97685331 95090171 90678842 85102943 79468018 74371652 69665590 65215965 60996780
5664 60996780 57624117 55359858 54065726 53732546 54159448 55485491 57578535 60386852
5656 60386852 63859168 67586611 71543815 75236888 78104898 79934910 80854489 80458472
5648 80458472 78241772 74689016 70258144 65908683 62138487 58954687 56111206 53757686
5640 53757686 51367571 48810005 46168306 43822749 42182728 41146335 40502804 39993013
5632 39993013 39684371 39599793 39695895 39800646 39682877 39374690 38909695 37769867 36089019
5623 36089019 33912449 31727956 29841947 28184254 26724107 25511934 24446686 23462801
5615 23462801 22688766 22044115 21441661 21149877 20822408 20541246 20372596 20339360 20390874 20513840
$$ packed form
5672I7685331k595160m411329n575899n634925n096366m706062m449625m219185
5664F0996780l372663k264259j294132l33180M26902J326043K093044K808317
5656F0386852L472316L727443L957204L693073K868010J830012R19579l96017
5648H0458472k216700l552756m430872m349461l770196l183800k843481k353520
5640E3757686k390115k557566k641699k345557j640021j036393o43531n09791
5632C9993013l08642q4578R6102J04751j17769l08187m64995j139828j680848
5623C6089019k176570k184493j886009j657693j460147j212173j065248r83885
5615B3462801p74035o44651o02454k91784l27469k81162j68650l3236N1514J22966
$$ plain form
5605 20513840 20788395 21093325 21577512 22172480 22873563 23758223 24638790 25505734 26172341
5596 26172341 26394147 26243889 25847500 25324992 24928188 24872778 25005915 25413284 25978170 26552230
5586 26552230 27306165 28279013 29439211 30335464 30766558 30524415 29673204 28347009 26937934
5577 26937934 25957031 25347259 24774719 24224109 23736922 23290196 22919151 22662390 22421191
5568 22421191 22244806 22144647 22127402 22207872 22386853 22582696 22832065 23195949 23511647 23748876
5558 23748876 24004158 24352345 24887192 25591323 26236544 26779566 27336744 27737004 27834809 27848401
5548 27848401 27917573 28103441 28334302 28851531 29481531 30378484 31642342 33276702 35177272
5539 35177272 37353371 39709050 42284377 44953714 47817097 50706316 53744323 56425486
$$ packed form
5605B0513840K74555L04930M84187N94968P01083Q84660Q80567Q66944O66607
5596B6172341K21806j50258l96389n22508l96804n5410J33137M07369N64886N74060
5586B6552230P53935R72848J160198Q96253M31094k42143q51211j326195j409075
5577B6937934r80903o09772n72540n50610m87187m46726l71045k56761k41199
5568B2421191j76385j00159j7245Q0470J78981J95843K49369L63884L15698K37229
5558B3748876K55282L48187N34847P04131O45221N43022N57178M00260R7805J3592
5548B7848401O9172J85868K30861N17229O30000Q96953J263858J634360J900570
5539C5177272K176099K355679K575327K669337K863383K889219L038007K681163
$$ plain form
5531 56425486 58371950 59598099 60343584 60305444 59719892 59117750 58552283 57868158 56890676
5522 56890676 55763159 54333900 53245425 52856378 53027686 53823165 55169555 57053398 59367935
5513 59367935 61963085 64578653 66624870 67860372 67875584 66493440 64061975 60877739
5505 60877739 57572045 54905631 52936055 51348239 49908532 48416171 46855807 44911021
5497 44911021 42983208 41430904 40217749 39485905 38918318 38464870 38050247 37331769 36188360
5488 36188360 34571014 33083816 32187989 31626691 31293207 31101582 30921120 30636677 30330558
5479 30330558 30056658 29794094 29463157 29098413 28898118 29024848 29249331 29477348 29739417
5470 29739417 30048925 30184200 30441897 30536664 30521202 30399479 29858550 28618998 27434065
$$ packed form
5531E6425486J946464J226149P45485l8140n85552o02142n65467o84125r77482
5522E6890676j127517j429259j088475l89047J71308P95479J346390J883843K314537
5513E9367935K595150K615568K046217J235502J5212j382144k431465l184236
5505F0877739l305694k666414j969576j587816j439707j492361j560364j944786
5497D4911021j927813j552304j213155p31844n67587m53448m14623p18478j143409
5488C6188360j617346j487198q95827n61298l33484j91625j80462k84443l06119
5479C0330558k73900k62564l30937l64744k00295J26730K24483K28017K62069
5470B9739417L09508J35275K57697R4767j5462j21723n40929j239552j184933
$$ plain form
5461 27434065 26663820 25989735 25602536 25334710 25095344 25006506 25166269 25470145 26119208 26850365
5451 26850365 27772464 28911045 29971926 31387317 32976526 34345654 35363989 36132006
5443 36132006 36170207 35351843 34450121 33930093 33905949 34004617 34330348 34834805 35631078 36577823
5433 36577823 37598451 38286744 38835074 39329768 39756618 40190859 40944799 42120653 43295094
5424 43295094 44286554 44930398 45288674 45300791 45172662 44976151 44659351 43987143 43568460 43264285
5414 43264285 42977873 43206369 43709252 44268234 45002065 45856696 46903992 47762310 48512805
5405 48512805 49600377 50842965 52158388 53560873 54777902 55848215 57043676 58431377
5397 58431377 60119570 61909203 63583576 64858426 65660809 66513482 67614768 69305667
$$ packed form
5461B7434065p70245o74085l87199k67826k39366q8838J59763L03876O49063P31157
5451B6850365R22099J138581J060881J415391J589209J369128J018335P68017
5443C6132006L8201q18364r01722n20028k4144R8668L25731N04457P96273R46745
5433C6577823J020628O88293N48330M94694M26850M34241P53940J175854J174441
5424D3295094R91460O43844L58276J2117j28129j96511l16800o72208m18683l04175
5414D3264285k86412K28496N02883N58982P33831Q54631J047296Q58318P50495
5405D8512805J087572J242588J315423J402485J217029J070313J195461J387701
5397E8431377J688193J789633J674373J274850Q02383Q52673J101286J690899
$$ plain form
5389 69305667 71453238 74007215 76979250 80603000 84855617 89683652 95425585 102559018
5381 102559018 111306732 121973392 135348217 152347959 173943556 200553688 232470243
5374 232470243 269768997 311790837 357497173 403416537 442093642 471901461 495090435
5367 495090435 502830934 486322067 446852018 395968839 349109826 311708073 282055793
5360 282055793 258529672 240881806 228800415 221577903 218637882 220039492 225905138 236554490
5352 236554490 252155351 272993219 298962768 329753827 362938616 394784854 423470811
5345 423470811 446149592 457779268 455018438 435899806 402035767 359622233 315712544
5338 315712544 276382903 243872086 217266905 194927019 175907765 159965304 146723818
$$ packed form
5389F9305667K147571K553977K972035L623750M252617M828035N741933P133433
5381A02559018Q747714J0666660J3374825J6999742K1595597K6610132L1916555
5374B32470243L7298754M2021840M5706336M5919364L8677105K9807819K3188974
5367D95090435P740499j6508867l9470049n0883179m6859013l7401753k9652280
5360B82055793k3526121j7647866j2081391p222512k940021J401610N865646J0649352
5352B36554490J5600861K0837868K5969549L0791059L3184789L1846238K8685957
5345D23470811K2678781J1629676k760830j9118632l3864039m2413534m3909689
5338C15712544l9329641l2510817k6605181k2339886j9019254j5942461j3241486
$$ plain form
5331 146723818 135862277 126940910 119591155 113623887 108752937 105051421 102570631 101118403
5323 101118403 100858009 101449470 102361187 102489693 100866159 97489746 93364695 90056041 87630218
5314 87630218 86140948 85416623 85334024 85603015 85789879 85661977 84843611 82788703 79443731
5305 79443731 74967914 69866079 65145688 61204421 58100723 55523491 53566929 51959347
5297 51959347 50797417 49810470 49162356 48977775 48926298 49036340 49519415 50033335 50560896
5288 50560896 51011280 51549600 52065506 52492357 52954757 53372378 53377803 52696868 51177535 48813219
5278 48813219 45714835 42673520 39972375 37783532 36225516 35187332 34379673 33848646
5270 33848646 33749574 33890234 34290271 34743833 35424299 35958110 36179454 35905724 35070329 33877464
$$ packed form
5331A46723818j0861541q921367p349755n967268m870950l701516k480790j452228
5323A01118403k60394N91461R11717J28506j623534l376413m125051l308654k425823
5314H7630218j489270p24325q2599K68991J86864j27902q18366k054908l344972
5305G9443731m475817n101835m720391l941267l103698k577232j956562j607582
5297E1959347j161930r86947o48114j84581n1477J10042M83075N13920N27561
5288E0560896M50384N38320N15906M26851M62400M17621N425o80935j519333k364316
5278D8813219l098384l041315k701145k188843j558016j038184q07659n31027
5270C3848646r9072J40660M00037M53562O80466N33811K21344k73730q35395j192865
$$ plain form
5260 33877464 32649351 31600631 30777790 29992191 29465590 29005320 28502705 28099852 27790365
5251 27790365 27440834 27124587 26938091 27086239 27350786 27641832 27867868 27858728 27793758 27627801
5241 27627801 27603282 27986423 28409026 28988386 29549064 29790436 29700465 29264106 28389666 27221953
5231 27221953 26035402 25028469 24364606 23725865 22910070 22058268 21148740 20226706 19471834
5222 19471834 19072495 18678669 18594321 18517974 18521479 18584121 18634153 18738974 18713545 18660677 18625594
5211 18625594 18756964 18639189 18445725 18070062 17706524 17229841 16443922 15522336 14674253
5202 14674253 13971813 13530812 13278247 13022831 12881608 12650023 12545202 12456089 12223948 12018006
5192 12018006 11868166 11663019 11430488 11127322 10916788 10801938 10585355 10283248 9960799
$$ packed form
5260C3877464j228113j048720q22841p85599n26601m60270n02615m02853l09487
5251B7790365l49531l16247j86496J48148K64547K91046K26036r140o4970j65957
5241B7627801k4519L83141M22603N79360N60678K41372q9971m36359q74440j167713
5231B7221953j186551j006933o63863o38741q15795q51802r09528r22034p54872
5222A9471834l99339l93826q4348p6347L505O2642N0032J04821k5429n2868l5083
5211A8625594J31370j17775j93464l75663l63538m76683p85919r21586q48083
5202A4674253p02440m41001k52565k55416j41223k31585j04821q9113k32141k05942
5192A2018006j49840k05147k32531l03166k10534j14850k16583l02107l22449
$$ plain form
5183 9960799 9650702 9439990 9147647 8956226 8761018 8450155 8274745 8121806 7978903 7873233
5173 7873233 7839000 7731960 7762607 7747526 7680538 7762225 7783776 7768809 7883377 8030351 8050076
5162 8050076 8107146 8147973 8147573 8389598 8444746 8477979 8561697 8653650 8717723 8811859 9026150
5151 9026150 9252511 9478435 9857688 10216538 10590637 11074137 11370585 11700622 12044671 12343837
5141 12343837 12615388 12968420 13268495 13528097 13757760 13865218 13877385 13846116 14016940 14453448
5131 14453448 15015077 15665174 16428560 17464660 18399086 19163019 19688926 19826726 19445623
5122 19445623 18930061 18677488 18628474 18704450 18750810 18912672 19083861 19307838 19629942 20127582
5112 20127582 20518235 20698137 21172456 21592412 21728075 21673873 21638835 21350313 20675213 20204547
$$ packed form
5183I960799l10097k10712k92343j91421j95208l10863j75410j52939j42903j05670
5173G873233l4233j07040L0647j5081o6988Q1687K1551j4967J14568J46974J9725
5162H050076N7070M0827m00K42025N5148L3233Q3718R1953O4073R4136K14291
5151I026150K26361K25924L79253L58850L74099M83500K96448L30037L44049K99166
5141A2343837K71551L53032L00075K59602K29663J07458J2167l1269J70824M36508
5131A4453448N61629O50097P63386J036100R34426P63933N25907J37800l81103
5122A9445623n15562k52573m9014P5976M6360J61862J71189K23977L22104M97640
5112B0127582L90653J79902M74319M19956J35663n4202l5038k88522o75100m70666
$$ plain form
5102 20204547 20121879 20209291 20431865 20926368 21246531 21299976 20967579 20639584 20470956 20156104
5092 20156104 19681515 19258816 18774278 18166361 17639299 17307472 16961902 16554172 16137133
5083 16137133 15984957 15981421 15948670 15872575 15661581 14933165 13891744 12880300 12110887 11688470
5073 11688470 11389828 11262735 11309045 11286211 11337455 11422429 11216188 10720584 9938402 9323910
5063 9323910 8787315 8439666 8181803 7980425 7819373 7706801 7713005 7719767 7857415 8032088
5053 8032088 8118276 8257893 8456965 8842253 9423336 9773325 10028831 10102064 10067932 9768090
5043 9768090 9507417 9481960 9645527 9988515 10496345 10996429 11432363 11996039 12584082 12971613
5033 12971613 13189408 13436668 13855709 14453634 15105253 15777621 16219049 16386950 16758906
$$ packed form
5102B0204547q2668Q7412K22574M94503L20163N3445l32397l27995j68628l14852
5092B0156104m74589m22699m84538o07917n27062l31827l45570m07730m17039
5083A6137133j52176l536l2751p6095k10994p28416j041421j011444p69413m22417
5073A1688470k98642j27093M6310k2834N1244Q4974k06241m95604p82182o14492
5063I323910n36595l47649k57863k01378j61052j12572O204O762J37648J74673
5053H032088Q6188J39617J99072L85288N81083L49989K55506P3233l4132k99842
5043I768090k60673k5457J63567L42988N07830N00084M35934N63676N88043L87531
5033A2971613K17795K47260M19041N97925O51619O72368M41428J67901L71956
$$ plain form
5024 16758906 17356070 17802584 17907534 18032183 18240954 18283990 18095757 17975558 17929620 17612111
5014 17612111 17409833 17548619 17685584 17754922 17938543 18139730 18414425 18518246 18476982 18402169
5004 18402169 18282940 18373014 18741191 18969225 19001584 19141530 19447517 19581124 19477533 19176041
4994 19176041 18950699 18533166 18336039 18231576 18066906 17695095 17412954 17226344 17140269 17068533
4984 17068533 17024992 17102436 17115015 17293150 17522450 17433145 17240368 17411367 17894283 18731336
4974 18731336 19872121 21255989 22903766 24261732 25186750 25907031 25987105 24820249 22951435
4965 22951435 21414696 20462344 19646717 18979815 18586343 18097041 17580030 17331898 17190488
4956 17190488 17175530 17263527 17388823 17499113 17608592 17613651 17528942 17544379 17508012 17535281 17503163
$$ packed form
5024A6758906N97164M46514J04950J24649K08771M3036j88233j20199m5938l17509
5014A7612111k02278J38786J36965O9338J83621K01187K74695J03821m1264p4813
5004A8402169j19229R0074L68177K28034L2359J39946L05987J33607j03591l01492
4994A9176041k25342m17533j97127j04463j64670l71811k82141j86610q6075p1736
4984A7068533m3541P7444J2579J78135K29300q9305j92777J70999M82916Q37053
4974A8731336J140785J383868J647777J357966R25018P20281Q0074j166856j868814
4965B2951435j536739r52352q15627o66902l93472m89302n17011k48132j41410
4956A7190488j4958Q7997J25296J10290J09479N059q4709J5437l6367K7269l2118
$$ plain form
4945 17503163 17469180 17389562 17433871 17424747 17452715 17453189 17301108 17191221 17061005 16974130 17016025
4934 17016025 17021906 17041738 16963912 16820144 16728940 16648983 16556571 16409630 16274363 16100638 15737474
4923 15737474 15532119 15177104 14861003 14472580 14040841 13736061 13421294 13322448 13319314 13336147
4913 13336147 13324565 13352572 13211336 12970811 12873246 12662277 12427556 11909940 11462264 11143784
4903 11143784 10907390 10560546 10230947 10013242 9749410 9533791 9263068 9145060 9049879 8971938
4893 8971938 8991887 8896559 8674708 8460926 8156019 8039489 7797334 7598125 7441691 7341582
4883 7341582 7109049 7070365 7033578 6986204 6943384 6892144 6906528 6789966 6651218 6544423 6459171
4872 6459171 6207165 6100951 5897887 5755170 5613150 5463053 5337681 5287594 5220710 5139112
$$ packed form
4945A7503163l3983p9618M4309r124K7968M74j52081j09887j30216q6875M1895
4934A7016025N881J9832p7826j43768r1204p9957r2412j46941j35267j73725l63164
4923A5737474k05355l55015l16101l88423m31739l04780l14767r8846l134J6833
4913A3336147j1582K8007j41236k40525r7565k10969k34721n17616m47676l18480
4903A1143784k36394l46844l29599k17705k63832k15619k70723j18008r5181p7941
4893H971938J9949r5328k21851k13782l04907j16530k42155j99209j56434j00109
4883G341582k32533l8684l6787m7374m2820n1240J4384j16562j38748j06795q5252
4872F459171k52006j06214k03064j42717j42020j50097j25372n0087o6884q1598
$$ plain form
4862 5139112 4959074 4880177 4878825 4859477 4802514 4891268 4854774 4738176 4801582 4849928 4804615
4851 4804615 4734328 4760494 4731712 4736802 4566293 4415193 4331393 4345968 4275410 4136491 4021385
4840 4021385 3834301 3800676 3715109 3683524 3665023 3635643 3610626 3581976 3533971 3580589 3528067
4829 3528067 3417328 3479532 3408906 3424156 3368220 3467341 3425191 3282883 3267913 3312007 3379304
4818 3379304 3339250 3330632 3455297 3518906 3443885 3478261 3490688 3534827 3598573 3529868 3459322
4807 3459322 3528943 3672260 3645439 3649456 3509896 3489632 3606265 3574517 3607496 3598168 3614094
4796 3614094 3631070 3768025 3831550 3802273 3905863 4122930 4340619 4349754 4479717 4596690
4786 4596690 4727691 4795718 4845104 4934039 5055693 5189045 5302963 5265758 5222329 5225212 5225651
$$ packed form
4862E139112j80038p8897j352j9348n6963Q8754l6494j16598O3406M8346m5313
4851D804615p0287K6166k8782N090j70509j51100q3800J4575p0558j38919j15106
4840D021385j87084l3625q5567l1585j8501k9380k5017k8650m8005M6618n2522
4829C528067j10739O2204p0626J5250n5936R9121m2150j42308j4970M4094O7297
4818C379304m0054q618J24665O3609p5021L4376J2427M4139O3746o8705p0546
4807C459322O9621J43317k6821M017j39560k0264J16633l1748L2979r328J5926
4796C614094J6976J36955O3525k9277J03590K17067K17689R135J29963J16973
4786D596690J31001O8027M9386Q8935J21654J33352J13918l7205m3429K883M39
$$ plain form
4775 5225651 5281660 5169509 5101866 5041654 5137991 5203689 5152862 5094223 5222610 5288126 5384955
4764 5384955 5526154 5675594 5825004 6041527 6240799 6521596 6770813 6996724 7322718 7581326
4754 7581326 7912594 8333717 8942257 9573365 10180487 10826919 11600754 12783711 14215600
4745 14215600 15654716 16881049 18091167 18955733 19270816 18897770 17641654 16143044 14589726
4736 14589726 13449598 12574925 11985696 11626640 11491432 11497070 11453350 11467707 11678376 11786192
4726 11786192 12038241 12419158 12901632 13391081 14129082 15019160 16204139 17681412 19443988
4717 19443988 21598603 24044634 26897237 30035271 32703474 35066578 37007765 37380246
4709 37380246 36129082 34035600 32049393 30193159 28847907 27989934 27967366 28681111 29930323
$$ packed form
4775E225651N6009j12151o7643o0212R6337O5698n0827n8639J28387O5516R6829
4764E384955J41199J49440J49410K16523J99272K80797K49217K25911L25994K58608
4754G581326L31268M21123O08540O31108O07122O46432P73835J182957J431889
4745A4215600J439116J226333J210118Q64566L15083l73046j256116j498610j553318
4736A4589726j140128q74673n89229l59056j35208N638m3720J4357K10669J07816
4726A1786192K52049L80917M82474M89449P38001Q90078J184979J477273J762576
4717A9443988K154615K446031K852603L138034K668203K363104J941187L72481
4709C7380246j251164k093482j986207j856234j345252q57973k2568P13745J249212
$$ plain form
4700 29930323 31910107 34744528 38151245 42308217 47293162 52403087 57284679 62017349
4692 62017349 65833413 67707794 67628954 66069070 62894132 58460455 53663276 49638502
4684 49638502 46700802 44891945 44213845 44417564 45170830 46658653 48569786 50888836 53666078
4675 53666078 56712740 60078512 62975119 64837678 65328026 64688664 62115284 57517808
4667 57517808 52642154 48561653 45477638 43039646 40982542 39244803 37595650 36070530
4659 36070530 34609977 33355969 32302470 31636702 31293654 31240804 31378178 31627110 32005584
4650 32005584 32153936 32311244 32489382 32314635 31836501 31103236 30186243 29183304 28351062
4641 28351062 27839433 27561819 27399499 27362266 27520817 27763734 27956173 27959704 27845868 27644413
$$ packed form
4700B9930323J979784K834421L406717M156972M984945N109925M881592M732670
4692F2017349L816064J874381p8840j559884l174938m433677m797179m024774
4684D9638502k937700j808857o78100K03719P53266J487823J911133K319050K777242
4675E3666078L046662L365772K896607J862559M90348o39362k573380m597476
4667E7517808m875654m080501l084015k437992k057104j737739j649153j525120
4659C6070530j460553j254008j053499o65768l43048n2850J37374K48932L78474
4650C2005584J48352J57308J78138j74747m78134p33265r16993j002939q32242
4641B8351062n11629k77614j62320l7233J58551K42917J92439L531j13836k01455
$$ plain form
4631 27644413 27364036 27036734 26790446 26608200 26531750 26437695 26239040 26031540 25846113 25500604
4621 25500604 24869515 24410327 24122884 23999866 23988908 23959981 23797843 23713722 23639995 23616616
4611 23616616 23597244 23752031 24008517 24273776 24544779 24923901 25297450 25401151 25440955 25246434
4601 25246434 24765757 24359884 24209464 23972552 23893572 23871112 24091050 24466043 24726004 24863301
4591 24863301 24963890 24935612 25050828 25219651 25733983 26288302 26892491 27566239 28134601 28704429
4581 28704429 29256204 29645032 29840221 30034811 30213951 30521028 30613175 30886357 31178764 31271647
4571 31271647 31274637 31154964 31140543 30866614 30509938 30559633 30538287 30345186 30372089 30405412 30544092
4560 30544092 30808237 31363486 32241261 33364072 34798252 36481212 38428310 40356043 42003405
$$ packed form
4631B7644413k80377l27302k46288j82246p6450r4055j98655k07500j85427l45509
4621B5500604o31089m59188k87443j23018j0958k8927j62138q4121p3727k3379
4611B3616616j9372J54787K56486K65259K71003L79122L73549J03701L9804j94521
4601B5246434m80677m05873j50420k36912p8980k2460K19938L74993K59961J37297
4591B4863301J00589k8278J15216J68823N14332N54319O04189O73748N68362N69828
4581B8704429N51775L88828J95189J94590J79140L07077R2147K73182K92407R2883
4571C1271647K990j19673j4421k73929l56676M9695k1346j93101K6903L3323J38680
4560C0544092K64145N55249Q77775J122811J434180J682960J947098J927733J647362
$$ plain form
4551 42003405 43084479 43512895 42940001 41544565 39708810 38419985 37949037 38030161 38614740
4542 38614740 39731022 41027543 42250801 43142820 43464295 43165336 42085727 40904814 40401471
4533 40401471 40711747 41781486 43394729 45185159 47274187 49287817 50680592 51443413
4525 51443413 51734615 52119135 52324239 52212647 52176812 53218852 54901586 56814205 58818910
4516 58818910 60896997 62289061 62930366 62880559 62280771 60977495 59053427 56696517 54438397
4507 54438397 53183277 52823336 53134858 53564413 54234247 54709188 54848562 54514867 54277378
4498 54277378 54719142 55606971 56795195 58540621 60675603 63059302 65028880 65878167 65061050
4489 65061050 63051135 60203965 57277784 54838772 53279363 52207816 51522303 50872698
$$ packed form
4551D2003405J081074M28416n72894j395436j835755j288825m70948Q1124N84579
4542C8614740J116282J296521J223258Q92019L21475k98959j079609j180913n03343
4533D0401471L10276J069739J613243J790430K089028K013630J392775P62821
4525E1443413K91202L84520K05104j11592l5835J042040J682734J912619K004705
4516E8818910K078087J392064O41305m9807n99788j303276j924068k356910k258120
4507E4438397j255120l59941L11522M29555O69834M74941J39374l33695k37489
4498E4277378M41764Q87829J188224J745426K134982K383699J969578Q49287q17117
4489F5061050k009915k847170k926181k439012j559409j071547o85513o49605
$$ plain form
4481 50872698 50185875 49502689 48717432 47951064 47326240 46793902 46341205 46033348 45692843
4472 45692843 45432738 44920432 43773094 41718580 39218156 37322311 36112419 35160879 34571373
4463 34571373 34250645 34093871 34008339 33691102 32992740 31986794 30584363 28959128 27495478
4454 27495478 26210383 25092665 24331237 23831588 23268202 22778129 22268473 21738010 21153835
4445 21153835 20682271 20306288 20002508 19932658 19927811 20027297 20037958 20209283 20283361 20096423
4435 20096423 19862684 19603726 19455454 19396789 19314403 19229011 19187736 19067206 18819422 18702722
4425 18702722 18766233 19005016 19346198 19787380 20311587 20786888 21001205 21310824 21445319 21522411
4415 21522411 21576033 21475647 21437550 21414921 21267351 21114117 20954792 20618179 20115310 19654617
$$ packed form
4481E0872698o86823o83186p85257p66368o24824n32338m52697l07857l40505
4472D5692843k60105n12306j147338k054514k500424j895845j209892r51540n89506
4463C4571373l20728j56774q5532l17237o98362j005946j402431j625235j463650
4454B7495478j285095j117718p61428m99649n63386m90073n09656n30463n84175
4445B1153835m71564l75983l03780o9850m847R9486J0661J71325P4078j86938
4435B0096423k33739k58958j48272n8665q2386q5392m1275j20530k47784j16700
4425A8702722O3511K38783L41182M41182N24207M75301K14317L09619J34495P7092
4415B1522411N3622j00386l8097k2629j47570j53234j59325l36613n02869m60693
$$ plain form
4405 19654617 19223318 19059084 19218200 19538801 20031019 20814551 21578742 22195221 22586950
4396 22586950 22593371 22198095 21450415 20696937 20078233 19605890 19594796 19690551 20006510 20338740
4386 20338740 20431070 20354306 20058150 19569715 18812088 18193721 17741758 17674831 17675711 17831289
4376 17831289 17976947 18117616 18081677 17808715 17430172 16938049 16570520 16341775 16202463 16105252
4366 16105252 15973076 15996926 15987701 15901199 15638334 15081946 14318932 13541733 12811826 12380806
4356 12380806 11969920 11701931 11397489 11023972 10851667 10696766 10621349 10646341 10667454 10746519
4346 10746519 10795547 10762381 10645646 10499691 10410235 10165044 9905362 9879761 9800045 9731974
4336 9731974 9731195 9693456 9726030 9646029 9750949 9855063 9951031 10076663 10166991 10336814 10754433
$$ packed form
4405A9654617m31299j64234J59116L20601M92218P83532P64191O16479L91729
4396B2586950O421l95276p47680p53478o18704m72343j1094R5755L15959L32230
4386B0338740R2330p6764k96156m88435p57627o18367m51963o6927Q80J55578
4376A7831289J45658J40669l5939k72962l78543m92123l67529k28745j39312r7211
4366A6105252j32176K3850r225q6502k62865n56388p63014p77199p29907m31020
4356A2380806m10886k67989l04442l73517j72305j54901p5417K4992K1113P9065
4346A0746519M9028l3166j16735j45955q9456k45191k59682k5601p9716o8071
4336I731974p79l7739L2574q0001J04920J04114R5968J25632R0328J69823M17619
$$ plain form
4325 10754433 11002546 11104220 11217088 11217855 11174152 11189382 11174322 11371356 11494226 11681262
4315 11681262 11705955 11873787 11748251 11526420 11391969 11097777 10881898 10699746 10602840 10506348
4305 10506348 10432926 10405316 10401313 10317679 10247988 10052844 9953408 9821249 9847835 9753881 9787538
4294 9787538 9730794 9583101 9371351 9175872 9066666 8961310 8901015 8821884 8730082 8537687
4284 8537687 8379913 8445095 8330144 8359084 8289082 8251595 8141119 8069529 8096624 8044457 8036288
4273 8036288 8059533 7991800 7960120 7900400 7784805 7738365 7642190 7595015 7682408 7710511 7747411
4262 7747411 7880845 7932630 8140330 8167190 8316674 8435573 8368044 8425636 8407944 8270348
4252 8270348 8352270 8412691 8445529 8534315 8585352 8652692 8772469 8866954 8940409 8923868 9107184
$$ packed form
4325A0754433K48113J01674J12868P67m3703J5230j5060J97034J22870J87036
4315A1681262K4693J67832j25536k21831j34451k94192k15879j82152r6906r6492
4305A0506348p3422k7610m003q3634o9691j95144r9436j32159K6586r3954L3657
4294I787538n6744j47693k11750j95479j09206j05356o0295p9131r1802j92395
4284H537687j57774O5182j14951K8940p0002l7487j10476p1590K7095n2167q169
4273H036288K3245o7733l1680n9720j15595m6440r6175m7175Q7393K8103L6900
4262G747411J33434N1785K07700K6860J49484J18899o7529N7592j7692j37596
4252H270348Q1922O0421L2838Q8786N1037O7340J19777R4485P3455j6541J83316
$$ plain form
4241 9107184 9297722 9464352 9595125 9837891 10066623 10350411 10557733 10746469 11020897 11321545
4231 11321545 11614639 11958440 12395841 12817703 13180093 13514900 13890927 14277831 14712896
4222 14712896 15132977 15587350 16230060 16958158 17728960 18742654 19703065 20898040 22343482
4213 22343482 23861893 25622449 27494070 29521841 31835704 34448365 36993296 39393343
4205 39393343 41342905 42755275 43407860 43765335 44456394 45446937 46762599 48181551 49800969
4196 49800969 51774139 53870988 56090727 58154368 59863792 60998508 62136619 64028660
4188 64028660 66628239 69948193 73614442 77773714 82768294 88543605 95070990 102843236
4180 102843236 112553728 124507958 138641422 154374642 169457532 183712396 196680443
$$ packed form
4241I107184J90538J66630J30773K42766K28732K83788K07322J88736K74428L00648
4231A1321545K93094L43801M37401M21862L62390L34807L76027L86904M35065
4222A4712896M20081M54373O42710P28098P70802J013694R60411J194975J445442
4213B2343482J518411J760556J871621K027771K313863K612661K544931K400047
4205C9393343J949562J412370O52585L57475O91059R90543J315662J418952J619418
4196D9800969J973170K096849K219739K063641J709424J134716J138111J892041
4188F4028660K599579L319954L666249M159272M994580N775311O527385P772246
4180A02843236R710492J1954230J4133464J5733220J5082890J4254864J2968047
$$ plain form
4173 196680443 204910261 206112156 203900478 200888893 194833750 185067051 175181199 167208865
4165 167208865 158931177 148979500 137795846 126104158 114807535 104622402 95949709
4158 95949709 88776461 82546945 77441459 73224184 69781324 67027668 65139339 63808456
4150 63808456 63070315 62793198 62998008 63661064 64945577 66962141 69931876 74110714 79995068
4141 79995068 87555514 97027719 108746808 122743742 139297928 158965894 180695270
4134 180695270 201855852 219513120 229620915 228807458 216251553 195884776 173607730
4127 173607730 153028381 134481277 118880681 106445354 96311075 87689754 80505061
4120 80505061 74404159 69194189 64816401 60933297 57217790 54081233 51296701 48903209
$$ packed form
4173A96680443Q229818J201895k211678l011585o055143r766699r885852p972334
4165A67208865q277688r951677j1183654j1691688j1296623j0185133q672693
4158I5949709p173248o229516n105486m217275l442860k753656j888329j330883
4150F3808456p38141k77117K04810O63056J284513K016564K969735M178838N884354
4141G9995068P560446R472205J1719089J3996934J6554186J9667966K1729376
4134A80695270K1160582J7657268J0107795q13457j2555905k0366777k2277046
4127A73607730k0579349j8547104j5600596j2435327j0134279q621321p184693
4120H0505061o100902n209970m377788l883104l715507l136557k784532k393492
$$ plain form
4112 48903209 46939363 45410347 44072509 42971874 41817307 40759671 39897463 39174251
4104 39174251 38588552 37936486 37332553 37063174 36982146 36661103 36032941 35242354 33952525
4095 33952525 32265714 30800851 29496837 28210187 27023890 26039216 25088108 24236163 23411842
4086 23411842 22526516 22039588 21590874 21078282 20797086 20518982 20337333 20107029 19868857
4077 19868857 19600620 19134620 18352051 17635097 16875482 16350983 15764481 15267860 15012529
4068 15012529 14854024 14601120 14436426 14353997 14414341 14327663 14286989 14319054 14512960 14676633
4058 14676633 14891619 15150578 15422347 15705051 16007733 16424219 16871535 17091780 17193038
4049 17193038 17179174 16767280 16196354 15513013 14946977 14509785 13992045 13475538 13216369 13120923
$$ packed form
4112D8903209j963846j529016j337838j100635j154567j057636q62208p23212
4104C9174251n85699o52066o03933k69379q1028l21043o28162p90587j289829
4095C3952525j686811j464863j304014j286650j186297r84674r51108q51945q24321
4086B3411842q85326m86928m48714n12592k81196k78104j81649k30304k38172
4077A9868857k68237m66000p82569p16954p59615n24499n86502m96621k55331
4068A5012529j58505k52904j64694q2429O0344q6678m0674L2065J93906J63673
4058A4676633K14986K58959K71769K82704L02682M16486M47316K20245J01258
4049A7193038j3864m11894n70926o83341n66036m37192n17740n16507k59169r5446
$$ plain form
4039 13120923 13023107 13071998 13369478 13704188 13871401 14079590 14380335 14617205 14805051 14747188
4029 14747188 14399279 13782693 13273839 12835891 12484415 12236476 12001655 11921335 12003802 12070629
4019 12070629 12043838 11975318 11847993 11626028 11359220 11294410 11259639 11215751 11212770 11323250 11346437
4008 11346437 11484344 11541045 11376097 11139844 10914837 10763125 10370657 9882316 9557051 9317423
3998 9317423 8965749 8637017 8270830 7911233 7780865 7588295 7416817 7282278 7222924 7211195
3988 7211195 7172232 7065100 7043805 7140545 7195916 7138467 7192574 7143179 7118682 7159336 7050269
3977 7050269 6884915 6537127 6291149 6260999 6233016 6158393 6130839 6087938 6250428 6366204
3967 6366204 6451800 6490506 6630379 6729749 6704665 6708979 6631144 6405411 6264747 6053912 5959055
$$ packed form
4039A3120923r7816M8891K97480L34710J67213K08189L00745K36870J87846n7863
4029A4747188l47909o16586n08854m37948l51476k47939k34821q0320Q2467O6827
4019A2070629k6791o8520j27325k21965k66808o4810l4771m3888k981J10480K3187
4008A1346437J37907N6701j64948k36253k25007j51712l92468m88341l25265k39628
3998I317423l51674l28732l66187l59597j30368j92570j71478j34539n9354j1729
3988G211195l8963j07132k1295R6740N5371n7449N4107m9395k4497M0654j09067
3977G050269j65354l47788k45978l0150k7983p4623k7554m2901J62490J15776
3967F366204Q5596L8706J39873R9370k5084M314p7835k25733j40664k10835r4857
$$ plain form
3956 5959055 5813553 5801960 5653935 5550188 5501290 5467235 5440263 5297178 5322599 5325951 5306103
3945 5306103 5214293 5112276 5043863 4929414 4929624 4910786 4892245 4895237 4858911 4867156 4935164 4931986
3933 4931986 5037116 5208885 5278458 5266366 5355197 5250638 5222118 5332172 5284990 5166572
3923 5166572 4871755 4569341 4396577 4385624 4206860 4131340 4147340 4057472 3918694 3911513 3876300
3912 3876300 3829356 3953900 3948580 3992132 4068135 3907402 3895471 4095039 4263693 4332866 4396079
3901 4396079 4558780 4680626 4936335 5106107 5201855 5304152 5324562 5329700 5279885 5240376 5372325
3890 5372325 5606671 5607343 5665132 5794301 5807498 5764569 5791726 5606319 5574812 5569902 5456750
3879 5456750 5440219 5401495 5412864 5448156 5383626 5361991 5491564 5474391 5382333 5464857 5524139
$$ packed form
3956E959055j45502j1593j48025j03747m8898l4055k6972j43085K5421L352j9848
3945E306103r1810j02017o8413j14449K10j8838j8541K992l6326Q245O8008l178
3933D931986J05130J71769O9573j2092Q8831j04559k8520J10054m7182j18418
3923E166572k94817l02414j72764j0953j78764p5520J6000q9868j38778p181l5213
3912C876300m6944J24544n320M3552P6003j60733j1931J99568J68654O9173O3213
3901D396079J62701J21846K55709J69772R5748J02297K0410N138m9815l9509J31949
3890E372325K34346O72N7789J29169J3197m2929K7157j85407l1507m910j13152
3879E456750j6531l8724J1369L5292o4530k1635J29573j7173r2058Q2524N9282
$$ plain form
3868 5524139 5602033 5730009 5893218 6159520 6403271 6780528 6928186 7107248 7216670 6909402
3858 6909402 6514615 6163774 5790607 5488851 5346182 5178147 5172653 5179683 5196299 5095181
3848 5095181 4997087 5020670 4939816 4914239 4871628 4842328 4903127 4850165 4847072 4913002 4909484 4820300
3836 4820300 4889054 4988552 5131003 5172052 5072484 4925691 4882678 4641765 4329689 3984877
3826 3984877 3708821 3548685 3467807 3415673 3348516 3266173 3174830 3233599 3257868 3127985 3086458
3815 3086458 2965855 2808919 2798374 2674464 2522396 2478854 2491954 2512763 2436056 2300890
3805 2300890 2208916 2130789 2189980 2227343 2051909 2012756 2141356 2097275 2116743 2050460 2012442
3794 2012442 1997819 2087153 2004128 2003237 2011977 2042346 2058636 2079435 2171330 2203655 2199261 2104130
$$ packed form
3868E524139P7894J27976J63209K66302K43751L77257J47658J79062J09422l07268
3858F909402l94787l50841l73167l01756j42669j68035n494P030J6616j01118
3848E095181r8094K3583q0854k5577m2611k9300O0799n2962l093O5930l518q9184
3836D820300O8754R9498J42451M1049r9568j46793m3013k40913l12076l44812
3826C984877k76056j60136q0878n2134o7157q2343r1343N8769K4269j29883m1527
3815C086458j20603j56936j0545j23910j52068m3542J3100K0809p6707j35166
3805B300890r1974p8127N9191L7363j75434l9153J28600m4081J9468o6283l8018
3794B012442j4623Q9334q3025q91Q740L0369J6290K0799R1895L2325m394r5131
$$ plain form
3782 2104130 2165068 2158373 2168861 2313611 2349778 2293668 2200166 2174101 2156008 2110833 2105266 2128104
3770 2128104 2091438 2128971 2119473 2143581 2261375 2292920 2307329 2336749 2364471 2379209 2487285
3759 2487285 2576409 2725224 2732881 2886284 2924694 3049595 3120992 3136972 3044095 2935895 2707079
3748 2707079 2561637 2564772 2488367 2361591 2286035 2272755 2171507 2208337 2138884 2096395 2062966
3737 2062966 1888250 1860812 1934427 1887814 1816398 1797464 1746196 1639219 1694524 1780891 1771147
3726 1771147 1639941 1693475 1703047 1752020 1725296 1718311 1717123 1743058 1731087 1777120 1744223 1601609
3714 1601609 1516643 1474331 1334363 1297195 1271865 1265464 1332457 1468232 1407554 1439445 1431038
3703 1431038 1351663 1320819 1374283 1394213 1352084 1346439 1323052 1359967 1363738 1258415 1259211 1276935
$$ packed form
3782B104130O0938o695J0488J44750L6167n6110r3502k6065j8093m5175n567K2838
3770B128104l6666L7533r498K4108J17794L1545J4409K9420K7722J4738J08076
3759B487285Q9124J48815P657J53403L8410J24901P1397J5980r2877j08200k28816
3748B707079j45442L135p6405j26776p5556j3280j01248L6830o9453m2489l3429
3737B062966j74716k7438P3615m6613p1416j8934n1268j06977N5305Q6367r744
3726A771147j31206N3534R572M8973k6724o985j188K5935j1971M6033l2897j42614
3714A601609q4966m2312j39968l7168k5330o401O6993J35775o0678L1891q407
3703A431038p9375l0844N3464J9930m2129n645k3387L6915L771j05323P96J7724
$$ plain form
3691 1276935 1307260 1303596 1390774 1340544 1321773 1360701 1216257 1146261 1176743 1100303 982412
3680 982412 1057933 938355 1063792 1026613 989147 951388 1009710 1086852 1114554 1100063 937378
3669 937378 981538 946820 934549 1042235 1059223 1041890 1039747 1142042 1225318 1206192 1207120 1169680
3657 1169680 1155817 1231360 1192157 1118426 982140 1014448 930933 892444 882818 856294 816484
3646 816484 838976 852243 802956 854825 913754 926641 850650 829602 844080 757047 829571 796222
3634 796222 863619 913524 914760 895574 945414 941633 902228 944337 908863 947861 872247 867841
3622 867841 818496 811781 809417 829977 812206 779243 784622 762175 803881 861729 901219 739408
3610 739408 757715 875936 876350 790769 793464 733856 713345 717092 729726 770884 679086 673275
$$ packed form
3691A276935L0325l664Q7178n0230j8771L8928j44444o9996L0482p6440j17891
3680I82412P5521j19578J25437l7179l7466l7759N8322P7142K7702j4491j62685
3669I37378M4160l4718j2271J07686J6988j7333k143J02295Q3276j9126R28l7440
3657A169680j3863P5543l9203p3731j36286L2308q3515l8489r626k6524l9810
3646H16484K2492J3267m9287N1869N8929J2887p5991k1048J4478q7033P2524l3349
3634G96222O7397M9905J236j9186M9840l781l9405M2109l5474L8998p5614m406
3622H67841m9345o715k364K0560j7771l2963N379k2447M1706N7848L9490j61811
3610G39408J8307J18221M14q5581K695n9608k0511L747J2634M1158r1798n811
$$ plain form
3598 673275 623898 748614 731546 615937 548091 475562 516964 536976 549637 632184 678648
3587 678648 626198 536737 491183 468017 455449 592502 561659 487065 620082 607975 600109
3576 600109 650075 630922 646483 688686 650392 619383 632555 651329 649689 667308 590129 641040
3564 641040 764187 695177 633183 591361 644550 650042 577782 603427 625803 568444 558278 505153
3552 505153 468075 543132 570710 542447 517354 522752 555259 615644 515414 560879 628347 570800
3540 570800 598434 667074 615797 558276 444784 466507 530685 481386 469695 487966 479193 600941
3528 600941 658356 561357 512520 478698 560760 595853 556910 556296 594555 621152 660422 626933
3516 626933 603140 581347 607212 597303 572279 609709 510848 545624 612750 601952 597125 562835
$$ packed form
3598F73275m9377J24716j7068j15609o7846p2529M1402K0012J2661Q2547M6464
3587F78648n2450q9461m5554k3166j2568J37053l0843p4594J33017j2107p866
3576F00109M9966j9153J5561M2203l8294l1009J3172J8774j640J7619p7179N0911
3564F41040J23147o9010o1994m1822N3189N492p2260K5645K2376n7359j0166n3125
3552E05153l7078P5057K7578k8263k5093N398L2507O0385j00230M5465O7468n7547
3540E70800K7634O8640n1277n7521j13492K1723O4178m9299j1691J8271q773J21748
3528F00941N7415r6999m8837l3822Q2062L5093l8943o14L8259K6597L9270l3489
3516F26933k3793k1793K5865r909k5024L7430r8861L4776O7126j0798m827l4290
$$ plain form
3504 562835 652965 748730 716814 741636 725305 740741 643148 572810 641196 637668 626144 656511
3492 656511 588162 548445 569841 616362 592453 497365 496146 540275 526520 534525 582441 601642
3480 601642 543302 498879 481171 514885 565132 551112 512185 470256 479449 486618 398155 456308
3468 456308 543281 558413 499493 501688 483708 363392 529473 571903 519769 436302 457652
3457 457652 455336 423145 468592 582195 483775 448126 547496 499671 528520 614800 547473 403453
3445 403453 377018 443993 531424 605244 611358 572406 564992 595770 581721 583322 534512 588810
3433 588810 587332 468584 393340 340843 558995 618861 480002 471937 470004 404987 438866 434711
3421 434711 444478 521456 423771 367673 475032 541031 466835 492352 520261 508685 448253 517332
$$ packed form
3504E62835R0130R5765l1916K4822j6331J5436r7593p0338O8386l528j1524L0367
3492F56511o8349l9717K1396M6521k3909r5088j219M4129j3755Q005M7916J9201
3480F01642n8340m4423j7708L3714N0247j4020l8927m1929R193P169q8463N8153
3468D56308Q6973J5132n8920K195j7980j20316J66081M2430n2134q3467K1350
3457D57652k316l2191M5447J13603r8420l5649R9370m7825K8849Q6280o7327j44020
3445D03453k6435O6975Q7431P3820O114l8952p414L0778j4049J601m8810N4298
3433E88810j478j18748p5244n2497K18152N9866j38859q065j933o5017L3879m155
3421D34711R767P6978r7685n6098J07359O5999p4196K5517K7909j1576o0432O9079
$$ plain form
3409 517332 523180 572492 652784 609115 706916 552988 504073 549704 571805 602223 604281 601323
3397 601323 677668 762536 696043 620889 576909 649507 620402 587132 576896 535471 518342 524688
3385 524688 528118 592436 702999 697490 620806 570214 607267 602300 563211 606862 667494 702733
3373 702733 764673 754762 742953 871811 756486 794636 849562 745568 758690 764469 675005
3362 675005 739373 714136 630070 611515 596674 577213 605146 640867 614464 540828 615628 594609
3350 594609 589270 584617 485527 573172 588840 529912 613821 759621 752922 758397 721159 749591
3338 749591 781569 820440 792728 790492 826895 967349 930505 923474 872542 827522 769623 846038
3326 846038 850550 817251 790054 805869 872580 855326 837269 726587 738838 739292 722117 659586
$$ packed form
3409E17332N848M9312Q0292m3669R7801j53928m8915M5631K2101L0418K058k958
3397F01323P6345Q4868o6493p5154m3980P2598k9105l3270j0236m1425j7129O346
3385E24688L430O4318J10563n509p6684n0592L7053m967l9089M3651O0632L5239
3373G02733O1940r911j1809J28858j15325L8150N4926j03994J3122N779q9464
3362F75005O4368k5237q4066j8555j4841j9461K7933L5721k6403p3636P4800k1019
3350E94609n339m653r9090Q7645J5668n8928Q3909J45800o699N475l7238K8432
3338G49591L1978L8871k7712k236L6403J40454l6844p031n0932m5020n7899P6415
3326H46038M512l3299k7197J5815O6711j7254j8057j10682J2251M54j7175o2531
$$ plain form
3314 659586 742987 828462 837382 918867 878373 885849 877361 913273 960442 932331 915483 877038
3302 877038 842018 846206 970811 885296 819027 929995 1040292 982866 1015369 1136197 1189461
3291 1189461 1190458 1169408 1224722 1232348 1217844 1286993 1361338 1350041 1386829 1294198 1295459 1323871
3279 1323871 1305532 1304904 1280178 1308953 1413488 1347376 1318208 1414093 1460488 1451910 1452951 1520018
3267 1520018 1509764 1417980 1347329 1432399 1495493 1552171 1640062 1669183 1710696 1668069 1741657
3256 1741657 1847536 1891553 1918245 1949214 2073990 2079546 2099681 2255768 2251414 2068696 2067517
3245 2067517 2205482 2174697 2258629 2268636 2273006 2366657 2310787 2320977 2337677 2352056 2427954
3234 2427954 2603231 2771199 2764400 2798086 3012954 3155613 3328274 3504188 3718588 3940371
$$ packed form
3314F59586Q3401Q5475Q920Q1485m0494P476q488L5912M7169k8111j6848l8445
3302H77038l5020M188J24605q5515o6269J10968J10297n7426L2503J20828N3264
3291A189461R97k1050N5314P626j4504O9149P4345j1297L6788r2631J261K8412
3279A323871j8339o28k4726K8775J04535o6112k9168R5885M6395q578J041O7067
3267A520018j0254r1784p0651Q5070O3094N6678Q7891K9121M1513m2627P3588
3256A741657J05879M4017K6692L0969J24776N556K0135J56087m354j82718j179
3245B067517J37965l0785Q3932J0007M370R3651n5870J0190J6700J4379P5898
3234B427954J75277J67968o799L3686K14868J42659J72661J75914K14400K21783
$$ plain form
3224 3940371 4055380 4253674 4284259 4300648 4274374 4051992 3879917 3634898 3324749 3081617
3214 3081617 2958936 2789410 2559947 2359238 2304830 2155535 2179241 2115854 2035911 2089055
3204 2089055 2077215 1916345 1834136 1796005 1770980 1681403 1667341 1647024 1536032 1526868 1561662
3193 1561662 1518790 1466231 1391760 1407776 1577315 1692166 1602193 1548422 1664032 1715912 1739694
3182 1739694 1787727 1802596 1744678 1604880 1532570 1394047 1344444 1354002 1225929 1230158 1110522
3171 1110522 1146998 1142763 1160719 1088502 1028492 974773 1029648 1233736 1254248 1171933 1193606
3160 1193606 1162543 1201840 1378148 1412206 1533396 1706550 1753876 1818863 1972645 1998959 2096471
3149 2096471 2015115 1825381 1656724 1386816 1282089 1210085 1221134 1166931 1060838 1021654
$$ packed form
3224C940371J15009J98294L0585J6389k6274k22382j72075k45019l10149k43132
3214C081617j22681j69526k29463k00709n4408j49295K3706o3387p9943N3144
3204B089055j1840j60870q2209l8131k5025q9577j4062k0317j10992r164L4794
3193A561662m2872n2559p4471J6016J69539J14851q9973n3771J15610N1880K3782
3182A739694M8033J4869n7918j39798p2310j38523m9603R558j28073M229j19636
3171A110522L6476m235J7956p2217o0010n3719N4875K04088K0512q2315K1673
3160A193606l1063L9297J76308L4058J21190J73154M7326O4987J53782K6314R7512
3149B096471q1356j89734j68657k69908j04727p2004J1049n4203j06093l9184
$$ plain form
3139 1021654 1080138 1099426 1039786 1033835 987749 974505 1003173 952491 1018497 1015192 988715 988423
3127 988423 1010523 1010777 1070643 1204137 1370700 1384760 1357085 1458997 1430807 1438029 1364400 1242649
3115 1242649 1236787 1153668 1001303 958596 882961 883052 883500 920869 783293 732449 788651 745784
3103 745784 639688 627799 625480 597153 639394 739788 672963 657324 738933 837912 919805
3092 919805 957904 910508 1082385 1073246 938996 859694 783227 730366 556596 631252 591261
3081 591261 564260 547472 513669 547919 549267 467001 523206 502699 456519 530484 532663 526356
3069 526356 516382 428441 409307 449662 528827 498596 522575 539937 490318 495896 548946 561360
3057 561360 541020 456126 402998 329821 328813 322363 294205 271223 276148 263415 249596 208614
$$ packed form
3139A021654N8484J9288n9640n951m6086j3244K8668n0682O6006l305k6477k92
3127I88423K2100K54N9866J33494J66563J4060k7675J01912k8190P222p3629j21751
3115A242649n862q3119j52365m2707p5635R1M48L7369j37576n0844N6202m2867
3103G45784j06096j1889k319k8327M2241J00394o6825j5639Q1609R8979Q1893
3092I19805L8099m7396J71877r139j34250p9302p6467n2861j73770P4656l9991
3081E91261k7001j6788l3803L4250J348q2266N6205k0507m6180P3965K179o307
3069E26356r974q7941j9134M0355P9165l0231K3979J7362m9619N578N3050J2414
3057E61360k0340q4894n3128p3177j008o450k8158k2982M925j2733j3819m0982
$$ plain form
3045 208614 170972 104060 236507 251347 195386 157791 267721 270875 159878 191844 124467
3034 124467 196226 176291 113253 203024 234979 192079 88277 86612 39044 26304 155977
3023 155977 144361 142236 230986 226180 182072 135466 253606 293925 177499 163417 108629 189924
3011 189924 223836 209646 150267 190383 148287 167969 174651 164907 192879 191467 142726 74656
2999 74656 105132 136437 89029 186058 242595 169599 231032 248654 235767 295016 242011 267557
2987 267557 215240 193326 265050 134301 132473 206969 209820 340894 375133 361572 282203 234159
2975 234159 190269 247750 221502 298262 278320 162041 153123 164795 177333 109409 113937 115196
2963 115196 95837 94818 123984 250405 303514 365371 291911 263045 265336 226901 235171 218320
$$ packed form
3045B08614l7642o6912J32447J4840n5961l7595J09930L154j10997L1966o7377
3034A24467P1759j9935o3038Q9771L1955m2900j03802j665m7568j2740J29673
3023A55977j1616k125Q8750m806m4108m6606J18140M0319j16426j4082n4788Q1295
3011A89924L3912j4190n9379M0116m2096J9682O682r744K7972j412m8741o8070
2999G4656L0476L1305m7408R7029N6537p2996O1433J7622j2887N9249n3005K5546
2987B67557n2317k1914P1724j30749j828P4496K851J31074L4239j3561p9369m8044
2975B34159m3890N7481k6248P6760j9942j16279q918J1672J2538o7924M528J259
2963A15196j9359j019K9166J26421N3109O1857p3460k8866K291l8435Q270j6851
$$ plain form
2951 218320 228859 210070 188534 134824 209404 316163 324514 300315 326275 269258 185476 171469
2939 171469 169572 266694 293748 287879 293580 304560 271710 251784 222363 167651 322264 364420
2927 364420 322731 358051 289758 241996 285489 312796 302939 322062 400678 300761 469285 498294
2915 498294 427059 474548 481379 496732 458112 421754 458400 417216 491292 399164 396740 440345
2903 440345 495941 452483 447359 425157 360617 381898 401574 555034 555472 514425 430548 395817
2891 395817 418098 350355 457619 483790 415941 454557 489946 485270 635776 708794 684455
2880 684455 735354 768345 774653 755042 802976 706560 601079 664576 659371 530685 401541
2869 401541 474414 582246 507469 554908 509760 634629 589011 652105 618359 550660 545511
$$ packed form
2951B18320J0539j8789k1536n3710P4580J06759Q351k4199K5960n7017q3782j4007
2939A71469j897R7122K7054n869N701J0980l2850j9926k9421n4712J54613M2156
2927C64420m1689L5320o8293m7762M3493K7307r857J9123P8616r9917J68524K9009
2915D98294p1235M7489O831J5353l8620l6358L6646m1184P4076r2128k424M3605
2903D40345N5596m3458n124k2202o4540K1281J9676J53460M38m1047q3877l4731
2891C95817K2281o7743J07264K6171o7849L8616L5389m676J50506P3018k4339
2880F84455N0899L2991O308j9611M7934r6416j05481O3497n205j28686j29144
2869D01541P2873J07832p4777M7439m5148J24869m5618O3094l3746o7699n149
$$ plain form
2858 545511 534527 513240 561210 688088 552901 510418 631093 593556 574754 596399 667575
2847 667575 660024 692155 620888 468785 580954 618430 658002 548810 485700 498338 498090 512969
2835 512969 565977 543317 528229 486876 579191 589066 508347 382158 305578 351598 410472 369284
2823 369284 432587 382000 269412 234404 152652 249204 355813 286971 191708 260884 320486
2812 320486 335407 281313 202387 222426 285566 223853 174721 146879 142889 200527 115169 61480
2800 61480 14785 6827 125014 192000 221586 213809 201343 74864 168696 142907 91317 110630
2788 110630 36874 31590 109078 123213 6948 -13886 3462 -36011 -53678 9045 67995 82110
2776 82110 36327 69102 91673 124901 109808 78351 91446 116033 107580 176457 113494 56555
$$ packed form
2858E45511j0984k1287M7970J26878j35187m2483J20675l7537j8802K1645P1176
2847F67575p551L2131p1267j52103J12169L7476L9572j09192o3110J2638k48J4879
2835E12969N3008k2660j5088m1353R2315R875q0719j26189p6580M6020N8874m1188
2823C69284O3303n0587j12588l5008q1752R6552J06609o8842r5263O9176N9602
2812C20486J4921n4094p8926K0039O3140o1713m9132k7842l990N7638q5358n3689
2800F1480m6695p958J18187O6986K9586p777j2466j26479R3832k5789n1590J9313
2788A10630p3756n284P7488J4135j16265k0834J7348l9473j7667O2723N8950J4115
2776H2110m5783L2775K2571L3228j5093l1457J3095K4587q453O8877o2963n6939
$$ plain form
2764 56555 126858 168318 173557 173218 79495 -60496 -85626 5507 98171 29828 -64696 40240
2752 40240 58351 -86758 -73996 -40466 30357 57244 30942 -46788 -10454 -34477 53067 129423
2740 129423 83793 12077 4658 86238 87286 -27544 -58380 -69490 -9524 57187 15170 9451
2728 9451 16578 -97092 -173587 -31943 -16677 16320 73347 11593 51007 17087 30393 71877
2716 71877 -56905 -59928 -4513 -114186 -121030 42671 49384 49370 176867 38951 11136 10075
2704 10075 -31767 -61648 -137594 -81926 -13220 14366 -4156 29418 44567 -39291 -67024 -37396
2692 -37396 2477 -8038 -31836 57764 49893 17168 10332 -24874 -38459 46273 -31364 -92820
2680 -92820 -83631 -154812 -135058 -149284 -88593 -50913 -40539 16409 -20925 -98587 -73813 -36081
$$ packed form
2764E6555P0303M1460N239l39r3723j39991k5130R1133R2664o8343r4524J04936
2752D0240J8111j45109J2762L3530P0823K6887k6302p7730L6334k4023Q7544P6356
2740A29423m5630p1716p419Q1580J048j14830l0836j1110N9966O6711m2017n719
2728I451P127j13670p6495J41644J5266L2997N7027o1754L9414l3920J3306M1484
2716G1877j28782l023N5415j09673o844J63701O713j4J27497j37916k7815j061
2704A0075m1842k9881p5946N5668O8706K7586j8522L3574J5149q3858k7733K9628
2692c7396L9873j0515k3798Q9600p871l2725o836l5206j3585Q4732p7637o1456
2680i2820R189p1181J9754j4226O0691L7680J0374N6948l7334p7662K4774L7732
$$ plain form
2668 -36081 -76925 -110907 -170474 -129367 -106436 -38306 -1344 -46557 -165252 -62911 -97638
2657 -97638 -151139 -10652 20571 -71643 -32184 52714 54273 85857 5530 30492 53805 -33747
2645 -33747 -75295 -97204 75378 1227 -40120 -5705 -59158 -69439 -68396 -34825 29921 30582
2633 30582 97309 37470 66748 58893 -26115 -69995 -15255 -15995 -128133 -84767 -95349 -60121
2621 -60121 -6037 71355 30404 38851 61779 -35707 -29051 40586 2838 104762 -4012 -94766
2609 -94766 -1231 -49556 -80581 34487 33568 -12314 2764 90483 29897 34447 1567 -27188
2597 -27188 31430 -19210 -90201 -77980 -78411 -120201 -121730 -131532 -92884 -184105 -99854 -47839 -17132
2584 -17132 -34706 -110849 34773 75682 -837 -52402 -89864 -40529 47016 -9157 20748 -930
$$ packed form
2668c6081m0844l3982n9567M1107K2931O8130L6962m5213j18695J02341l4727
2657i7638n3501J40487L1223r2214L9459Q4898J559L1584q0327K4962K3313q7552
2645c3747m1548k1909J72582p4151m1347L4415n3453j0281J043L3571O4746O61
2633C0582O6727n9839K9278p855q5008m3880N4740p40j12138M3366j0582L5228
2621f0121N4084P7392m0951Q447K2928r7486O656O9637l7748J01924j08774r0754
2609i4766R3535m8325l1025J15068r19m5882J5078Q7719o0586M550l2880k8755
2597b7188N8618n0640p0991J2221m31m1790j529r802L8648r1221Q4251N2015L0707
2584a7132j7574p6143J45622M0909p6519n1565l7462M9335Q7545n6173K9905k1678
$$ plain form
2572 -930 -18576 -84798 -87520 -12913 44842 42456 -17361 6112 18366 -52628 -95555 -145632 -132165
2559 -132165 -83232 -68311 -58778 -64712 -36056 -50286 7139 91730 5385 -150685 -185916 -44624
2547 -44624 -52807 -61669 -82149 -153570 -146044 -120732 -43736 -52978 -162010 -228765 -128080 -51822
2535 -51822 -57332 -8153 12742 4754 38261 -66373 -192716 -166154 -119712 -96352 -33991 13581
2523 13581 3800 -1751 -37165 -129714 -87150 -66633 -61889 -126678 -142424 -112148 -60615 -95208
2511 -95208 -140026 -89147 -34944 -71400 -121856 -83967 -46435 -13630 -78754 -66492 -55285 -118847
2499 -118847 -140279 -36880 -3391 -31609 4704 6347 37745 44626 -73811 -64431 -66966 10077
2487 10077 -63636 -145111 -107389 -141129 -94180 -53300 -17822 -59639 -83500 -399 -42585 -86969
$$ packed form
2572i30j7646o6222k722P4607N7755k386n9817K3473J2254p0994m2927n0077J3467
2559a32165M8933J4921R533n934K8656j4230N7425Q4591q6345j56070l5231J41292
2547d4624q183q862k0480p1421P526K5312P6996r242j09032o6755J00685P6258
2535e1822n510M9179K0895p988L3507j04634j26343K6562M6442K3360O2361M7572
2523A3581r781n551l5414r2549M2564K0517M744o4789j5746L0276N1533l4593
2511i5208m4818N0879N4203l6456n0456L7889L7532L2805o5124J2262J1207o3562
2499a18847k1432J03399L3489k8218L6313J643L1398O881j18437R380k535P7043
2487A0077p3713q1475L7722l3740M6949M0880L5478m1817k3861Q3101m2186m4384
$$ plain form
2475 -86969 -51922 -92614 -106838 -72840 -87361 -6341 -16036 -118025 -42736 -13489 21657 -75645
2463 -75645 -46584 8008 -14468 -80880 -115327 -81767 -84913 -49068 -90993 -134184 -59622 -54996
2451 -54996 -123387 -118783 61233 21292 -34842 -51612 -41772 -209 -133329 -163793 -4690 -29760
2439 -29760 45956 8178 -94699 -150080 -115351 -45414 -61648 1603 -83550 -101995 -12247 -98900
2427 -98900 -72391 -12725 -155511 -20981 -27178 -98170 -192105 -165584 -89347 -40049 -10859 -43526
2415 -43526 -136406 -88092 -84711 -81030 -94970 -209667 -76547 -90709 -115751 -42897 -55036 -57415
2403 -57415 -69937 650 42744 -55532 22102 16024 -21782 7306 -25929 -80804 -73828 -46107
$$ packed form
2475h6969L5047m0692j4224L3998j4521Q1020r695j01989P5289K9247L5146r7302
2463g5645K9061N4592k2476o6412l4447L3560l146L5845m1925m3191P4562M626
2451e4996o8391M604J80016l9941n6134j6770R840M1563j33120l0464J59103k5070
2439b9760P5716l7778j02877n5381L4729O9937j6234O3251q5153j8445Q9748q6653
2427i8900K6509N9666j42786J34530o197p0992r3935K6521P6237M9298K9190l2667
2415d3526r2880M8314L381L681j3940j14697J33120j4162k5042P2854j2139k379
2403e7415j2522P0587M2094r8276P7634o078l7806K9088l3235n4875O976K7721
$$ [...]
##END NTUPLES=NMR SPECTRUM
##END=
