##TITLE=1H_TG-2330-1
 CDCl3
 8 sc, 
 11.11.2021
##JCAMPDX= 6.0         $$ Bruker NMR JCAMP-DX V2.0
##DATA TYPE= NMR SPECTRUM
##DATA CLASS= NTUPLES
##ORIGIN= UXNMR, Bruker Analytische Messtechnik GmbH
##OWNER= root
$$ XWIN-NMR		Version 3.5
$$ Thu Nov 11 12:04:14 2021 Russian Standard Time (UT+4h)  she@DPX200
##.OBSERVE FREQUENCY= 200.1313468511
##.OBSERVE NUCLEUS= ^1H
##.ACQUISITION MODE= SIMULTANEOUS
##.ACQUISITION SCHEME= undefined
##.AVERAGES= 8
##.DIGITISER RES= 18
##SPECTROMETER/DATA SYSTEM= spect
##.PULSE SEQUENCE= zg30
##.SOLVENT NAME= CDCl3
##.SHIFT REFERENCE= (INTERNAL, CDCl3, 0, 15.7601)
##AUDIT TRAIL= $$ (NUMBER, WHEN, WHO, WHERE, WHAT)
$$ ##TITLE= Audit trail, XWIN-NMR		Version 3.5
$$ ##JCAMPDX= 5.01
$$ ##ORIGIN= Bruker BioSpin GmbH
$$ ##OWNER= she
$$ F:/spectra/data/she/nmr/H-F/1/pdata/1/auditp.txt
$$ ##AUDIT TRAIL=  $$ (NUMBER, WHEN, WHO, WHERE, WHAT)
(   1,<2021-11-11 12:01:53.25 +0400>,<she>,<DPX200>,
      <created by zg, POWCHK disabled, PULCHK disabled
       configuration hash MD5:
       00 E9 B6 7A A2 85 ED C7 34 08 36 98 17 FE 4E 26
       data hash MD5: 16K
       C9 C5 05 F7 D4 15 B1 69 90 7A 69 C2 DF 28 90 B5>)
(   2,<2021-11-11 12:01:56.31 +0400>,<she>,<DPX200>,
      <Start of raw data processing
       efp BC_mod = 2 LB = 0.24 FT_mod = 6 PKNL = 1 PHC0 = -15424.71 PHC1 = 11.20081 SI = 16K 
       data hash MD5: 16K
       13 15 C5 5B A9 79 ED 31 7C 94 56 9E 35 12 B1 91>)
(   3,<2021-11-11 12:02:25.10 +0400>,<she>,<DPX200>,
      <pk PHC0 = -87.50632 PHC1 = 2.400001 
       data hash MD5: 16K
       09 1E 82 7A B6 4C 82 24 5C 40 9C 6D 29 66 26 BC>)
(   4,<2021-11-11 12:02:28.57 +0400>,<she>,<DPX200>,
      <abs ABSG = 5 
       data hash MD5: 16K
       63 A3 D6 BA 04 80 5F 19 E6 92 3B DF BC F3 A1 61>)
$$ ##END=
$$ 
$$ hash MD5
$$ 43 26 1D C8 43 C4 50 FC 10 77 B4 A5 6F 14 82 DC
##$RELAX= 
##$RELAX= 
##$RELAX= 
##$RELAX= 
##$RELAX= 
##$RELAX= 
$$ Bruker specific parameters
$$ --------------------------
##$DU= <F:/spectra>
##$EXPNO= 1
##$NAME= <H-F>
##$PROCNO= 1
##$TYPE= <nmr>
##$USER= <she>
##$AMP= (0..31)
100 100 100 100 100 100 100 100 100 100 100 100 100 100 100 100 100 100 
100 100 100 100 100 100 100 100 100 100 100 100 100 100 
##$AQSEQ= 0
##$AQ_mod= 1
##$AUNM= <au_zg>
##$AUTOPOS= <>
##$BF1= 200.13
##$BF2= 200.13
##$BF3= 200.13
##$BF4= 200.13
##$BF5= 200.13
##$BF6= 200.13
##$BF7= 200.13
##$BF8= 200.13
##$BYTORDA= 1
##$CFDGTYP= 0
##$CFRGTYP= 5
##$CHEMSTR= <none>
##$CNST= (0..31)
1 1 145 1 1 1 1 1 1 1 1 1 1 1 1 1 1 1 1 1 1 1 1 1 1 1 1 1 1 1 1 1 
##$CPDPRG= <>
##$CPDPRG1= <>
##$CPDPRG2= <>
##$CPDPRG3= <>
##$CPDPRG4= <mlev>
##$CPDPRG5= <mlev>
##$CPDPRG6= <mlev>
##$CPDPRG7= <mlev>
##$CPDPRG8= <mlev>
##$CPDPRGB= <>
##$CPDPRGT= <>
##$D= (0..31)
0 1.2 0 0 0 0 0 0 0 0.06 0 0.03 0 0 0 0 0.0002 0 0 0 0 0 0 0 0 0 0 0 0 
0 0 0 
##$DATE= 1636617712
##$DBL= (0..7)
120 120 120 120 120 120 120 120 
##$DBP= (0..7)
150 150 150 150 150 150 150 150 
##$DBP07= 0
##$DBPNAM0= <>
##$DBPNAM1= <>
##$DBPNAM2= <>
##$DBPNAM3= <>
##$DBPNAM4= <>
$$ [...]
##$SUBNAM2= <"">
##$SUBNAM3= <"">
##$SUBNAM4= <"">
##$SUBNAM5= <"">
##$SUBNAM6= <"">
##$SUBNAM7= <"">
##$SUBNAM8= <"">
##$SUBNAM9= <"">
##$SW= 18.0517286264689
##$SWIBOX= (0..15)
0 0 2 0 0 0 0 0 0 0 0 0 0 0 0 0 
##$SW_h= 3612.71676300578
##$TD= 16384
##$TD0= 1
##$TE= 0
##$TE2= 300
##$TE3= 300
##$TEG= 300
##$TL= (0..7)
0 120 120 120 120 120 120 120 
##$TP= (0..7)
150 150 150 150 150 150 150 150 
##$TP07= 0
##$TPNAME0= <>
##$TPNAME1= <>
##$TPNAME2= <>
##$TPNAME3= <>
##$TPNAME4= <>
##$TPNAME5= <>
##$TPNAME6= <>
##$TPNAME7= <>
##$TPOAL= (0..7)
0.5 0.5 0.5 0.5 0.5 0.5 0.5 0.5 
##$TPOFFS= (0..7)
0 0 0 0 0 0 0 0 
##$TUNHIN= 0
##$TUNHOUT= 0
##$TUNXOUT= 0
##$USERA1= <user>
##$USERA2= <user>
##$USERA3= <user>
##$USERA4= <user>
##$USERA5= <user>
##$V9= 5
##$VALIST= <valist>
##$VCLIST= <CCCCCCCCCCCCCCC>
##$VD= 0
##$VDLIST= <DDDDDDDDDDDDDDD>
##$VPLIST= <PPPPPPPPPPPPPPP>
##$VTLIST= <TTTTTTTTTTTTTTT>
##$WBST= 1024
##$WBSW= 4
##$XGAIN= (0..3)
0 0 0 0 
##$XL= 0
##$YL= 0
##$YMAX_a= 421540
##$YMIN_a= -715754
##$ZGOPTNS= <>
##$ZL1= 120
##$ZL2= 120
##$ZL3= 120
##$ZL4= 120
##$ABSF1= 15.78325
##$ABSF2= -2.268601
##$ABSG= 5
##$ABSL= 3
##$ALPHA= 0
##$AQORDER= 0
##$ASSFAC= 0
##$ASSFACI= 0
##$ASSFACX= 0
##$ASSWID= 0
##$AUNMP= <proc_1d>
##$AZFE= 0.1
##$AZFW= 0.1
##$BCFW= 0
##$BC_mod= 2
##$BYTORDP= 0
##$COROFFS= 0
##$CY= -3
##$DATMOD= 1
##$DC= 0
##$DFILT= <>
##$DTYPP= 0
##$F1P= 0
##$F2P= 0
##$FCOR= 1
##$FTSIZE= 16384
##$FT_mod= 6
##$GAMMA= 0
##$GB= 0
##$INTBC= 1
##$INTSCL= 0
##$ISEN= 128
##$LB= 0.24
##$LEV0= 0
##$LPBIN= 0
##$MAXI= 10000
##$MC2= 0
##$MEAN= 0
##$ME_mod= 0
##$MI= 1.114404
##$NCOEF= 0
##$NC_proc= -7
##$NLEV= 6
##$NOISF1= 3.799351
##$NOISF2= 2.8
##$NSP= 0
##$NTH_PI= 0
##$NZP= 0
##$OFFSET= 15.76011
##$PC= 1
##$PHC0= -15512.22
##$PHC1= 13.60081
##$PH_mod= 1
##$PKNL= yes
##$PPARMOD= 0
##$PSCAL= 0
##$PSIGN= 0
##$REVERSE= no
##$SF= 200.129999139093
##$SI= 16384
##$SIGF1= 3
##$SIGF2= 2
##$SINO= 5.538805
##$SIOLD= 16384
##$SREGLST= <1H.CDCl3>
##$SSB= 0
##$STSI= 16384
##$STSR= 0
##$SW_p= 3612.71676300578
##$SYMM= 0
##$S_DEV= 0
##$TDeff= 16384
##$TDoff= 0
##$TI= <>
##$TILT= no
##$TM1= 0
##$TM2= 0
##$TOPLEV= 0
##$USERP1= <user>
##$USERP2= <user>
##$USERP3= <user>
##$USERP4= <user>
##$USERP5= <user>
##$WDW= 1
##$XDIM= 16384
##$YMAX_p= 485410695
##$YMIN_p= -520618
$$ End of Bruker specific parameters
$$ ---------------------------------
##NTUPLES= NMR SPECTRUM
##VAR_NAME=  FREQUENCY,     SPECTRUM/REAL,   SPECTRUM/IMAG
##SYMBOL=    X,             R,               I
##VAR_TYPE=  INDEPENDENT,   DEPENDENT,       DEPENDENT
##VAR_FORM=  AFFN,          ASDF,            ASDF
##VAR_DIM=   16384,         16384,           16384
##UNITS=     HZ,            ARBITRARY UNITS, ARBITRARY UNITS
##FACTOR=    0.220516191357247, 1,           1
##FIRST=     3154.07078100484, 0,            0
##LAST=      -458.645982000939, 0,           0
##MIN=       -458.645982000939, -520618,     0
##MAX=       3154.07078100484, 485410695,    0
$$ Real data points
##PAGE= N=1
##DATA TABLE= (X++(R..R)), XYDATA
$$ [...]
11716a18555j03979J19018N7652J45434j55333m3296j09917M7306j48126O9417
11706b40379J01105J64443J04325j29370O4720j46655M5752P772K8840P7458J0748
11695H8759j95554P0555j09990J03551M0172R632m015j50449j76425J52950J42087
11684b8727p0508P8495j8526j01164r2860J00627j05457q7317K24319O1850p7241
11673a16509J68820P1960j12219j91802j22510J9006J69984R0044R2931L0379
11663A00084p2935J2332k11364o1883P5078Q841M8542N3611J54451j09657O278
11652C378J37713j53643k6400M4297j42565q2604K15564K8644j5578L1596k89838
11641b49436J78491j36R2526n1099k2419p1531j56133Q4211j20871J89594j00877
$$ y = [-118555, -222534, -103516, -45864, 99570, -55763, -99059, -208976, -161670, -309796, -240379, -139274, 25169, 129494, 124, 64844, -81811, -36059, -28287, 553, 78011, 88759, -106795, -36240, -146230, -42679, -2507, 7125, 3110, -147339, -323764, -170814, -28727, -99235, -20740, -39266, -140430, -233290, -132663, -238120, -325437, -101118, -39268, -116509, 52311, 124271, 12052, -179750, -302260, -283254, -113270, -23226, 69705, 100084, 27149, 39481, -171883, -233766, -158688, -149847, -101305, -47694, 106757, -2900, 3378, 141091, -12552, -38952, 5345, -137220, -219824, -4260, 24384, 8806, 40402, -249436, -70945, -71081, 21445, -29654, -52073, -123604, -279737, -195526, -316397, -126803, -227680]
11630b27680Q2241J38359j28535o1397k89J41320j23485j66910J68507O5603p4815
11619a87081P5043L3834o0955J77481q3276j23623j98458J40548N3266r986J91513
11608H306L8359k2559K0184j51811L207R2027J56249j7637o2952q2247Q4800j73535
11596a07609j07318j00025Q0876Q4041j66766m0605N0221O0597J43447J16888
11586A3747k00681j86985J0579J52218K17822j04408k00251J92414Q8816M2006
11576B5277k94182P3196J90398j30037l850L0783j67131J29042O9180J22865q6029
11565d0488n4924Q316n842l7335K6971J3913j749n4583J48366M0474Q4709j7134
11553A10694K22850j67287l0486j51290j16730P7197k04130K06339Q3761j29174
$$ y = [-227680, -145439, -7080, -135615, -197012, -197301, -55981, -179466, -346376, -177869, -112266, -187081, -112038, -78204, -139159, 38322, -44954, -168577, -367035, -226487, -173221, -183207, 8306, 46665, 24106, 44290, -107521, -104314, -12287, 143962, 126325, 63373, -18874, 65926, -107609, -214927, -314952, -234076, -150035, -316801, -357406, -307185, -246588, -103141, 13747, -186934, -373919, -363340, -211122, 6700, -97708, -297959, -105545, -16729, 25277, -268905, -195709, -5311, -135348, -139198, -108415, -275546, -146504, -77324, 45541, -40488, -95412, -87096, -92938, -130273, -103302, -89389, -91138, -145721, 2645, 43119, 127828, 110694, 333544, 166257, 135771, -15519, -132249, -55052, -259182, -52843, 30918, -98256]
11543i8256q6049K55669J45804j71473j03819J32013j18272J8971K3618k0237
11533b2031L1822N1873L9089k06890p8359K3493O1828q0637L6581K85549r2290
11522E0028J6821M6975p5251j3072l8579L0550r3803J65801P1387k96361J05640
11511b9864J02748j45536l2554K5447j05675j71860R8956M5879K40544J95519
11501B23604k59755n751k31405j15018P5660R8170L42896k9353l00667p5606O1179
11490b16046J52810o1032O9329J58582j12312j1337p0776r0669Q157J36754j16686
11479a53226k4400o235L5561p1040j31740J81205j03619k0975K90732k144P0801
11468F4920N8381o1331j02496k92484o36L85537L8891k38256K01580q0106k14060
$$ y = [-98256, -184305, 71364, 217168, 45695, -58124, 73889, -44383, -25412, -1794, -22031, 9791, 61664, 100753, -106137, -184496, -161003, -99175, -179812, -143231, 142318, 50028, 66849, 113824, 38573, 25501, -13078, 17472, -76331, 89470, 160857, -135504, -29864, 72884, -72652, -105206, -79759, -185434, -357294, -258338, -212459, 28085, 223604, -36151, -41902, -273307, -388325, -312665, -214495, 128401, 99048, -201619, -277225, -216046, -63236, -124268, -54939, 103643, -8669, -20006, -90782, -181451, -173294, -36540, -153226, -177626, -183861, -148300, -219340, -351080, -169875, -273494, -294469, -3737, -5881, 64920, 123301, 61970, -40526, -333010, -333646, 51891, 90782, -147474, 54106, -26000, -240060]
11457b40060J32764K26500j25706J42154j54526j89122j2398O7227R0217P0473
11447G523j07681q1926J05129k499P2565r6087k0796J01718j22418J3591j42724
11436b73605J87981J50172j6906J34566j71249j38834j19822K53985J47790o2794
11426I1284M2887j68190J14167J26062j28213n7478K0297r4457q4761n6295q4573
11415b79270J84189O9486k04962k2796J50641p6646j848J64590M795J02533j79260
11404h8548k4702l9655K23258Q7631k56608K0445J27276O7161P3211j08899j10658
11393c0088K06268P1675n5884j65397K2990L7575J18300j52701j10661j5632K0334
11382e3221j80K36825L4565j84409j15385j25591K0379J19802j92955K22369k6836
$$ y = [-240060, -107296, 119204, -6502, 135652, -18874, -207996, -220394, -153167, -62950, 7523, -100158, -182084, -76955, -79454, -6889, -102976, -123772, -22054, -144472, -130881, -273605, -85624, 64548, 47642, 182208, 10959, -127875, -247697, 6288, 154078, 91284, 134171, -34019, 80148, 206210, 77997, 20519, 40816, -53641, -138402, -194697, -279270, -95081, -25595, -230557, -253353, -102712, -179358, -181206, -16616, -11821, 90712, -88548, -113250, -152905, 70353, 157984, -98624, -78179, 49097, 116258, 189469, 80570, -30088, 176180, 247855, 191971, 26574, 49564, 87139, 205439, 52738, -57923, -73555, -53221, -53401, 183424, 217989, 33580, -81805, -207396, -187017, -67215, -260170, -37801, -64637]
11371f4637K1894J26917j68739J4735m4452Q9052K78063k24392j22018O1847j07183
11360a38913J01244j29471l4846J52174j07652O132l9116J20196J80454k51561
11350a41359l8998K5322P9106K0733M5247N7278k2318n8518p3921N3606r8708
11339a52530P1274J76867m2657m7244j68523M8951K21335J94395k4943j12065
11329A64860M510l7225m9814j58474q1713J1532M1603J2744J48619P143q3254
11318a9469N0444j58951j40868K2247K93949j8114o2957R0738l7851j42400L9427
11307h3805J050O8227O6650j87864J10021o9635j16882M296J17499l0808r0042
11296b11293K7927l5052J39817J08656p2196J38256p5700k44327q8498m3339K36514
$$ y = [-64637, -42743, 84174, -84565, -69830, -114282, -25230, 252833, 28441, -93577, -31730, -138913, -37669, -167140, -201986, -49812, -157464, -151332, -190448, -70252, 110202, -141359, -180357, -155035, -75929, -55196, -9949, 47329, 25011, -33507, -107428, -53822, -152530, -81256, 95611, 52954, 5710, -162813, -113862, 107473, 301868, 276925, 164860, 169370, 132145, 82331, -76143, -157856, -146324, -104721, -91977, 56642, 63785, -19469, 30975, -127976, -268844, -246597, 47352, 29238, -33719, 57019, 19168, -123232, -83805, -82755, -14528, 52122, -135742, -25721, -95356, -212238, -207942, -90443, -121251, -211293, -183366, -218418, -78601, 30055, -42141, 96115, 20415, -223912, -312410, -355749, -119235]
11285a19235P8491R8920k6788J78536N0065k78952r0994M3361O4634O9650l42761
11274b75073k35813J77421p6656J49095K0477k9659J52561Q8933J78618L4289
11264A84193p9558l1804j06950J157k6688M8981Q3507O5920J43250k29924j60966
11253a08882J71214n0393k5948q6984l1475l2826R0093Q3509j6732P025K27357
11242B25958j26734J0167J07885j41981P293k17336m8771K09574n3079j21708
11232a48732p6017k9625J74171j01179k4349J29314J92531j00611K8250m6251
11222b498m9720m0211K82318R554k01103j9155j45852J81292L6291k16885J18212
11211d7757j38749N5792J59569P3229j1013j45781P4714j92842P0659O8825n7634
$$ y = [-119235, -40744, 58176, 31388, 209924, 259989, -18963, -109957, -66596, -1962, 67688, -275073, -510886, -333465, -410121, -261026, -240549, -270208, -117647, -28714, 149904, 184193, 104635, 72831, -34119, -32962, -59650, -10669, 72838, 138758, 282008, 52084, -108882, 62332, 11939, -14009, -100993, -132468, -165294, -75201, 8308, -8424, -1399, 225958, 99224, 109391, 217276, 75295, 82588, -134748, -183519, 26055, -27024, -148732, -224749, -254374, -80203, -181382, -205731, -76417, 116114, 15503, 43753, -2498, -52218, -92429, 189889, 199443, -1660, -20815, -166667, 14625, 50916, -165969, -47757, -186506, -130714, 28855, 102084, 91071, -54710, 20004, -172838, -102179, -33354, -90988]
11200i0988p374J85722k0325j3564M608j71658O1122R0385l5486p9159J18563
11189D1846J18839j2517j30470L6155n3268j62638K9281Q5176J25532p9552j72405
11178a74021J97008r0449J03045k3896J6278r6670n4076P4882K3144J59696P0000
11167B04941o0639j82679R620J0855k789q9151q0985r8394J32641J16673m0458
11156h0365q0137q0525K16143J25611l31432J6927K44139J54467j06707m6179
11146C1942R9755L1566l00222O6564O8872k1279j1249j53482k07317M7397j2720
11135c60173K59971l4108N9554K5675O1823l8424k3122j6922o6518K64375O0167
11124A92298j05115j18560J42579p3554J44506m1089M2238q3612k68072N7018
$$ y = [-90988, -98362, 87360, 67035, 53471, 58079, -113579, -52457, 37928, 2442, -76717, 41846, 160685, 148168, 17698, 53853, 585, -162053, -132772, -47596, 77936, -1616, -174021, 22987, -67462, 35583, 11687, 27965, -68705, -122781, -47899, -24755, 134941, 204941, 144302, -38377, -28757, -17902, -20691, -109842, -190827, -289221, -156580, -39907, -80365, -160502, -241027, -24884, 100727, -230705, -213778, 30361, 184828, 78121, 31942, 131697, 163263, -136959, -70395, -1523, -22802, -34051, -187533, -394850, -347453, -360173, -100202, -134310, -74756, -49081, 12742, -25682, -48804, -65726, -132244, 132131, 192298, 87183, -31377, 111202, 37648, 182154, 141065, 183303, 99691, -168381, -111363]
11114a11363n9978R7195J06645m8225j51914j84498J40257M6449J10498K54821
11104A99887j05090j46724k6129K16521N4604l03517j50551k4952J09839J77963
11094A851m3256k1480J20177Q0978j45902j93479J37813o7519P3035q2112j19405
11083b59299P4979J61239m0122R0787O5553k1618O799K3288r8347r9727J51697
11072E5229M3422p213l8029M3744J67253k08105L0286Q134K96J8977m7399k39691
11060a73096j03357k9171J35838K73760j50066J3025K2954j43646J61897r1518
11050h3380j6421m7149n029J39365j13219K27829P8610L7396m0426R2008k60709
11039H875j86212K07273J5609m7641Q1857k4079j34885j8322M6546n4428N2288
$$ y = [-111363, -171341, -74146, 32499, -15726, -167640, -352138, -211881, -165432, -54934, 199887, 94797, -51927, -78056, 138465, 193069, -110448, -260999, -285951, -176112, 1851, -41405, -62885, 57292, 138270, -7632, -201111, -63298, -130817, -57782, -139894, -259299, -184320, -23081, -63203, 27584, 93137, 71519, 78318, 101606, 3259, -96468, 55229, 98651, 91438, 53409, 97153, 264406, 56301, 86587, 94721, 95017, 113994, 66595, -173096, -276453, -305624, -169786, 103974, -46092, -33067, -10113, -153759, 8138, -83380, -99801, -146950, -151979, -12614, -125833, 101996, 180606, 218002, 177576, 269584, 8875, -177337, 29936, 45545, -2096, 79761, 55682, -79203, -97525, -50979, -105407, -53119]
11028e3119O6106p3220M5598J47228k69864K97151n5868j20660j9182j35100j6450
11017a87380J63685k31635j11624L40207j16797K3466j07983J15838P258M436
11007a00529R9194K3256J43091j52206m9616R3422J05387p9476k19180j373R6259
10996d1771j3695J77840J90340k43354n5156j7531j84017J44753J36226l3694
10986E9941N1981k13424J26361O1868J2372k4689K6546r3720J26592J45081K4256
10975C03165j04429n5476n7011N818K55373L8922M0402j81639j25060O768J41551
10964B68384j22720Q0685J95477j77470q0780j3676K08260J14437K9878J509L6493
10953E40477j07955q1425k5527k13763j89293K44035L05869k23339j1418j19192
$$ y = [-53119, 12987, -60233, -14635, 132593, -137271, 159880, 104012, -16648, -35830, -170930, -187380, -23695, -255330, -366954, -26747, -143544, -120078, -228061, -112223, -104965, -100529, -1335, 21921, 165012, 12806, -36810, 56612, 161999, 82523, -136657, -138030, -41771, -55466, 122374, 312714, 69360, 14204, -3327, -187344, -42591, 93635, 59941, 111922, -101502, 24859, 86727, 99099, 74410, 100956, 7236, 133828, 278909, 303165, 198736, 143260, 86249, 92067, 347440, 386362, 426764, 245125, 120065, 126833, 268384, 145664, 226349, 421826, 244356, 163576, 149900, 358160, 472597, 502475, 503984, 540477, 432522, 351097, 325570, 111807, -77486, 166549, 472418, 249079, 237661, 118469]
10943A18469o6584k9456J75680J40191o6165l3660q3809j061q7653p256J0622
10932F9318L5820j64364J10387K11088j62091K8255K47866J15240p6243k96536
10922A18740m1447K7392P312M3699O5852O424k2887L5990n7842j74503P1005J69066
10910B48801o91N0652r3017L2117O1459k7034k24543J8830O2509K21464P344j78949
10898A78942P8110n9015k02804Q0762J10611o8748o0286J35760j6361M8605r682
10887B15894j18982P2380J44162j04919J4636p3204j10083M7516j69479R533J65736
10876I3190J28365l5316J80056j59336m8632O7153o6130p3489m0692R0205j4614
10865A20760J67203k1154j95292R7352l4165M8989R8474p3189j24080J06159J08518
$$ y = [118469, 51885, 22429, 198109, 338300, 272135, 238475, 154666, 153605, 65952, 58696, 69318, 105138, -59226, 51161, 262249, 100158, 128413, 376279, 491519, 415276, 118740, 77293, 104685, 111997, 155696, 221548, 227972, 205085, 241075, 183233, 8730, 79735, 248801, 248110, 298762, 205745, 237862, 299321, 272287, 47744, 66574, 129083, 350547, 357891, 178942, 257052, 198037, -4767, 75995, 186606, 117858, 57572, 193332, 176971, 225576, 215894, 96912, 169292, 313454, 208535, 223171, 149967, 39884, 87400, -82079, -72546, 93190, 221555, 186239, 366295, 206959, 158327, 225480, 159350, 85861, 45169, 135374, 120760, 287963, 266809, 71517, 168869, 134704, 183693, 282167, 208978, 84898, 191057, 299575]
10854B99575j55990n9228M0345j0503K491m8311O8880Q847J4136J8576O9331j46157
10842A01992M8918j09758j8331K5007n6844K5915o3400O4874o3340R2407O9535
10831A16975J3783R9515R567L0747j54268o9546K9223J72420J37556p8279n7968
10820B49725j84682J94296k9144q2982J4351l2594k38357R9326R4378J5031m19809
10809c20461K44699K27631j39231k6730J74606R7209k31474R3485l9638J21835
10799B01931j70344O379J08737K237J77787j8931k20915O3005R106n8191k1248
10788G9553m6438J57235j1206j88654m4943J15563r4577Q0426N1378j07001K0700
10777A2036M6004K3596J42599P3578j39053K26574k17651l62748J69940q4361
$$ y = [299575, 143585, 84357, 124702, 114199, 116690, 68379, 137259, 146106, 160242, 178818, 248149, 101992, 150910, 41152, 22821, 47828, -9016, 16899, -46501, 18373, -44967, 47440, 116975, 130758, 230273, 239840, 270587, 116319, 46773, 75996, 248416, 385972, 307693, 249725, 65043, 259339, 230195, 147213, 161564, 128970, -109387, -10061, 84317, 99348, -320461, -75762, 151869, 12638, -14092, 160514, 257723, 26249, 119734, 80096, 201931, 31587, 37966, 146703, 148940, 326727, 307796, 86881, 149886, 158992, 100801, 79553, 33115, 190350, 179144, -9510, -54453, 61110, -33467, 46959, 98337, -8664, 12036, 58040, 81636, 224235, 297813, 158760, 385334, 167683, -195065, -25125, -109486]
10767a09486O6794J40015J04068n5343J11571N9684M0280r2873q5427K9740p5356
10756A33667K64425j86139j39846L6935K11945N2707l3518j13998j45409j60314
10746g9545J53521P0695P5049k59603J08394k1769k0291j06528M6316J01402J32047
10735A99688J33114k33484O9749J02688J0034k5276m5277n1163p6829P0137O9458
10724B22839l3233Q6619K8735k353o4067N9573M1647k3300j46490j09298J7012
10713G7684J28385k6626J737J64383j36353j25020N7327p7852L30381r22l8707
10702C54417j31772L06095j97432j42304P050p3580O8404n0785J39k34234m4431
10691a38433K36491J74613p2140j85484J53099J47881K9290m2458M4568j34682
$$ y = [-109486, -42692, 97323, 201391, 146048, 257619, 317303, 357583, 264710, 179283, 209023, 133667, 398092, 211953, 72107, 109042, 320987, 373694, 340176, 226178, 80769, -79545, 73976, 144671, 219720, -39883, 68511, 46742, 26451, -80077, -33761, 67641, 199688, 332802, 99318, 169067, 271755, 281789, 256513, 211236, 160073, 83244, 153381, 222839, 189606, 276225, 304960, 302607, 238540, 298113, 339760, 316460, 169970, 60672, 77684, 206069, 179443, 181180, 345563, 209210, 84190, 141517, 63665, 394046, 393124, 354417, 222645, 528740, 331308, 189004, 196054, 122474, 190878, 140093, 140232, -94002, -138433, 98058, 272671, 200531, 15047, 168146, 316027, 345317, 302859, 347427, 212745]
10681B12745J8187P8828j96791l2472L2871Q3420L7946o7331p5954O9467J58177
10670C19093K107j70129J9329J7622K19994N9518r2716q5792j03176j60066m9918
10659b4134K3081J23532k1976l00222J62774j18202q083K79567j82452j285K09985
10648A42585j2395l7992K14656n1108j45127N2062n5495K29148Q7454l09887j38202
10637b4301j11148J48895J11107Q6988Q1078K8169O263k3913j51155m4028o7837
10626D0118J66068Q0108L4896J1837j60425l0781j6009k03238j6471J09317J04669
10615A20089M2418j31481J0750K58222M4132j01094j96470J80043P5908R2330
10605C94847r2015j42105K40225p1390O5217j48621j65135K8362R8792J34025
$$ y = [212745, 230932, 309760, 112969, 80497, 113368, 196788, 234734, 167403, 91449, 160916, 319093, 321200, 151071, 170400, 188022, 408016, 467534, 374818, 289026, 185850, 25784, -24134, -1053, 122479, 100503, -199719, -36945, -155147, -163230, 116337, -66115, -67400, 142585, 130190, 92198, 306854, 255746, 110619, 162681, 107186, 336334, 423788, 113901, -24301, -135449, 13446, 124553, 211541, 292619, 320788, 327051, 303138, 151983, 107955, 40118, 206186, 286294, 321190, 333027, 172602, 141821, 125812, -77426, -93897, 15420, 120089, 162507, 31026, 41776, 299998, 344130, 243036, 46566, 226609, 302517, 394847, 302832, 160727, 400952, 329562, 394779, 246158, 81023, 109385, 208177, 342202]
10595C42202j81840K5679N1601j39790K64228j09823k49852J10047p263M1583
10585A46772L4346Q3411N6873q3205j05175j26560Q4139L0101N3429J91673j14989
10574B50815j90056K30436L7123o7964Q6828k31971r7766N4303J40813K26489
10564D39050j14719o7315p6516o5403j00320J42031J04877j10315L2194L9934
10554B23498O3267m184k40436J72009O8019j15798J4515J7277j29349J54883M3205
10543B66906j74782R635O6177q930J92755k24309n6875L9970n0760r8154J26335
10532H7968N8326j8978J69319j45883j55566J33276M97M5683J29331j90853J14382
10521B27502k4946P1715j41965j37744J37967R8406k41830R9294J73107J2340
$$ y = [342202, 160362, 186041, 237642, 97852, 362080, 252257, 2405, 112452, 105189, 146772, 181118, 264529, 321402, 238197, 133022, 6462, 90601, 120702, 174131, 365804, 250815, 60759, 291195, 328318, 260354, 347182, 115211, 17445, 71748, 212561, 439050, 324331, 257016, 180500, 115097, 14777, 156808, 261685, 151370, 183564, 223498, 286765, 282581, 42145, 214154, 282173, 166375, 180890, 198167, 68818, 223701, 266906, 92124, 101759, 167936, 159006, 351761, 127452, 70577, 110547, 59787, -38367, 87968, 146294, 127316, 296635, 150752, -4814, 128462, 128959, 174642, 303973, 113120, 227502, 202556, 274271, 132306, -5438, 132529, 230935, -10895, 88399, 261506, 273846]
10511B73846j01283O0037J80313j3688o7169p0499j94482J71122P5074j06615
10501B06656P87j36619N7871J3509K6064J83512J72571k7606o4515n5275j26292
10490B50663J00625R119l0004q7866p8449L06519J8475j70843k3777P302m6899
10479B54865J08488P6344j8908o7438J65992J71217j18427L7363j46538j13937
10469C49021O1795j00550j4751J2521o89K31264j95685j00427J2543j14533J00969
10458B41478K9047O0700j95323K20506J14586j43403N4032Q2408P1184k37850
10448B97365P2119Q225p4138l6278j18477o9739Q563j9757N6066J0025K8686k3815
10436A38845j05824J00818M5333q9549N585M4761j52306J78519K1885m6821J45877
$$ y = [273846, 172563, 232600, 412913, 399225, 332056, 261557, 67075, 238197, 313271, 206656, 207443, 70824, 128695, 142204, 168268, 351780, 524351, 496745, 432230, 376955, 250663, 351288, 360407, 330403, 242537, 164088, 470607, 489082, 318239, 294462, 301764, 254865, 363353, 439697, 420789, 353351, 519343, 690560, 572133, 609496, 462958, 349021, 410816, 310266, 295515, 308036, 307347, 538611, 342926, 242499, 255042, 140509, 241478, 270525, 331225, 135902, 356408, 470994, 327591, 381623, 464031, 535215, 297365, 369484, 377709, 303571, 267293, 148816, 79077, 87640, 67883, 123949, 133974, 162660, 138845, 33021, 133839, 179172, 89623, 95208, 139969, -12337, 166182, 188067, 141246, 287123]
10425B87123l0543m9227k30917J80204m0118J51728R2690J7487r5336j36858J81638
10414C27871o3958L7891j67912M3292J26369j62149J42898m4309n9127Q524M1128
10403B30518L4981k37121J78298J7774k31248J2893K1579j3599K9076j10782R0118
10392B2487J21139K28170O1740k74434r196m8298j92362q8220L6088J96618R8962
10381A52694j46361j63915J45797J72285q9430k2981Q5082N2236J00818L3516
10371C19741n2014P5879j739j16495j04443j0981M5507o9505J22170j18067j7341
10360G2712J15271j36372J45575J14058m2539R799j41886P9840K22982L0768l93
10349D69815l5774j13723j01800m4799n4061m7178J51515Q3654j52399l0232J13560
$$ y = [287123, 256580, 207353, -23564, 156640, 116522, 268250, 360940, 378427, 283091, 146233, 327871, 263913, 301804, 133892, 177184, 303553, 141404, 284302, 239993, 180866, 189390, 230518, 265499, 28378, 206676, 224450, -6798, 6095, 27674, 14075, 43151, -67631, 22487, 143626, 371796, 433536, 159102, 149906, 101608, -90754, -178974, -142886, 53732, 152694, 6333, -157582, -11785, 160500, 71070, 48089, 133171, 185407, 286225, 319741, 267727, 343606, 341867, 225372, 120929, 109948, 155455, 85950, 208120, 90053, 72712, 187983, 51611, 197186, 311244, 268705, 278504, 136618, 216458, 439440, 470208, 469815, 434041, 320318, 218518, 173719, 119658, 72480, 223995, 307649, 155250, 125018, 238578]
10338B38578r5895j10877j32443L06032L0500j42365N2028j8106L0697j26231
10328C1918Q7718K9602j49149J40057J08565j44097l9175J28841j44546K1663
10318G1397R389J52021p5416r7492J78674N2303Q5303o7813J0897j03980M3745
10307B59028N035k0235L5752j03360r5930n181P8346J24508l7079J7743j67681
10296I0946J17515K5607L3270J53319m6083k75516P609K91819l1591j43066j89765
10285C4064K25678q1202j8055o6941R3841K36469j46438j66491p3340K23330l7288
10274B23627k4026J68926R297k4193l0083J1807q1057j5461J40332j0926l48046
10263B0197J51542k5020J06101J22897j04815J06581J61371J75609k94883k47389
$$ y = [238578, 142683, 31806, -100637, 205395, 235895, 93530, 145558, 127452, 158149, 31918, 119636, 149238, 89, 140146, 248711, 104614, 65439, 194280, 49734, 71397, 80786, 232807, 157391, 59899, 238573, 290876, 376179, 308366, 319263, 215283, 259028, 264063, 243828, 279580, 176220, 80290, 75109, 153455, 277963, 240884, 258627, 90946, 208461, 234068, 267338, 420657, 374574, 99058, 106667, 398486, 366895, 223829, 34064, 259742, 178540, 160485, 93544, 187385, 423854, 277416, 110925, 37585, 260915, 223627, 199601, 368527, 377824, 353631, 323548, 335355, 254298, 238837, 379169, 368243, 20197, 171739, 146719, 252820, 375717, 270902, 377483, 538854, 714463, 419580, 172191]
10253A72191N7697M4351l11932N521N6977J21528J35575J57810Q1896j41071n9876
10242C20667K6190n9098l1798l2464K64428k42017j34071J33686K17696o3989
10232C99230k9893J02780K2386j02621o680j91169J7566J52714l5339q2519k750
10221B43705j19684O5690p137J15575N566j29065J03689j21279j44800l1542j3175
10210c2457K9196r8822M1607L21223j69460J62656j8677j47366l8685m5775J61011
10199A64451M1883M45l8696j616p9004j22470J69504L0147j26264j60609J44077
10188B1848J31455J27032k05762J46250k7823r6718L5589J88215O8331r6879j34273
10177A57265j08385J05915J16824j5777j32711j07495n4098J78356j5317p2312
$$ y = [172191, 229888, 274239, -37693, -32172, 24805, 146333, 281908, 439718, 521614, 380543, 320667, 346857, 287759, 255961, 223497, 487925, 245908, 111837, 245523, 463219, 399230, 369337, 472117, 494503, 391882, 385202, 194033, 211599, 364313, 328974, 246455, 243705, 124021, 189711, 182574, 298149, 303715, 174650, 278339, 157060, 12260, -19282, -32457, -3261, -102083, -60476, 260747, 91287, 253943, 235266, 87900, 49215, 3440, 164451, 206334, 206779, 168083, 166467, 87463, -35007, 134497, 164644, 38380, -122229, 21848, 153303, 280335, 74573, 220823, 193000, 96282, 131871, 320086, 388417, 291538, 157265, 48880, 154795, 271619, 255842, 123131, 15636, -38462, 139894, 124577, 52265]
10167E2265J34519N1281J33228k4767J32050R2026k5199j69582j0975j54081l29119
10156a18354m3228J88085L8762l603n0727J06418L1751j39500J04803j49613J468
10145c3738Q5812O7588J02810j0082o7670q8431J41368J53833j11337j52220n4406
10134C3527L22899K7402r5037o6752j64768j5776r3515J70069J21518Q8878J6685
10123C45130q959J79089k35109j45837J03869j24702K48602N5022m6153Q4481
10113D55433L113k2237l36363N322Q7639j3372N6784M0624j19621R13Q5217K58720
10101E02172j16225k11973M7001J63854J6338k66234K5651Q3897k9370j28313
10091H6798j81116J44805K04565Q2137j8590r1592J9953l5090Q6048m7261k81232
$$ y = [52265, 186784, 238065, 371293, 346526, 478576, 570602, 545403, 375821, 364846, 210765, -118354, -161582, 26503, 65265, 61662, 10935, 117353, 149104, 9604, 114407, -35206, -33738, 52074, 119662, 222472, 212390, 144720, 56289, 197657, 351490, 240153, 87933, 33527, 356426, 383828, 288791, 222039, 57271, 41495, -52020, 118049, 239567, 328445, 345130, 336171, 515260, 280151, 134314, 238183, 113481, 362083, 417105, 370952, 455433, 458546, 436309, 99946, 105268, 192907, 179535, 236319, 276943, 157322, 158235, 243452, 502172, 385947, 173974, 220975, 384829, 401167, 134933, 160584, 244481, 215111, 86798, -94318, 50487, 255052, 337189, 318599, 227007, 246960, 211870, 297918, 250657, -30575]
10080c0575l2191K82324K0684j19437K84187m3529m0287J94800j06973j76387
10070B32616J6517J74681l6671j61431p6174j5759L399L1732K6662L234J19767
10059C18573r5823J09879J64300k90775j35389J76573m854l6006M1742l6880r7033
10048A14307J31539J15773R3907j64800j47575J18699N3892l461o9018j57921
10038H5342l6060R815m4758K87l425O9597Q677l3668J23343j18341J75207J23406
10026C59422n7235p4020r3269J60909k61101k7193L88555J15852j55658m5814
10016C10448l76695j76709J36880R3571K68900j04548o9883J22233J20453p1402
10006B53248k67921J25436J01797J00530p1958j39244J46605Q9207j25205k51557
$$ y = [-30575, -62766, 219558, 240242, 120805, 404992, 361463, 321176, 515976, 409003, 232616, 249133, 423814, 387143, 225712, 149538, 133779, 137178, 168910, 195572, 198806, 318573, 222750, 332629, 496929, 206154, 70765, 247338, 242484, 206478, 248220, 211340, 114307, 245846, 361619, 455526, 290726, 143151, 261850, 315742, 312281, 243263, 85342, 49282, 59097, 14339, 14626, 11201, 80798, 89475, 55807, 179150, 60809, 236016, 359422, 302187, 228167, 134898, 295807, 34706, 7513, 396068, 511920, 356262, 310448, -66247, -242956, -106076, -12505, 256395, 151847, 81964, 204197, 324650, 253248, -14673, 110763, 212560, 313090, 241132, 101888, 248493, 337700, 212495, -39062]
9996c9062J94213J25672M5944J19829r8972j58876O2742j44877j02191l2702O8457
9985D0177L27310j76642p8250J18232p0230K09625m3631k91399J17230K54891
9975D07313n6790l3023j5480j8667K05341p1009k60192p7007J3496o3389Q6064
9964A16657N7999L559q4253P4005Q4068k3680m383J02182k3676J28135r731j87979
9952B32903o221m4706m4746J05355Q2090R5109r6945q7907m1961Q9452J38272
9941D20695J0744j7252M5020j30260p9483Q581J1181r019j21526l9461o1045L32103
9929C70278n8521j32996J70102k89081l8480J58098K43686j95243L8139J2769
9919B78751J19013J8887j15250J73682k4472j14188r4828M1829O8417O9335n1378
$$ y = [-39062, 155151, 280823, 326767, 446596, 347624, 188748, 251490, 106613, 4422, -28280, 40177, 367487, 190845, 112595, 230827, 160597, 370222, 326591, 35192, 152422, 407313, 350523, 317500, 302020, 283353, 488694, 417685, 157493, 80486, 93982, 30593, 116657, 174656, 178215, 93962, 167967, 252035, 228355, 223972, 326154, 302478, 430613, 420882, 232903, 226682, 181976, 137230, 242585, 324675, 419784, 322839, 234932, 192971, 282423, 420695, 431439, 414187, 459207, 328947, 249464, 258045, 269226, 260207, 138681, 99220, 38175, 370278, 311757, 178761, 348863, 59782, 21302, 179400, 423086, 227843, 265982, 278751, 397764, 416651, 301401, 475083, 450611, 336423, 241595, 283424, 351841, 421176, 369798]
9908C69798O0502j55677K8451M8139j70890j00339J61695J14570o0707K2344J0205
9897C28091J36627l5715k14759K40945K2771j81856J35058L7863j15383k2471
9887C31171J41337J19028r1433j61674j07410N4728L6099r5710K62169M4099j23453
9876D08951j68957J03753L47306k06372j9053o9596j14467l0889m6635J52733
9866C56774L288k37314K63870J28715L7530M5013k70633k38377P5605K27722J66613
9855E58806k25464l2791J04036J52428m4887r2743o0900j26976J84965n1858p2677
9844B91939j14226J12475M3740q2229J15134k4551J08430J38696q9217j06068
9834C94123Q3471J46416p6634j12790P1619k54083q88Q027r5154l591n0730M5866
$$ y = [369798, 430300, 274623, 303074, 351213, 180323, 79984, 241679, 356249, 295542, 317886, 328091, 464718, 429003, 214244, 455189, 477960, 296104, 431162, 469025, 353642, 331171, 472508, 591536, 500103, 338429, 231019, 285747, 321846, 226136, 488305, 532404, 408951, 239994, 343747, 691053, 484681, 465628, 396032, 281565, 250676, 204041, 356774, 360062, 122748, 386618, 515333, 552863, 597876, 327243, 88866, 164471, 392193, 558806, 333342, 300551, 404587, 557015, 512128, 419385, 358485, 231509, 416474, 364616, 291939, 177713, 290188, 333928, 251699, 366833, 342282, 450712, 589408, 500191, 394123, 477594, 624010, 547376, 434586, 506205, 252122, 251234, 259261, 164107, 160516, 109786, 155652]
9822A55652J21382l9257M7685n1398J42026k9816j09061J7582P563j06063K82340
9811D38635M5104n2775J12163r1016J1678k87045L01462J25785K6545p7536q6472
9800D66528p1374k2668J43519J82748p2077J10711k15717n1991p8905Q6064q3033
9789C93805K5118l4161k13495K466J34838K17135j27191M6563J67580m9600j14092
9778D48966j06895n096J77719O4497j00338j34290Q9933P9707n9372k73319K43619
9767D25131N2010j36894K0934K32646j813r0044j65518K3024r0938l02096J43597
9756A10039K54670l4029j37764M8403O7045k9324J787r5484j15352J38860J87494
9745C96345M0165m0630J74135m8878J5283J1454J36719o5414k92634K4113J4268
$$ y = [155652, 277034, 237777, 285462, 234064, 376090, 346274, 237213, 254795, 262358, 156295, 438635, 483739, 430964, 543127, 452111, 463789, 176744, 478206, 603991, 630536, 553000, 466528, 395154, 372486, 516005, 698753, 626676, 737387, 521670, 469679, 390774, 476838, 393805, 418923, 384762, 171267, 173733, 308571, 525706, 398515, 445078, 612658, 563058, 448966, 342071, 336975, 514694, 579191, 478853, 344563, 434496, 514203, 454831, 181512, 425131, 477141, 340247, 361181, 593827, 592014, 501970, 336452, 359476, 268538, -33558, 110039, 364709, 330680, 192916, 241319, 308364, 279040, 280827, 185343, 69991, 208851, 396345, 436510, 395880, 570015, 521137, 536420, 547874, 684593, 619179, 326545, 350658, 364926]
9734C64926q0599l0970R5927M0048l0394l1979j28733K58401q5583O412J96761
9723E74217r9323k8806N8179q7327O519J34133k43969k6955L6654m0031M0439
9712C23730K01049J02519j8541r1662r9459Q7827o5655Q6633Q7293j86715J30251
9701E57270R016O690K16737j29942j91595J4933L4291L1890o9148O8320j3993
9690E34469m0621j81343J65496J05151J4281r102m06891J1863Q572R6565K66383
9679E64823N6598j05639m276j7963J12810J0095J4311R7442j27108k12638J50130
9668E38585j33979L6708m2767m4352o6330j7518J38465j78805O5375J65555j39626
9657C21311L5896J39631N7645o7943k8087K29280r8145j29802N0752k8183P2660
$$ y = [364926, 284327, 253357, 349284, 389332, 358938, 326959, 198226, 456627, 371044, 377456, 574217, 474894, 446088, 504267, 416940, 423459, 557592, 313623, 286668, 323322, 283291, 323730, 524779, 627298, 608757, 517095, 417636, 505463, 439808, 526441, 613734, 427019, 557270, 566286, 572976, 789713, 659771, 468176, 483109, 517400, 549290, 480142, 548462, 534469, 493848, 312505, 478001, 583152, 597433, 588331, 181440, 193303, 201875, 298440, 564823, 621421, 515782, 511506, 493543, 606353, 616448, 630759, 728201, 601093, 388455, 538585, 404606, 441314, 398547, 354195, 287865, 270347, 408812, 230007, 295382, 460937, 321311, 357207, 496838, 554483, 486540, 458453, 687733, 589588, 459786, 510538, 482355, 555015]
9646E55015j10781j97868K17785l2012J7349P9046k6057N0890n0526l6159p4971
9635C91711J08459R4288p5881L8950k24652J45739L3086J9270J30412P254j20511
9624E48125k0736L1257j46954P6948J39985p0230L141M5710J10750o841k32345
9613D78810M6727K23418j62094N9190k14465j88287L54960j26647J42220j03322
9603E10510j53771J12823P9312K6803o015k1591P6494J35905j82915J32262j34266
9592E75551n6324k0726j06512R1629J13150R280J21416k41474r5332K44602m0350
9581E94910P7714J93160k08103k18103J52719K673l6712J8905j38934J0032P1660
9570E19921j23591J22484J31325n0480R4217K6592L7975n4982j59259k4847j700
$$ y = [555015, 444234, 246366, 464151, 432139, 449488, 528534, 502477, 553367, 502841, 466682, 391711, 500170, 594458, 518577, 557527, 332875, 478614, 511700, 530970, 661382, 668636, 548125, 527389, 558646, 411692, 488640, 628625, 558395, 561536, 607246, 717996, 711155, 478810, 525537, 748955, 586861, 646051, 431586, 243299, 598259, 471612, 613832, 510510, 356739, 469562, 548874, 575677, 569662, 548071, 624565, 760470, 577555, 709817, 575551, 519227, 498501, 391989, 483618, 596768, 606048, 727464, 485990, 390658, 635260, 594910, 672624, 865784, 657681, 439578, 592297, 594970, 558258, 577163, 438229, 448261, 519921, 396330, 518814, 650139, 599659, 693876, 720468, 758443, 703461, 544202, 519355, 517655]
9559E17655J38129M2079K3179j7008j73534O0602o0928m0004J22166M3589O3862
9548G19787n8022J0645O115k8498l447N7288Q9012m8623k10668K3915M2267O5850
9536F65621L1037K41226J08474p5952L632k95980j3727N0506k2377M7652J2301
9525G52413J42500k91960m0432K8170q4273Q8264R7949j63636J49804Q3941n3963
9514G08777j03639K20504O8247q9465r5791j13344o8029J50105p8241q2861K08764
9503G25027p0028j44619J13533N2488j09478M7504m842q0451Q0398J32649l7235
9492G04946K76214K03342j31388j76810l0178q8766J66906K99208j14835j55994
9482I52645l8861K8127k8188k84672R4573N2310N8452q452o784L8762P1119j1928
$$ y = [517655, 655784, 697863, 721042, 704034, 530500, 591102, 530174, 490170, 612336, 655925, 719787, 661765, 672410, 678525, 650027, 646580, 703868, 792880, 744257, 533589, 557504, 599771, 665621, 696658, 937884, 1046358, 970406, 974038, 678058, 664331, 714837, 692460, 740112, 752413, 894913, 602953, 562521, 590691, 506418, 594682, 692631, 528995, 678799, 762740, 708777, 605138, 825642, 893889, 804424, 708633, 595289, 527260, 677365, 599124, 516263, 725027, 654999, 510380, 623913, 676401, 566923, 614427, 609585, 529134, 609532, 742181, 704946, 981160, 1184502, 1053114, 876304, 846126, 757360, 924266, 1223474, 1108639, 952645, 913784, 941911, 913723, 629051, 723624, 775934, 834386, 825934, 819150, 857912, 929031, 917103]
9470I17103M2906j38057J8452Q4775M732j7159j26580O0050j34426M4479o2412
9459F93863q58P3373L4450M3617l809J30760j60210P9472J32489N1027J13946
9448A188120r7651j11541m3278j12692Q0008J14686J4756j60389J52292J11404
9438A135715j50266q997J81322n1492J01896l3303o2682K0677q9705M8435J74955
9427A266555K2378N1988k9814j66777k02951J50308P5969m5558K27897p5384l26324
9416I48287J7215J69008j02330J40751J00699J6881j84793L3662R1412k3047n1108
9405A156637J20149j93476n1960l223k5022N4234P7036J54949J24117m3112J96615
9394A566944p1280n7397J11071j30752N1344m3803l9544n0651k7227j18490j20190
$$ y = [917103, 960009, 821952, 840404, 925179, 929911, 912752, 786172, 846222, 711796, 756275, 693863, 693005, 766378, 800828, 844445, 840636, 971396, 811186, 890658, 1023147, 1074174, 1188120, 1090469, 978928, 935650, 822958, 902966, 1017652, 1032408, 872019, 1024311, 1135715, 985449, 976452, 1157774, 1106282, 1208178, 1174875, 1112193, 1132870, 1043165, 1091600, 1266555, 1288933, 1340921, 1311107, 1144330, 941379, 1091687, 1167656, 1122098, 1349995, 1274611, 948287, 965502, 1134510, 1032180, 1172931, 1273630, 1290511, 1105718, 1139380, 1230792, 1207745, 1156637, 1276786, 1083310, 1031350, 1028127, 1003105, 1057339, 1134375, 1289324, 1413441, 1370329, 1566944, 1495664, 1438267, 1549338, 1418586, 1469930, 1426127, 1386583, 1335932, 1308705, 1190215, 1070025]
9383A070025l0481q1967J79730j09530J09962K55862j09113K7730k76449j21400
9373I14369M20229K32499R200j24186l5397J9102M4461q9272q5341l7849K97880
9362A565695N5801k38579J99563l6002j07499k23487j9661L9098J95331J5614
9352A445874K6881J09744N8138l7591J33732J51717j68040j5229l2987J89504
9342A861743k1790m7890O5413n1555j32679J22458k7812K3696N7926N6935m9711
9331A856734k6867J19593J07014K48903j01181K81245j07982o502N6806J71885
9321B599648M7080K65352K43581J15114R3274J60635J90975Q4725J31274J18577
9311D050235J0594j58986N0865J30002R4702q0203j42037k692N6876k04860M0720
$$ y = [1070025, 1039544, 957577, 1137307, 1027777, 1137739, 1393601, 1284488, 1312218, 1035769, 914369, 1334598, 1567097, 1576297, 1452111, 1416714, 1435816, 1480277, 1391005, 1305664, 1267815, 1565695, 1621496, 1382917, 1582480, 1546478, 1438979, 1215492, 1195831, 1234929, 1430260, 1445874, 1472755, 1582499, 1640637, 1603046, 1736778, 1888495, 1720455, 1705226, 1672239, 1861743, 1839953, 1792063, 1857476, 1805921, 1673242, 1795700, 1767888, 1791584, 1849510, 1906445, 1856734, 1829867, 1949460, 2056474, 2305377, 2204196, 2485441, 2377459, 2370957, 2427763, 2599648, 2646728, 2912080, 3155661, 3270775, 3364049, 3524684, 3715659, 3800384, 3931658, 4050235, 4060829, 3901843, 3952708, 4082710, 4177412, 4097209, 3955172, 3952480, 4009356, 3804496, 3845216]
9300C845216j73170l00801l35396r074L0096r6113M51862Q1905j76644l1972n0118
9289C235791J09950j23513l076O647K27707K18304J1782j68444j63444Q5555M336
9278C441595J59709Q2854K18694J35348Q5696O4583M6189O3511j32488O4616O7843
9267D298150J38766Q2340J66218j30961o7676J79901Q8009j7399L128o9742R3732
9256D764466k9413J28848j13382m6360J23289L4385O9191J78060J47098l6810
9246E219372r4925L1760J86661m265j06356J34791L81048k14075P0610J54374
9236E758995O01R1473K0009m0556l3970J20553o4214L171j4155k3452J30851Q891
9224E958197k0494j17390J66662J7324j00814k9705j16850O9204J45004r2250
$$ y = [3845216, 3672046, 3371245, 3035849, 3026775, 3056871, 2960758, 3412620, 3494525, 3317881, 3285909, 3235791, 3345741, 3222228, 3219152, 3225799, 3453506, 3671810, 3683592, 3515148, 3351704, 3437259, 3441595, 3601304, 3684158, 3902852, 4038200, 4123896, 4188479, 4234668, 4298179, 4165691, 4230307, 4298150, 4436916, 4519256, 4685474, 4554513, 4486837, 4666738, 4754747, 4737348, 4740476, 4670734, 4764466, 4735053, 4863901, 4750519, 4704159, 4827448, 4861833, 4931024, 5109084, 5256182, 5219372, 5124447, 5156207, 5342868, 5338603, 5232247, 5367038, 5748086, 5534011, 5604621, 5758995, 5759596, 5851069, 5871078, 5830522, 5796552, 5917105, 5852891, 5856062, 5841907, 5818455, 5949306, 5958197, 5937703, 5820313, 5986975, 6004299, 5903485, 5873780, 5756930, 5826134, 5971138, 5878888]
9214E878888k31829l7201k1953j36256P9097m7635o8130L2120m2433j06075J02814
9203E401407J09249j19250j4164K64722o1957M1881m7727J05524M395p5909l8514
9192E569657R5044K9945j05806J46887p5893J57368J71962Q4296j42456j45337
9182E785667j55066o3494k30005j78616J17631j77874k08493l3392m2583j45556
9172D668219j9662j08252J22749P2732P8808J11980Q8421r0940j57500J01368
9162D867923j01491k4364K3970J51747Q2674j07833r8061N5629n9699J39773K18523
9151E148791n9623n3999m2340k31521J0103J78865J79927J69544j28784M7146
9141E218109j29843O3702J03825J2838m3538J82721Q789l4037J26491R9921l8995
$$ y = [5878888, 5647059, 5609858, 5587905, 5451649, 5530746, 5483111, 5414981, 5447101, 5404668, 5298593, 5401407, 5510656, 5391406, 5377242, 5641964, 5580007, 5621888, 5574161, 5679685, 5684080, 5608171, 5569657, 5664701, 5694646, 5588840, 5735727, 5659834, 5817202, 5989164, 6073460, 5931004, 5785667, 5630601, 5567107, 5337102, 5158486, 5276117, 5098243, 4889750, 4856358, 4813775, 4668219, 4648557, 4540305, 4663054, 4735786, 4814594, 4926574, 5014995, 4924055, 4766555, 4867923, 4766432, 4742068, 4766038, 4917785, 5000459, 4892626, 4794565, 4850194, 4790495, 4930268, 5148791, 5089168, 5035169, 4992829, 4761308, 4771411, 4950276, 5130203, 5299747, 5170963, 5218109, 5088266, 5151968, 5255793, 5268631, 5225093, 5407814, 5416603, 5382566, 5509057, 5608978, 5569983]
9130E569983j7351P2129l95592L3609n1632M2563L6780q0199q998K15732k6129
9119E390895J24085M031n8082J57769J79065J05136j96930j67380K13232K86817
9109F038638J4480o2198L827J20729J15804N0938l7653J87213J68554N8922n8668
9098F600586R8853J77162J54648M4786Q1390j4527J24346K78903Q1065J01278
9088G728490j60334J6132M3494L01008L6958J18541j05106Q4702K02993l13598
9078G953280m8409L2166K04010J16895p7844J03879J65621K5650K89928K68752
9068I033928R4557O9538K92481L26189J24730L86459K04133J85382L75720J45987
9058A1239104M15639N12514M13171N58803L45777M30688K26998M10977N60351
$$ y = [5569983, 5552632, 5624761, 5229169, 5262778, 5211146, 5253709, 5290489, 5210290, 5201292, 5417024, 5390895, 5514980, 5519011, 5460929, 5618698, 5797763, 5902899, 5705969, 5538589, 5751821, 6038638, 6053118, 5990920, 5994747, 6115476, 6231280, 6282218, 6244565, 6431778, 6600332, 6659254, 6600586, 6699439, 6876601, 7031249, 7076035, 7157425, 7142898, 7267244, 7546147, 7627212, 7728490, 7568156, 7584288, 7627782, 7928790, 7965748, 8084289, 7979183, 8063885, 8266878, 7953280, 7904871, 7937037, 8141047, 8257942, 8180098, 8283977, 8449598, 8475248, 8765176, 9033928, 9128485, 9198023, 9490504, 9816693, 9941423, 10327882, 10532015, 10717397, 11093117, 11239104, 11654743, 12167257, 12580428, 13139231, 13485008, 13915696, 14142694, 14553671, 15114022]
9049A5114022L28484L27717J41731j71729J59460L22938J15612M046k73479l55669
9039A5713133k15774l67986j82388J07907k19018J6270O7861J56130k13558Q3129
9029A4945706p3367J72897J03445J4914K68346K56919J62219L23659K42021K64536
9019A6681295M35610O71115N17998K92477L56553M64544K50341M22929M95745
9010B0588607J89564P5367J15329l0468q5902O8257l08763n17539l23015l55645
9000A9415792m28722k59377j38887o4050l10036l24898J8981n576Q4421R1774
8990A8079422o2203k92640l68820q6886R7502J9842O1527j14455l48357j04227
8980A6880705r5351L7628N9490o4294j57108N6997j9639k7825j89356r9485J72768
$$ y = [15114022, 15442506, 15770223, 15911954, 15740225, 15899685, 16222623, 16338235, 16342281, 16068802, 15713133, 15497359, 15129373, 14946985, 15054892, 14835874, 14852144, 14920005, 15076135, 14862577, 14945706, 14872339, 15045236, 15148681, 15163595, 15431941, 15688860, 15851079, 16174738, 16416759, 16681295, 17116905, 17788020, 18306018, 18598495, 18955048, 19419592, 19669933, 20092862, 20588607, 20778171, 20853538, 20968867, 20938399, 20852497, 20920754, 20611991, 20094452, 19771437, 19415792, 18987070, 18727693, 18588806, 18524756, 18214720, 17889822, 17908803, 17903227, 17987648, 18079422, 18017219, 17724579, 17355759, 17268873, 17366375, 17386217, 17447744, 17333289, 16984932, 16880705, 16785354, 16822982, 16882472, 16818178, 16661070, 16718067, 16698428, 16670603, 16481247, 16381762, 16554530]
8969A6554530p2788r8645J84365N2409J37351j16776k39435Q2590O3162L13229
8959A6859992j74730j74497J70850K66323K41554q2956q923o9226L75817P0408
8949A7474612q6112K55235J99689J33357R9500l040L56413j42961L09601K81474
8939A8877768K53470K84966K06204J40580K03463J37763K45714K71265L4120L57838
8929B1013151N90460K71996L13453L74651L14045J71326N56416O71273L00397
8920B4577168M80639O61406N02125O84413O11748M59883J088027P91237Q24292
8911C0680938J057923R58530J011801J071998J347602J492968J792346K086932
8903D1501038J683301J465616J818784K212686K154078K427178J852662R04984
$$ y = [16554530, 16481742, 16383097, 16567462, 16619871, 16757222, 16640446, 16401011, 16483601, 16546763, 16859992, 16685262, 16510765, 16681615, 16947938, 17189492, 17106536, 17097613, 17028387, 17404204, 17474612, 17388500, 17643735, 17843424, 17976781, 18076281, 18073241, 18429654, 18286693, 18596294, 18877768, 19131238, 19416204, 19622408, 19762988, 19966451, 20104214, 20349928, 20621193, 20655313, 21013151, 21603611, 21875607, 22189060, 22563711, 22877756, 23049082, 23605498, 24276771, 24577168, 25057807, 25719213, 26221338, 26905751, 27517499, 27977382, 29065409, 29856646, 30680938, 31738861, 32697391, 33709192, 34781190, 36128792, 37621760, 39414106, 41501038, 43184339, 44649955, 46468739, 48681425, 50835503, 53262681, 55115343, 56020327]
8895E6020327R75814J199018J159892J446617J021075K15277o5830l8773L62066
8886F2295483Q50481R13110R55599N30889J122996J547527J454291J652162J705320
8877G3027858J686947J863443K023408K566075L007521L119337L346669L987568
8869I4628826M076257L785935L658252L970239M546907M710055L972781K647187
8861A25996439J717391K064991K458695K337128J527202K43630p29068o92897
8853A34923511m63755J79569l26911j025843q96002q38292q22768l83902J32040
8844A30477647P11648J339769J503901J884359J997396K329965L058492L566497
8836A46869674L376541L310011L157477L494720M036760L692108L672423L639092
$$ y = [56020327, 56996141, 58195159, 59355051, 60801668, 61822743, 62038020, 61972190, 61933417, 62295483, 63145964, 64059074, 65014673, 65545562, 66668558, 68216085, 69670376, 71322538, 73027858, 74714805, 76578248, 78601656, 81167731, 84175252, 87294589, 90641258, 94628826, 98705083, 102491018, 106149270, 110119509, 114666416, 119376471, 123349252, 125996439, 127713830, 129778821, 132237516, 134574644, 136101846, 136345476, 135616408, 134923511, 134459756, 134639325, 134312414, 133286571, 132390569, 131552277, 130729509, 130345607, 130477647, 131189295, 132529064, 134032965, 135917324, 137914720, 140244685, 143303177, 146869674, 150246215, 153556226, 156713703, 160208423, 164245183, 167937291, 171609714, 175248806]
8828A75248806L636637L795950L506784K231032J188610J73947n17505j175538
8820A88088723k444135k743684k655886j933870q49719p40903q17261o24493r3046
8811A75185726L48453L66872P01195R31832J238116J374436J633768J289709J280011
8802A84350118J403903J705975J769884J829587K145622K073690K091389K821720
8794B00191888L266702L575833M010336M202243M236315M553123M509084M401259
8786B32946783M214565M503661M434841M512127M734384M321253M050172L467610
8778B67185396L343870L449929M008830M415134M543755N026948N170866M388766
8770C01533494L329905K746834K345283K426613K174115J898734M61403j615966
$$ y = [175248806, 178885443, 182681393, 186188177, 188419209, 189607819, 189781766, 189264261, 188088723, 185644588, 182900904, 180245018, 178311148, 177461429, 176720526, 175903265, 175278772, 175185726, 175534179, 175901051, 176602246, 177534078, 178772194, 180146630, 181780398, 183070107, 184350118, 185754021, 187459996, 189229880, 191059467, 193205089, 195278779, 197370168, 200191888, 203458590, 207034423, 211044759, 215247002, 219483317, 224036440, 228545524, 232946783, 237161348, 241665009, 246099850, 250611977, 255346361, 259667614, 263717786, 267185396, 270529266, 273979195, 277988025, 282403159, 286946914, 291973862, 297144728, 301533494, 304863399, 307610233, 309955516, 312382129, 314556244, 316454978, 316916381, 315300415]
8762C15300415l122886l741930l000560j672834p49511o51060o10439n07787j84841
8753C01058567M79209Q93410J665946K085129K291498K611381K335887K169651
8745C15590678J380836R90965J400190J701466K747888L913834M272707L791713
8737C35790277K832125K434520K577062K672324K944790L044444J900776P39182
8729C54935500O39536M62997N38754J28285K36615L49530J283981J845668K325518
8720C62746384K586558L154570M818684Q008791J1104176J4398462J8284510K4654457
8712D49756592K2931389J2722714j0582365l4832303l6013605l0394111k2513979
8705C51074332j7060292j3017997j0304247q767005q098560p724551p600428o830106
$$ y = [315300415, 312177529, 308435599, 305435039, 303762205, 303012694, 302361634, 301751195, 301243408, 301058567, 301537776, 302431186, 304097132, 306182261, 308473759, 311085140, 313421027, 315590678, 316971514, 317962479, 319362669, 321064135, 323812023, 327725857, 331998564, 335790277, 338622402, 341056922, 343633984, 346306308, 349251098, 352295542, 354196318, 354935500, 355575036, 356038033, 356576787, 356705072, 356941687, 357291217, 358575198, 360420866, 362746384, 365332942, 368487512, 373306196, 381314987, 392419163, 406817625, 425102135, 449756592, 472687981, 485410695, 474828330, 439996027, 403982422, 373588311, 351074332, 334014040, 320996043, 310691796, 301924791, 293826231, 286101680, 278501252, 271671146]
8697B71671146n695921n137655n081164m787089m671054m281934l624063l490118
8689B34902148l826154l638412l528954l122808k762196k264684k319912k734769
8681B10704259k747851k496604k095933k064497k243159k387587k195516k043016
8673A92430096k393881k675691k669178l122931l489775l802311l836912m082026
8665A66357391l818569l727779l702121l770617l680903l400098k820911k371005
8657A39065388k449942k345744k140963k076472j909350j823941j301078j163859
8649A23854039j333171j460386j213455j361258j337225j643920j609759j244148
8641A12650717j178453j160647r40489j274046j275847j158824j139671j246379
$$ y = [271671146, 265975225, 260837570, 255756406, 250969317, 246298263, 242016329, 238392266, 234902148, 231075994, 227437582, 223908628, 220785820, 218023624, 215758940, 213439028, 210704259, 207956408, 205459804, 203363871, 201299374, 199056215, 196668628, 194473112, 192430096, 190036215, 187360524, 184691346, 181568415, 178078640, 174276329, 170439417, 166357391, 162538822, 158811043, 155108922, 151338305, 147657402, 144257304, 141436393, 139065388, 136615446, 134269702, 132128739, 130052267, 128142917, 126318976, 125017898, 123854039, 122520868, 121060482, 119847027, 118485769, 117148544, 115504624, 113894865, 112650717, 111472264, 110311617, 109371128, 108097082, 106821235, 105662411, 104522740, 103276361]
8633A03276361k083392k580817k589218k956981k477664j952954k139834j848076
8625H4647425j448100j252421r81946q89126j017600j329211j064379j056292
8617G5608350j124538r15502j282596j151439j066811j075078p84229q77448q28989
8608F6501720r55027j170795j172997o58069m23936n93437p20378r77609j207375
8599E8622097j077395j147492q57876r45933q39749j121434j078134j155003q82572
8590D9516509n18770q40207o54268r66399k31608m68991n93483m32112l51332
8581D4459339n49255l51980m24084k21862l53624j76869K239j48167q7908L20156
8571D2467985q262j35084J32977L5626J23296M24180K71305M22681M79471K11583
$$ y = [103276361, 101192969, 98612152, 96022934, 93065953, 90588289, 88635335, 86495501, 84647425, 83199325, 81946904, 80964958, 80075832, 79058232, 77729021, 76664642, 75608350, 74483812, 73568310, 72285714, 71134275, 70067464, 68992386, 68208157, 67330709, 66501720, 65546693, 64375898, 63202901, 62544832, 62120896, 61527459, 60807081, 59829472, 58622097, 57544702, 56397210, 55539334, 54593401, 53753652, 52632218, 51554084, 50399081, 49516509, 48997739, 48157532, 47503264, 46536865, 46305257, 45836266, 45242783, 44810671, 44459339, 43910084, 43558104, 43134020, 42912158, 42558534, 42381665, 42383904, 42235737, 42147829, 42467985, 42459723, 42324639, 42457616, 42493242, 42616538, 43040718, 43312023, 43734704, 44214175, 44425758]
8561D4425758O24999N12032Q18554Q34375Q87014J110836J156081J117948J561785
8552E3049382J477355J534852J820870J661681J623299J515430J590459J599800
8544F5873128J642016J570566J232940Q57783R9353k29295l50951m48076j32668
8535G0114796j81255m81677q46250j243920j593657j458271j088240r61369q49217
8526F1410940l59501j12093j10253L04743L75709K48665K31499N08122N86198
8517F3084029N94866R06164R03505O28696O56884N62995K85202R8767j00865k03591
8507F7416652k6952l36703l53332n61973j126685j580760j635151j732675j805050
8498E8257371j531165j555648k013729j942899j734654j585570j364402j115117
$$ y = [44425758, 45050757, 45562789, 46381343, 47215718, 48102732, 49213568, 50369649, 51487597, 53049382, 54526737, 56061589, 57882459, 59544140, 61167439, 62682869, 64273328, 65873128, 67515144, 69085710, 70318650, 71176433, 71275786, 71046491, 70695540, 70247464, 70114796, 69933541, 69451864, 68605614, 67361694, 65768037, 64309766, 63221526, 62260157, 61410940, 61051439, 60939346, 60829093, 61133836, 61509545, 61758210, 61989709, 62497831, 63084029, 63678895, 64585059, 65488564, 66117260, 66774144, 67337139, 67622341, 67721108, 67620243, 67416652, 67389700, 67052997, 66699665, 66137692, 65011007, 63430247, 61795096, 60062421, 58257371, 56726206, 55170558, 53156829, 51213930, 49479276, 47893706, 46529304, 45414187]
8490D5414187r72486r64706q20885p95895o08565m57506m75366r39964q11940
8481C8566874o85224q48863p77690p22964r74808r73845p24256q96146r43171
8472C1019907j032736p24124q02723q57402o08710o50087o21213n74920n78590
8463B4569402p40873l51325n10139m51870k62960l29640p13099j62864j76988
8454B0869644l69300k70550k36716m09894k64347k08972m62849k06973j72262
8445A8267781K7090l98560m61855l48820l28322o3894l08849m55585l53669l39162
8435A5236155k63973l46637l86707l67280j25969k16340n44057m04206j7948j76385
8425A2386653k00234q6428k12224k9215N2897P107j45478l70320p5582j2260l0607
$$ y = [45414187, 44441701, 43476995, 42656110, 41860215, 41251650, 40794144, 40318778, 39378814, 38566874, 37881650, 37032787, 36255097, 35532133, 34557325, 33583480, 32859224, 31963078, 31019907, 29987171, 29263047, 28460324, 27602922, 26994212, 26344125, 25722912, 25147992, 24569402, 23828529, 23477204, 22967065, 22515195, 22252235, 21922595, 21209496, 21046632, 20869644, 20500344, 20229794, 19993078, 19583184, 19318837, 19109865, 18647016, 18440043, 18267781, 18294871, 17896311, 17434456, 17085636, 16757314, 16693420, 16384571, 15928986, 15575317, 15236155, 14972182, 14625545, 14238838, 13871558, 13745589, 13529249, 12985192, 12580986, 12563038, 12386653, 12186419, 12099991, 11887767, 11858552, 11911449, 11918556, 11773078, 11402758, 11327176, 11314916, 11284309]
8414A1284309k65211o2274K7316o3876j04389p9928j86020j87826K1572l00840
8404A0082833k28569o8221j86437l50164j91743p2805j81435k98765j34614r0765
8394H279315n4176j68787l50660L8071j29110k23992J51725k08441j69742k72583
8384F891620j50390j0459M5800j17831j26483K9304j45807k53564l1589J70920
8374F301521o4131j5088j00769j55361m4349k79074r7287J35244m8728l9790J23578
8363E715766j67682j85497j6219M7531n4311k65423o2358n6477K88802o4978r0521
8352E088633j26606p5968n0464J4786K34807k85938j48582k4421L6449M850j46256
8341D521290j89047P228P4277l4917k0919j19216j51168q6834K23508k02008m0304
$$ y = [11284309, 11019098, 10956824, 10984140, 10920264, 10815875, 10735947, 10549927, 10362101, 10383673, 10082833, 9854264, 9786043, 9599606, 9249442, 9057699, 8984894, 8803459, 8504694, 8370080, 8279315, 8225139, 8056352, 7705692, 7743763, 7614653, 7390661, 7542386, 7333945, 7164203, 6891620, 6741230, 6730771, 6776571, 6658740, 6532257, 6561561, 6415754, 6162190, 6130601, 6301521, 6237390, 6222302, 6121533, 5966172, 5921823, 5642749, 5545462, 5680706, 5631978, 5592188, 5715766, 5548084, 5362587, 5346368, 5393899, 5339588, 5074165, 5011807, 4955330, 5244132, 5179154, 5088633, 4962027, 4886059, 4835595, 4850381, 5085188, 4799250, 4650668, 4626247, 4662696, 4667546, 4521290, 4332243, 4339471, 4413748, 4378831, 4357912, 4238696, 4087528, 4000694, 4224202, 4022194, 3981890]
8330C981890P7934j65523j93201R3834K4227l0398o4833j27511J85039j67912
8320C613546q1858o8454J77044L2770j16341J46659j17316k1943J2931q0534K51953
8309C748457q2898q459J32485k24347N467j26602j2076K49552j54470l37175k638
8298C187296N8872j46815r9032P6391p2014L0495P1205J05601R1580o197q7732
8287C209650q6847k48085M0114Q2702K06312m8498j01743j59910r018K93132P9104
8276C256913P0748k53603K4907O6641L0673j20494j14568O6664R9659r599k3415
8265C094526j07709J9927j45999q6887J7768J42838O2598p7202N4098K20163J118
8254C195239j21917J52869J70230m1925J86013J38670m6133j00763P3122j5256
$$ y = [3981890, 4059824, 3894301, 3701100, 3794934, 3819161, 3788763, 3723930, 3596419, 3781458, 3613546, 3531688, 3463234, 3640278, 3673048, 3556707, 3703366, 3586050, 3564107, 3577038, 3496504, 3748457, 3665559, 3657100, 3789585, 3565238, 3570705, 3444103, 3432027, 3681579, 3527109, 3189934, 3187296, 3246168, 3099353, 3000321, 3076712, 3004698, 3035193, 3106398, 3211999, 3303579, 3297382, 3209650, 3122803, 2874718, 2914832, 2997534, 3203846, 3155348, 3053605, 2893695, 2884677, 3177809, 3256913, 3327661, 3074058, 3098965, 3165606, 3196279, 3075785, 2961217, 3027881, 3127540, 3117941, 3094526, 2986817, 3006744, 2860745, 2773858, 2791626, 2934464, 2997062, 2919860, 2973958, 3194121, 3195239, 3073322, 3226191, 3396421, 3354496, 3540509, 3679179, 3633046, 3532283, 3605405, 3590149]
8244C590149r3620K4538J30105N6478n3889K2007l9405J8103l7747N838M0842
8233C663399J02879N91n7657k34071m55785m05034P4570k04832l1936N4703l94935
8222B111892J4282M89214j39410l2722N4756L8962o9249l8087j30091M7535m7588
8211B299494n0454J01373j74348N8512o2663J19677P1833k11433O1740l5470J30997
8200B309258j31464r0599K05437J6599L3096N6915k5632m1371J518281q27721
8190C022799n48332N3749l56803K14849j36734n465j15150Q2569j35524j4913
8180B061045Q0148J55983q4203Q1128j18265Q3524l6069P911J45785q784j18349
8169B249854j58513J92453o7505j27292Q295K6296J76938K0814j53302j10936
$$ y = [3590149, 3496529, 3521067, 3651172, 3707650, 3653761, 3675768, 3636363, 3654466, 3616719, 3622557, 3663399, 3766278, 3766869, 3709212, 3475141, 3019356, 2614322, 2688892, 2484060, 2452124, 2506827, 2111892, 2126174, 2615388, 2475978, 2443256, 2498012, 2536974, 2467725, 2429638, 2299547, 2347082, 2299494, 2249040, 2350413, 2176065, 2234577, 2171914, 2291591, 2363424, 2151991, 2213731, 2178261, 2309258, 2177794, 2087195, 2292632, 2309231, 2342327, 2399242, 2373610, 2332239, 3850520, 3022799, 2474467, 2528216, 2171413, 2386262, 2249528, 2244063, 2128913, 2211482, 2075958, 2061045, 2141193, 2297176, 2212973, 2294101, 2175836, 2259360, 2223291, 2231202, 2376987, 2368203, 2249854, 2091341, 2283794, 2216289, 2088997, 2097292, 2123588, 2300526, 2321340, 2168038, 2057102]
8159B057102J2539j46602j00708K82316J52498J7402j76935j5228J58324O9811
8149B310519j23877l88055K25410Q4628k39039N9045P4906Q6908O8110Q5981q4971
8138B159565k2131Q2097r7566j09273l4223k14849R3471Q1909l5348K17599j12617
8127B008634K832J37157o0127k09256j18553R5801J09611n9639J4209l6503J05140
8116A989306K49081k861j06546l4380M691L5999n0419k51160n2550m8694J71729
8105A904196l6567o5179P9757j85483K96590j41528p9483L3138j68179K42936
8095A880198M980k1409n1545l8598J0636M3900N8164P8068q6038L337J69651N5473
8083B106817n5499q1030j5837J0953R8491K1682K22107j97097k44661N5451j33327
$$ y = [2057102, 2069641, 1923039, 1822331, 2104647, 2257145, 2274547, 2097612, 2082384, 2240708, 2310519, 2186642, 1798587, 2023997, 2108625, 1869586, 1928631, 2003537, 2090445, 2158555, 2244536, 2159565, 2137434, 2219531, 2121965, 2012692, 1978469, 1763620, 1857091, 1939000, 1903652, 2121251, 2008634, 2011466, 2148623, 2088496, 1879240, 1760687, 1856488, 1966099, 1906460, 1920669, 1884166, 1989306, 2238387, 2235526, 2128980, 2094600, 2099291, 2135290, 2084871, 1833711, 1781161, 1732467, 1904196, 1867629, 1802450, 1882207, 1696724, 1993314, 1851786, 1772303, 1805441, 1637262, 1880198, 1885178, 1863769, 1812224, 1773626, 1784262, 1828162, 1886326, 1964394, 1878356, 1881693, 2051344, 2106817, 2051318, 1970288, 1954451, 1965404, 2063895, 2085577, 2307684, 2110587, 1865926, 1921377, 1788050]
8072A788050n1701J28749m5035J53038R3321j05704J13058r0536k13541q4509
8062A685190L9828l00001p609K84421j83241J8132L81408J98571j02521k34868
8052A779310k12548J85389r1042j48941J74877j70182Q6535K28163j79186J01657
8042A754032l8843r1823J0460J83893P7793l8965r9115m2412J98931R0734k42583
8031A762102M3593j57017m75817J83717J60657K3385J20527O9795j66823n2424
8021A511695N081q7693J38384L1406Q4649M3744K1736j9040j85610Q445L8247
8010A591044J06785M638N0614l04k67546Q913L06894j18073j07891J95259N3926
7999A824259j49206j50892n3534K3262j8305j03904K3752n184J57932K22810J26303
$$ y = [1788050, 1736349, 1865098, 1820063, 1973101, 2066422, 1960718, 2073776, 1983240, 1769699, 1685190, 1725018, 1425017, 1417408, 1701829, 1518588, 1536720, 1918128, 2116699, 2014178, 1779310, 1566762, 1752151, 1661109, 1512168, 1687045, 1516863, 1603398, 1831561, 1652375, 1754032, 1715189, 1623366, 1633826, 1817719, 1895512, 1856547, 1757432, 1715020, 1913951, 2004685, 1762102, 1805695, 1648678, 1172861, 1356578, 1517235, 1540620, 1661147, 1730942, 1564119, 1511695, 1516776, 1429083, 1567467, 1598873, 1683522, 1727266, 1749002, 1729962, 1544352, 1552797, 1591044, 1697829, 1702467, 1753081, 1752777, 1485231, 1494144, 1801038, 1682965, 1575074, 1770333, 1824259, 1675053, 1524161, 1470627, 1493889, 1475584, 1371680, 1395432, 1390248, 1548180, 1770990, 1897293]
7988A897293j06232J425J37832j41941l1713q2349Q8337O6877K46025j47596M0496
7977A968454P7242j92177j18775J06051J21880K7207J3328K0669n1350R6307J09700
7966B178536K7908m9651J8645Q0386n942k4382J72878n8310m6103M2027J45787
7955B481779j51414j0149M4597J94478j24818l2429J811K0264J64223j07885N6208
7944B536665J16987R6617j00099J00392O2880K4204J46675L19253j36935j44360
7934C022279r7280J62216p231Q5150J11336Q4391K6160J36301J52486J68985k2694
7923C822099K39993L49334l5626q4747K80573Q3667J05586K19961J44428K59235
7913E384503K93258R379L74552M75396J02509N25225L76358N43045M17355L9684
$$ y = [1897293, 1791061, 1792486, 1930318, 1788377, 1756664, 1674315, 1762652, 1829529, 2075554, 1927958, 1968454, 2045696, 1853519, 1734744, 1840795, 1962675, 1989882, 2003210, 2023879, 1972529, 2068836, 2178536, 2206444, 2156793, 2175438, 2255824, 2249882, 2225500, 2398378, 2340068, 2293965, 2335992, 2481779, 2330365, 2320216, 2364813, 2559291, 2434473, 2402044, 2403855, 2424119, 2588342, 2480457, 2536665, 2653652, 2750269, 2650170, 2750562, 2813442, 2837646, 2984321, 3303574, 3166639, 3022279, 2924999, 3087215, 3079984, 3165134, 3276470, 3360861, 3387021, 3523322, 3675808, 3844793, 3822099, 4062092, 4411426, 4375800, 4291053, 4571626, 4655293, 4760879, 4980840, 5125268, 5384503, 5677761, 5687140, 6061692, 6537088, 6639597, 7164822, 7541180, 8084225, 8501580, 8541264]
7903H541264N57446N29595O37520N23158K04056J11809J81740P9949K28731J78936
7893A1774204K17743j31751l58771n77243n89138o74893k88996l59370n91947
7884H419838k81871n80922l90325l99989l25548l37730l26231k23182k763r6258
7874E455019l73911K8628O3740J39863J38538k38003l7383J6421J15636m0803
7864E267745m1377J03031n2685p7037L68574J3027l4109K39752j75298o4023L05371
7853E852971J57391K61135J91488J64147P4331K23079K21376L12044O25008M93145
7843H576115M56573N00983L99012L27401M46498O86374N48832L33160K8024K92463
7833A2595435K02707K21650N2171j06132l96346l81510m67925n13891n80897n67930
$$ y = [8541264, 9098710, 9628305, 10265825, 10788983, 10993039, 11104848, 11286588, 11366537, 11595268, 11774204, 11991947, 11860196, 11501425, 10924182, 10335044, 9660151, 9371155, 9011785, 8419838, 8137967, 7557045, 7166720, 6766731, 6441183, 6103453, 5777222, 5554040, 5551277, 5455019, 5081108, 5109736, 5173476, 5313339, 5451877, 5213874, 5176491, 5192912, 5308548, 5267745, 5226368, 5329399, 5276714, 5199677, 5568251, 5581278, 5547169, 5786921, 5611623, 5547600, 5852971, 6010362, 6271497, 6462985, 6627132, 6701463, 6924542, 7145918, 7457962, 8082970, 8576115, 9032688, 9533671, 9932683, 10260084, 10706582, 11392956, 11941788, 12274948, 12302972, 12595435, 12798142, 13019792, 13071963, 12965831, 12569485, 12187975, 11720050, 11206159, 10625262, 10057332]
7823A0057332n79596p17947m88625n45864n21230m67588m05667l64747j63053
7814E803015j15450l58306l11379j01911j14382k13114j91580K9726n6804K7463
7804D397278k83234j00896m5724Q5264k8804O0024o05019o45567L07376J26832
7794C267530J34053k02R8658q7432q9836K7522k4701R0823L4357j82128Q6605
7783C355249j52677n5308K67430j01351o6533k0458J16949J41727K2900q4766
7773C423162q9849J21358N3087J28253J04704j60192K2458k01449R9535R6736
7763C597803O8113j55200J04733o693j6175J25634K9854n1272O4807q0035j94806
7752C486763q4925m5248Q9550K56211O7320k69244j60085N5364J01772J39013
$$ y = [10057332, 9477736, 8759789, 8271164, 7725300, 7204070, 6736482, 6330815, 5966068, 5803015, 5687565, 5329259, 5017880, 4915969, 4801587, 4588473, 4396893, 4426619, 4369815, 4397278, 4114044, 4013148, 3967424, 4052688, 4023884, 4083908, 3478889, 2833322, 3140698, 3267530, 3401583, 3401381, 3500039, 3412607, 3322771, 3350293, 3325592, 3416415, 3450772, 3268644, 3355249, 3202572, 3147264, 3414694, 3313343, 3246810, 3226352, 3343301, 3485028, 3507928, 3423162, 3333313, 3454671, 3507758, 3636011, 3740715, 3580523, 3602981, 3401532, 3501067, 3597803, 3665916, 3510716, 3615449, 3608756, 3592581, 3718215, 3748069, 3696797, 3761604, 3681569, 3486763, 3401838, 3356590, 3446140, 3702351, 3769671, 3500427, 3340342, 3395706, 3497478, 3636491]
7742C636491O3782p4720R4700j3066N2800J28000p2077Q467l0221R3303K41352
7731D128811n6080l35778L6743O5226j44418K17819p3154N9733L754n8228P6930
7720C921358J14119q1418n8782Q5437o5554Q1227J86884N4120K55193K48302l7328
7709D703558k14824K06826L9317J31211M1689m2176k01092J29475j83680J84754
7699D795058p960k38360Q0872j64141r4983J12216J18188r9086l7770n6944P3174
7688D480264O897J67151o8783J13902q6507m5119J09886M3429r9067j79280J38419
7677D581192M7833J6701J40600J89380O0590j02071O0138J5283P6463J24782L560
7666E214451q0209j35509J02173N5337Q473Q103K19262r8948m18609m5673J11774
$$ y = [3636491, 3700273, 3625553, 3720253, 3707187, 3759987, 3887987, 3815910, 3824377, 3794156, 3887459, 4128811, 4072731, 3736953, 3773696, 3838922, 3694504, 3912323, 3839169, 3898902, 3902656, 3844428, 3921358, 4035477, 3954059, 3895277, 3980714, 3915160, 3996387, 4183271, 4237391, 4492584, 4740886, 4703558, 4488734, 4695560, 4734877, 4866088, 4907777, 4865601, 4664509, 4793984, 4610304, 4795058, 4787098, 4548738, 4629610, 4465469, 4370486, 4482702, 4600890, 4501804, 4464034, 4407090, 4480264, 4487161, 4654312, 4585529, 4699431, 4612924, 4567805, 4677691, 4721120, 4622053, 4442773, 4581192, 4629025, 4645726, 4786326, 4975706, 5036296, 4934225, 4994363, 5009646, 5086109, 5210891, 5214451, 5134242, 4998733, 5100906, 5156243, 5164716, 5172819, 5392081, 5293133, 4874524, 4828851, 4940625]
7655D940625j3815m6994J68593J24070K50415j24437K78954N8659P4191o3900
7645E646361J34600K21305j68197O9080p7250j19723r4573J43663K0257j89412
7635E586111j50662Q6717J77577j8347o4217N308j52503J19548p9074j6097O5906
7624E560267p3970J4174P0676O9972R319N5612L9954J60587K46177K25813P8275
7613F456856L05014N2879Q6729K04011M3883K02365J59152r3446J28468l0018
7603G515893R6393K43374q3302K35165p3711k8837J684k21022k2291k66849j81633
7592G214864k09343l02619r9933j29426l07582L787j36852l38195j41066k32894
7582E320741k50651L4360j53674j40212k3067J0541j93038p3167n7033o2094q1998
$$ y = [4940625, 4926810, 4879816, 5048409, 5172479, 5422894, 5298457, 5577411, 5636070, 5710261, 5646361, 5780961, 6002266, 5834069, 5903149, 5825899, 5706176, 5611603, 5755266, 5775523, 5586111, 5435449, 5522166, 5699743, 5681396, 5617179, 5622487, 5469984, 5589532, 5510458, 5494361, 5560267, 5486297, 5500471, 5571147, 5641119, 5650438, 5706050, 5746004, 5906591, 6152768, 6378581, 6456856, 6761870, 6814749, 6901478, 7105489, 7149372, 7351737, 7510889, 7417443, 7545911, 7515893, 7612286, 7855660, 7772358, 8007523, 7933812, 7904975, 7906659, 7685637, 7663346, 7396497, 7214864, 7005521, 6702902, 6602969, 6473543, 6165961, 6169748, 6032896, 5694701, 5553635, 5320741, 5070090, 5104450, 4950776, 4810564, 4787497, 4798038, 4605000, 4531833, 4474800, 4412706, 4330708]
7571D330708r5043j57391O204l3852L0872O7229m2031J26071r0911K07745o1803
7560D287798P0957P3454R2128K09538j72520K23818P1360O7626L53303Q6669J58660
7549E522791J9898J87058j22546K30905j45933m1403L09574L72947p1076p214
7539F255001M4465K31468K61774j58147r0843M6136k66745N6012k1458o734j35832
7528F215097n22504j33905j42893j48898l50758o5255M8458k69310k79111j48126
7518D202795k06584j81815k40553L0601k4216k25350j39102K0759n8263j14869
7508C063403M7774n4351n2607Q145j30197r2581j76433K936J79840J42117l13940
7497B624106q9212J74884J5853J11376k7742J992J7558j50748J13846l3188p997
$$ y = [4330708, 4235665, 4078274, 4084478, 4050626, 4081498, 4148727, 4106696, 4232767, 4141856, 4349601, 4287798, 4358755, 4432209, 4524337, 4733875, 4561355, 4785173, 4856533, 4924159, 5277462, 5364131, 5522791, 5542689, 5729747, 5607201, 5838106, 5692173, 5650770, 5960344, 6333291, 6262215, 6255001, 6299466, 6530934, 6792708, 6634561, 6543718, 6589854, 6323109, 6379121, 6357663, 6350929, 6215097, 5692593, 5558688, 5415795, 5266897, 4916139, 4850884, 4899342, 4630032, 4350921, 4202795, 3996211, 3814396, 3573843, 3604444, 3580228, 3354878, 3215776, 3236535, 3178272, 3063403, 3111177, 3056826, 3004219, 3012364, 2882167, 2789586, 2613153, 2616089, 2795929, 2938046, 2624106, 2534894, 2709778, 2725631, 2837007, 2809265, 2811257, 2828815, 2678067, 2791913, 2758725, 2750728]
7486B750728r6527j01623j16806O8187N2057J1571J4638K0268K2548r6783J07521
7475B635779j43121P0758K1411o987l194k03504K4341J48945J36553j14098j51661
7464B415222N2745N0950N1082M166o831N2100k16318K6698j3933o4621j7968K49411
7452B582703k5833q1348J12665j60252P6172K47458M0513j20252J33169K0634
7442B825629Q2177j22529J5422N1765K0858P5607n7810K166J11368J08017P3179
7431C185849l14012J05684K63402m0149p0311k48422Q1192L7500J39647j1986
7421C128394J76729R0097L2949m0296r9831J33252j79447Q0050K32077k20888
7411C333086j24948J84550l749j59917J7844P5464J25587n0731O935J66739q2953
$$ y = [2750728, 2654201, 2552578, 2435772, 2503959, 2556016, 2567587, 2582225, 2602493, 2625041, 2528258, 2635779, 2492658, 2563416, 2584827, 2577840, 2574646, 2371142, 2395483, 2544428, 2680981, 2566883, 2415222, 2467967, 2518917, 2569999, 2574165, 2567334, 2619434, 2403116, 2429814, 2415881, 2351260, 2333292, 2582703, 2556870, 2475522, 2588187, 2427935, 2504107, 2751565, 2792078, 2671826, 2804995, 2825629, 2907806, 2785277, 2800699, 2852464, 2873322, 2948929, 2891119, 2893285, 3004653, 3112670, 3185849, 2871837, 2977521, 3240923, 3200774, 3130463, 2882041, 2963233, 3000733, 3140380, 3128394, 3305123, 3395220, 3428169, 3387873, 3288042, 3421294, 3241847, 3321897, 3553974, 3333086, 3208138, 3392688, 3388939, 3229022, 3246866, 3322330, 3447917, 3397186, 3404121, 3570860, 3487907]
7400C487907j87274q869J51971j36527P4153r8830j14335n1071Q5092J0520j43081
7389C069656L38545O6846o2424J5256j81219o1619J79200j45444N5251J48571
7379C422619P4874O6398m6503L2646k13037K19340J14682O5897n3556K3285l578
7368C703067j02042j03191N4597J49433l0642J31678j23313j37885r7929M8192
7358C491965K09382K24053k28901M6622K8128N4560J39347M1729M7553k94j32884
7347C921260O9235J0422j24754J9238J6037K05062M6865O2113J29317o4400k5878
7336D264517L676R9987m1565j8923L0516J30970k4023k1286J18587j92506J64030
7325D513980K31769K21565K87216J29719Q8758K10669k42123N1978L13418J54029
$$ y = [3487907, 3300633, 3291764, 3443735, 3307208, 3381361, 3282531, 3168196, 3117125, 3202217, 3212737, 3069656, 3408201, 3475047, 3412623, 3427879, 3246660, 3185041, 3364241, 3218797, 3274048, 3422619, 3497493, 3563891, 3517388, 3550034, 3336997, 3556337, 3671019, 3736916, 3683360, 3706645, 3703067, 3601025, 3497834, 3552431, 3701864, 3671222, 3802900, 3679587, 3541702, 3443773, 3491965, 3701347, 3925400, 3696499, 3743121, 3771249, 3825809, 3965156, 4006885, 4054438, 4054144, 3921260, 3990495, 4000917, 3876163, 3895401, 3911438, 4116500, 4163365, 4225478, 4354795, 4290395, 4264517, 4268193, 4368180, 4326615, 4307692, 4338208, 4469178, 4445155, 4423869, 4542456, 4349950, 4513980, 4745749, 4967314, 5254530, 5384249, 5473007, 5683676, 5441553, 5493531, 5806949, 5960978]
7315E960978N4126J74019L20674M1562m2697K87813J73234J0722K89141l0165
7305G239407l76035L19010J00057M52J03942J39751n984K07582O554J16495J07022
7294G958253R3500M21850K17794K17647K73976K36982L31913M19694L03280M21364
7284A0896253N33497N41808L92324O72924O95782K21046P24640P88897N61389
7275A6028560O35944N48572P06462O90858O70797N72897N24404M15022N95238
7266B1388754L45354J034272J099202J324961J342093J760881K135859K380946
7258C2812322K217113J954229J739491J255727J247697J703470J546785J547615
7250D6024449J377775M8987j192334j818234k346699k350296j999380j801847
$$ y = [5960978, 6015104, 6189123, 6509797, 6551359, 6508662, 6796475, 6969709, 6980431, 7269572, 7239407, 6863372, 7182382, 7282439, 7282891, 7386833, 7526584, 7520600, 7728182, 7734736, 7851231, 7958253, 8051753, 8473603, 8691397, 8909044, 9183020, 9420002, 9751915, 10171609, 10474889, 10896253, 11429750, 11971558, 12363882, 13036806, 13732588, 13953634, 14678274, 15467171, 16028560, 16664504, 17213076, 17919538, 18610396, 19281193, 19854090, 20378494, 20793516, 21388754, 21734108, 22768380, 23867582, 25192543, 26534636, 28295517, 30431376, 32812322, 35029435, 36983664, 38723155, 39978882, 41226579, 42930049, 44476834, 46024449, 47402224, 47451211, 46258877, 44440643, 42093944, 39743648, 37744268, 35942421]
7242C5942421j693104j677592j585955j118782q39068q77475p63332p85860n05749
7233B6095504n27239o67910o57040j005515n48049m55880n47261l31963m26447
7224B0928200j07817l09893j41940k24051q4867j55939j71942l14956j82079k81606
7214A8953110l26959k69810n7404m08313m49961j23020j01288l75491l86477j04299
7204A6350088k10094l07597m29524j48670k24435k69743k86707k28802k88833
7195A3955683l47816m28051j08907k36280k30334m12399l71156p2186n45074k16267
7185A0987213j51462j71104k46968l01875k42472j42715j90855j98841j62184
7176I178737l1361j19585j37970j16029j35311j22523O320k09737l50900l05384
$$ y = [35942421, 34249317, 32571725, 30985770, 29866988, 29027920, 28150445, 27387113, 26601253, 26095504, 25568265, 24900355, 24243315, 23237800, 22689751, 22233871, 21686610, 21354647, 20928200, 20820383, 20510490, 20368550, 20144499, 20059632, 19903693, 19731751, 19416795, 19234716, 18953110, 18626151, 18356341, 18298937, 17890624, 17440663, 17317643, 17216355, 16840864, 16454387, 16350088, 16139994, 15832397, 15402873, 15254203, 15029768, 14760025, 14473318, 14244516, 13955683, 13607867, 13179816, 13070909, 12834629, 12604295, 12191896, 11820740, 11748554, 11203480, 10987213, 10835751, 10664647, 10417679, 10115804, 9873332, 9730617, 9539762, 9340921, 9178737, 9147376, 9027791, 8889821, 8773792, 8638481, 8515958, 8522278, 8312541, 7961641, 7656257]
7166G656257j47646K45539j41740j47964j08006r3509j43760p1349r8641Q0918
7156G030099J12328j66865j70911M6385J67720j52069J13045k8164r5655q8261
7146F767652o3787J56945l8987j0571J79056k6399J03847j7586K4031J25670N030
7135G204901Q8825j24234O2606P3881k1904J33263J19651J66675P2405J90994
7125G967063J55411P3471J26158J21392J55465J86709J81907Q1099K89708O48224
7115I986607O47965N06668M71992M46834O84871N92178K80171M55336L58700J23980
7105A4555302l40369p41707o49067p70922m98868n20158l61535k86221r7251O7048
7095A0356252N0676j63312J64884K46184M15575j21311K2738K47435J10950K13610
$$ y = [7656257, 7508611, 7754150, 7612410, 7464446, 7356440, 7262931, 7119171, 7047822, 6949181, 7030099, 7142427, 6975562, 6804651, 6851036, 7018756, 6866687, 6979732, 6951568, 6855913, 6767652, 6703865, 6860810, 6821823, 6811252, 6990308, 6963909, 7067756, 7050170, 7074201, 7199871, 7204901, 7293726, 7169492, 7232098, 7305979, 7284075, 7417338, 7536989, 7703664, 7776069, 7967063, 8122474, 8195945, 8322103, 8443495, 8598960, 8785669, 8967576, 9048675, 9338383, 9986607, 10634572, 11141240, 11613232, 12060066, 12744937, 13337115, 13617286, 14072622, 14431322, 14555302, 14214933, 13473226, 12824159, 12053237, 11554369, 11034211, 10672676, 10386455, 10289204, 10356252, 10406928, 10243616, 10408500, 10654684, 11070259, 10948948, 10971686, 11219121, 11330071, 11543681]
7085A1543681K80598J25789J72893N8839J3668j7083k04885J22451L41402J46660
7075A2584013R5575o8768J23462J22245k09255K19891K87076j03882K47804M99415
7065A3797576K7979J03089K02697p91L94649K54512J33989L59489J72394L03171
7055A5748754L01261M07828M43589O16065K00786K90359M11268K85763K19711
7046A8925384N57702K12094J40307K11529L13081J19740M36396K39206K24508
7037B1379947O71553M81460O90059Q00221P36194J053612J296292J456184J798944
7028C0364466K086961K149771K508878K974708L402502L560333M142757M552625
7020E5743001M777011N136892M646366M317654M494053M191535L735044L219078
$$ y = [11543681, 11824279, 11950068, 12122961, 12181800, 12195468, 12178385, 11973500, 12095951, 12437353, 12584013, 12679588, 12610820, 12734282, 12856527, 12647272, 12867163, 13154239, 13050357, 13298161, 13797576, 13825555, 13928644, 14131341, 14130550, 14525199, 14779711, 14913700, 15273189, 15445583, 15748754, 16050015, 16457843, 16901432, 17517497, 17718283, 18008642, 18419910, 18705673, 18925384, 19483086, 19695180, 19835487, 20047016, 20360097, 20479837, 20916233, 21155439, 21379947, 22051500, 22532960, 23223019, 24023240, 24759434, 25813046, 27109338, 28565522, 30364466, 32451427, 34601198, 37110076, 40084784, 43487286, 47047619, 51190376, 55743001, 60520012, 65656904, 70303270, 74620924, 79114977, 83306512, 87041556, 90260634]
7012I0260634K204435O13980j025927j747162k408544l665654m784315n482507
7004G3964940o005938o089696n509327m845400m401799l839451l155161k674909
6996C7443259k238039j843287j505876r90864q26294r98193p07323m83029n33171
6987B7317183m67370j92946m38649l96895j40707k40944j49527k91739k47158
6978B4751248m2898j59919k61022j34430j49067K16689j76068j58281Q4484J53354
6968B4124090J20930L05182K06669N26499M83403K22828N89422M33477O20567
6959B7633067R55600Q16502J077648J022358J128749J128272R87178J285471J151783
6950C7186628J211204J150576R96260Q05907J035119K39871k72264j75620m72391
$$ y = [90260634, 92465069, 93079049, 92053122, 90305960, 87897416, 84231762, 79447447, 73964940, 67959002, 61869306, 56359979, 51514579, 47112780, 43273329, 40118168, 37443259, 35205220, 33361933, 31856057, 30865193, 30038899, 29040706, 28333383, 27850354, 27317183, 26849813, 26656867, 26218218, 25821323, 25680616, 25439672, 25290145, 24998406, 24751248, 24708350, 24548431, 24287409, 24152979, 24003912, 24220601, 24044533, 23886252, 23970736, 24124090, 24245020, 24550202, 24756871, 25283370, 25766773, 25989601, 26579023, 27012500, 27633067, 28588667, 29405169, 30482817, 31505175, 32633924, 33762196, 34749374, 36034845, 37186628, 38397832, 39548408, 40544668, 41350575, 42385694, 42625565, 42353301, 42177681, 41705290]
6941D1705290q46081j153006j277716j405781j482959j511916j251396j201420
6933C1575015j160671j125191q65202q35747m21288k93161j14238l17123k78644
6924B6163750k37109J093J32902o9067L7404K03624n0586K9150K17645L3528j29581
6913B6332753k92791l75248o00289j88500j64569m04691k49039J46678k6023j24239
6903B4054042K60535J29887J01172J71086J22054K27489K50207M2062J8801Q4096
6893B5461431Q688J9247k56921j81368k69470r986K4720J2202n8379q0301j71641
6882B4498222l3167j63702o6607K67242J49665N7867J58120K00718J3977k79623
6872B4802712j75895j64890k80752k30224m44297l38387m55174k19981k68548
$$ y = [41705290, 40859209, 39706203, 38428487, 37022706, 35539747, 34027831, 32776435, 31575015, 30414344, 29289153, 28423951, 27588204, 27166916, 26873755, 26759517, 26442394, 26163750, 25926641, 25927734, 26060636, 25991569, 26028973, 26232597, 26182011, 26211161, 26428806, 26462334, 26332753, 26039962, 25664714, 25064425, 24875925, 24711356, 24306665, 24057626, 24204304, 24178281, 24054042, 24314577, 24444464, 24545636, 24716722, 24838776, 25066265, 25316472, 25358534, 25377335, 25461431, 25470119, 25489366, 25232445, 25051077, 24781607, 24771621, 24796341, 24808543, 24750164, 24669863, 24498222, 24465055, 24301353, 24234746, 24501988, 24651653, 24709520, 24867640, 25068358, 25082335, 24802712, 24626817, 24461927, 24181175, 23950951, 23506654, 23168267, 22713093, 22493112, 22224564]
6863B2224564n5707L1830k23851K22703L59495n7037n6680J68554L8923j66516
6853B2486278L11046P3313j13362m7810J49037K23693K01993N94631M04118L04818
6843B4587755N83154P46285P77495J071164J043624J355686J529706J309241J497501
6834C4501611J608135J393073J500638J153242Q71838O75956J95717k20807l16745
6825D1362658r11054j367303j612497j627409j472789j684248j619781j655352
6817B9412225j259125j086513p96185r11954n88998o65175o18870n95546l28862
6808B2560997m39158m59155m14733m80988l65494k58209j68432j62921J3589j74493
6798A9651003N8103R686M24558j75520J70343K47442J21367L83703K23657J28125
$$ y = [22224564, 22168857, 22200687, 21976836, 22199539, 22559034, 22501997, 22445317, 22613871, 22652794, 22486278, 22797324, 22870637, 22757275, 22709465, 22858502, 23082195, 23284188, 23878819, 24282937, 24587755, 25170909, 25917194, 26694689, 27765853, 28809477, 30165163, 31694869, 33004110, 34501611, 36109746, 37502819, 39003457, 40156699, 41028537, 41704493, 41900210, 41679403, 41362658, 40451604, 39084301, 37471804, 35844395, 34371606, 32687358, 31067577, 29412225, 28153100, 27066587, 26270402, 25358448, 24769450, 24104275, 23485405, 22889859, 22560997, 22121839, 21662684, 21247951, 20766963, 20401469, 20143260, 19974828, 19811907, 19825496, 19651003, 19709106, 19718792, 20143350, 19967830, 20138173, 20385615, 20506982, 20890685, 21114342, 21242467]
6788B1242467L4078l7712j27937l4795j60235n31032n71550k57942l26659k55671
6778A8973012r6575j23789j77371R685L79404M755J15486L70343L17934M42251
6768B0215135L14456L77335M02883L09146N74919O87129N38891L76670P05009
6759B4501573N60936M88883M29934J050522J371452J422913J406227J863417J881337
6750C4977194K130215K454701K241262K262196J936414J993397J811129J609060
6742E1415568J054993Q03204j21440l89907q51449j512274j783804k186517k474739
6733D3953635k462101j967146j736641j474151j065987j009727j127440j141063
6725C1969379j070433q62032p14008j007984j417903j350519j136406j279822
$$ y = [21242467, 21276545, 21238833, 21110896, 21076101, 20915866, 20384834, 19813284, 19555342, 19228683, 18973012, 18876437, 18752648, 18575277, 18584962, 18964366, 18969121, 19084607, 19454950, 19772884, 20215135, 20529591, 20906926, 21309809, 21618955, 22193874, 22881003, 23419894, 23796564, 24501573, 25062509, 25551392, 25981326, 27031848, 28403300, 29826213, 31232440, 33095857, 34977194, 37107409, 39562110, 41803372, 44065568, 46001982, 47995379, 49806508, 51415568, 52470561, 53273765, 53152325, 52762418, 51910969, 50398695, 48614891, 46428374, 43953635, 41491534, 39524388, 37787747, 36313596, 35247609, 34237882, 33110442, 31969379, 30898946, 30036914, 29322906, 28314922, 26897019, 25546500, 24410094, 23130272]
6717B3130272r95842q00532o65184n11485m95143l46790k38627k44565J3482j13251
6707A8732335j09991j73857j61486j28837j66336k88725k24815m68207m75316
6698A6534765m16489l75241m84934l38747n29306p09719m34834k56211l36625
6689A2652659k53631j69982k69963p0497m71231l20737o5891k8752k852k09180
6679A0789943k18108j64819k51676j50887j46133k07281Q4978J3327k24170j53889
6669I371285q4502m34389j1054N6704j96465j15715p9239j28723L9929j90676
6659H227155j53249n4139K3366l2325j9171Q6061j07257K0748k7031J18620k42512
6648G840266r6575J6811k3126j42630j95976j392j08352k07607J3872M5108l3767
$$ y = [23130272, 22134430, 21333898, 20668714, 20157229, 19662086, 19315296, 19076669, 18832104, 18845586, 18732335, 18622344, 18448487, 18287001, 18158164, 17991828, 17703103, 17478288, 17010081, 16534765, 16118276, 15743035, 15258101, 14919354, 14390048, 13680329, 13245495, 12989284, 12652659, 12399028, 12229046, 11959083, 11888586, 11417355, 11096618, 11030727, 11001975, 10999123, 10789943, 10571835, 10407016, 10155340, 10004453, 9858320, 9651039, 9736017, 9749344, 9525174, 9371285, 9286783, 8852394, 8841340, 8898044, 8701579, 8585864, 8506625, 8377902, 8417831, 8227155, 8073906, 8019767, 8043133, 8010808, 7991637, 8077698, 7970441, 7991189, 7964158, 8082778, 7840266, 7743691, 7760502, 7737376, 7594746, 7398770, 7397378, 7289026, 7081419, 7095291, 7140399, 7106632]
6637G106632N1592N7456k60992j63257k3014J07600m5929p4943n5713J67239k45553
6626F621118k16763J26809j24978P9572j3319k0845l3037n3226o2263R7552K45280
6615F645900R0257K01589r8826k09343o8239q9321K01018k3759N7654j8678o4331
6604F623921q6663k15437L37762P5331j67763j18382K29653O5067O9835r3093
6594F720231j23296j57788J78267j33284j22412J24075p3719k3492m443j90017
6584F194122k4420M6081R9339j0249R2972J33835k64815j39078k18835J00167
6574F009119J13101r09R6799k11974K03358J29355k73495K39186k6780l7270q2898
6563F157592M6036R2346j44925M5037J31913j2149J44322P8388j75014j451J04140
$$ y = [7106632, 7158224, 7215680, 6954688, 6791431, 6768417, 6876017, 6830088, 6755145, 6699432, 6866671, 6621118, 6404355, 6531164, 6406186, 6485758, 6472439, 6451594, 6418557, 6365331, 6303068, 6400620, 6645900, 6736157, 6937746, 6838920, 6629577, 6561338, 6472017, 6673035, 6649276, 6706930, 6688252, 6623921, 6537258, 6321821, 6659583, 6734914, 6567151, 6448769, 6678422, 6743489, 6813324, 6720231, 6596935, 6439147, 6617414, 6484130, 6361718, 6485793, 6412074, 6388582, 6384139, 6194122, 6169702, 6215783, 6315122, 6304873, 6397845, 6531680, 6266865, 6127787, 5908952, 6009119, 6122220, 6121311, 6218110, 6006136, 6209494, 6338849, 6065354, 6304540, 6277760, 6240490, 6157592, 6203628, 6295974, 6151049, 6196086, 6327999, 6315850, 6460172, 6538560, 6363546, 6362095, 6466235]
6552F466235N3599j79449n9179K8086P2035J69409j92742J43691j9027j48274
6542F334384J71845o9452j49802J08688N3276Q6962L1319J35078j51661r6661
6532F453976J38295L4162j37730Q0265M5882M2245J05764M3180j641j30820O257
6521F679835M6723K11702o647J6299J5752k6790J87155J28311r5926N7290J15931
6510G329635m5034j577j17176j60103o5078J77825q792k6529N7372J43520J0874
6499G294937q7688k46401J27602K78843J18742P3187l5884N4131j05871o5885
6489G405713J29323J24439j61843J15778j62446r9986J40351R0400m988j5488
6479G561253J05920p1978j13617q4003K2531j71082K61693N2317j20472l2482
$$ y = [6466235, 6519834, 6340385, 6281206, 6309292, 6381327, 6550736, 6357994, 6501685, 6482658, 6334384, 6506229, 6436777, 6286975, 6395663, 6448939, 6535901, 6567220, 6702298, 6550637, 6453976, 6592271, 6626433, 6488703, 6568968, 6614850, 6657095, 6762859, 6806039, 6804398, 6673578, 6679835, 6726558, 6938260, 6931613, 6947912, 6963664, 6936874, 7124029, 7252340, 7156414, 7213704, 7329635, 7284601, 7283024, 7165848, 7005745, 6940667, 7118492, 7109700, 7083171, 7140543, 7284063, 7294937, 7207249, 6960848, 7088450, 7367293, 7486035, 7559222, 7523338, 7577469, 7471598, 7405713, 7535036, 7659475, 7497632, 7613410, 7450964, 7350978, 7491329, 7581729, 7576741, 7561253, 7667173, 7595195, 7481578, 7397575, 7420106, 7249024, 7510717, 7563034, 7442562, 7410080]
6469G410080K4438O2313J7548l9562j46579J58048J86456p5453j59276L7028L203
6458G478244m1443J28769J13465r4643J28798M0440l2077k580j19629Q3920j59737
6447G523527K77141J46435j15700N9147k3056j26565j10843J06883q2418N1333
6437G705884K10676J648k84857m8733J26621r7321P7632M31540J59319j62971
6427H119438o9733O9467j36286J19575N247M3871N0085j79067P4839q0597j49937
6416G866902L36456J15073k72959r558J27666J23360J18703k7040K13206K40166
6406H831975r2629j5071N8100j05287N810l5942J4957j5560J87871O8143Q3152
6395H985519J74954o9127J28878J6443j2597k05124N3969l0804j06934K39059
$$ y = [7410080, 7434518, 7496831, 7514379, 7474817, 7328238, 7486286, 7672742, 7597289, 7438013, 7475041, 7478244, 7436801, 7565570, 7679035, 7584392, 7713190, 7753630, 7721553, 7718973, 7599344, 7683264, 7523527, 7800668, 7947103, 7831403, 7890550, 7867494, 7740929, 7630086, 7736969, 7654551, 7705884, 7916560, 7918208, 7633351, 7584618, 7711239, 7613918, 7691550, 8123090, 8282409, 8119438, 8049705, 8119172, 7982886, 8102461, 8107708, 8151579, 8201664, 8022597, 8097436, 8016839, 7866902, 8203358, 8318431, 8045472, 8035914, 8163580, 8286940, 8405643, 8378603, 8591809, 8831975, 8739346, 8724275, 8782375, 8677088, 8682898, 8646956, 8661913, 8646353, 8834224, 8902367, 8985519, 9160473, 9091346, 9220224, 9236667, 9224070, 9018946, 9072915, 9042111, 8935177, 9174236]
6385I174236K39112J30058m2270K2793q5971J62943p3343R9054J75595L6849J41812
6374I980868K3436R2480q2053p025j1540J53496K69436O499j00631J33574N933
6363A0464473q032K00579P7531J85465p6443N331J38860J51482J36813K93084
6353A1569143j5414P2381P3270l7332L1438J46484J66647l9516K51863m710K79382
6342A2493636J39916j48766R1137L069K09121K88361n973q5612J17787J22717
6332A3225393K7477N6161P3339J04528q8460K74278L02117k5342J07315J42139
6322A4198945J25834L4445k2416j5264m8973K14406M5907m0465Q9911K37852J05357
6311A4925539l8968P0623j48098K45444J9349n2524M887Q1090P227j75745r7257
$$ y = [9174236, 9413348, 9543406, 9501136, 9523929, 9437958, 9600901, 9527558, 9626612, 9802207, 9839056, 9980868, 10004304, 10096784, 10014731, 10007706, 9996166, 10149662, 10419098, 10425597, 10324966, 10458540, 10464473, 10456441, 10657020, 10734551, 10920016, 10843573, 10848904, 10987764, 11139246, 11276059, 11569143, 11553729, 11626110, 11699380, 11662048, 11693486, 11839970, 12006617, 11967101, 12218964, 12214254, 12493636, 12633552, 12484786, 12575923, 12578992, 12788113, 13076474, 13070501, 12984889, 13102676, 13225393, 13252870, 13309031, 13382370, 13486898, 13398438, 13672716, 13974833, 13949491, 14056806, 14198945, 14324779, 14359224, 14336808, 14321544, 14272571, 14486977, 14532884, 14492419, 14582330, 14820182, 14925539, 14886571, 14957194, 14809096, 15054540, 15073889, 15021365, 15026252, 15107342, 15114569, 14938824, 14841567]
6300A4841567L8110m2129J0164J20444j70525o9105j80797K32372n575O736n801
6289A4775461k2552J48300j02108L210r5427L4764P748j61978Q1405j18143J35848
6278A4686528J37060k29019r0937p1948k69838K10118J96641j00526r7499m5309
6268A4325271l01197P3512N9710j72019M508j03870l2488L0033P2448L8279J0299
6257A4004486j54028j90256o6875K04099p8572L8782j27830j06160P1243k91046
6247A3303843j79373o7107O5628J38518N1341p9033K7832J11800O8048J060j64505
6236A3278052M6866m6651j6261K8281k9498l1333j42825J22276k08402n7123J94881
6225A3138263J20572r543r9382n5876j63980k11602J69657J08399j71359R1165
$$ y = [14841567, 14879677, 14837548, 14847712, 14968156, 14797631, 14728526, 14547729, 14780101, 14774526, 14781262, 14775461, 14752909, 14901209, 14799101, 14802311, 14706884, 14741648, 14749396, 14587418, 14668823, 14550680, 14686528, 14823588, 14594569, 14503632, 14431684, 14161846, 14371964, 14568605, 14468079, 14370580, 14325271, 14024074, 14097586, 14157296, 13985277, 13989785, 13885915, 13853427, 13883460, 13955908, 13994187, 14004486, 13850458, 13660202, 13593327, 13797426, 13718854, 13757636, 13629806, 13523646, 13594889, 13303843, 13124470, 13057363, 13122991, 13261509, 13312850, 13233817, 13261649, 13373449, 13441497, 13442557, 13278052, 13324918, 13278267, 13262006, 13290287, 13260789, 13229456, 13086631, 13208907, 13000505, 12943382, 13138263, 13258835, 13249292, 13149910, 13094034, 12930054, 12718452, 12888109, 12996508, 12825149, 12916314]
6215A2916314k11356J54492r279k02725J1780J56243J33225j03905M4683l7182
6205A2852290k30251R930k1984J9593J98730j38914J19422k00558r4450J23102
6195A2636910K16234J25518j57085L5636n7920j02846K37871M6065p9869P4538
6185A2975052j07588n0280R3978O339J3584J25066p3214j43696M0924k5512N7045
6174A2911698J57755M0104j07273r4970n3853N9931J59152j31623k00115K9204
6164A2770010Q4815j86872o4589J53742k5569k3494J78449K74564j39507k47948
6154A2773601n1882M5758J30461o14o8716j22776J44790J9153J26052j2097K05592
6143A3189322J6552l0760O21J38101p4669m4530P6155j20498K58550m3021n4631
$$ y = [12916314, 12704958, 12859450, 12850171, 12647446, 12659226, 12815469, 12948694, 12844789, 12889472, 12852290, 12622039, 12631969, 12609985, 12629578, 12828308, 12689394, 12808816, 12608258, 12513808, 12636910, 12853144, 12978662, 12821577, 12857213, 12799293, 12696447, 12934318, 12980383, 12900514, 12975052, 12867464, 12817184, 12911162, 12917501, 12931085, 13056151, 12982937, 12839241, 12880165, 12854653, 12911698, 13069453, 13109557, 13002284, 12907314, 12853461, 12913392, 13072544, 12940921, 12740806, 12770010, 12854825, 12667953, 12603364, 12757106, 12731537, 12708043, 12886492, 13161056, 13021549, 12773601, 12721719, 12767477, 12897938, 12897324, 12828608, 12705832, 12850622, 12869775, 12995827, 12983730, 13189322, 13205874, 13175114, 13175735, 13313836, 13239167, 13194637, 13270792, 13150294, 13408844, 13365823, 13311192]
6132A3311192J30078J48522M27067j09635K26145n7525j00300o6541K024o6322
6122A3844705Q4336J13642J93256O3561o2154K6290K27358P4683N6639j9211j7041
6111A4586064L0415n5076J00338j28870P012K41740J07740k0589l8576j9988P2685
6100A4882895M3024J47775N09K38391K9935j18447O0863K25041J11793K19937
6090A5841716R8898K07789J6145K15960K06238J88597K53912J21998P1361M20659
6080A7643273J60339J50167K98608K71743J92754O6630O1143m3409j53295R3409
6070A8741362K63714R6595j75613Q689J5131K24161J39929P8253p3430k50204
6060A9068587j55135j39041k17663L099j07315n9368J2080j74729j05539J41528
$$ y = [13311192, 13441270, 13589792, 14016859, 13907224, 14133369, 14075844, 13975544, 13909003, 13911027, 13844705, 13929041, 14042683, 14235939, 14299500, 14237346, 14263636, 14490994, 14565677, 14622316, 14603105, 14586064, 14616479, 14561403, 14661741, 14532871, 14539883, 14781623, 14889363, 14868774, 14830198, 14810210, 14882895, 14925919, 15073694, 15074203, 15312594, 15342529, 15224082, 15284945, 15509986, 15621779, 15841716, 15940614, 16148403, 16164548, 16380508, 16586746, 16775343, 17029255, 17151253, 17222614, 17643273, 17803612, 17953779, 18252387, 18524130, 18716884, 18783514, 18844657, 18801248, 18647953, 18741362, 19005076, 19101671, 18926058, 18934747, 18949878, 19174039, 19313968, 19392221, 19318791, 19068587, 18913452, 18774411, 18556748, 18559847, 18452532, 18393164, 18405244, 18230515, 18124976, 18266504]
6050A8266504k7376L2841L8392r057m129K30793m2215J55677R6029j70050J33051
6039A8700460J71881K07025j2461J52173K74359K10999K31128J40348L93908Q6560
6029B0556380J67202L13545K33628K30725L69939K69703k0379l20238n2506N7892
6019B1805891K9681J03908J03571P9495k13299J73676J86985O4216k43275j28415
6009B1962434k99521k78726k08219k36154O3369J61018j44838Q199J06647K04295
5999B1338504j78570J30713J13421p6508j19459J82242J34823q6164M9430K70585
5989B1759017J91180P505J93789P9032L5564M37701M0860J19151o1119O3259R6880
5978B2962819J40364O0819J61481J03202j7257K44069K59812K28561P373K24151
$$ y = [18266504, 18239128, 18271969, 18310361, 18301304, 18297175, 18527968, 18485753, 18641430, 18737459, 18567409, 18700460, 18872341, 19079366, 19066905, 19219078, 19493437, 19704436, 19935564, 20075912, 20469820, 20556380, 20723582, 21037127, 21270755, 21501480, 21871419, 22141122, 22120743, 21800505, 21747999, 21805891, 21835572, 21939480, 22043051, 22122546, 21909247, 22082923, 22269908, 22334124, 22090849, 21962434, 21662913, 21384187, 21175968, 20939814, 21003183, 21164201, 21019363, 21027562, 21134209, 21338504, 21159934, 21290647, 21404068, 21327560, 21208101, 21390343, 21525166, 21439002, 21488432, 21759017, 21950197, 21957702, 22151491, 22230523, 22266087, 22703788, 22744648, 22863799, 22802680, 22865939, 22962819, 23103183, 23164002, 23325483, 23428685, 23411428, 23655497, 23915309, 24143870, 24151243, 24375394]
5968B4375394p225J2994J89356K39738M44298P871K36655K04790L29549J63466
5958B6196886R7460M07043J96694M3347J90947L63463K71586J15879L00713N27089
5948B8711107O5678J32443J60327L79372M35495O4699N85126K70885J6994K30917
5938C1053043j41041J69861K57942K41390K99243J79331K03175J59400P9267L20596
5928C2822207K32753L91138L44553J86492M77923N72808J48776M10327P52010
5919C6338987O18441N33587O52695P90456Q39932Q35659Q52628R40822R68761
5910D3371968Q59862N90584P37230O69157N18162N70241L59764L09049J96811
5901D8182828J87316l7074j97937o4928M7556k69742k38622j93293m4107k53082
$$ y = [24375394, 24368169, 24381163, 24570519, 24810257, 25254555, 25262426, 25499081, 25703871, 26033420, 26196886, 26294346, 26701389, 26898083, 26941430, 27132377, 27495840, 27767426, 27883305, 28184018, 28711107, 28776785, 28909228, 29069555, 29448927, 29884422, 29949121, 30534247, 30805132, 30822126, 31053043, 30912002, 31081863, 31339805, 31581195, 31880438, 32059769, 32262944, 32422344, 32501611, 32822207, 33054960, 33446098, 33790651, 33977143, 34455066, 35027874, 35176650, 35586977, 36338987, 36957428, 37491015, 38143710, 38934166, 39774098, 40609757, 41462385, 42403207, 43371968, 44231830, 44822414, 45559644, 46228801, 46746963, 47317204, 47676968, 47986017, 48182828, 48370144, 48333070, 48135133, 48070205, 48117761, 47848019, 47609397, 47416104, 47371997, 47118915]
5891D7118915j19854k55800l62285j97949l29670n07626k91816o78499m35964
5882D3939452m43432o63049r37645j014962r01999r56043r02169j371154j137525
5873C5611474j012377o25111j058873p92763m26605m92603n16273l63155m83082
5864B9840632o73226l65033q2304l2330l99457j77515j68319p2281k23759j886
5854B7644522L2909j90963j66242P5842L5160p6756k26665o4773k3383K0508j6841
5843B7043318p959K19654J8280j256r2556p5573J7800K31151k4706o3541O3664
$$ y = [47118915, 46999061, 46743261, 46380976, 46183027, 45853357, 45345731, 45053915, 44375416, 43939452, 43496020, 42832971, 41895326, 40880364, 39978365, 39022322, 38120153, 36748999, 35611474, 34599097, 33973986, 32915113, 32122350, 31695745, 31203142, 30686869, 30323714, 29840632, 29167406, 28802373, 28720069, 28687739, 28288282, 28110767, 27942448, 27870167, 27646408, 27644522, 27677431, 27486468, 27320226, 27396068, 27431228, 27354472, 27127807, 27063034, 27039651, 27060159, 27043318, 27035359, 27255013, 27273293, 27272037, 27179481, 27103908, 27121708, 27352859, 27328153, 27264612, 27328276]
$$ [...]
##END NTUPLES=NMR SPECTRUM
##END=
