##TITLE=1H_TG-2327-x
 DMSO, 8 sc, 
 2.06.2021
##JCAMPDX= 6.0         $$ Bruker NMR JCAMP-DX V2.0
##DATA TYPE= NMR SPECTRUM
##DATA CLASS= NTUPLES
##ORIGIN= UXNMR, Bruker Analytische Messtechnik GmbH
##OWNER= root
$$ XWIN-NMR		Version 3.5
$$ Wed Jun  2 11:04:42 2021 Russian Standard Time (UT+4h)  she@DPX200
##.OBSERVE FREQUENCY= 200.131506
##.OBSERVE NUCLEUS= ^1H
##.ACQUISITION MODE= SIMULTANEOUS
##.ACQUISITION SCHEME= undefined
##.AVERAGES= 8
##.DIGITISER RES= 18
##SPECTROMETER/DATA SYSTEM= spect
##.PULSE SEQUENCE= zg30
##.SOLVENT NAME= CDCl3
##.SHIFT REFERENCE= (INTERNAL, CDCl3, 0, 15.9968)
##AUDIT TRAIL= $$ (NUMBER, WHEN, WHO, WHERE, WHAT)
$$ ##TITLE= Audit trail, XWIN-NMR		Version 3.5
$$ ##JCAMPDX= 5.01
$$ ##ORIGIN= Bruker BioSpin GmbH
$$ ##OWNER= she
$$ F:/spectra/data/she/nmr/H-F/1/pdata/1/auditp.txt
$$ ##AUDIT TRAIL=  $$ (NUMBER, WHEN, WHO, WHERE, WHAT)
(   1,<2021-06-02 11:03:22.39 +0400>,<she>,<DPX200>,
      <created by zg, POWCHK disabled, PULCHK disabled
       configuration hash MD5:
       00 E9 B6 7A A2 85 ED C7 34 08 36 98 17 FE 4E 26
       data hash MD5: 16K
       A6 D0 E9 F7 D9 05 5E 64 C2 84 C4 33 82 F3 0C 0A>)
(   2,<2021-06-02 11:03:24.62 +0400>,<she>,<DPX200>,
      <Start of raw data processing
       efp BC_mod = 2 LB = 0.24 FT_mod = 6 PKNL = 1 PHC0 = -11479.8 PHC1 = 8.00099 SI = 16K 
       data hash MD5: 16K
       BA C4 39 F0 39 07 45 04 2C 1F FC BB 5E 4B A2 7B>)
(   3,<2021-06-02 11:03:44.42 +0400>,<she>,<DPX200>,
      <pk PHC0 = -5.019118 PHC1 = 4.799999 
       data hash MD5: 16K
       B7 6F 94 5B 51 F8 A1 C5 EA AA 59 E0 0E 95 70 12>)
(   4,<2021-06-02 11:03:47.60 +0400>,<she>,<DPX200>,
      <abs ABSG = 5 
       data hash MD5: 16K
       8B 20 BA 27 78 63 2F A2 95 2B 39 59 A3 CB B5 02>)
$$ ##END=
$$ 
$$ hash MD5
$$ 52 BD 95 45 03 B3 4A 9A 37 B9 EA 3E BB 40 04 1D
##$RELAX= 
##$RELAX= 
##$RELAX= 
##$RELAX= 
##$RELAX= 
##$RELAX= 
$$ Bruker specific parameters
$$ --------------------------
##$DU= <F:/spectra>
##$EXPNO= 1
##$NAME= <H-F>
##$PROCNO= 1
##$TYPE= <nmr>
##$USER= <she>
##$AMP= (0..31)
100 100 100 100 100 100 100 100 100 100 100 100 100 100 100 100 100 100 
100 100 100 100 100 100 100 100 100 100 100 100 100 100 
##$AQSEQ= 0
##$AQ_mod= 1
##$AUNM= <au_zg>
##$AUTOPOS= <>
##$BF1= 200.13
##$BF2= 200.13
##$BF3= 200.13
##$BF4= 200.13
##$BF5= 200.13
##$BF6= 200.13
##$BF7= 200.13
##$BF8= 200.13
##$BYTORDA= 1
##$CFDGTYP= 0
##$CFRGTYP= 5
##$CHEMSTR= <none>
##$CNST= (0..31)
1 1 145 1 1 1 1 1 1 1 1 1 1 1 1 1 1 1 1 1 1 1 1 1 1 1 1 1 1 1 1 1 
##$CPDPRG= <>
##$CPDPRG1= <>
##$CPDPRG2= <>
##$CPDPRG3= <>
##$CPDPRG4= <mlev>
##$CPDPRG5= <mlev>
##$CPDPRG6= <mlev>
##$CPDPRG7= <mlev>
##$CPDPRG8= <mlev>
##$CPDPRGB= <>
##$CPDPRGT= <>
##$D= (0..31)
0 1.2 0 0 0 0 0 0 0 0.06 0 0.03 0 0 0 0 0.0002 0 0 0 0 0 0 0 0 0 0 0 0 
0 0 0 
##$DATE= 1622617401
##$DBL= (0..7)
120 120 120 120 120 120 120 120 
##$DBP= (0..7)
150 150 150 150 150 150 150 150 
##$DBP07= 0
##$DBPNAM0= <>
##$DBPNAM1= <>
##$DBPNAM2= <>
##$DBPNAM3= <>
##$DBPNAM4= <>
$$ [...]
##$SUBNAM3= <"">
##$SUBNAM4= <"">
##$SUBNAM5= <"">
##$SUBNAM6= <"">
##$SUBNAM7= <"">
##$SUBNAM8= <"">
##$SUBNAM9= <"">
##$SW= 16.9725357007746
##$SWIBOX= (0..15)
0 0 2 0 0 0 0 0 0 0 0 0 0 0 0 0 
##$SW_h= 3396.73913043478
##$TD= 16384
##$TD0= 1
##$TE= 0
##$TE2= 300
##$TE3= 300
##$TEG= 300
##$TL= (0..7)
0 120 120 120 120 120 120 120 
##$TP= (0..7)
150 150 150 150 150 150 150 150 
##$TP07= 0
##$TPNAME0= <>
##$TPNAME1= <>
##$TPNAME2= <>
##$TPNAME3= <>
##$TPNAME4= <>
##$TPNAME5= <>
##$TPNAME6= <>
##$TPNAME7= <>
##$TPOAL= (0..7)
0.5 0.5 0.5 0.5 0.5 0.5 0.5 0.5 
##$TPOFFS= (0..7)
0 0 0 0 0 0 0 0 
##$TUNHIN= 0
##$TUNHOUT= 0
##$TUNXOUT= 0
##$USERA1= <user>
##$USERA2= <user>
##$USERA3= <user>
##$USERA4= <user>
##$USERA5= <user>
##$V9= 5
##$VALIST= <valist>
##$VCLIST= <CCCCCCCCCCCCCCC>
##$VD= 0
##$VDLIST= <DDDDDDDDDDDDDDD>
##$VPLIST= <PPPPPPPPPPPPPPP>
##$VTLIST= <TTTTTTTTTTTTTTT>
##$WBST= 1024
##$WBSW= 4
##$XGAIN= (0..3)
0 0 0 0 
##$XL= 0
##$YL= 0
##$YMAX_a= 95820
##$YMIN_a= -74700
##$ZGOPTNS= <>
##$ZL1= 120
##$ZL2= 120
##$ZL3= 120
##$ZL4= 120
##$ABSF1= 15.99371
##$ABSF2= -0.9789543
##$ABSG= 5
##$ABSL= 3
##$ALPHA= 0
##$AQORDER= 0
##$ASSFAC= 0
##$ASSFACI= 0
##$ASSFACX= 0
##$ASSWID= 0
##$AUNMP= <proc_1d>
##$AZFE= 0.1
##$AZFW= 0.1
##$BCFW= 0
##$BC_mod= 2
##$BYTORDP= 0
##$COROFFS= 0
##$CY= -3
##$DATMOD= 1
##$DC= 0
##$DFILT= <>
##$DTYPP= 0
##$F1P= 0
##$F2P= 0
##$FCOR= 1
##$FTSIZE= 16384
##$FT_mod= 6
##$GAMMA= 0
##$GB= 0
##$INTBC= 1
##$INTSCL= 1.334414e-10
##$ISEN= 128
##$LB= 0.24
##$LEV0= 0
##$LPBIN= 0
##$MAXI= 10000
##$MC2= 0
##$MEAN= 0
##$ME_mod= 0
##$MI= 1.114404
##$NCOEF= 0
##$NC_proc= -9
##$NLEV= 6
##$NOISF1= 3.799351
##$NOISF2= 2.8
##$NSP= 0
##$NTH_PI= 0
##$NZP= 0
##$OFFSET= 15.99682
##$PC= 1
##$PHC0= -11484.82
##$PHC1= 12.80099
##$PH_mod= 1
##$PKNL= yes
##$PPARMOD= 0
##$PSCAL= 0
##$PSIGN= 0
##$REVERSE= no
##$SF= 200.130002926836
##$SI= 16384
##$SIGF1= 3
##$SIGF2= 2
##$SINO= 5.538805
##$SIOLD= 16384
##$SREGLST= <1H.CDCl3>
##$SSB= 0
##$STSI= 16384
##$STSR= 0
##$SW_p= 3396.73913043479
##$SYMM= 0
##$S_DEV= 0
##$TDeff= 16384
##$TDoff= 0
##$TI= <>
##$TILT= no
##$TM1= 0
##$TM2= 0
##$TOPLEV= 0
##$USERP1= <user>
##$USERP2= <user>
##$USERP3= <user>
##$USERP4= <user>
##$USERP5= <user>
##$WDW= 1
##$XDIM= 16384
##$YMAX_p= 382909964
##$YMIN_p= -4015865
$$ End of Bruker specific parameters
$$ ---------------------------------
##NTUPLES= NMR SPECTRUM
##VAR_NAME=  FREQUENCY,     SPECTRUM/REAL,   SPECTRUM/IMAG
##SYMBOL=    X,             R,               I
##VAR_TYPE=  INDEPENDENT,   DEPENDENT,       DEPENDENT
##VAR_FORM=  AFFN,          ASDF,            ASDF
##VAR_DIM=   16384,         16384,           16384
##UNITS=     HZ,            ARBITRARY UNITS, ARBITRARY UNITS
##FACTOR=    0.207333158178282, 1,           1
##FIRST=     3201.44372344437, 0,            0
##LAST=      -195.295406990422, 0,           0
##MIN=       -195.295406990422, -4015865,    0
##MAX=       3201.44372344437, 382909964,    0
$$ Real data points
##PAGE= N=1
##DATA TABLE= (X++(R..R)), XYDATA
$$ [...]
8220 13932093 14134409 13985582 13756067 13674811 13735606 13147340 13063245 13664597 13587659 13573420
8210 13573420 14681702 15401184 16086813 16958164 17445429 18300846 18701765 18693967 18140203 18456670
8200 18456670 18179250 18554669 18699384 19441762 18672519 18066313 18371087 20949040 23237239
8191 23237239 20595962 20956739 21283606 22353603 23852820 23369485 23461763 24027284 24495935
8182 24495935 25477470 25507982 26451023 27381524 27629444 28947759 30218763 31562530 32772542
8173 32772542 33842676 35631407 36390775 37215370 37722825 38761751 40021250 40767377 41039402
8164 41039402 42732619 43900173 44647141 45952466 46213823 46845993 46207937 46878907 46457703
8155 46457703 45047149 43702916 42038622 41539491 41859450 41658450 41252216 41141912 41361849
8146 41361849 41177318 40941252 41273343 41741832 41666209 42333919 44238824 44717208 45816695
8137 45816695 47851099 49168461 50035237 52050656 53465915 54989244 57391564 58390341
8129 58390341 59256510 60956360 63366349 65204059 66679157 67492030 67427187 65551270 64146284
8120 64146284 62666657 59820008 57114751 54777078 52322147 50906611 48974576 46677495
8112 46677495 45034435 43595749 42083618 40909050 38968984 37973227 38065038 37288005 36369718
8103 36369718 36914669 37293949 37756723 37878698 37095964 37714619 37956950 38368909 38901464
8094 38901464 39220078 40172461 41426779 42099761 42880240 43630313 43565183 43825901 44469518
8085 44469518 44021165 43192208 42149216 41514220 39025158 36906673 34100054 31283215 30137632
8076 30137632 29477072 27715413 26546109 25951731 24201714 23112877 23170327 21925419 20909992
8067 20909992 20223362 19495491 19517580 19103765 18621060 18151393 18337821 17674757 17803077 18269567
8057 18269567 18126639 17849642 17325696 16658014 16010178 15280285 15255999 14616597 13446668
8048 13446668 13212094 13440580 13717044 13786002 13751180 13980787 14336071 13965340 13712791 13379604
8038 13379604 12712131 12156712 12548988 12702925 12031428 11967337 12561417 12820658 12578673 12955152
8028 12955152 12744960 12379665 12864265 13480995 13868226 12860136 12790971 13157525 14018862
8019 14018862 15052399 14285075 14361686 15076812 14295030 14511594 15147550 15541052 15104987
8010 15104987 15883989 17725221 18470819 18754075 20212480 21379660 22173310 22429991 23753983
8001 23753983 25169783 24924566 25747663 26371789 27319428 27097073 27324194 27786801 27352687
7992 27352687 25463430 24777505 24556716 23837773 22305024 21702028 21397988 20887125 20429455
7983 20429455 19865438 19237680 18313818 17972361 17780549 18994922 19332322 20069623 21652851
7974 21652851 22176166 22673219 22748643 23176360 23772017 24648192 25123602 25663172 25822953 26163663
7964 26163663 27196579 28659463 29032961 29593528 30297019 30009426 28550781 26816602 25452359
7955 25452359 23645950 22210236 20774715 19050614 18670045 18510913 17823111 17323434 16822936
7946 16822936 17384259 16697345 15570362 15037082 15827746 15344296 14136639 14610569 14936182
7937 14936182 14846524 15710148 15303891 15182195 15153461 15180399 14982192 15204021 16579145 15521660
7927 15521660 15154966 16018596 15337110 14745024 14536639 14433289 13137586 11474090 10918268
7918 10918268 10751448 10617739 10428918 9644578 9340848 9252776 9101531 8891330 8029520 8723643
7908 8723643 8425986 7727388 7642862 6939701 6225713 6339387 5647463 6724514 6985191 6613641
7898 6613641 6422200 5969046 6157160 5311604 5197293 5305059 5701222 5480759 5141788 5527370
7888 5527370 4689633 4247801 4132475 4134610 4208298 3650420 3606623 3512056 3644455 3821022
7878 3821022 3425347 2781810 3221889 2625551 2482895 2580168 2103601 1719358 1962629 1231651
7868 1231651 2011249 2406186 2584871 2240136 1900800 3100340 3660106 4241031 3152886
7859 3152886 2434596 1846426 1187182 889066 1036899 1001899 324386 606478 1117321 508805
7849 508805 -98547 425776 1305161 1234874 436580 -347116 107306 -92992 107024 287495
7839 287495 708499 788185 305440 -948159 -1170465 -96336 -33971 -203036 -540525 249656
7829 249656 963977 92844 311956 750989 528073 10246 388916 705427 -655763 -974684
7819 -974684 -469376 -821132 -705085 127737 -668484 -1259494 -765537 -203127 -123810 331558
7809 331558 352743 376461 -97256 -358024 71836 -156832 -627740 -1014074 -1819396 -1723864
7799 -1723864 -1883588 -1698539 -1470145 -413279 -230344 -901352 -488202 -1556936 -715188
7790 -715188 -678149 -570646 -70482 -860280 -1835045 -1439597 -1522305 -1766752 -1555346 -1437505
7780 -1437505 -1504414 -1094502 -1214468 -1475292 -177086 -158490 -1393030 -1362519 7971 195352
7770 195352 -672609 -1205344 -978012 -1377201 -1754242 -1590325 -1979713 -2240527 -1343974 -989409
7760 -989409 -694384 -601411 -847461 -927948 -549777 299909 911994 -142225 -424435 -642944
7750 -642944 -1168052 -1633728 -2120627 -2182796 -1345527 -628356 -626597 -1364200 -1410484 -1152584
7740 -1152584 -872406 -597752 -382133 -1459580 -1173332 -1197075 -1071373 -305116 -505813 -1723533
7730 -1723533 -2390052 -1910552 -2045158 -1855945 -648472 -249433 -847582 -903389 -820832 -1497826
7720 -1497826 -1219883 -1236711 -1748045 -1446931 -1907570 -1626811 -1593357 -2294626 -2524611 -1032294
7710 -1032294 -917287 -1404788 -1129916 -501018 -1238182 -463310 -370081 -126646 -1308312 -1727732
7700 -1727732 -2295155 -3095351 -2927835 -2744157 -2386116 -1390626 -1922391 -1589736 -981826 -383406
7690 -383406 -1063361 -1356081 -1229805 -2164200 -2132779 -2241273 -1355775 -1883489 -2335933 -2249224
7680 -2249224 -2242284 -1853403 -1931961 -2501782 -1487856 -1328511 -1396126 -1091617 -1250875 -1893242
7670 -1893242 -2089267 -2407668 -2791670 -2805223 -2666038 -2697160 -2659504 -2001412 -1682082 -1240948
7660 -1240948 -541923 -421930 -1240959 -1332601 -361632 -729795 -1363524 -1661085 -2402759 -2469845
7650 -2469845 -2027183 -1359760 -1751632 -1500575 -1520606 -1942670 -2400536 -2029322 -1746556 -747605
7640 -747605 -716925 -630900 -1115966 -810272 -801010 -904284 -983523 -2146126 -1206397 -1035159
7630 -1035159 -1741839 -2296025 -1780523 -1971423 -2415564 -2618141 -2940096 -3878946 -2742626
7621 -2742626 -2895451 -2894308 -2430348 -2204016 -2047176 -1744266 -1616551 -2465741 -2044265 -2298129
7611 -2298129 -3239107 -2160373 -1821540 -1537972 -1589938 -1824612 -1971209 -1872836 -1998769 -2144655
7601 -2144655 -2982524 -2990884 -2629848 -3011530 -2952937 -2839133 -3025680 -2313152 -1671564 -1236430
7591 -1236430 -2174347 -1815255 -1340822 -1032824 -1474301 -1358871 -1171836 -1527435 -1530495 -1978158
7581 -1978158 -1641395 -2017758 -2061214 -1721848 -1710817 -1567102 -600867 -1475493 -2437356 -2060345
7571 -2060345 -2284196 -2773616 -2552491 -2264870 -2778329 -2525770 -2327518 -2098830 -1066573
7562 -1066573 -602780 -592576 -1221994 -398928 -1188364 -2093193 -1611220 -1699642 -2511333 -2630731
7552 -2630731 -2223519 -2519926 -2134649 -1610460 -1488682 -1641266 -1716357 -2305408 -2602359 -2217672
7542 -2217672 -2187644 -2052397 -1661789 -1561373 -1328875 -678383 -575693 -561555 -1717906 -2029688
7532 -2029688 -1428888 -1264818 -1059052 -1845249 -1969431 -2651443 -2989871 -2062961 -1719621 -2234263
7522 -2234263 -2295433 -2274582 -1831244 -1958062 -1952162 -1567253 -2718039 -2552332 -2348477 -1839522
7512 -1839522 -1543350 -1122923 -1909409 -1518150 -1142838 -1849553 -2546089 -2232604 -2103656 -2270556
7502 -2270556 -1960650 -1743863 -2431974 -2195120 -1786148 -1351182 -1457211 -1362186 -1837505 -1763823
7492 -1763823 -1793946 -1942337 -2003380 -2333073 -2568859 -1966242 -1677485 -2209965 -1687727 -1548617
7482 -1548617 -2018628 -2289881 -1295899 -2116258 -2543406 -1820591 -1890756 -1574369 -1377533 -1500177
7472 -1500177 -1388967 -1176645 -1932050 -1848671 -1897679 -2834152 -2858501 -2693484 -2053506 -2006738
7462 -2006738 -2604909 -2535115 -1813089 -2148977 -1524813 -1602365 -2185158 -2695720 -3742782 -4015865
7452 -4015865 -3130518 -2371810 -2417056 -2258764 -2001892 -1712360 -2125941 -1891359 -2254200 -2627523
7442 -2627523 -2075789 -1909011 -2538919 -2120748 -1684113 -1694663 -1465547 -1799590 -2353573 -2641036
7432 -2641036 -1615278 -1153309 -371020 -804934 -1498672 -1511074 -1886757 -2136132 -1546158 -1970063
7422 -1970063 -2547140 -2728309 -3011570 -3448158 -2858879 -2640907 -2124021 -2045920 -2570985 -2512294
7412 -2512294 -2535916 -1732875 -912333 -2064350 -1396177 -1422186 -1922223 -1543118 -1283317 -1513165
7402 -1513165 -1560357 -2410157 -2850828 -2509449 -3165809 -3669418 -2943431 -2469254 -1725586 -1886784
7392 -1886784 -1536721 -1403071 -887943 -1422909 -2056861 -2033341 -2093951 -1868663 -2271351 -2312389
7382 -2312389 -3133045 -2591506 -2425209 -2054636 -1272167 -668755 -650375 -1202183 -1952294 -1588843
7372 -1588843 -1995108 -1835800 -1739356 -793501 -1489595 -1757083 -1330207 -2062004 -3180154 -2901224
7362 -2901224 -2798501 -2800876 -2181903 -2767721 -1945892 -1339169 -1682296 -1064037 -965071 -1524388
7352 -1524388 -773078 -1063174 -1096040 -1403640 -1414924 -1455227 -2278093 -1698397 -2321810 -2088118
7342 -2088118 -1749525 -2206786 -2242207 -1287146 -395776 -761221 -1657728 -1933594 -1508273 -1545047
7332 -1545047 -1307300 -956815 -1311849 -1869065 -2831459 -3058683 -3446049 -3132908 -2552304 -2080689
7322 -2080689 -1611923 -1347490 -1044796 -910324 -1439008 -1707919 -1740192 -1435955 -1580814 -2180110
7312 -2180110 -2534639 -3259307 -3631079 -2975667 -1872838 -2014398 -1442469 -1340123 -1961231
7303 -1961231 -1722753 -1264831 -1102519 -588001 -1046034 -1696443 -1582516 -1849514 -1987511 -2281260
7293 -2281260 -2349597 -2199731 -2349171 -2523366 -2490989 -2437986 -2282618 -2490877 -2240305 -1474668
7283 -1474668 -835165 -358651 -714758 -1251517 -1193209 -1667740 -2360833 -2216784 -1425453 -1370883
7273 -1370883 -2242337 -1977288 -1559354 -1532073 -1662928 -1843185 -1743171 -1820667 -1875063 -1090147
7263 -1090147 -1166365 -711724 -315770 -1107733 -1996382 -1960582 -1887187 -2415524 -1648173 -1434096
7253 -1434096 -2340909 -1912923 -1552423 -1687986 -1129586 -850350 -595106 -196653 -734345 -1041043
7243 -1041043 -1335876 -1974585 -2275018 -2454704 -2858700 -2304949 -1060500 -1279222 -1616981
7234 -1616981 -2122667 -1758168 -1193231 -901292 -355298 -895132 -1404643 -1410829 -1286811 -1312988
7224 -1312988 -1815017 -2205466 -2148002 -2345548 -2106445 -2086095 -1767521 -1515682 -2033498 -2184020
7214 -2184020 -1845259 -930576 -882992 -885452 -1173164 -1526213 -1384413 -1824677 -1965675 -1296968
7204 -1296968 -876350 -1200494 -1984941 -1403755 -1373472 -1979148 -1270557 -986071 -701348 -708622
7194 -708622 -958413 -1222273 -1017785 -999823 -924629 -124247 315055 -579699 -975140 -236389
7184 -236389 -843865 -1314494 -1088222 -1948161 -2039524 -1326875 -785027 -752130 -813320 -533447
7174 -533447 -1058941 -894898 -1200497 -1747343 -1697970 -1395306 -1639279 -1716962 -1964795 -1808604
7164 -1808604 -2403544 -2256330 -1251385 -1518668 -1793180 -1779831 -1648253 -1278450 -1252717 -1702967
7154 -1702967 -1047708 -842839 -1219403 -1777332 -1490106 -1460772 -1293302 -1477973 -2068638 -2282358
7144 -2282358 -1592972 -1425998 -1509010 -1444106 -1106953 -1218000 -1114540 -945773 -790741 -1001868
7134 -1001868 -932397 -1280417 -1740923 -2297041 -2529421 -2178949 -2470144 -1776407 -1458097 -1448965
7124 -1448965 -770574 -814145 -1122413 -354419 -536451 -1163144 -754974 -1593751 -2396013 -992347
7114 -992347 -283648 -1551960 -1742340 -1401074 -1720013 -1685059 -1964519 -1762647 -1429787 -1367968
7104 -1367968 -1462408 -979334 -844819 -1134522 -1070206 -249536 -746313 -1770187 -1920470 -2474095
7094 -2474095 -2992660 -2500861 -2548273 -1875529 -909214 -343496 -315857 -476676 -1132839 -705407
7084 -705407 -793080 -1572373 -1777033 -1841799 -1145426 -1198331 -1055479 -1519922 -1556636 -1396445
7074 -1396445 -1683996 -1640277 -1983729 -1900904 -1371259 -1704070 -1592975 -1007751 -892020 -690008
7064 -690008 -291188 -603196 -262408 -479607 -1184298 -1168791 -1103398 -1103848 -1529118 -1470747 -1171452
7053 -1171452 -1286341 -1157263 -1916899 -2088806 -1493554 -982511 -743294 -1598692 -1921940 -2007102
7043 -2007102 -1014449 -606984 -900450 -1061621 -767425 -1074347 -1335783 -1216463 -1257405 -1750781
7033 -1750781 -2568915 -1890515 -1082346 -1136620 -1214830 -1492969 -1154434 -813373 -977164 -865389
7023 -865389 -929868 -1694048 -2130380 -1463543 -1897560 -2161675 -2530970 -2807713 -2004571 -1505552
7013 -1505552 -1858183 -1914363 -1589181 -1428205 -1180554 -1372572 -671928 -204936 -517495 -1050583
7003 -1050583 -1256600 -1938192 -1782409 -1840804 -2082252 -1954753 -1752021 -1338398 -1582045 -1330562
6993 -1330562 -1508648 -1032102 -606505 -1233578 -1232876 -1162248 -484106 -102199 -775631 -1230519
6983 -1230519 -894813 -1270586 -1517570 -1022170 -1342202 -1686070 -1319575 -1516867 -2431367 -1414767
6973 -1414767 -858786 -1327074 -1261011 -502843 -833039 -1073349 -283044 -549064 -281729 -248394
6963 -248394 -1856038 -1903946 -1199896 -906664 -1869706 -1849528 -928952 -623499 -185433 477388
6953 477388 -425795 -560436 142925 -974904 -1282767 -1852677 -2419839 -2373131 -1596720 -1394194
6943 -1394194 -1143957 -372274 -804196 -1341344 -1515861 -978559 -672013 -1135543 -846173 -629975
6933 -629975 -113251 -258333 -857152 -967803 -1136488 -989515 -986759 -781596 -1491238 -1202795
6923 -1202795 68958 904357 289933 285890 -169211 -577187 -169033 -906104 -1273366 -258675
6913 -258675 -1032630 -1780565 -954798 -1047351 -1161142 -453975 -430405 -180114 -643119 -57296
6903 -57296 -107576 -907258 -191381 -185562 -465103 -59552 -308966 -1400312 -737978 -1230602
6893 -1230602 -1626426 -1433027 -944283 -729555 -1392830 -1407210 -1002347 -975856 -817215 -825520
6883 -825520 -644088 -609375 -638063 -1545985 -1772294 -1823867 -2144378 -2048809 -1855211 -1209588
6873 -1209588 -1405984 -1590429 -1482416 -868399 71814 5121 -838742 -341835 -417094 -535964
6863 -535964 -161027 -807669 -851073 -997425 -676463 -736097 -592490 -1121076 -1248559 -875709
6853 -875709 -286334 -250972 150072 102698 -384262 -560778 -1088910 -1116090 -1118036 -1547648 -1723066
6842 -1723066 -1596416 -1395297 -2067374 -2080974 -1017359 -1254605 -759666 -429615 -284461 -468430
6832 -468430 -1025346 -982432 -1799075 -1590501 -521509 -427724 -427333 -1326219 -845344 -570661
6822 -570661 -1439113 -698530 -313493 -346054 -736480 -1153957 -1118526 -392178 -844260 -1614513
6812 -1614513 -1199978 -439907 -654681 -552813 -682634 -1148739 -797952 -100546 751750 1427677
6802 1427677 804454 -115357 51445 15664 -94321 -559918 -523894 -1657496 -2087678 -1538796
6792 -1538796 -1454175 -1650089 -1748456 -1400948 -1585798 -1258104 -834564 -339658 -162543 -901747
6782 -901747 -251999 1072711 259709 -913672 -681882 -1994574 -1527275 -1352848 -1763678
6773 -1763678 -888753 -943190 -911533 -428677 357495 532543 214646 434479 -206966 -594502
6763 -594502 -1013016 -1211637 -495980 -1014141 -1860007 -2071070 -1636740 -1518257 -655043 241553
6753 241553 -919531 -787664 -354122 -1293574 -506383 298471 -1052417 -617046 -310807
6744 -310807 -1447991 -1585022 -757082 -798834 -939747 -927374 -690645 -432936 -385587 35927
6734 35927 -126270 9392 585912 432453 153089 165783 26098 -350835 -804389 -1371252
6724 -1371252 -1766261 -323521 82460 -91426 -28197 -82964 -761218 -996412 -983448 -807455
6714 -807455 -981981 -323429 -229329 -1126041 -1503308 -946653 -1238155 -1492861 -786353 -1218095
6704 -1218095 -1471755 -575747 372394 743219 -2666 83115 641997 460192 -142269 -176379
6694 -176379 -402523 -1094765 -1104074 -930794 -1066047 -515529 32146 -1174857 -1080594 -1033331
6684 -1033331 -217035 -678671 388672 1013514 228713 42481 -366444 -313231 383018 73268
6674 73268 -143194 -267582 -98481 -287395 -385164 305853 212485 413935 339029 120002
6664 120002 -125917 -605012 -829243 -605498 -187725 248977 -3787 -364613 214199 324472
6654 324472 481088 975647 1123271 1039520 -384245 -1319599 -792022 464943 332544 723441
6644 723441 253076 -729475 -307343 -630648 -695369 507041 341296 -355565 435926 703259
6634 703259 579415 1191002 1197023 688624 -14122 -255404 -390625 -686458 -819362 -80905
6624 -80905 302228 728286 1143686 1204451 1359438 1619936 1613141 1519614 1568679 1396691 1197228
6613 1197228 900917 1007603 834925 518977 506086 221040 -136364 486053 927554 1272918
6603 1272918 1961356 2036370 2166665 2860549 3282169 2755037 2167433 2021885 2155678 1793362
6593 1793362 295221 402531 762830 1523326 1275090 1345459 2781298 2694013 2232226 1859044
6583 1859044 1722595 2534344 3116050 2143168 3052276 3998830 3486475 3382787 3328218 4064262
6573 4064262 3888353 4356050 4381738 4195925 6021208 6846170 6806991 6590681 6630841 6375460
6563 6375460 6459070 6285752 6315901 6106612 7287249 7317144 6506813 7715208 9112127 8722426
6553 8722426 8432556 8682439 8526752 9021854 9697271 8932155 8582690 9738699 10354691
6544 10354691 10509139 11301246 12471339 11556288 11759781 12061467 12527423 12912677 14436711
6535 14436711 15487755 16254227 18096960 19541019 20687555 21454550 22930527 24594654
6527 24594654 27310501 30022936 33716475 36826256 40774717 44912366 48172089 51088028
6519 51088028 53593939 53336693 51635828 49005799 44589790 39657508 34635191 29874661
6511 29874661 26105810 22985567 20324446 18273405 16225919 14793381 14180386 13524638
6503 13524638 12723517 13026113 11870506 10720886 10112700 9409031 8054640 8146589 8294930
6494 8294930 8033018 7627002 7119898 7083608 6710468 6702275 6978817 6146242 5335136 5090852
6484 5090852 3943284 3684603 3930171 4167983 4628093 4462570 4060153 3514030 3765755
6475 3765755 3117051 3231510 3671918 3668526 3629723 3874619 3677804 3876609 3275112 3951312
6465 3951312 3892656 2876162 2377540 2484613 2645832 2540270 2309032 1593252 1787720 2057449
6455 2057449 2729521 2216574 1836233 1455746 1414334 1607198 1196522 1765692 2639366 2353331
6445 2353331 2468606 2628599 1887890 651498 170914 1033454 1178555 1422517 1838071
6436 1838071 2575425 3182347 2799897 2416482 2814389 2525284 1818610 2477544 2138355 1766539
6426 1766539 1306976 861158 1175105 2194644 2213934 1426626 1671695 1639435 1249368 737651
6416 737651 2173330 2836815 2850246 3097809 2331972 1859455 1084466 879099 281182 630468
6406 630468 936687 1229489 895292 872536 907131 1673999 2093588 2012368 2273753 2849677
6396 2849677 2773537 2074183 1876204 2609126 2686835 1768592 449540 1398057 2445494 1689786
6386 1689786 2132856 2396025 1554713 1566548 2518904 2357933 1213246 1097954 1428290 1922145
6376 1922145 2311033 1609518 1128771 1543550 1022185 1260535 1590383 1953252 1434632 1875847
6366 1875847 2707256 2992933 2814975 3757841 3674591 3217687 3426907 2647470 2544255 2846794
6356 2846794 2776943 1017061 1696798 1932294 2028754 1830062 1465366 1727108 2496115 1905269
6346 1905269 1647243 1749643 2882036 3039743 2089968 1764664 1431001 1736135 2391087
6337 2391087 1904654 947112 1658790 1529771 1261973 1628640 1114338 863531 667484 1533237
6327 1533237 1375022 1907619 1849183 1588308 2152971 2607593 2466915 2098812 1990771 1514232
6317 1514232 1201798 1422262 1356127 724682 1546496 2838706 1947170 2090697 2054391 1422867
6307 1422867 2479650 3237973 2823414 2559552 2990850 2516641 2072545 1783837 1452344
6298 1452344 1080511 1271531 1634210 2506274 2303530 2137484 2616103 3087666 2238761 2342191
6288 2342191 2529186 2513416 2183974 1855765 2787269 2786050 2171973 2811500 2715533 2489538
6278 2489538 2450449 2509768 2731298 2008821 1471056 1718308 1860504 2248576 2619553 3092738
6268 3092738 3022536 2877696 2958801 3223634 2829622 3127466 2834808 1928903 2208934 2568212
6258 2568212 2948912 3291752 4046933 2829035 2093230 3062001 3165931 2586552 2785238
6249 2785238 2479264 2740969 3159173 3853613 3897794 4023501 3417927 2910292 2862239 2372126
6239 2372126 2453495 2973700 2872889 3107980 2947802 3162695 3118460 3606350 4192602 2989479
6229 2989479 2901441 2976421 2903169 2920168 3747040 3767598 3579790 3957653 3636240 3340184
6219 3340184 3748656 2909016 3112786 3619330 3352441 3559465 3242301 4121630 4719339 4648177
6209 4648177 4439067 4131554 3361349 2788860 3086877 2836124 3176306 3231714 3333862 3906048
6199 3906048 3011728 2275975 2761805 2825154 2426360 2738721 2441466 2922539 3528220 3343626
6189 3343626 3786191 4309150 4240954 4524650 4757514 4566600 3910861 3366364 3764585 3471051
6179 3471051 3927393 5025563 4350807 4514529 5210628 4715046 4677817 5413186 5081078 4653424
6169 4653424 5021456 4287522 3901997 4285820 4610460 4686628 4545415 3868738 4761774 5495886
6159 5495886 5381642 5521859 5314419 5314088 5097080 4942881 5060960 5641915 4883152 4920650
6149 4920650 5896392 5435577 6116865 6635650 5987599 5223300 4934484 5264315 5493953 4789394
6139 4789394 5456441 5793707 5457114 5798707 6522872 7397697 7472991 6509447 6091343 6357277
6129 6357277 6059101 6090146 6560294 6561057 6904000 7296566 7261511 6734752 6747457 6128860 5884167
6118 5884167 5611178 6002925 6860205 6906691 6956338 7811463 7899832 7436587 8399015 8103614
6108 8103614 7489292 7753513 7893793 7498410 7556199 7921498 7917019 8036429 8937622 8674956
6098 8674956 8148416 8092213 8041542 8136937 8547439 8009343 7982521 8994857 9614812 9028064
6088 9028064 9429387 8863747 8629663 8809311 8801020 9212164 9630729 9918681 9663013 10594956
6078 10594956 10540427 9610470 9626315 10047902 9753022 9569547 9916357 10151813 10038633 10302277
6068 10302277 10237483 10554396 10803371 10793691 10681114 10911729 11057197 10835165 10921469 11155206
6058 11155206 11072465 11022486 11242265 10868223 9632189 10959511 11984556 11133055 11635923
6049 11635923 12611668 12427817 12330260 12909200 12293521 12332287 12523866 11541177 11456808 11769674
6039 11769674 11718101 11941725 13282523 12774125 12867176 14557366 14210087 13914789 14111942
6030 14111942 14709692 14488893 14529238 13484063 13887632 14563940 14372611 14693475 15273086
6021 15273086 15511808 15054506 14747816 14903818 15146579 15772439 15975080 15808233 15878804 16903120
6011 16903120 16017694 15895673 16265719 16212279 16515581 17108208 17569588 17128580 17862332 18044503
6001 18044503 17420285 17414486 19060263 19556996 18964179 19207455 19246367 18530496 18911210 18800495
5991 18800495 18779757 19497800 20386920 19780633 19224294 20157306 20209579 20640942 21922705 21917503
5981 21917503 21748129 22411000 22475922 22805373 22888944 23047444 22835763 23330472 23073268 22681042
5971 22681042 23770001 23994387 23092304 24000295 25061441 24303569 24983622 25432165 25271798
5962 25271798 26030784 26652626 26648018 27912855 27773176 26939078 27872522 28066226 28141012 28786310
5952 28786310 28758558 28976412 29749521 29895954 29225243 29567284 29841166 30161827 31360122
5943 31360122 31840871 31579803 31291709 31593768 31573672 30961604 32522587 33261573 32837353
5934 32837353 33337470 33677622 33479411 34349852 35170174 35452935 35538824 35680933 36252874 37910580
5924 37910580 37979639 37904351 38556105 39110483 38578289 37861956 38434598 39927267 39524948 38685678
5914 38685678 39636994 40291988 40517208 40710296 41495235 41735696 42393833 42155611 42886068
5905 42886068 44112943 44111206 43694883 45396033 46149234 45125574 44508962 44772443 44811942
5896 44811942 45595565 46292350 47060478 47475137 47667664 47682565 47991322 48997498 48512474
5887 48512474 49100005 50142183 50171216 50128231 50426946 51239693 51240842 51191216 51870519 52380218
5877 52380218 52375258 51699374 52385172 53480693 53380607 53843242 54082897 53943527 55018680
5868 55018680 55339607 56072321 56966478 57166225 57076183 57913959 58051755 57372620 57385225 58031016
5858 58031016 57829789 57418197 58105362 58386987 58260200 59671523 60811625 60239429 60096875
5849 60096875 60774665 61128528 61859151 62122274 60793424 61840319 62400333 61969084 62464764
5840 62464764 61407158 61998645 62980057 62328802 63087264 63192871 63090088 63647922 64321186
5831 64321186 64595477 64868975 65437972 65320184 65169038 64788878 65309977 65784402 65076666
5822 65076666 64869241 65594272 65123746 64880158 65513458 66787795 65989554 65367724 65763803
5813 65763803 66152269 66768326 67159934 67116929 66099731 67102356 67081374 66708837 68099509
5804 68099509 67772181 67056380 67460947 67542009 66764517 66611279 67141326 67320139 67846821 67890602
5794 67890602 68089321 68403955 69199358 68461498 68776849 68154779 67657361 67147737 66957661
5785 66957661 67170521 66598774 67068709 67938821 67737069 68064571 67905382 67428509 67191872
5776 67191872 66756487 66230269 66995347 67162884 66582958 66804489 67434469 67448537 66846132 66076311
5766 66076311 64702013 64165664 64515903 65452884 64766494 64303696 65914825 66179450 65381779
5757 65381779 66229844 65855093 65254157 64682354 63334155 63604348 64678167 64326312 63769647
5748 63769647 64134936 64141098 63894867 64035587 63659698 63384685 63264371 62964522 62596701 62555509
5738 62555509 62797106 62003934 61506535 62344793 62921397 62275500 62048895 61156893 59804952
5729 59804952 60823927 60692393 61290405 61606427 61328567 60541787 60392631 59846239 58855242
5720 58855242 58102498 58351470 58267820 57450202 58195639 57890439 57743526 58142179 58608465 58008217
5710 58008217 57080297 56966437 55812372 55910260 55797963 55026513 55912119 56178590 56171114 56401958
5700 56401958 56107394 55394669 54544453 53732153 53059890 53508405 53758941 53483270 53287749
5691 53287749 52936439 53162833 52888322 51953325 51483952 50042705 49789050 50199598 49964512
5682 49964512 50023776 50314160 50678458 50288668 49985132 49539749 48715211 48722569 48235915 47971315
5672 47971315 47160116 46687337 47282931 46890257 46467277 45671135 45512646 46418168 45324979
5663 45324979 44443797 44607404 43759790 42741709 42861075 43853119 43141351 43395127 42009803
5654 42009803 41333627 40892635 40451114 40390352 39657254 39517784 39770423 39402892 39356106 40040264
5644 40040264 38982977 39158928 39381132 37639712 36514849 36776803 36560151 36545385 36565658
5635 36565658 36102669 35655734 36147006 36085251 35625191 35268342 35091818 34704590 35171454 35275334
5625 35275334 34437474 33765672 33773872 32781227 32494855 32390201 31528762 31555691 32312694 31382788
5615 31382788 30893613 31124035 30507312 29895844 30002389 29144297 28372512 29212993 28614446
5606 28614446 29113662 29163730 28362359 27621979 26730978 26171093 26337910 25571596 25750232 24978654
5596 24978654 24425784 25379619 26001340 25488875 25251602 24563491 23582760 23684941 23444699
5587 23444699 23333092 23642358 23178164 22887882 22775539 23421693 22713570 22459003 22686317
5578 22686317 22320624 21106684 21297658 21520101 20823742 21129274 21357061 19941004 20077941
5569 20077941 20479636 19380426 19599923 19634259 18758416 17691646 18492965 18361291 17943843
5560 17943843 18805171 18268864 17693551 17873660 17535487 17055704 16060369 16512125 16044513
5551 16044513 17205895 17656483 17071627 17071392 16875034 16007140 15646811 16318046 15141644 15231726
5541 15231726 15490103 14680685 14078658 14485095 14111129 14446652 14099297 13396367 13409195 13495249
5531 13495249 13377210 13351258 13389681 13002659 12810037 13063003 13833110 13562143 13123267 13134141
5521 13134141 11979118 11498051 11260033 11046769 10302020 10802529 11601493 10364647 10865355
5512 10865355 11539996 11090448 10627499 10678765 10658736 10219570 10400216 10297464 10156539 11260868
5502 11260868 11114568 10686055 11683341 11813239 10503526 10395112 9513243 8331627 8422307
5493 8422307 9398669 8827687 8199531 8103425 8359975 8957369 9066883 8653894 8216109 8180397
5483 8180397 9182243 9287526 9547466 10012049 9940824 9724020 9212212 8822779 8682398 8841092
5473 8841092 8134944 6908400 7195264 7140415 7844483 7270147 7381809 7641357 7209538 7145973
5463 7145973 6636874 7170268 8157908 7651308 7577776 7634673 7170877 7740376 8129705 7019103
5453 7019103 7054108 7416830 6777856 7625749 8040911 7385134 7019680 7524989 6977020 6741611
5443 6741611 6729463 6753249 6381967 6383391 6792633 6769455 6550484 5802009 5645751 5315186
5433 5315186 5037509 5089742 4920466 5778287 5555519 5212468 5972487 6670754 7293616 7123297
5423 7123297 6536541 6007079 5586953 5671088 5604500 5433362 4726523 4631283 5191297 5533792
5413 5533792 5655632 4940533 4744574 4711403 4334589 5213760 5333871 5255508 5199108 5662265
5403 5662265 5605733 5096564 5951750 6183173 5821595 5736448 4332711 4162117 4447536 4208849
5393 4208849 4136562 4625724 4311557 4137939 4444515 4895809 4123717 3850806 3901235 3806907
5383 3806907 4975549 5062680 4156758 4146560 4998927 4307189 3643310 4549178 3960292 4173669
5373 4173669 4731908 5051501 5460847 5462363 5764718 5843382 4855072 3982021 3421795 3551797
5363 3551797 3634360 2623478 2822513 4023407 4239797 4107661 5610604 5783913 4432624
5354 4432624 4600154 4869679 4846995 4107735 4224178 4319355 4304554 4690479 4565383 4834927
5344 4834927 4519936 3974330 3526469 4194360 4337447 3474756 3357155 4075435 3737640 4358485
5334 4358485 4249234 3673979 4142780 4570405 4468567 4445551 3597565 3725384 5124715 4611228
5324 4611228 4136413 4828050 4558941 4045172 4244277 4672966 4477058 4341816 3817331 4271057
5314 4271057 4185633 4042973 4354472 4179036 4705310 4587548 4763557 5149231 4848627 4536705
5304 4536705 4640764 5284437 4365801 4185828 3875904 4258460 4530568 4578553 4948471 5105555
5294 5105555 4742075 5147948 5523035 5402504 4481041 4215776 4370034 4298758 4721608 4600220
5284 4600220 3929096 3347936 3444518 3093273 3765824 4036401 3567383 3694019 4256564 4202142
5274 4202142 4847420 4863306 5157776 5087722 4802469 5225396 5459373 4364990 4280997 4508098
5264 4508098 4326847 3934987 3848318 4091313 4015662 3817728 3962212 4257416 4621563 4673214
5254 4673214 4523487 3793239 4449322 4068871 4414232 3842398 3858296 4244356 3024055 3620183
5244 3620183 3682552 3178478 3391106 4625907 4873275 4637563 4724749 4737745 3264037 3057994
5234 3057994 3278417 3510421 3889754 3526460 2700803 3152147 3377920 2918867 2789483 3786566
5224 3786566 4403198 4672034 4379220 5038704 5289048 4582587 4280909 4620564 3539164
5215 3539164 2903800 3387708 3820944 4329733 4112510 4002147 4062353 3465103 4294896 5040618
5205 5040618 4393743 4062152 3550607 4454969 3841031 4290691 3966182 3430299 4254171 4446850
5195 4446850 4378469 4567048 4703859 4240810 5040287 4960892 4119793 4489825 4380050 3754109
5185 3754109 4170556 5147049 5353122 5229641 4606635 4979739 5093420 4933839 4377511 4318688
5175 4318688 4930318 4754433 4462623 5418783 5371911 5047759 4875991 4793725 4790274 4370779
5165 4370779 4628747 4845425 4548640 4829817 5885613 5974527 5298754 5677428 5211924 4806565
5155 4806565 5344924 4621310 3615457 4269284 5903447 5619825 5198135 5748098 6450254
5146 6450254 6739068 5961049 6064271 6002592 6170391 6646895 7016634 6978259 6516598 6768873
5136 6768873 6897097 7183213 6550037 6328219 6660379 6339988 6262799 7336109 8611006
5127 8611006 9180864 8427359 8945539 9811964 9405003 8750727 7897728 8117899 9064213 9188822
5117 9188822 9698401 10069333 10266747 10134613 10925767 11825818 11365835 11560107 11815768 11493335
5107 11493335 12164728 12520963 13125613 12766964 11944934 12641970 13928223 13720394 13044495
5098 13044495 13209142 13516703 14532015 15025695 15170087 16354565 16447198 16585343 16922348
5089 16922348 16818085 16551319 16899519 17265468 16325877 16397566 16850877 17119873 17458225 17604600
5079 17604600 16821825 17430996 18814238 17715681 17840741 18885977 18007017 18426980 19085034
5070 19085034 18352913 17623643 18685504 18270789 17663493 18032369 17667094 17213922 18674430
5061 18674430 19027113 19629379 20191242 19807347 19670112 19498284 19807356 19426813 18790598
5052 18790598 18845973 18831973 17995244 18088020 18033516 18251600 18548137 18435178 18052231 18342587
5042 18342587 19058653 18722421 19328610 19173264 18226993 17728523 17986193 18078688 17555899 17356486
5032 17356486 17592152 16909305 17531769 18556123 17793277 18254584 18926876 18341777 18522016
5023 18522016 18544694 18636729 19280596 18865662 18524120 18319717 18075159 18158834 19113857 18095972
5013 18095972 17221262 16997873 17689063 18071460 18060663 18961040 19383878 19494965 20374797 20936294
5003 20936294 20390662 20440118 20345506 20056755 20345186 21393403 22619911 23929693 24983421
4994 24983421 25488879 27467575 28631082 28773571 29251229 30706927 33077623 34204233 35567440
4985 35567440 37432901 39553370 41979531 44299102 47220560 48900669 50782763 52147343
4977 52147343 52593319 53664298 54293773 53707450 54729084 54835412 52928907 52087638 50777256
4968 50777256 49096862 47648439 47269776 46206856 45736611 45382787 45597232 45486613 45089250
4959 45089250 45833665 45925365 45754213 45223408 45173389 44877551 44163659 43394043 43336802 41515137
4949 41515137 40479717 40682702 38678097 36924107 36766983 34916003 33104340 31988424
4941 31988424 29782060 28191919 27185836 25957440 25332153 24526632 23027161 21993886
4933 21993886 21453941 20863837 21153355 21345280 20448621 20384506 20114520 20112892 19717413 19468580
4923 19468580 18631460 17671045 16390426 16319881 16230382 16242620 15778196 15028512 15398758 14918899
4913 14918899 14932740 15605833 14938878 14682580 15638472 15143826 14466942 14291959 13370281 13055309
4903 13055309 13300703 12864772 11953948 11879927 11755836 11068554 10904738 11187042 12044341 11026401
4893 11026401 10441132 11361793 10376071 9467207 10604735 11317125 9423297 9155892 9616461
4884 9616461 7692178 7248640 7825945 8077887 7589612 8189623 8560729 7847149 7886132 7587088
4874 7587088 7554341 7540983 6831491 6257690 5998442 5625399 5736235 5843826 5155152 5377661
4864 5377661 5720806 4879865 4756717 5600573 5754394 5241276 5819219 5036004 5501882 5709893
4854 5709893 5165030 5389045 5682158 5417169 4576829 4490165 3909533 3309511 4758191 4260371
4844 4260371 3046770 3724483 3468258 3583850 4282046 4392723 4012130 2870696 3077315
4835 3077315 3723591 3508386 3484766 3236670 3330225 3274669 3899098 4716846 4327188 4415585
4825 4415585 4087859 3009069 3233951 3518589 3644219 3740136 3823928 3674782 3653791 3339845
4815 3339845 2943684 2703407 2055239 2273979 2104154 2539488 2898470 3537906 3989296 2759342
4805 2759342 3653402 3819203 3674500 4179298 3680119 3162487 3377499 3167208 3282923 2891440
4795 2891440 3231947 3224717 3506243 4660660 3487649 2418601 3411557 3528074 2974244
4786 2974244 3193703 2629415 2259075 2264441 2770347 3358668 3176539 3355755 2695134 2530109
4776 2530109 3149637 3211151 3690786 3393839 2470301 1774822 2191888 2247391 1518826 1973741
4766 1973741 2492178 2673472 2458486 2877080 2229973 2402369 3058939 3525686 3573763 3811740
4756 3811740 3573852 3358600 2139166 2245402 2630014 2133274 2007898 2609206 2717459
4747 2717459 1865008 1939201 2399200 2200085 2456632 2760151 2210907 2333479 2119649 2239616
4737 2239616 2309582 2944629 3668109 2671154 1803291 2222240 1997345 2665740 2402717 1794720
4727 1794720 2717123 3529795 2744923 2873267 3610972 2283243 2381227 2706699 2145706 2701850
4717 2701850 2428931 2034424 1607277 2462008 3818455 3487423 3732412 4019332 3799552
4708 3799552 3443921 2919013 3102327 2801226 2619030 2855863 3243518 2869248 3414910 3379310
4698 3379310 3347201 3322524 3358858 3620340 3976982 4730967 4949568 5191951 5043106 4022459
4688 4022459 3888237 3624955 3135351 2300002 2529187 2481444 3465148 3930827 3992175 4917802
4678 4917802 4692184 4977073 5750582 5508574 5219146 5559197 4778391 3751275 4391462
4669 4391462 3897644 3480163 4475261 5257199 4803711 5033740 5221609 5291430 5050914 5790421
4659 5790421 5894575 4430839 4249737 4183021 4137497 4250442 4378329 4296594 5331317 5375314
4649 5375314 4541473 4509909 5094427 4656612 4601969 5111579 5053746 4852459 5295331 5599549
4639 5599549 4729737 3918418 4230040 2915048 3184421 3825823 4505920 4939501 4939989 4982616
4629 4982616 5894411 6761513 5885328 5973327 6125707 5431764 4530553 4164748 4775331 4449088
4619 4449088 4124544 4723494 4379366 5057994 4757364 4993953 5538365 5397105 5593339 5742270
4609 5742270 5796522 4966601 5458367 6311400 5633094 4719063 4774137 3657491 3929881 4309590
4599 4309590 3881449 4064421 5264374 5333487 5779907 6394582 6670708 6161724 5532539 5513407
4589 5513407 4973982 4186975 3569067 4437276 4505237 4330725 4537948 3896821 4498147 4733783
4579 4733783 4714155 5967562 6235077 6277924 6286076 6193931 6023962 6679331 6926040 6134729
4569 6134729 5599755 5714518 6215537 6156404 6798892 6370408 6834183 6888462 7267036 7664550
4559 7664550 8462483 8187645 8318574 8880884 8254578 8346168 8669111 8412870 7777587 7844509
4549 7844509 7747592 7975333 9069844 9081813 8695313 9765894 9793907 10229628 10137966 10695138
4539 10695138 11709216 11612278 10897647 11452327 10995147 11108743 11032874 12010053 12491230 12942721
4529 12942721 14111834 15611457 17036801 17732715 17609689 18568733 19360574 19145241 19115100
4520 19115100 19204766 18929245 19618321 19069027 18655573 19534068 19796475 20372556 20120358 19846571
4510 19846571 19667255 20079899 19855474 19483692 19654594 19154576 18089236 18500396 18823032
4501 18823032 18143942 18653461 18752894 18219482 18258457 18538002 18225162 17859097 17531386 16871317
4491 16871317 16862509 16782087 16242572 15805636 16551166 16032708 15671385 15413145 14266410 13979356
4481 13979356 14250643 12736932 11330263 10845960 11039758 9963508 8812848 9211585 9391334
4472 9391334 9036789 8720810 7681892 7897378 8801371 8719209 8558567 8339782 8089023 8196530
4462 8196530 7951144 7345848 6952034 6722565 6845430 6271698 6008730 5962772 5793139 5698575
4452 5698575 6439610 6271019 5759151 6228450 5953669 5997088 6105610 5255779 5357483 5953637
4442 5953637 5443849 4327105 4507807 4764301 4104863 4583160 4888477 3597511 3513717
4433 3513717 4666730 4855308 5180071 5525505 4992303 4763489 4839408 3755289 3698702 3420831
4423 3420831 2974540 4095214 4617129 3778850 3924845 4373972 3758619 3866191 3822253 3868202
4413 3868202 3916140 4370374 4349874 4307317 3758064 3818869 4119580 4146178 4749977 5172345
4403 5172345 4067820 3398741 2856804 2458213 2928636 3271633 3259883 3591196 4132744 4327960
4393 4327960 4645936 4951619 4768870 4594602 3703727 3420453 3831720 3533211 3195824 3947173
4383 3947173 3716583 3829887 4276202 4059614 3170343 2977988 3808998 3056411 3120617 3921056
4373 3921056 4442393 4234890 4325003 3847904 3665147 4074197 3477101 3036083 3389738 3873850
4363 3873850 4166831 4500966 4468518 3608811 3411104 3989684 4020185 4392725 5026358 4130683
4353 4130683 4676084 5276690 4835123 4521119 4497828 3760045 4312502 4589525 3673648 3512450
4343 3512450 4302387 3450612 3962547 4766506 4700250 4550267 4929733 4093570 3950065 4420291
4333 4420291 4025721 4789660 5413656 4577610 3778217 4223926 3799435 3996981 4133366 4620647
4323 4620647 4501895 4078520 3956424 4089358 4503619 4673370 5158807 5042307 5321958 5105556
4313 5105556 4402676 4698038 5430960 4732849 4249485 4313585 4135501 3627773 4191226 4298231
4303 4298231 3418426 4053428 4313136 4035320 5169410 4599995 3215809 3809466 3866381
4294 3866381 3096302 3585039 4000261 3375363 3809145 4170477 3900026 3877795 4201655 3778078
4284 3778078 4378009 4206515 4157028 3952513 3483037 2995797 3130136 3600694 3380263 3117555
4274 3117555 3507133 3186125 3561995 3912674 4388413 3161019 3732641 3511592 2940414
4265 2940414 3557658 2872187 3238604 3687382 4434200 3855970 4199873 5012335 3927548
4256 3927548 3327279 3939603 4949561 5108861 4538761 4115337 3811568 3501403 2800841
4247 2800841 2165909 2648172 2889993 3369384 3250262 3570718 3689553 3421574 4443621
4238 4443621 4236234 3725457 3549521 3493593 3455423 3229564 3183157 2450570 3106656 3460219
4228 3460219 2040867 2378010 3173044 2627554 2128613 2583398 3084495 3760566 3743434 3387999
4218 3387999 3349824 3950212 4510787 4714559 4446126 3888908 3219126 4758601 4282098 3269857
4208 3269857 4268541 4313646 4678858 4589641 4120860 3618140 4034191 3411974 3185256 4221907
4198 4221907 3770976 3420410 3553805 3184423 2243871 2491533 3231753 3447406 3534755 3453688
4188 3453688 4316070 4190321 3981837 3718947 3398851 3868140 4214002 4132152 3439810 3203092
4178 3203092 3569828 4312108 4695324 3951387 3353733 3366066 2779523 2826466 3174615 3461089
4168 3461089 2949387 2709398 1995512 2377146 2828718 2983529 2736520 2685227 2816907 2802887
4158 2802887 3171468 4031055 3316893 3419007 3774410 3848417 3706536 3388200 2771786 3481646
4148 3481646 3144853 2132698 2852533 3330870 3408627 2832051 2649434 2982715 3402260 2670665
4138 2670665 2635236 3155746 3633189 2798240 2548613 3044201 3357732 2685027 2946097 3377222
4128 3377222 2421380 2279018 3120128 2811646 2741791 2596660 2950823 3135990 3937554 4344918
4118 4344918 3955002 2587199 2248363 2922621 3057768 3232837 2782490 2040436 2689570
4109 2689570 3457499 3090988 3754851 4072833 3956980 3535622 3598962 4734144 3931370 3230441
4099 3230441 4296380 3568370 2591753 2532303 2931677 3034717 2501934 1922422 2844412 3468452
4089 3468452 3371747 3060905 3951999 3581901 4334085 5201483 4404063 4269788 3325897 3518858
4079 3518858 3885777 3852880 3766091 3995408 3236270 4062886 4542047 3814483 3525175 3966900
4069 3966900 3621142 3614717 4616644 4551732 4682261 4669770 5085946 5839248 5519290 5317743
4059 5317743 4750822 3792284 4524193 4963047 4414884 4395861 4780280 5703729 5592450 5854440
4049 5854440 6486838 6353643 5786879 6821714 7091649 6763353 8422354 7725680 7604007
4040 7604007 8452936 7894283 6694200 7429938 7512987 7565661 8119580 7451218 7940164 7877980
4030 7877980 7705404 9240695 9558456 8428036 8618098 9071388 9389433 9154259 9019280
4021 9019280 9060419 9536617 9788627 9406534 8987602 9022669 8909618 9408846 9075620 9128730
4011 9128730 9217696 9864337 10589338 10622277 11566454 11590704 11360557 11625422 11814430 10903886
4001 10903886 10997098 10454843 10258841 10110459 10435914 11307691 11618804 11572744 12813931 13944051
3991 13944051 13509417 14738194 15632543 15806325 16735731 16465914 15687361 15440536 14953720
3982 14953720 14528371 15198396 15664638 15506369 15031340 14737222 15721489 15762847 16147611 17349856
3972 17349856 16527166 16886915 17679713 17198037 16877671 17081910 16563512 16087146 14979813
3963 14979813 15138584 15610151 14758615 14683405 15721847 15382982 15943927 16665866 16729292 16457176
3953 16457176 16468486 16096694 16159893 15805753 14965821 15212610 14993839 14724778 14271555 15023424
3943 15023424 14567974 15165055 15291428 16034424 16229700 15974157 16827692 16625248 16553133 16999275
3933 16999275 16291673 16037339 15990520 15602944 14420621 14897160 15354720 14330902 14307809
3924 14307809 15793376 16496631 15820142 15972673 16476896 16366946 15557842 15910475 15176579
3915 15176579 14331612 13945564 14236225 14449869 13820288 12918195 13041767 12815884 12885169 12713219
3905 12713219 12113970 12449486 12094034 11636897 11903689 12388356 12224684 12181443 11646245 11524988
3895 11524988 11826644 11297135 10831487 11159393 9866354 10308795 10232888 9988616 10299388
3886 10299388 10465608 9801063 9996637 9420810 9349715 9257602 8112360 7814433 8937211
3877 8937211 10084025 9570492 9166088 9763211 9787444 9669063 9703300 9592793 8978537 8311596
3867 8311596 9200356 8792655 8867077 8606895 7937278 8197378 8831929 7780067 8222865 8335283
3857 8335283 8361205 8085348 7345316 7123636 7077500 6768891 5900168 7244790 6490288 5662546
3847 5662546 6157339 6311035 6962572 7505969 7446520 7437937 7231070 7549295 7952847 7001106
3837 7001106 7167489 7005731 6650455 6665767 6628139 6091728 6574736 6602515 6457618 6542829
3827 6542829 6763034 6595983 6751734 6700337 7350560 7481687 7509858 8636057 8963577 7835373
3817 7835373 7760381 8023445 8425379 8560413 7331403 7365819 7875412 8217586 8237939 8718054
3807 8718054 8608681 9118741 9898789 10332978 10047820 9979139 10483390 10272171 10520096 10399133
3797 10399133 9426122 8930021 9858638 9742332 9658817 9261369 9926064 10682254 10890024 10864328
3787 10864328 10834756 10159344 10003699 10892538 10722052 10053600 10342033 10690976 10086184 10260501
3777 10260501 11108868 10945334 10878425 10760816 10556776 11947529 12042310 11823069 12997041
3768 12997041 13824741 13645002 13764191 14473249 14436004 13248124 12531150 13079774 14313364
3759 14313364 13673594 14040895 14576503 14622175 14584047 15472870 15792018 15557522 15837433 16017871
3749 16017871 15394840 15525682 15605354 15972653 16186497 15056558 14611826 14479880 14342001
3740 14342001 14047196 14173854 14347701 14458212 14520460 14717366 14459597 14163388 14753859 14620379
3730 14620379 13736156 12669887 13712819 13302673 12968599 13253678 13305513 13114153 14248233
3721 14248233 14864750 14075218 14123754 14082137 13574616 13844869 14815637 15662632 15358905 14812528
3711 14812528 15887769 16402490 15613290 14632059 15066422 15593752 15397057 15754718 16825747
3702 16825747 16702287 16833012 17048633 17132381 16254747 16535836 16314053 15406114 15590094 15849661
3692 15849661 14695417 14115196 14698324 14467320 15178259 15908650 15403195 14549341 14915155
3683 14915155 15185545 14676053 13648905 13669247 13528678 12452678 11748500 11960352 11903903
3674 11903903 9835463 9687663 10684050 10831926 10383358 10344691 11452421 12065542 11035073
3665 11035073 11894383 13234139 11381158 10447907 10925562 11243914 10403734 10182521 9611550
3656 9611550 9638246 10457058 9407472 9728262 10614504 10616785 10102997 11107432 11264554 10059359
3646 10059359 9961914 9852415 9212577 8938945 8652362 8566930 8365995 8188658 7822635 9345209
3636 9345209 9215578 8220053 7986993 8414745 8281681 8757796 9218390 8550699 8176939 7360462
3626 7360462 6764085 6387624 6797244 5876899 5749999 5471632 5381439 5500765 5650450 6466453
3616 6466453 6564041 7041746 7587403 6969986 6695270 6821952 6232670 5445440 5564624 4433405
3606 4433405 4403248 5106829 4758571 5496048 5582059 5729964 5877870 6442858 6010710 5115789
3596 5115789 4906275 6325891 6813856 5425360 5673891 5896097 5525433 5458260 4665169
3587 4665169 4127622 5308739 4921770 4646733 5463814 5967354 5586729 4805772 5572400
3578 5572400 5299538 4157586 4232839 4339835 3902431 3781654 4204765 3193198 3073577
3569 3073577 3825114 3920913 5002260 4679942 4004052 4306233 4660442 4061043 4290200 4188673
3559 4188673 3835175 3736110 4125858 4320720 4598662 4378305 3856594 4179762 3692631 3933873
3549 3933873 3661621 4175000 3997531 4186916 5431330 6023932 5040388 4386862 4489886
3540 4489886 4437187 4459807 4112015 4396412 4718210 4821131 4483431 4551718 4497529 4549252
3530 4549252 4893459 4876588 4065610 3654878 4136648 4839167 4563210 4623959 5041153 4496803
3520 4496803 3864869 4772141 5503154 5145404 5345809 5001316 5354107 5689007 6921372
3511 6921372 6870938 6431875 6514003 6250969 5494152 6289581 5934245 5753534 6061097 5788098
3501 5788098 4915978 5900836 5965565 6235929 7603841 6853365 6288430 7298527 7516506
3492 7516506 7530411 8196072 7752874 8014695 7765021 7854453 7919472 7517287 6471500 6851905
3482 6851905 7955204 8069585 8686007 9403346 9144522 8767566 8748294 8918687 9674455 9560099
3472 9560099 8754946 8131423 8100001 9036940 8925704 9390250 9539643 9203608 10326335 10866825
3462 10866825 10256159 11463838 12206759 12115868 12800625 11748801 11468226 12885178 12410640
3453 12410640 12398298 13186834 12431235 12269866 13161324 13879763 14632495 14883142 15147833 16059389
3443 16059389 16718350 17091880 17622833 18212347 18931839 18734231 18424846 19706092 19978939
3434 19978939 20033110 20462748 20368501 21326802 22779170 23383670 23800224 25231964 24131209
3425 24131209 24486536 25856685 26021083 27288740 28179159 28126257 28572387 29196405 29482771
3416 29482771 30241263 31615459 32833900 34435574 34729427 35311812 36874573 38293948 40083532
3407 40083532 41873123 43031724 44089127 45283818 47691933 49300671 51793452 54901789
3399 54901789 56791971 59569364 63344041 66914171 70211615 74288345 79151042 84467873
3391 84467873 90004532 95921844 104238916 112770966 120978265 131792319 143308556 155573596
3383 155573596 169368530 183858578 196978706 209859379 221617960 232377938 244287891
3376 244287891 256280894 270871778 287939818 303806736 318270471 329980840 336913034
3369 336913034 341739642 346264581 350890629 358120755 367374643 375515708 382356737 382909964
3361 382909964 376786163 366080466 353495175 342074152 331833610 324548478 318946641
3354 318946641 311556533 301592406 288813279 272037667 255069722 239140557 224497244
3347 224497244 212610867 201544908 189878781 179521628 165745018 152562857 140587236
3340 140587236 128320635 116741502 107262242 98988784 92943533 87837084 82601899 78325023
3332 78325023 73874931 69933821 66929008 64449258 61834349 59025868 55983822 53406229
3324 53406229 52011027 50953332 48441622 46536745 45137631 43653030 41418432 39846981
3316 39846981 39696260 38351489 38123287 37657025 36134406 34759350 33388840 32016642 30595156
3307 30595156 29665664 28691015 27893512 27610629 26754832 26776851 26256046 24759659 24166516
3298 24166516 23431566 22869168 22685002 22809983 22444081 22510398 21959216 20682659 19919349
3289 19919349 20168468 20346009 19714379 19835770 18826419 18724805 19183435 19322640 19128103
3280 19128103 19318694 19442033 18872167 19093906 19152141 17779251 16912300 16684706 16591407 16460201
3270 16460201 15945184 16141291 16541321 16420945 16979011 17455024 16964693 16712771 15532088
3261 15532088 14475806 14112203 14996197 15091479 15631671 15327296 14586755 14617948 14831780 14222059
3251 14222059 14355671 14466197 13851491 14429651 14378466 14463079 14750819 15059610 14379339 13691726
3241 13691726 13552891 13373073 13207958 13497884 13793075 14784849 15347168 15100703 15837793
3232 15837793 16146092 14979311 13787782 14301477 14268341 14114974 13351436 11803509 11631263
3223 11631263 11899203 12049559 11987959 11574910 11682320 11968205 11848417 10787681 11124119
3214 11124119 11288541 11245574 11530508 11820286 11937340 11354199 12435360 13320245 12832630
3205 12832630 12748056 12274499 11376142 10767718 10791225 11521034 12407624 12660100 12291270 12314963
3195 12314963 11695170 11494903 11830391 11743340 12109169 11556095 11850644 11453137 11610795 12251328
3185 12251328 12449826 12305477 13412638 13787502 13988889 14645949 14839218 15036196 14138686
3176 14138686 13386992 13523235 13715698 12886716 12846466 12535182 12607290 12826796 13427435 13464796
3166 13464796 12678906 12876636 13285471 13624765 13788009 14150481 13771234 13929063 14347214
3157 14347214 14244634 13625924 13010489 13457991 13297181 13551379 14168193 14938782 16030825
3148 16030825 15838508 15589813 15503541 15215310 14978986 14532026 14792771 14987835 15726861 16372021
3138 16372021 16806623 17927356 17900980 17768861 17586662 18480026 18288148 18348299 19365958
3129 19365958 18909347 19631809 20459085 20807913 21170630 21949519 21621007 21559744 21359812 20997760
3119 20997760 21525229 22432977 22482492 23194931 23696142 24187953 24568144 24878367 25205102 26308643
3109 26308643 27788097 27655549 27219660 28467657 28741955 29802081 30989410 32073325 33395665
3100 33395665 33828781 34004650 35079801 36447093 36989925 38121245 39213819 40353635 41201540
3091 41201540 42578877 43698618 44074755 45621722 45324973 45129905 45963337 46340511 46412516
3082 46412516 47601768 48017924 48152480 48961501 50035221 50119234 50784426 51352338 52246812
3073 52246812 53228547 53305052 54118382 55855381 57765608 59267344 61740705 63585332 65219640
3064 65219640 67036630 69754764 71801048 74350333 76751321 79532097 83298105 87709888
3056 87709888 91102859 95601430 100179003 105528332 110980720 117469884 124320796 130756501
3048 130756501 137931896 146771667 157004175 167034536 178610334 190979342 201314478
3041 201314478 210057475 215530870 214474544 207385483 196494175 182477377 168054130 154431681
3033 154431681 142141553 132338108 123967684 115379011 108523608 103354351 97298784 92001886
3025 92001886 88582962 84679871 80114511 77147072 74061116 71741383 69747755 66421129
3017 66421129 63543726 62479184 60832462 57901128 56231404 55358898 52633843 51189001
3009 51189001 49531992 48378157 47199834 46230662 45835458 45587209 44069917 42641775 43294759
3000 43294759 42349406 42252488 41664325 41547990 41369269 40834072 39864430 39328314 38487100 37258007
2990 37258007 36695081 36745500 36852144 36862174 37561332 38188063 38799566 38080846 38478580 39745637
2980 39745637 39957440 39925274 40271251 41798328 42054890 43182471 45018276 46058504 47982689
2971 47982689 50979101 54579864 57049940 60012858 63692590 67847286 74073917 79948404
2963 79948404 86570540 97064405 108781229 123181537 142622819 160153588 167183878
2956 167183878 161227618 146894297 126849678 104903352 87716123 74965439 65620671
2949 65620671 58922521 53267830 49136284 46505560 43952244 41331782 39084654 36607190
2941 36607190 34884739 33647646 31729142 30126055 28373222 26848842 25971797 25714394
2933 25714394 25723953 25523675 24868093 23454843 23244811 22709075 21725650 22085737 21950856 21393019
2923 21393019 21475715 20691585 20073763 19583408 18645051 18380941 17620755 17020325 17360433 17454696
2913 17454696 16384391 16409522 16559825 15304058 14978859 14421305 13401000 13318861 12638483
2904 12638483 12574886 13334026 12809279 11789865 12169725 12599410 12655052 12458505 12566248 12007006
2894 12007006 11462070 11888394 12624927 11454261 10680137 10571612 9605962 9335214 9334061 9741647
2884 9741647 10243585 9566934 8409828 8436172 8579948 9270713 9658983 9702295 10068838 10427636
2874 10427636 11609726 11314756 10562759 10496762 9323167 8697686 8818714 9040429 8970357
2865 8970357 8753262 8698790 8493573 8803425 8622333 7847728 8017347 9717716 9532639 9135893
2855 9135893 9284180 9120609 9000663 8899070 8569189 9266922 9416271 8532564 8701508 8696928
2845 8696928 9325955 9203181 9784054 10266541 10063723 9472752 9735105 10567024 9896892 10278098
2835 10278098 10048276 8989387 9384772 9611197 9391738 10263713 9806973 9300400 10113368
2826 10113368 10947429 10427529 10566997 11521557 11390659 11775760 10997734 11356017 11676828
2817 11676828 10999055 10646918 10421535 9888561 10294627 10693920 10613114 10348323 10758128 11102792
2807 11102792 11840786 12363480 11896094 12393938 12871788 12895534 12570077 11928840 11773098 12403844
2797 12403844 12759142 12472641 12339804 13093017 13300341 14157589 14421207 14039981 13836444
2788 13836444 14571096 16103162 15775461 14881721 14978824 14872693 14677039 14586340 14047337 13603576
2778 13603576 13610844 14549885 14561210 15106905 15592076 15709755 15616910 16207084 16312165 16609600
2768 16609600 16873998 16851354 16566397 15632498 15554518 15488682 15186987 14234532 13459677 13607957
2758 13607957 13668740 13451725 14338602 14720623 14333605 14245546 14584027 14372291 14548561 15236675
2748 15236675 14832491 14165682 15014748 15206011 14976955 15502351 15770572 15843892 15584066 15415866
2738 15415866 15633780 15551487 15924216 16227495 16581710 16399572 16383241 16379326 16315849 16520884
2728 16520884 16899356 16393885 16109893 16765008 16979621 17335632 17357353 17993807 17786819 17484975
2718 17484975 17987440 18002319 17358759 18137089 18685284 18333985 18197474 18805726 18738692 18595360
2708 18595360 18629978 19378266 19505690 20120671 20984362 20724777 20591666 21551778 21969461 22762322
2698 22762322 24301850 24574005 24478696 24381213 25143177 25336467 25085967 24732426 26197114
2689 26197114 26677508 25811636 26045174 26083657 25875991 25771497 25718572 26087578 26097114 26048678
2679 26048678 26684215 26318900 26711044 28169318 28309613 28652420 29651959 30026363 30345042
2670 30345042 31362008 31575859 31567530 31721044 32551408 33641699 34108002 34407942 35312117
2661 35312117 35411365 35910608 37751595 39364052 40039101 41477901 42389097 43710624 45171379
2652 45171379 45710656 46415963 47358341 48583984 50548741 52163660 52804611 54048645 55858314
2643 55858314 57025191 58933413 61010462 62674476 63788850 64250471 65447704 65616890
2635 65616890 67201534 68499328 68751054 69431983 70174680 70098122 70231984 70667478 70271130
2626 70271130 71513834 72515520 71990431 71566545 71719512 72259308 72426319 71850020 70713792
2617 70713792 68895984 67927721 67383097 65739423 65245152 64228894 63792994 62877493 61522131
2608 61522131 60514155 60492981 59567674 57508302 56314855 55509026 54316596 52563484 52625772
2599 52625772 51493787 50331230 49122326 48071812 46946828 45376056 44546949 43243101
2591 43243101 42996182 43474265 42518245 41883669 42078901 42002840 41223937 40871714 40347462 40302825
2581 40302825 39794531 38212205 37336461 37981583 38519901 38734401 38917562 38028975 37816669
2572 37816669 37789223 38302288 38110853 38240095 38445169 38157849 38548354 39044751 38915829 38424133
2562 38424133 38344933 38573512 37946922 37413914 37460715 36727059 36661176 35926464 36026255 36674071
2552 36674071 36791206 37030730 36916295 36420509 35977493 36117583 36774155 35935955 35389947
2543 35389947 36003962 35724501 35390136 34778367 34675462 34105909 34935248 35409265 34690778
2534 34690778 35222445 35191675 35306055 36101547 36636690 35695652 36369262 36608974 36630978 37788473
2524 37788473 37865513 37931231 38407584 38751478 37793220 38035590 38643909 38917385 39696036 40485979
2514 40485979 40040105 40847085 41135364 41205270 41295603 42756160 42805257 42832987 42726364 42092233
2504 42092233 42746422 43130997 42703488 42835918 43457315 43447077 43391804 43879306 43837965 44044062
2494 44044062 44194914 43955802 43878986 43851695 44212402 44261934 45350576 45395412 45458774 45566014
2484 45566014 46105746 45818362 45885115 46399910 47537204 47568644 48338823 49902134 51136987
2475 51136987 51695718 52547403 53000391 53902799 55082558 55721539 56762973 57854188 59550682
2466 59550682 61080566 62305613 63454939 64856247 66196574 68312981 69131085 70931675
2458 70931675 72670213 73609406 74534105 76009525 77875812 80719669 82936313 84235794
2450 84235794 86047791 87927967 88575372 90900452 93739339 95205834 96666309 98595190
2442 98595190 100774549 103023712 104622004 105968904 108035206 109114166 109728591 111126682
2434 111126682 112547344 112715383 113320214 115020387 116215788 116083194 117042557 116788198 117110871
2425 117110871 117422607 116395269 115634501 114261720 113045748 111509547 109719176 107976021
2417 107976021 105036227 102543685 99951771 97988420 95582583 92639830 90726729 88160521
2409 88160521 84704712 81817025 79314421 76706587 75123983 73134141 70321802 68119312
2401 68119312 65683835 64085819 62344691 59889788 57865368 56991051 55060655 53320928
2393 53320928 52206297 50520991 48488022 48182122 46848606 44941962 44233802 43008332
2385 43008332 42204544 41165725 40638687 39350533 39217975 38758963 37639692 37891234 38062901
2376 38062901 38277008 37551259 37705782 36588581 35963116 36006826 34744508 35296397 36393792
2367 36393792 34982165 33959973 34946235 34314012 33273423 33995020 34236178 33763778 33963467
2358 33963467 34563401 34396794 34387334 34745821 33706846 33358625 33288878 32770303 32739429 32147266
2348 32147266 31490549 31639480 31713610 32087768 31901931 31930069 32076816 31547217 30382610 30377657
2338 30377657 30274125 29779896 29703069 29191648 29196017 29230677 28597035 28133294 28355415 28277117
2328 28277117 27952812 28059985 27636793 27215671 27973062 28354394 27610128 27507702 27866775
2319 27866775 28138261 28020447 27430250 25958376 26063695 26924859 27265996 26778605 27535744
2310 27535744 27844675 27802508 27753620 27110516 27032823 27373308 26496195 25634297 25263141 25202971
2300 25202971 25921045 26531996 26309010 25754253 26401989 26602002 25774019 25317151 24838073
2291 24838073 25212313 25358002 25886077 27074408 27173926 27092877 27598301 27724128 26560957
2282 26560957 26581750 26477415 26104812 26399861 26705028 27769026 27719619 27928747 27766418 27475196
2272 27475196 28454299 29089295 29422638 30321773 30193648 30448934 31212479 31558001 32338699
2263 32338699 32848383 32839374 34062353 34721696 35302252 35942138 36762121 37022353 36363790 38053146
2253 38053146 38427359 39054199 40034530 40447881 40271578 40889964 42026053 43457769 44752463
2244 44752463 46207537 46968717 47605029 48780166 50478255 51030129 51465396 53198285 54789193
2235 54789193 55667431 57360118 59314975 60086953 61277649 62633016 64182061 66456354
2227 66456354 69081296 71224793 73262079 76389241 79432823 82918529 85170498 87793384
2219 87793384 91370128 94221628 96960139 101600038 105982182 110052592 114194550 118732856
2211 118732856 123767938 128765304 134996376 139497962 143782183 149891708 154990295 159665707
2203 159665707 163971785 167775956 171625716 174912683 177715197 179864323 181735598 183241294
2195 183241294 185396858 185638891 185414847 185625136 185546753 184747485 182224153 181398812 179796449
2186 179796449 176349313 173521951 169704087 165157444 161051339 156289393 151872203 146675949
2178 146675949 141329995 137056291 132363978 128167211 123515646 119014608 114425299 110498912
2170 110498912 106679280 102883387 99035713 96728350 93820150 90900203 88178372 85766930
2162 85766930 83890223 81822484 80383996 78154134 75845981 74891709 74260660 72920605
2154 72920605 71519538 69951617 68306804 66847038 65654323 63083148 62203520 61731570
2146 61731570 60710234 58997157 58471572 57986765 57233200 56725636 56133208 55887123 55442975
2137 55442975 54154286 54101211 53487049 53420952 53320881 51529835 49771493 48534136 47369953
2128 47369953 46886601 46569582 45878837 44841143 43981395 43813804 43898604 44327961 43451085
2119 43451085 43215796 43124756 42037919 41164858 41624011 41587883 40717328 40501013 41035871 41237330
2109 41237330 41465269 41690145 41919882 42103736 42042888 41250868 41042100 40883490 40597856 40949868
2099 40949868 41147735 40164051 39534612 39712153 39579563 37797968 37103578 37281576 37568804
2090 37568804 36953431 37582275 37962124 38142818 39628829 39464668 39187892 39426259 39156412
2081 39156412 39065629 39888506 40304892 40223206 41745241 41514625 42153394 42801464 43395708 44208041
2071 44208041 45669624 46718942 46235270 47001854 48421245 48191458 50048947 52166679 52936608
2062 52936608 53485646 55035351 56121590 57014699 59142301 60928900 62425261 63429522
2054 63429522 64483611 66066784 67042335 68397598 70148030 71262907 73237957 74648438
2046 74648438 76119946 77762798 79538297 79637832 81067895 82219906 81416178 81858302 82408773
2037 82408773 81742474 81290450 80346831 80082755 79659752 78885468 78644179 78447920 77815962
2028 77815962 77938013 76822585 76291304 76403265 75694379 74115652 73169362 71705243 70864059
2019 70864059 70707807 68506162 66169264 65971455 64494210 63185153 62452723 60855061 58520336
2010 58520336 57701432 56269841 54172363 52712870 50745811 49355393 48202285 46972647
2002 46972647 46004140 44652545 42444507 40984051 40158945 38795421 36903489 36218041 35363230
1993 35363230 34338912 34305462 34340524 33076391 31784958 31210967 30798154 30513561 29790329
1984 29790329 29163269 28801750 28383475 28218631 28974478 28608876 28117914 27698439 26909775
1975 26909775 25959583 26362625 26058845 25079706 25665713 25321659 24993084 25648023 26065194
1966 26065194 25446508 25451295 25051110 24669734 23905411 24627908 24542903 24275227 24219529 24196588
1956 24196588 23641658 23075161 23027714 22160063 21207721 20742866 20727764 19323799 18490208 18568799
1946 18568799 19113600 18244666 18026626 17340186 16801647 16226207 16213000 15568262 15300574 15660379
1936 15660379 15230431 14423834 13913005 14810760 14681669 14328554 14599357 14571063 14019893 13334399
1926 13334399 13236816 13495494 13577472 13445486 13939673 13519621 13173876 13061925 12709861 13128017
1916 13128017 13059735 12425447 12500840 13103650 13594893 14689103 14093839 14593343 14379248 13907348
1906 13907348 13308666 13287419 12889602 13182460 13810850 14907823 14282315 14367559 14781217 13961612
1896 13961612 14412547 14667414 13852466 14353479 14874742 14627410 15001444 15195487 14739012
1887 14739012 15187207 14788531 14765183 14671111 14163514 14201761 14388217 15876116 16218461 16968642
1877 16968642 16803510 16154313 16593264 17053637 17556934 17025035 15845523 16162721 17073208
1868 17073208 17055711 16783225 17859849 18848265 18639243 18576602 19013992 18764060 19866662
1859 19866662 21411895 21615119 21725016 21523530 21838614 22384698 23419950 24428961 24972751
1850 24972751 25341023 25256259 25717843 25959185 26488777 27380741 28089946 28747927 29728851 30708901
1840 30708901 31179896 30945085 33349173 34196870 34445907 36048701 36662402 38525634 39233895
1831 39233895 40075256 41684888 42405957 43521026 44787229 45821426 46847347 49073235
1823 49073235 51180544 52899543 54578012 56822424 60065289 62354288 64743206 66903597
1815 66903597 69449549 72160447 74662725 77706113 80917761 83577142 86152155 89725213
1807 89725213 93050073 96429131 100443585 103649100 106904174 110996911 113901971 116850710
1799 116850710 119443460 122070244 125672449 129792420 133537416 137100135 141388513 145813983
1791 145813983 151275884 157102079 162948364 170468445 178710409 188084338 198350746 208986368
1783 208986368 219345073 230370183 241796489 253957853 265506007 277053450 289402288
1776 289402288 302015799 314999560 327794482 340400171 353687533 364265172 371294269
1769 371294269 376583412 378105934 373824392 365166719 353214680 338191376 321660917 304183125
1761 304183125 285959531 268659662 253255166 238382598 224862329 213086201 202153486
1754 202153486 191610247 182623949 174686604 166885024 160307315 154445236 148555065 143318563
1746 143318563 137067390 132547464 128327624 123182991 119018923 114753277 110561571 106720064
1738 106720064 103251094 100312204 97526753 95202268 93109453 90716802 88790542 86651377
1730 86651377 84081499 82064563 79506512 77356999 76049741 73879598 70799184 68802836
1722 68802836 67283051 65084863 63501479 62689941 60958130 58266054 58137527 57519573 55244616
1713 55244616 53664987 51764625 50553559 49010863 47742397 45947559 44180449 42590991
1705 42590991 41519198 40581472 38897790 37987144 36845163 36895813 37114456 35744763 33850453
1696 33850453 33051505 32007713 30894119 30800363 29918993 29407035 28900858 27073123 26602020
1687 26602020 26520275 25846518 25578284 25032875 23999175 23247527 22816611 22484919 22764662
1678 22764662 22189764 21641611 20458431 20349508 19680649 18833621 18476655 18440814 18014558
1669 18014558 17772421 17602503 17337104 16758196 16515600 16128453 15714121 14693685 14031213
1660 14031213 14557533 14321739 13353475 12573177 12901335 12421873 11670820 12431118 12258807
1651 12258807 11844779 11778251 11346988 11563985 11474825 10828301 10605677 10804210 11352204 10950032
1641 10950032 9438963 9605676 9518905 9592530 9464919 10598079 10798946 9643530 9169622
1632 9169622 9149072 8202892 8572698 7972408 7513065 7808208 8430489 7913613 7735803 7299609
1622 7299609 6436212 7929170 8337468 7212923 6509338 5963771 6275330 7538162 7023726
1613 7023726 5718326 5946300 6145469 6151281 6481061 6374211 5549506 6041839 6353927 5788950
1603 5788950 5714104 5745502 5131074 4681744 5162411 4550944 4310834 4154242 3906095 3831921
1593 3831921 4434785 3534237 3273628 4324022 4196599 4423709 4472200 3791712 3841946 4525447
1583 4525447 4274912 4131886 3786698 3167697 3227963 2759609 2323480 2284478 2430886 2138220
1573 2138220 2243962 2743627 3150940 2988619 3004810 2586189 3016666 3149821 2706473 2371254
1563 2371254 2422970 2084477 1573466 1105943 1605688 2309475 2656277 2422467 2493908 2318803
1553 2318803 2410070 2315623 2322482 1863062 1682617 1158988 994538 1415299 1209493 1625845
1543 1625845 2405670 2336516 1853209 2138410 980811 1546470 2149589 1027773 951792 1411502
1533 1411502 1132234 1931208 1464437 751364 343783 1082960 1722809 1781660 1833332 2163559
1523 2163559 1945127 1698496 2067895 1950494 1561020 1330515 624173 345104 778478 943661
1513 943661 563211 1714400 1736403 1089091 572298 978491 1401004 1417620 1400254 1093585
1503 1093585 1232973 1414944 627170 585726 1083710 227299 96884 359360 129697 -2905
1493 -2905 324471 316428 -286859 -396770 551427 1017160 1118417 965210 975478 680058 1269799
1482 1269799 1009912 857774 887219 1974111 2010274 1354051 918701 774179 1409570 1631216
1472 1631216 1327914 754659 1469173 1523008 1866591 1515520 1551042 2711679 2332112 1792921
1462 1792921 1679382 2101989 1495837 2016160 3016817 2845026 2546692 1941032 950007
1453 950007 887913 948295 981804 385862 337015 868468 540635 1157662 495252 434250 502545
1442 502545 574416 -38674 -238015 462695 572451 710480 1224542 582745 293100 1506479
1432 1506479 434701 177754 904035 317332 279431 787723 1048709 150295 585128 1168440
1422 1168440 161894 230061 397661 212899 -322477 -24124 -297585 112321 -459968 -1253607
1412 -1253607 -606690 -143360 -460795 -1052262 -372843 -672880 -1213986 -155246 -12887
1403 -12887 -893407 -455679 68712 -553016 318766 332616 -953263 -967279 -1201277 -1519644
1393 -1519644 -995281 -778927 -268583 98673 -65114 -418897 59118 259069 -377110 -472599
1383 -472599 -405830 -829711 -876301 -224939 -507888 -319955 -306110 -1208836 -1498141 -1283851
1373 -1283851 -1108698 -1140630 -1555526 -644818 -56377 -426087 -729597 -602593 -368458 638619
1363 638619 647153 -200120 -563324 -640267 -938173 -687899 -28203 -694524 -895953 -993021
1353 -993021 -526427 -203633 -1341195 -1064933 -341239 67776 -1137274 -785198 -117522
1344 -117522 -1297179 -2183874 -1120465 -1007639 -1706543 -378274 -685945 -1449143 -408021
1335 -408021 -286495 -1046668 -775275 -1573815 -1082632 -1195648 -694283 -864227 -595892 299672
1325 299672 31612 1199771 273628 -1060838 -639833 -378251 -1759146 -1694958 -1069387
1316 -1069387 -674347 -743454 -577032 -529743 -2975 -412885 -1071638 -1629566 -954842 -402328
1306 -402328 -197868 437252 99114 -168042 162864 77447 -659866 -1513163 -1026193 -314573
1296 -314573 -388782 -215685 -1265019 -703330 -513470 491793 -9485 -721814 -1447673 -1286134
1286 -1286134 -1916533 -990943 -842570 -1660876 -1408244 -710367 -505642 25153 -68110 -970680
1276 -970680 -20280 -353635 -733125 -29341 -395475 -881732 -720908 -799412 -1490397 -1892970
1266 -1892970 -1082567 -1644298 -1779733 -903025 -463338 -1007183 -676661 -874376 -352833 -288618
1256 -288618 -102734 35771 -558560 -1018718 -1106895 -1085189 -1800215 -1944561 -801475 -504842
1246 -504842 -502049 -496930 -519955 -1032674 -1392228 -867386 -273000 -658029 -1050213 -1932918 -1759334
1235 -1759334 -688483 -572077 -1276706 -1325276 -596880 -178849 -124699 -558085 -380373 -366676
1225 -366676 -770128 -236552 -68689 -232602 -795565 -1456455 -1308009 -1557498 -1799414 -1377378
1215 -1377378 -1385856 -1155104 -1029936 -488765 -456641 -1457600 -779238 -342478 -634587 -1114378
1205 -1114378 -1109354 -1397639 -868438 -437946 6075 -340388 -689827 -1007996 -430764 79805
1195 79805 -85962 -725108 -143112 -223706 -1013241 -636617 -530868 -622195 -1146153 -1484793
1185 -1484793 -996859 -969856 -1221070 -493396 -541790 -705922 -373950 -1030415 -794917 -284480
1175 -284480 -1920871 -1930740 -964824 -1104781 -912261 -826272 -166078 -8502 -558706 -639242
1165 -639242 -664455 -1348185 -1374489 -1217659 -893049 -1031606 -638600 -57915 -628566 -574772
1155 -574772 -166204 -83689 -504399 -1370607 -549587 85493 -1161472 -1570719 -1286219 -313803
1145 -313803 379157 380883 -749953 -812096 -1388250 -1456040 -1439834 -1534574 -1981433 -1983366 -1608981
1134 -1608981 -1073123 -1418971 -1676482 -536461 -42674 -370953 -32231 424695 -265139
1125 -265139 -21102 -332056 -751070 -980122 -988724 -901701 -1139583 -2094783 -1663372 -675078
1115 -675078 -799638 -1809286 -1580391 -596707 -225342 -339034 -176691 -789030 -775362 -93857
1105 -93857 -243823 -713329 -1063267 -1171996 -1241296 -776558 -835727 -1607753 -1215961 -580477
1095 -580477 -785503 -640173 -40472 -135637 -605607 -1423366 -892475 -19974 -383011 -996742
1085 -996742 -1349079 -1398091 -1622203 -1345972 -193041 -560530 -925514 -365199 -653376 -791154
1075 -791154 -1012417 -835627 -728409 -353035 -1289724 -239572 64499 -486581 -843814 -735057
1065 -735057 -1543685 -1789561 -1603815 -1439736 -943376 -265226 -802610 -190830 6792 -180562
1055 -180562 -286626 -246304 -315009 -1101180 -1492700 -1470647 -667678 -1262281 -1309525 -779860
1045 -779860 -845495 -956677 -680000 -851062 -812207 -995128 -889731 -432051 -317692 -1031797
1035 -1031797 -835429 48360 -51129 -113565 -589554 -318197 -914210 -494530 196133 -147930
1025 -147930 -556259 -740336 -446619 606480 582973 -831490 -1050159 -895918 -1485170 -1156969
1015 -1156969 -486485 -750470 -873365 -632236 301016 816640 867246 342089 -3789 153087
1005 153087 533528 -225731 115174 324543 167306 -146874 566493 -642366 -1025220 -525239
995 -525239 -189310 -157154 195458 -52701 663913 -149715 -472066 -110011 -118624 -458380
985 -458380 -594412 241350 291359 111714 383077 520471 1079586 1247621 1974227 2360243
975 2360243 1564272 1436806 828398 181810 632316 1461792 1044548 189165 53216 -42914
965 -42914 961128 842128 866533 1699772 2404000 3017906 4117413 4772940 4980444 5700908
955 5700908 5070370 4697144 5279462 5479253 5173768 6401423 8609585 9844676 10344331
946 10344331 12088233 14489424 16495112 19904384 23516889 22728404 21836948 19002612 15718553
937 15718553 13242065 10186929 7741566 7407631 5832912 4651509 3465332 3220457 3218754
928 3218754 2913103 3407818 4322299 3708799 4073986 3803574 3233860 2782987 2273909 1312925
918 1312925 1174260 381217 -513600 -64209 130345 7054 991472 1111370 758573 1695128
908 1695128 1267687 1144220 1651371 1716643 1552113 1750147 1206947 1045350 -465573 -1073961
898 -1073961 -437735 -451185 -324298 -318320 -123493 112778 556461 792631 719303 -413209
888 -413209 -276173 314658 219919 362661 394751 -80728 24525 373602 -611140 -447973
878 -447973 303043 -498493 -56585 930053 554393 1062710 1090414 1055219 836310 369920
868 369920 -312001 88716 -848059 -789509 -843270 -1401669 -713812 190899 296773 781010
858 781010 1054540 327813 -191793 81958 777157 868915 428576 -201261 -139291 563006
848 563006 118132 193176 -2429 -594749 -1206898 -132085 391180 161355 -266600 489578
838 489578 -556275 -1008361 -741388 -1208195 -1493704 -993434 -633326 24137 775137 439814
828 439814 1307494 1155344 1215647 848141 637105 476238 -289603 -415542 -433486 -987774
818 -987774 -361623 -901141 -386916 -477267 74269 -442493 233577 1135767 583363 465069
808 465069 748752 363320 845937 1070708 -214925 -181769 -633993 -654195 -944387 -709400
798 -709400 -660661 -260605 286678 374221 -286351 -636560 431239 517326 448463 69287
788 69287 -691565 -1272208 -881591 -635254 -1264205 -1243141 -1322586 -1582705 -690585 -204874
778 -204874 -127961 785779 618646 598666 477887 13392 -367369 395037 1332373 841047
768 841047 488020 268798 -351645 -901971 7356 -200394 -945073 -767655 -1740781 -1950461
758 -1950461 -490457 -253334 -1211436 -51709 -527819 -1011554 231616 830100 75142
749 75142 -192467 37713 -96610 -61188 -222754 163168 -599859 -626524 -1208960 -1556248
739 -1556248 -1344560 -1141749 -1114288 -508910 -533003 -543908 -178605 -455475 -655596 102794
729 102794 182113 -610737 -821113 -1364677 -831450 -962201 -1543825 -1599324 -1440713 -1467668
719 -1467668 -613574 483497 282496 249795 54160 11609 -97580 -910700 -1257825 -949575
709 -949575 -1395915 -1283206 -891657 -1652665 -1822568 -1574120 -1449645 -315023 37117 63147
699 63147 -65297 582272 1115082 930062 575789 166963 -543423 -895943 -77448 -1044369
689 -1044369 -1672244 -1623798 -1031561 -1206096 -302394 -56208 -446587 -432453 -385773 245145
679 245145 453726 614855 381614 -649289 -554471 417193 -71036 -21854 367742 -277
669 -277 -287602 -198501 -767777 -1569146 -1226322 -1398033 -1069688 -430948 -346107 -227310 -279269
658 -279269 -269330 -116064 -223867 -1660484 -1998153 -1268710 -740040 -703789 -1250715 -427273
648 -427273 163791 -178947 -72440 484036 -143919 226476 511304 -24180 312371 657726
638 657726 78499 -418685 -261038 -481514 -363509 -300432 -680333 -1380435 -1018373 312818
628 312818 168357 22960 187760 279056 355166 512278 984084 505198 -601227 -1146153
618 -1146153 -508294 -252524 -433418 -691230 -175817 -741824 87139 652341 -31249 -798020
608 -798020 -889416 145976 -233817 -336589 -667333 -1333407 -583069 81308 -434259 -1183875
598 -1183875 -648055 -775024 -775288 -348634 -903471 -558405 -794420 -1004375 32688 188572
588 188572 353617 553057 169545 37460 -84807 -246186 -59630 -477038 -936612 32845
578 32845 -257044 -552916 -129484 -533821 -1014078 -333213 -210927 -24333 396406 -282230
568 -282230 -779077 -143717 323149 332595 648313 -30686 494569 720946 81802 596964
558 596964 61780 -994212 -1022761 -268890 -340662 -511115 -1097526 -864582 -515538 146941
548 146941 991762 315961 -179081 -672134 -629986 -777156 353275 30337 -543623 -431929
538 -431929 -33062 -335357 -1499381 -388742 95228 -37499 -308273 43637 641276 286010
528 286010 1115864 317670 -131665 159892 302683 -315619 -660800 -204386 -1367899 -1181740
518 -1181740 -453287 583098 1031400 599494 356294 190062 130315 370422 -1324 -823745
508 -823745 -679266 -88920 397954 -386922 -90729 230453 -757327 -270103 -199196 -499166
498 -499166 -345584 -724662 16130 595060 846796 349643 561264 -136194 -399879 1079392
488 1079392 266765 -608199 -637142 -1115340 -1515898 -9288 955024 719243 510367 783898
478 783898 344271 42083 122033 152701 -582616 -291678 356308 309593 -251207 -387567
468 -387567 -234286 -316068 -561626 -364497 -261517 288169 392648 953466 1183173 991913
458 991913 450568 445714 290807 334644 -90081 -482557 -173495 -41103 -286756 -508894
448 -508894 583093 1431982 1197617 606167 1043369 385233 411086 -474947 -314977 -412168
438 -412168 -740824 -158315 -346875 -685669 -223994 732431 970760 1007499 751502 1083305
428 1083305 570212 108874 -26586 -153640 -342319 -598014 -477912 -916015 -12993 349743
418 349743 56480 -593354 -586531 -39089 375636 642807 -222537 584334 1703466 1320098
408 1320098 605294 80112 -115856 233008 -155531 -937654 -920749 -1436748 -1312458 -742631
398 -742631 441894 847173 544124 664963 1468834 1169999 172526 -137766 -421831 -787234
388 -787234 -411482 -298741 -456543 57521 90439 22816 -485892 -567192 -454985 77172
378 77172 892913 686127 790756 402713 426449 180130 -210945 -635604 -921401 -1246179
368 -1246179 -1989227 -1856602 -338985 59517 183115 389609 736826 489771 1043833 1367636
358 1367636 663106 531380 156715 148947 343554 1217400 48878 -261529 350193 254983
348 254983 590447 115558 -541993 -814989 -300721 439398 673073 464792 -215611 -27174
338 -27174 1272537 1355372 704179 158230 -362746 -454649 -474507 -552735 -1090135 -444731 -283369
327 -283369 607582 342695 1417346 1281311 736242 458383 374135 -15409 -665457 -657580
317 -657580 -382942 643116 657475 1460292 1376484 764735 495703 432241 138305 138695 329664
306 329664 53927 555084 1241851 2073337 1221285 305210 467388 -363461 -158398 610959
296 610959 924203 636497 1045494 1324428 700015 429952 127455 263288 267734 -510180
286 -510180 220111 570479 624334 158547 206994 695822 1138636 1224923 686969 124453
276 124453 544858 991416 -24876 -75520 -8137 99041 631744 1180435 198991 359718
266 359718 1257901 1156317 538052 804845 50197 -706895 -93702 232640 297883 -227521
256 -227521 -64954 667575 1380950 1099824 376929 172646 -60700 -495380 -463577 -379774
246 -379774 -818320 -294883 563855 476034 -3166 -183537 -510707 -419101 592629 775634
236 775634 382807 53928 -99159 375811 879143 766870 895851 79167 -96560 -531353
226 -531353 14834 849263 1019571 241391 709148 761353 895476 757503 196457 419903
216 419903 311138 669090 100591 159695 745857 -16057 751222 1415563 902445 1297438
206 1297438 2079668 1660217 1220312 1505268 517187 662302 134104 285386 -292642 -63794
196 -63794 294736 648234 704924 1325479 1384710 380039 598728 -537394 -705546 393830
186 393830 1027778 1146877 952781 729599 574517 491305 626869 -259476 -426608 191185
176 191185 -45101 -152521 1056328 1200914 1049919 1688181 657114 296587 379777 35931
166 35931 -396044 -418218 572097 206416 211154 119164 436415 841418 910531 1509015 1387193
155 1387193 721695 33782 -211514 26347 390773 611004 881615 -74640 -430574 -67637
145 -67637 -527706 -852867 -119893 520676 1045668 1247758 1518269 1734376 2109455 2139270
135 2139270 1349000 355104 -552867 -798525 -832360 -378943 296754 249854 245266 175075 238597
124 238597 276381 700151 1195377 1510156 1603371 529643 463732 515232 -90844 32740
114 32740 58350 37191 -92242 -430973 -157082 458527 707823 780958 488787 604944 784364
103 784364 1103248 1435681 1359801 1347425 363196 137327 -69677 -363544 212453 371546
93 371546 356096 431175 259945 130749 545172 845187 501299 -29689 115605 307469
83 307469 498722 800346 1394442 1305289 637195 746732 679201 948691 982390 365670 -262790
72 -262790 -194202 -181529 615208 274012 893276 1208072 778919 378223 235277 126033
62 126033 -24545 228172 -405813 -762952 -289602 81626 -111551 498492 902476 772258
52 772258 667487 684536 661912 386411 -69961 -92411 -162483 477002 235886 -40948 -178996
41 -178996 117923 254126 113386 293323 15468 -87319 248210 254149 122925 628134
31 628134 1070453 430020 -124129 13345 -68017 -213363 5371 466065 652073 1126167
21 1126167 1004523 401050 259355 736261 242090 641876 797909 318873 397608 69094
11 69094 -72081 -216860 143552 518682 427564 576202 680720 332722 347004 336673 701673
0 701673
$$ Imaginary data points
##PAGE= N=2
##DATA TABLE= (X++(I..I)), XYDATA
16383 -6623001 -6322745 -6870684 -6970192 -7222998 -7131399 -6988139 -6174956 -5577476 -6133396 -5535243
16373 -5535243 -5240312 -5772175 -5540538 -5482559 -4874108 -4716716 -5315601 -5606116 -5454767 -5523904
16363 -5523904 -5258678 -4852149 -4595201 -5094441 -4693915 -4810302 -4940550 -4776990 -4676403
16354 -4676403 -4280112 -4105587 -4181207 -4116742 -3884720 -3915406 -4391519 -4388264 -4281084 -4183468
16344 -4183468 -3545788 -3299787 -3388451 -3333934 -3223206 -3627533 -3672954 -3546720 -3297107 -3803024
16334 -3803024 -3674027 -3087257 -3331196 -3454897 -2542452 -2043257 -2542380 -2338227 -2614107
16325 -2614107 -2784675 -2680580 -2718516 -2125615 -1839125 -1571944 -1837638 -2185492 -1553181 -1130653
16315 -1130653 -1881805 -1292855 -1129188 -1754003 -1107831 -882865 -1070471 -1480388 -749069
16306 -749069 -909737 -1092182 -1047283 -883087 -1406884 -855081 -400728 -367419 -428868 -1053351
16296 -1053351 -303693 74660 -24129 -179845 -300561 -43008 469843 251080 31502 76537
16286 76537 -57504 -662279 -822011 -607785 -708067 -748558 -131670 737893 940554 1351504
16276 1351504 331197 330356 1092945 424403 349167 840513 1196745 808923 1198083 1390068
16266 1390068 1032929 929758 1213497 1226970 1339977 1166116 1800388 1939505 1291519 1992624
16256 1992624 1975212 1429123 1764145 1666643 1214898 680971 1093867 546269 1516406 2217285
16246 2217285 2239488 1779194 2637101 3087332 2264757 2787724 2869663 2151373 2007585 2009858
16236 2009858 1136736 1422158 2521928 2808299 2477326 2967213 3229556 2395092 2254116
16227 2254116 3105254 2716019 2740469 3293766 2758365 2636837 3300379 2943225 1796873
16218 1796873 2085097 3152051 2724940 2471048 2816263 2972631 2758655 3634643 3757633
16209 3757633 4362925 4480066 3936919 2833317 2938588 2942389 2583247 3682404 3153046
16200 3153046 2230565 3344374 3751115 4149709 4453537 3884550 3510947 4227582 4029517
16191 4029517 3448891 4016437 3560503 3378507 3457849 3359966 3119846 3716762 3258339 3244431
16181 3244431 3127243 3220992 3221045 3385400 4078935 3974175 3776910 5040016 5114848 4622952
16171 4622952 4362792 4390893 4710461 3629572 4408591 4811098 3693220 4311168 4626642
16162 4626642 4578544 4948042 4765260 4659461 4406840 4757776 3679474 3988888 5334241
16153 5334241 4012255 3547903 4525417 4128053 3467238 4648845 4688038 4182910 5133855
16144 5133855 5457835 4909539 5514377 5823626 5117408 5261362 5315619 4353579 3577139 4198618
16134 4198618 4435612 4836702 4763578 4393020 4347254 5040166 5145442 5578650 5640674 5791578
16124 5791578 5873143 5490172 4275754 4634405 5025209 4088412 4600396 4334567 4613985
16115 4613985 4808323 5901201 5776431 4738389 5203399 5927338 5568742 5518502 5115353
16106 5115353 4958764 4655369 4475839 5741283 4926550 4638718 5051856 4532086 4856492
16097 4856492 4848441 4458730 4895703 5486240 5426392 4868224 5026644 5446321 5446864 5387436 4965610
16086 4965610 4258447 4383392 4282263 3901637 4138751 4843432 4441788 5176023 6053965
16077 6053965 5346410 5659960 5641023 5160588 4892987 5118452 4812015 5616372 5795910 4865061
16067 4865061 4399992 4838726 4879390 4685815 4450306 4329528 4841219 5651763 5029103 5040957
16057 5040957 6162403 5635093 5003830 5084752 4633017 4084251 4381987 3881693 4188726
16048 4188726 5030579 5245898 5540779 6323671 6311017 6030457 5593511 5373241 4892077 4293041
16038 4293041 4610791 4696058 5132553 5162520 6276843 5670647 4652671 5192664 4765687
16029 4765687 4926306 5047726 4888327 4463122 5323719 6408388 6010491 5822681 5563980
16020 5563980 4951179 4645028 5182135 4721498 4372524 4713443 4499244 4833549 5122966
16011 5122966 5353012 4556006 4680887 4734364 4238368 5018312 5576146 5621217 5138452 5351445
16001 5351445 5955317 5677156 5121736 5736289 5442750 5049530 5866015 5825625 4939689 5329835
15991 5329835 5675251 4432924 4801309 5360453 4663490 5317679 6683282 5682041 4649476
15982 4649476 4814370 5518614 6014998 5758589 5577840 5656564 5299050 5205663 5140399 4172087
15972 4172087 3923857 4421392 4436691 5066334 5503788 5652514 5604247 6051831 6984840 6718169
15962 6718169 6875725 6641380 5390973 4451792 4285086 5186714 5478338 4732435 4741447 4643761
15952 4643761 4347280 4967390 5159120 4980532 5193310 5896387 5576996 5428467 6381204
15943 6381204 5548313 5395492 6379307 5587625 4955946 4694703 4407248 3324805 3857233
15934 3857233 3764746 3758044 4758775 5503067 5896282 6142521 6415084 5504432 6016771 6394028
15924 6394028 5963704 5726930 5635475 3911369 3582041 4189979 3855893 4387307 5010596
15915 5010596 5056051 5742437 5293961 4887218 5075910 5321483 5378005 4778931 4037529 4498553
15905 4498553 4643559 5073080 4954589 5455259 4495037 3958363 4638112 4909979 5595327
15896 5595327 6398245 5838613 6251302 6896146 6090621 6620775 6531924 5939998 5040985 4928190
15886 4928190 4645120 3894163 4404698 4503121 4567850 5524192 4984997 4958666 5932650 6162745
15876 6162745 5189462 5570340 5365469 4475432 4934782 5402384 5227764 5443850 5436968 5360844
15866 5360844 5064067 5305691 4727790 5004994 5375703 5373441 6405288 6127545 5600202 5747312
15856 5747312 6453745 5970087 5036706 5070720 4441824 4635129 4902544 4965976 4200110 4168363
15846 4168363 5196459 5306024 4603838 5742282 5979698 5457123 5286913 5257123 4682596
15837 4682596 5175711 6080089 5345218 4895605 5292346 5290676 4530657 4992442 5169833 4444545
15827 4444545 4646547 5365691 4994023 5932693 5586208 5696589 6364851 6031892 5905483
15818 5905483 5758317 5506019 5086518 4497792 4897407 4786523 5109593 5575657 5546129 5590651
15808 5590651 5516636 5789492 5011454 4903218 4473591 3899538 4153685 4443909 5517280
15799 5517280 5531216 5155713 5462014 5239232 5683532 5401007 5044246 4808487 4850611 5042354
15789 5042354 4779202 4894681 4998298 5303148 5098828 4631770 4707583 4717016 4123712 4423184
15779 4423184 5091004 5475845 5866867 7008630 6422020 5900839 6474443 6357008 6165373
15770 6165373 5639320 5029863 5129601 5037088 4528591 4990350 5562777 5067885 5363852 5824327
15760 5824327 5827424 5907933 5827257 5287327 4580973 5227371 5449995 5009671 5119861 4780233
15750 4780233 4297965 4943097 5575491 5148042 5049011 4855788 4312043 4998107 5819443 5447094
15740 5447094 5967020 6100167 5760656 5195514 4752807 3809750 3932934 4827846 4220545
15731 4220545 3520830 4731181 5457974 5287672 5149474 5271469 5228643 5146429 5854451 5723049
15721 5723049 5074843 5805574 5542716 4746072 4958194 5757826 5248509 5332884 5939584 5072189
15711 5072189 4501217 4995680 6254783 5310315 5355342 5286122 4969689 5318925 5942981 6022786
15701 6022786 6245092 6004534 5590180 5887066 5113744 4464908 5284331 5260811 5560329 6198319
15691 6198319 6249782 6259863 6089297 5797149 5527296 4647915 4761689 4764049 5164790 6183624
15681 6183624 6007185 5396039 5585614 5166696 4781941 4998700 4606012 4384273 4138337
15672 4138337 4830574 4962538 5370422 5794877 5412084 5686122 6056058 6061892 5422383 4383610
15662 4383610 4843526 5323476 5239214 5340803 4462867 4314058 4939426 4631549 4692827 4828767
15652 4828767 4342483 4727274 4877344 4608901 4703089 6609762 7154004 6509430 5751677
15643 5751677 5643618 5739953 4836430 4795431 4556474 3943401 3840215 4059769 4916399 4773336
15633 4773336 6087519 6024245 5405854 5476298 5479948 6168731 6324427 5566396 5502922 5718388
15623 5718388 5131484 4271472 3968785 4443041 4248350 4345043 5709574 5525145 4983129
15614 4983129 5192337 6051436 6534638 6756202 6485353 6217004 6248316 4904533 4871552 4861038
15604 4861038 4558510 3915078 3943325 4422618 4780801 4487887 5652691 6026088 5667753
15595 5667753 5642117 6200791 5650559 5420868 5753803 5728519 6413949 6195850 4590286 5083670
15585 5083670 5808583 5317728 5265963 4910491 3997829 4586265 5344620 5509440 5273105 6419837
15575 6419837 5855879 5519015 6052557 5129557 4328727 5594581 5883412 5111437 4748978
15566 4748978 4580817 4223073 4375020 4524786 4477275 4696709 4706143 4495721 5083098 5357393
15556 5357393 4750602 4618161 4433877 4169878 4049221 5033031 5842611 5552288 5873648
15547 5873648 5402794 4768598 5112261 4926114 4301174 4376511 5621731 5576272 5653566 6297369
15537 6297369 6628014 5347722 5836816 5952406 4691246 4635019 4862596 4221791 4887476
15528 4887476 5317917 5129296 4964663 5524239 5335304 4686643 5162395 5065560 5029265 4927730
15518 4927730 5200905 4794132 6088422 6124595 4612966 5396938 5260668 5099587 5515296
15509 5515296 5952549 4247989 4240248 5124072 4896442 5293287 6077321 5915335 6176298 6208644
15499 6208644 6106258 5436951 5434753 5467549 5498189 4987235 4747282 5196938 5007318 5477743
15489 5477743 4954900 5001130 5677828 5696024 5419948 6413794 6141612 5989319 6423286 6483449
15479 6483449 6001676 5507939 5315554 4648021 4736337 5309196 5175213 5183134 6175447 5790169
15469 5790169 4825361 5536464 5608249 4775174 5263027 5900324 4926727 6105072 5723497
15460 5723497 5225153 6188800 5465594 5268563 4836783 5231628 5049849 5583244 4921854
15451 4921854 4857573 4878978 4732263 5102865 5286049 5684842 6260379 5539130 5031980 5123033
15441 5123033 5423003 5628293 6005672 6307574 6266057 5712334 5425585 5578901 5092477 4291951
15431 4291951 4150960 4427223 4796868 5003934 4813791 5691733 5849318 5577962 5725405
15422 5725405 5099963 5493842 6063798 4844573 4851983 5826375 5466648 4941769 5009237 4575144
15412 4575144 5131749 5594829 5891848 5508901 6258057 6070881 5444366 5700912 5670145 5398115
15402 5398115 6134656 5408072 5139997 4842987 4541594 4306409 4751140 4915937 4381972
15393 4381972 4172517 4552052 5340475 5638602 6541024 6931098 6023378 6440105 6360189 6201390
15383 6201390 6289600 5932143 5646341 4157942 3707255 4858888 4659575 4768132 5223249
15374 5223249 5405531 6342111 6534907 6395751 6014472 5769890 5403471 5583102 5602810 5160291
15364 5160291 5080520 5528280 5563003 4967442 4783165 5123874 5400581 5396358 5600482 5867703
15354 5867703 6650498 6025015 5529230 5992401 5485383 4843136 4814563 5008296 3932165
15345 3932165 3655985 4346378 4576385 5215772 5941407 6123412 6847324 5933405 5981846 5821802
15335 5821802 5210223 5417255 4888241 5489782 5402187 5060763 5446685 5558075 4591718 4383915
15325 4383915 5483753 5308406 5109985 4867154 5265318 5485663 5383113 4776157 5344759
15316 5344759 6428662 6285987 5182642 5290747 5218997 5341996 5321655 4746692 5187767
15307 5187767 5368327 5400568 6207120 7438724 6930237 5783450 5550617 5173629 4395386
15298 4395386 5388194 5780258 5301895 4580774 5157205 5140948 4906178 5355433 5152082 5777163
15288 5777163 5879263 5585655 5749234 6473928 5515888 5118826 5481198 5422352 5189162 5315296
15278 5315296 5790145 5779905 4895931 5281311 6198629 6108462 5747531 6672697 6835361 6068522
15268 6068522 5852029 4225690 4345528 5020944 4568234 4147643 5088285 5036738 4728958
15259 4728958 6045585 6308314 5983164 6110132 7716186 6340151 5915857 6888841 6664339
15250 6664339 5905447 5169236 4907242 4320371 4613209 4566152 5806291 5432216 4675829
15241 4675829 5618032 5015392 5006230 5538918 5608741 6342636 6190824 6261887 5123771 5741884
15231 5741884 5511983 5270814 5299064 5446234 5813816 6263827 5355509 4907286 6006083
15222 6006083 6672122 6669301 5680465 5427825 5063278 4821303 5252519 5047740 4773314 4963929
15212 4963929 4815041 5456469 5506792 5910868 6046669 6314461 5439779 5352353 5199320 5696311
15202 5696311 4930181 4655733 4813513 5277894 5099769 4551260 4668497 4542220 4903275
15193 4903275 4966858 4699278 4236380 4654291 5515274 6058982 6371924 6834004 7203054 6632569
15183 6632569 5684727 4814918 5059949 4954655 4218361 5149853 4734899 5367260 6105443
15174 6105443 5885395 5920479 6447133 5376412 4595670 5815197 6000698 5028409 6400433
15165 6400433 6898253 5514941 4650029 5781035 5178681 5302672 5659074 4465873 4895293
15156 4895293 4684190 4162977 4657999 6043490 6364293 6745929 7751056 7896292 7155230
15147 7155230 6543232 5998689 5596563 5370604 4737914 5062738 5103853 5161347 6308936 6236489
15137 6236489 5787992 5034767 4657232 4476115 5293234 5749903 5486177 6469138 5803278
15128 5803278 5693829 6899010 6781189 6134086 6426223 5804664 5080765 4612576 4930715
15119 4930715 5437989 5750279 5367412 5529667 5838353 5416604 4239774 4576068 4993262
15110 4993262 4560401 4409472 5183221 5783752 5759280 6518256 6291278 6437842 6421441 5620026
15100 5620026 4963255 5367615 4319496 4065899 5151833 6005451 4931217 5327004 5871869
15091 5871869 6416842 6531560 6343785 5972638 5176662 5744681 6644517 6075950 5592874
15082 5592874 5730607 6016395 6042399 5653020 5048244 5771135 5806159 4642074 4587912 5699081
15072 5699081 6724056 6320446 5563881 5727888 5538821 5312814 5230440 4565987 5622769
15063 5622769 5914804 4658585 5031313 5547721 5024066 5131323 5431413 5886689 6578969
15054 6578969 7305109 6452660 6377897 6551598 5566101 5404868 5141975 4626213 4904040 5171846
15044 5171846 5389916 5040473 5038549 5279377 4972333 5007396 4673500 5318784 5955612 6406018
15034 6406018 6958386 7062695 6345966 5276659 4945348 5148490 4597764 3472613 4837424
15025 4837424 5100182 4328212 4495617 5379078 5785061 5880336 7078449 6789242 6379568
15016 6379568 6208796 5168301 4592207 5165250 4612814 4628963 4895139 4866968 5417460 6149513
$$ [...]
##END NTUPLES=NMR SPECTRUM
##END=
