##TITLE=1H_TG-2327-XY
 DMSO, 8 sc, 
 2.06.2021
##JCAMPDX= 6.0         $$ Bruker NMR JCAMP-DX V2.0
##DATA TYPE= NMR SPECTRUM
##DATA CLASS= NTUPLES
##ORIGIN= UXNMR, Bruker Analytische Messtechnik GmbH
##OWNER= root
$$ XWIN-NMR		Version 3.5
$$ Wed Jun  2 12:17:28 2021 Russian Standard Time (UT+4h)  she@DPX200
##.OBSERVE FREQUENCY= 200.131506
##.OBSERVE NUCLEUS= ^1H
##.ACQUISITION MODE= SIMULTANEOUS
##.ACQUISITION SCHEME= undefined
##.AVERAGES= 8
##.DIGITISER RES= 18
##SPECTROMETER/DATA SYSTEM= spect
##.PULSE SEQUENCE= zg30
##.SOLVENT NAME= DMSO
##.SHIFT REFERENCE= (INTERNAL, DMSO, 0, 16.0445)
##AUDIT TRAIL= $$ (NUMBER, WHEN, WHO, WHERE, WHAT)
$$ ##TITLE= Audit trail, XWIN-NMR		Version 3.5
$$ ##JCAMPDX= 5.01
$$ ##ORIGIN= Bruker BioSpin GmbH
$$ ##OWNER= she
$$ F:/spectra/data/she/nmr/H-F/1/pdata/1/auditp.txt
$$ ##AUDIT TRAIL=  $$ (NUMBER, WHEN, WHO, WHERE, WHAT)
(   1,<2021-06-02 12:15:18.12 +0400>,<she>,<DPX200>,
      <created by zg, POWCHK disabled, PULCHK disabled
       configuration hash MD5:
       00 E9 B6 7A A2 85 ED C7 34 08 36 98 17 FE 4E 26
       data hash MD5: 16K
       D5 04 0C 65 B2 5A 5A 11 3A F6 B1 61 B1 77 11 3F>)
(   2,<2021-06-02 12:15:20.73 +0400>,<she>,<DPX200>,
      <Start of raw data processing
       efp BC_mod = 2 LB = 0.24 FT_mod = 6 PKNL = 1 PHC0 = -11568.24 PHC1 = 19.20099 SI = 16K 
       data hash MD5: 16K
       E8 FB 34 6F 92 2B 72 F1 9F D1 4D 73 44 24 EF 3A>)
(   3,<2021-06-02 12:15:44.17 +0400>,<she>,<DPX200>,
      <pk PHC0 = 89.2049 PHC1 = -12.2 
       data hash MD5: 16K
       6D 73 CE 2A 56 07 CC D2 6C AB 70 A0 98 81 3D 9B>)
(   4,<2021-06-02 12:15:47.81 +0400>,<she>,<DPX200>,
      <abs ABSG = 5 
       data hash MD5: 16K
       2F F5 80 60 2A 43 DA 0D 37 F8 9B 69 BE 0A 0F AF>)
$$ ##END=
$$ 
$$ hash MD5
$$ 8D 91 1F EC EA C6 16 85 07 E8 DB A8 0A 15 04 B8
##$RELAX= 
##$RELAX= 
##$RELAX= 
##$RELAX= 
##$RELAX= 
##$RELAX= 
$$ Bruker specific parameters
$$ --------------------------
##$DU= <F:/spectra>
##$EXPNO= 1
##$NAME= <H-F>
##$PROCNO= 1
##$TYPE= <nmr>
##$USER= <she>
##$AMP= (0..31)
100 100 100 100 100 100 100 100 100 100 100 100 100 100 100 100 100 100 
100 100 100 100 100 100 100 100 100 100 100 100 100 100 
##$AQSEQ= 0
##$AQ_mod= 1
##$AUNM= <au_zg>
##$AUTOPOS= <>
##$BF1= 200.13
##$BF2= 200.13
##$BF3= 200.13
##$BF4= 200.13
##$BF5= 200.13
##$BF6= 200.13
##$BF7= 200.13
##$BF8= 200.13
##$BYTORDA= 1
##$CFDGTYP= 0
##$CFRGTYP= 5
##$CHEMSTR= <none>
##$CNST= (0..31)
1 1 145 1 1 1 1 1 1 1 1 1 1 1 1 1 1 1 1 1 1 1 1 1 1 1 1 1 1 1 1 1 
##$CPDPRG= <>
##$CPDPRG1= <>
##$CPDPRG2= <>
##$CPDPRG3= <>
##$CPDPRG4= <mlev>
##$CPDPRG5= <mlev>
##$CPDPRG6= <mlev>
##$CPDPRG7= <mlev>
##$CPDPRG8= <mlev>
##$CPDPRGB= <>
##$CPDPRGT= <>
##$D= (0..31)
0 1.2 0 0 0 0 0 0 0 0.06 0 0.03 0 0 0 0 0.0002 0 0 0 0 0 0 0 0 0 0 0 0 
0 0 0 
##$DATE= 1622621717
##$DBL= (0..7)
120 120 120 120 120 120 120 120 
##$DBP= (0..7)
150 150 150 150 150 150 150 150 
##$DBP07= 0
##$DBPNAM0= <>
##$DBPNAM1= <>
##$DBPNAM2= <>
##$DBPNAM3= <>
##$DBPNAM4= <>
$$ [...]
##$SUBNAM3= <"">
##$SUBNAM4= <"">
##$SUBNAM5= <"">
##$SUBNAM6= <"">
##$SUBNAM7= <"">
##$SUBNAM8= <"">
##$SUBNAM9= <"">
##$SW= 16.9725357007746
##$SWIBOX= (0..15)
0 0 2 0 0 0 0 0 0 0 0 0 0 0 0 0 
##$SW_h= 3396.73913043478
##$TD= 16384
##$TD0= 1
##$TE= 0
##$TE2= 300
##$TE3= 300
##$TEG= 300
##$TL= (0..7)
0 120 120 120 120 120 120 120 
##$TP= (0..7)
150 150 150 150 150 150 150 150 
##$TP07= 0
##$TPNAME0= <>
##$TPNAME1= <>
##$TPNAME2= <>
##$TPNAME3= <>
##$TPNAME4= <>
##$TPNAME5= <>
##$TPNAME6= <>
##$TPNAME7= <>
##$TPOAL= (0..7)
0.5 0.5 0.5 0.5 0.5 0.5 0.5 0.5 
##$TPOFFS= (0..7)
0 0 0 0 0 0 0 0 
##$TUNHIN= 0
##$TUNHOUT= 0
##$TUNXOUT= 0
##$USERA1= <user>
##$USERA2= <user>
##$USERA3= <user>
##$USERA4= <user>
##$USERA5= <user>
##$V9= 5
##$VALIST= <valist>
##$VCLIST= <CCCCCCCCCCCCCCC>
##$VD= 0
##$VDLIST= <DDDDDDDDDDDDDDD>
##$VPLIST= <PPPPPPPPPPPPPPP>
##$VTLIST= <TTTTTTTTTTTTTTT>
##$WBST= 1024
##$WBSW= 4
##$XGAIN= (0..3)
0 0 0 0 
##$XL= 0
##$YL= 0
##$YMAX_a= 276813
##$YMIN_a= -290476
##$ZGOPTNS= <>
##$ZL1= 120
##$ZL2= 120
##$ZL3= 120
##$ZL4= 120
##$ABSF1= 15.99578
##$ABSF2= -0.9768839
##$ABSG= 5
##$ABSL= 3
##$ALPHA= 0
##$AQORDER= 0
##$ASSFAC= 0
##$ASSFACI= 0
##$ASSFACX= 0
##$ASSWID= 0
##$AUNMP= <proc_1d>
##$AZFE= 0.1
##$AZFW= 0.1
##$BCFW= 0
##$BC_mod= 2
##$BYTORDP= 0
##$COROFFS= 0
##$CY= -3
##$DATMOD= 1
##$DC= 0
##$DFILT= <>
##$DTYPP= 0
##$F1P= 0
##$F2P= 0
##$FCOR= 1
##$FTSIZE= 16384
##$FT_mod= 6
##$GAMMA= 0
##$GB= 0
##$INTBC= 1
##$INTSCL= 1.334414e-10
##$ISEN= 128
##$LB= 0.24
##$LEV0= 0
##$LPBIN= 0
##$MAXI= 10000
##$MC2= 0
##$MEAN= 0
##$ME_mod= 0
##$MI= 1.114404
##$NCOEF= 0
##$NC_proc= -6
##$NLEV= 6
##$NOISF1= 3.799351
##$NOISF2= 2.8
##$NSP= 0
##$NTH_PI= 0
##$NZP= 0
##$OFFSET= 16.04447
##$PC= 1
##$PHC0= -11479.04
##$PHC1= 7.000991
##$PH_mod= 1
##$PKNL= yes
##$PPARMOD= 0
##$PSCAL= 0
##$PSIGN= 0
##$REVERSE= no
##$SF= 200.129993388836
##$SI= 16384
##$SIGF1= 3
##$SIGF2= 2
##$SINO= 5.538805
##$SIOLD= 16384
##$SREGLST= <1H.CDCl3>
##$SSB= 0
##$STSI= 16384
##$STSR= 0
##$SW_p= 3396.73913043479
##$SYMM= 0
##$S_DEV= 0
##$TDeff= 16384
##$TDoff= 0
##$TI= <>
##$TILT= no
##$TM1= 0
##$TM2= 0
##$TOPLEV= 0
##$USERP1= <user>
##$USERP2= <user>
##$USERP3= <user>
##$USERP4= <user>
##$USERP5= <user>
##$WDW= 1
##$XDIM= 16384
##$YMAX_p= 382614364
##$YMIN_p= -368939
$$ End of Bruker specific parameters
$$ ---------------------------------
##NTUPLES= NMR SPECTRUM
##VAR_NAME=  FREQUENCY,     SPECTRUM/REAL,   SPECTRUM/IMAG
##SYMBOL=    X,             R,               I
##VAR_TYPE=  INDEPENDENT,   DEPENDENT,       DEPENDENT
##VAR_FORM=  AFFN,          ASDF,            ASDF
##VAR_DIM=   16384,         16384,           16384
##UNITS=     HZ,            ARBITRARY UNITS, ARBITRARY UNITS
##FACTOR=    0.207333158178282, 1,           1
##FIRST=     3210.97964168052, 0,            0
##LAST=      -185.759488754268, 0,           0
##MIN=       -185.759488754268, -368939,     0
##MAX=       3210.97964168052, 382614364,    0
$$ Real data points
##PAGE= N=1
##DATA TABLE= (X++(R..R)), XYDATA
$$ [...]
13023f0807L3043L0484l1911l249l2409J5522J1671o729J07862j11225M92O5893
13011A8637n7636J5412p7424K6148J45413p4281K0489M0634o6533o6513p4944
13000a50598J94972N7601j04092K711n4420n836K0858Q6873K5605o8827j4471
12989i624l7715j7664R2751j5990J9557m0937q3450J21228p0672N7137j09118
12978i4497k5805N4184m6469J3135L1556O4248M1006m3305m932j1061J17249n74
12966I4735j18597K988J7669q3852o4104J07393N5442j5153o3878P3586m1666
12955c5437O043j27922n326J24553R9099K8348r2233j3331j7416k4249K2832J23682
12943H8643n5253K6844m3759m7236J13790n0672M254P1218q768L6727o7869m4081
$$ plain form
13023 -60807 -27764 2720 -29191 -32440 -64849 -49327 -37656 -44385 63477 -47748 -47256 18637
13011 18637 -38999 -23587 -101011 -74863 70550 -3731 16758 57392 -9141 -75654 -150598
13000 -150598 44374 101975 -2117 594 -53826 -59662 -38804 48069 73674 4847 -9624
12989 -9624 -47339 -65003 27748 11758 31315 -9622 -93072 28156 -42516 14621 -94497
12978 -94497 -120302 -66118 -112587 -99452 -67896 -3648 37358 -5947 -10879 -21940 95309 94735
12966 94735 -23862 -20874 -3205 -87057 -151161 -43768 11674 -3479 -67357 6229 -35437
12955 -35437 -29394 -157316 -162642 -38089 61010 89358 -2875 -16206 -33622 -57871 -35039 88643
12943 88643 33390 60234 16475 -30761 83029 32357 36611 107829 99061 135788 67919 23838
12931B3838n468l3898m840j05375J03329L8731l6298k2163L6097O9022r3368l3689
12919f4082J3707J1208j8556m4118n4591R0759J01044M8843l9235o7383o7630
12908i0034l7777K9850N1331K2313K5511Q1513o994r7728j6629N5142J15850j5548
12896A16800k3652O2109q1566j54497p5557L7503J19710j0249l4879n620K9258
12885b0640j7879p3384O1068N7454K3967j2110j4684k8794l9650m3138O7455N5540
12873A5205r8468j9326N5344j24717l3978K1624J22260n5147q518J9448M7759
12862e8514j8449l7419Q8427l3252J09523n1866j3927l9590l7677J49460k5257
12851C1459j70192r297K5482R1632L4116k3618M6707k0193m4476j3772N547R114
$$ plain form
12931 23838 18370 -15528 -20368 -125743 -22414 16317 -19981 -42144 -6047 62975 -30393 -64082
12919 -64082 -50375 -39167 -57723 -101841 -156432 -65673 35371 84214 44979 -22404 -90034
12908 -90034 -127811 -97961 -46630 -24317 1194 82707 75713 -22015 -38644 16498 132348 116800
12896 116800 93148 155257 73691 -80806 -156363 -118860 850 -9399 -44278 -49898 -20640
12885 -20640 -38519 -111903 -50835 6619 30586 18476 3792 -25002 -64652 -107790 -40335 15205
12873 15205 -83263 -102589 -47245 -171962 -205940 -184316 -62056 -117203 -125721 -106273 -58514
12862 -58514 -76963 -114382 -25955 -59207 50316 -1550 -15477 -55067 -92744 56716 31459
12851 31459 -138733 -148030 -122548 -30916 3200 -20418 26289 6096 -38380 -52152 -46605 -37491
12839c7491N0257Q306K5523m2195p4756P6463P6403r9786r1355J7216R6577r071
12827c909n2534N1424K5372J8689l0908P898J1167Q7860o2894J0979K6192j07654
12815a8318r003J721n5372J2743N3362j8955J24469q3644K424j17812Q6112O1254
12803C8981j23332Q735n3738p9657k1383J05213R0597m4954j2291j439O4916k9836
12791e8188r4736M744L0992R1823O8489j1033l6519O9613l6698L9589O4212M6083
12779A78371r156k4926J9758q1051j09418P4995q6479n1219j0762q1657L5426
12768a46118M7932L542m3768n6003J29970j6592j4799J6190R783j1811n0365l6323
12756a68362Q5682N9638p2185K3133o8463P2892O559L7902O7550J7891J282m7103
$$ plain form
12839 -37491 12766 21072 46595 4400 -70356 6107 82510 -17276 -108631 -91415 5162 -3909
12827 -3909 -56443 -5019 20353 39042 8134 16032 27199 115059 52165 63144 89336 -18318
12815 -18318 -27321 -25600 -80972 -68229 -14867 -33822 90647 7003 9427 -108385 -22273 38981
12803 38981 -84351 -75616 -129354 -209011 -230394 -125181 -34584 -79538 -91829 -93268 -28352 -58188
12791 -58188 -152924 -148180 -117188 -25365 43124 32091 -4428 65185 28487 68076 132288 178371
12779 178371 169215 144289 164047 82996 -26422 48573 -37906 -89125 -99887 -181544 -146118
12768 -146118 -98186 -94644 -138412 -194415 -64445 -81037 -95836 -79646 -69863 -81674 -132039 -168362
12756 -168362 -82680 -23042 -95227 -72094 -140557 -67665 -61106 -23204 44346 62237 63519 16416
12744A6416r8k0560J2491J09695l9353j0357j00417j9189N5335j10462J34005
12733B7506J32898m7790K1892o8331J9874j6822j18471q645R3956n393j00190
12722f9516N3520q7622j16624N3438O228j01905R120M4048J28239l0690j05953
12711b17717J1596j0236Q3432K4148L0912R0810p0572K1039J4472J10661m7214
12700D1331k9340K6696R558Q7968m0303m5832J60826n6710p7862j04448p0297
12689i8413M6977L1224l1150J4813J03620j04988k9869L8542p5752j17172J7754
12678b04414P7165J44579R321p9673r1455N742N4949K2126N1505J605j73368j8399
12666b00317J55500J30930L4962j30490N2083J3951j62808K2946O0605K9890m2781
$$ plain form
12744 16416 16318 -4242 8249 117944 78591 68234 -32183 -51372 3963 -106499 27506
12733 27506 160404 112614 134506 66175 86049 69227 -49244 -57889 36067 30674 -69516
12722 -69516 -15996 -103618 -220242 -166804 -160576 -262481 -253361 -209313 -81074 -111764 -217717
12711 -217717 -206121 -216357 -132925 -108777 -77865 12945 -57627 -36588 -22116 88545 41331
12700 41331 11991 38687 48245 136213 95910 50078 210904 154194 76332 -28116 -98413
12689 -98413 -51436 -20212 -51362 -36549 67071 -37917 -67786 -29244 -104996 -222168 -204414
12678 -204414 -127249 17330 26651 -53022 -144477 -138735 -83786 -61660 -10155 -8550 -181918 -200317
12666 -200317 -44817 86113 121075 -9415 42668 56619 -106189 -83243 -22638 7252 -35529
12655c5529O5636M8353K6927p37m5559o2674J5695N5329M7477J34130k0362k10420
12643A8266o5423j23602O2707K14730l5845j17548P1119L0768j04165j10858J6302
12632a43549K1948J4376l3141P1140j8548m8042j43141K3530J80981m1863j06782
12621b23091O2855J68604K7914o5552l2264O4554p25J02099o9854L7695P764j82167
12609a02168O8821J4887m783N5203p7182l6690J04126o0001N2782J1063k2306
12598C752Q3396j59860l3950M9866R3381j00191R9655k9950m0048n9535O8064
12587b5420J2741L0793m7498p4074J32590J3896n7868q2760k4108O6056l3444
12576h9096k8056J04889M6588r8043J9469R2907o7859K1145K1181N7513k925q8682
$$ plain form
12655 -35529 30107 78460 105387 104650 59091 -3583 12112 67441 114918 249048 228686 18266
12643 18266 -47157 -170759 -108052 106678 70833 -46715 24404 55172 -48993 -159851 -143549
12632 -143549 -121601 -107225 -140366 -69226 -87774 -135816 -278957 -255427 -74446 -116309 -223091
12621 -223091 -160236 8368 36282 -29270 -61534 3020 2295 104394 34540 72235 79999 -102168
12609 -102168 -33347 -18460 -23243 31960 -45222 -81912 22214 -37787 14995 26058 3752
12598 3752 87148 -72712 -106662 -56796 36585 -63606 36049 6099 -33949 -93484 -25420
12587 -25420 -12679 18114 -29384 -103458 29132 43028 -14840 -97600 -121708 -55652 -89096
12576 -89096 -117152 -12263 34325 -63718 -44249 48658 -19201 1944 23125 80638 77713 -10969
12564a0969K1913K6133L0860M2051l7898n2039O0553q6432n6687Q0220O8721N2840
12552A39266j48621l4210L373l5065p430l2158R6064k6058j28690J13676M7239
12541a2614K7832k8310m7634J33789l0703j39772J3488J19350r7235m1811L3138
12530g0482Q4329M246j47935K5338P4725k6127k9633N0062O7813J4750j21545
12519g4459J38001P5529l0266l4979J9890K7462J6964j36270j43774O0968J5659
12508f5275q8695P7847J11170K9283j9351p0570K8214K9087p2402K3900K6452
12497I660N1816j13963j47346J41392J04508o0560o7566L9292J11802j26404p5984
12486a33353P4396O7442l4905j91796O3154R5262j9723J20336j2427M8804L3051
$$ plain form
12564 -10969 10944 37077 67937 109988 72090 20051 80604 -5828 -62515 17705 86426 139266
12552 139266 -9355 -43565 -40192 -75257 -82687 -114845 -18781 -44839 -173529 -59853 -12614
12541 -12614 15218 -13092 -60726 73063 42360 -97412 -83924 35426 -61809 -103620 -70482
12530 -70482 13847 18093 -129842 -104504 -29779 -55906 -85539 -35477 32336 47086 -74459
12519 -74459 63542 139071 108805 73826 93716 121178 138142 1872 -141902 -80934 -65275
12508 -65275 -153970 -76123 35047 64330 44979 -25591 2623 31710 -40692 -16792 9660
12497 9660 61476 -52487 -199833 -58441 46067 -14493 -82059 -42767 69035 -57369 -133353
12486 -133353 -58957 8485 -26420 -218216 -155062 -59800 -79523 40813 28386 77190 110241
12475A10241j02361l0538K8012P4570j5659o0018Q8917Q2651j27522n3013J10567
12464A05847M0591n2406q1244j00568J45569M6127r9506k7769L1439O7043n2705
12453B2418m3109J602o7955j35957L6391K33807n9074j9874J10127N4085l3369
12442I9092q5238J27017l2946J3194o1119l5282R0968k2294j8280J7483n9300
12431C3295Q787J0938l1789Q7524r4307j6659J8050L0969K584p5583M0582N8393
12419G2784l4563L7985j10133L6915K9146j14916N5322l7171l0170j1461o3337
12408a69599J63290p7660k6027J8176J5430R7085O0943l9832N9811M5894r4820
12397E2691p3449J27312O6659q4506q4836J48148R8593j24544p0216M9322P7763
$$ plain form
12475 110241 7880 -22658 5354 79924 64265 4247 93164 175815 48293 -4720 105847
12464 105847 146438 94032 12788 -87780 57789 103916 4410 -23359 8080 75123 22418
12453 22418 -20691 -19089 -87044 -223001 -186610 47197 -11877 -31751 78376 132461 99092
12442 99092 13854 140871 107925 121119 60000 24718 115686 93392 75112 92595 33295
12431 33295 42082 53020 21231 108755 14448 -2211 15839 46808 49392 -26191 14391 72784
12419 72784 38221 76206 -33927 2988 32134 -82782 -27460 -64631 -94801 -106262 -169599
12408 -169599 -6309 -83969 -109996 -91820 -76390 20695 81638 41806 101617 147511 52691
12397 52691 -20758 106554 173213 88707 3871 152019 250612 126068 55852 105174 182937
12386A82937L8p1725m0671J03481q2365q9382r360P1790K5008n7906j05945m2292
12374a16392J01926N6202l550j10015N0183j1132j60337o9088J4553J54521j3343
12363a06472Q6752K4054j04907R5453J16874L205J3626r2611N6125J9869K2902
12352A34870J3822m2013K063N4414J5317K6137R907Q211r6414m2352J62163j23425
12340A22700j0645L5236n0970j5692p8590N0256M8240j34520j8458R38L8903K0167
12328G565j16412O8071N2527m6854l1647O0278R812L9295n7587L71M1651k4450
12316B620m0861j14542R6960Q3648n3306l3886n2279O9118K8906J45711R0302
12305B22391l6610l9633r6661R8365Q9379j31260P855n4525L3608j3247j04533
$$ plain form
12386 182937 182975 111250 70579 174060 91695 2313 -7047 64743 89751 31845 -74100 -116392
12374 -116392 -14466 41736 38186 -71829 -21646 -32778 -193115 -262203 -247650 -93129 -106472
12363 -106472 -19720 4334 -100573 -5120 111754 114959 128585 35974 92099 111968 134870
12352 134870 148692 106679 108742 163156 178473 204610 214517 222728 126314 83962 246125 122700
12340 122700 112055 147291 96321 80629 2039 52295 100535 -33985 -52443 -51505 -12602 7565
12328 7565 -108847 -40776 11751 -35103 -66750 -6472 3340 42635 -14952 -14581 27070 2620
12316 2620 -38241 -152783 -55823 27825 -25481 -59367 -111646 -42528 -13622 132089 222391
12305 222391 185781 146148 49487 147852 237231 105971 113826 59301 92909 79662 -24871
12294b4871O265L6634O6766N6815j35432j232l5408K8068Q9934q5192M9053M1123
12282I2523k6374m0636k2296m087J0724n92n867l1640R0501o301L9827P4532K59
12269A70573j9616j74276k5545J25783m7318J0330K7229j02948k0306J921o2940
12258a17113Q3779Q1675N7975j9533J5241M4202q522n6743n8179J5974l6602o0643
12246e8489N0476K2301O9252O5095J6429q4771k0960m192j6541p4536J8201J7323
12234d12M5115m6194o1707L9356O9061m7047l7086Q6987L5957J8052P6668l9419
12222A39331l2498J27593o3648q2535J8158o3974M8832j170j91019o833j1484
12211a19247k5486R5099M5154l1455J9974l3549L824N1823L6430K6951N7852K7498
$$ plain form
12294 -24871 -18606 18028 84794 141609 6177 4945 -30463 -2395 87539 2347 51400 92523
12282 92523 66149 25513 3217 -870 9854 9262 3395 -28245 62256 55955 95782 170314 170573
12269 170573 150957 -23319 -48864 76919 29601 39931 67160 -35788 -56094 -54173 -117113
12258 -117113 -33334 48341 106316 86783 102024 146226 137704 80961 22782 38756 2154 -58489
12246 -58489 -8013 14288 83540 148635 165064 80293 59333 55141 38600 -35936 -17735 -412
12234 -412 44703 -1491 -63198 -23842 45219 -1828 -38914 48073 84030 102082 178750 139331
12222 139331 106833 234426 170778 88243 106401 42427 91259 90089 -100930 -107763 -119247
12211 -119247 -144733 -49634 -4480 -35935 -15961 -49510 -45686 6137 42567 69518 127370 154868
12199A54868j4235r3953j61435P9154J12823J0891J24966K6348r4729j04967q617
12188C1114N4588J26853l2609r4839N2698j28967k3390n9448J45001k8787j01604
12177e9390L655J11334J4523q0956R5102Q8311o319J8187j14830j29110Q0559
12166B1066p8676O0882Q3512j2034n153j3032K1215l67p8037R19J12589Q4697
12154A97581k5189n6797j41060j0297Q9751J5903M0369N8186o0992o9760p0117
12143c2422q504R3246J0461k2820P4576o8901n540m4024r9448j41150P4363N7941
12131a12222O9604k2367j60982o6534Q4646J11634q583K35213N8290n3742q0727
12120E4230j27291J01632P9161M9118O4386L3509q5061L5063j87896j5620J5167
$$ plain form
12199 154868 140633 46680 -114755 -35601 77222 88113 213079 239427 144698 39731 31114
12188 31114 85702 212555 179946 85107 137805 8838 -14552 -74000 71001 42214 -59390
12177 -59390 -55735 55599 70122 -10834 84268 172579 166260 184447 69617 -59493 21066
12166 21066 -57610 3272 86784 74750 69597 56565 77780 77413 -624 295 112884 197581
12154 197581 172392 115595 -25465 -35762 53989 69892 110261 168447 107455 37695 -32422
12143 -32422 -40926 52320 62781 39961 114537 45636 40096 -3928 -103376 -244526 -170163 -112222
12131 -112222 -42618 -64985 -225967 -292501 -207855 -96221 -104804 130409 188699 134957 54230
12120 54230 -73061 28571 107732 156850 221236 254745 169684 204747 16851 1231 16398
12109A6398L2141J32018Q6799p0687r5825J115o9912J15755P2691o0362p7613
12098H2518l1148q3758O9958r2355o2761J26825j3696L571n79o4729Q8961O0101
12086H2908L489k126l4328L8434K6990j3036o6338J6231L1437k9949m6044K7193
12074C4861o9127M2654M1769J08602P3647L9825J1014j82305k2267j80397N5919
12063d5805P8818k3489J1981K4607j3328M3660r7177j9994K0829O7854M7245M0374
12051A35575j0106j32865k4745O6829k0883m7921J5542j0390L6968o6653P6230
12040A7581Q0562Q8364K4682j29909j9377n861k6761M6537m9709K6231L7606p1799
12028A8147j4929K5400J02970o4701L347n5149K970N2250O678Q965q2353j2493
$$ plain form
12109 16398 48539 180557 267356 196669 100844 101959 32047 147802 220493 160131 82518
12098 82518 51370 -32388 37570 -54785 -117546 9279 -4417 -846 -1425 -66154 22807 82908
12086 82908 86397 84271 49943 88377 115367 102331 35993 52224 83661 53712 7668 34861
12074 34861 -34266 8388 50157 158759 232406 272231 283245 100940 78673 -101724 -45805
12063 -45805 33013 9524 21505 46112 32784 76444 -20733 -40727 -19898 47956 95201 135575
12051 135575 125469 -7396 -32141 34688 13805 -34116 -18574 -28964 8004 -58649 17581
12040 17581 98143 186507 211189 81280 61903 56042 29281 75818 26109 52340 89946 18147
12028 18147 3218 28618 131588 66887 70234 15085 18055 70305 76983 85948 3595 -8898
12016h898L9372j14335P7886k7870L887Q2931q7658n4764L0601R6038j5975O5509
12004H6724K1890l6895P6909o8961l4103P015j765K7405J1759k0745q8785N1675
11992C2123L1862J00318j8168m3129j0944K3192L757L4692L113n2990l9721o8260
11980d155r1652o3979k096m5054J35966L6739k4648q6534K8941N7410J1176K1625
11968b6261K9538j519J9080J5886j942j3348J9147J27537k8513j73776J1837j984
11956b4318n136J81551j2684N1131q262m1278m5689k284m2322p374k2878J6946
11944C7403o0341m8241J2275O334L6352l7718J6371M0499o108k3837r656r1136
11932a27803P2693N5967k9854M4893K0136J6539j40532m301Q9566J14593l6297
$$ plain form
12016 -8898 30474 -83861 -5975 -33845 -29958 52973 -34685 -89449 -58848 37190 21215 86724
12004 86724 108614 71719 148628 79667 45564 52579 50814 78219 89978 69233 -19552 32123
11992 32123 63985 164303 146135 103006 92062 115254 119011 153703 156816 103826 64105 -4155
11980 -4155 -95807 -159786 -161882 -206936 -70970 -34231 -58879 -145413 -116472 -59062 -47886 -26261
11968 -26261 3277 1758 20838 36724 34782 21434 40581 168118 139605 -34171 -22334 -24318
11956 -24318 -29454 152097 139413 190544 182282 141004 95315 93031 50709 43335 20457 37403
11944 37403 -22938 -71179 -58904 -52570 -16218 -53936 -37565 2934 -3174 -27011 -36667 -127803
11932 -127803 -55110 857 -28997 15896 36032 52571 -87961 -92262 -2696 111897 75600
11921G5600N9283R3583j19418j40924J5918O0718n4096l010p9402o3943P3604
11910h2087l7428K7640R3249J378M8526O9683j9171j69062j44597K22565R2918
11899A03614k2234n7675J19087j76954l2980M7907P4396J25851o894q5353j9014
11888F9751l2657j60552M6226J09048J81866L3924j42838j35586n6163K6467J09615
11877D9101N4692J5064k08655o5872K8330K21648m264j77539n4849J25489p195
11866b4050q0993R996Q8650J7327j08031l1182J07147m5383p9556K5851J20686
11855D62j00503m3946j4104Q912J36377O950J8259R2335l9527l1460K4390K8117
11843H6262n5568l7853N5215k0259R0914j10066o6208J01393J020Q2969k2123
$$ plain form
11921 75600 134883 228466 109048 -31876 -15958 44760 -9336 -12346 -91748 -155691 -82087
11910 -82087 -119515 -91875 1374 2752 51278 120961 101790 -67272 -211869 10696 103614
11899 103614 81380 23705 142792 -34162 -67142 -19235 55161 181012 174118 88765 69751
11888 69751 37094 -123458 -77232 31816 213682 247606 104768 -30818 -86981 -60514 49101
11877 49101 103793 118857 -89798 -155670 -127340 94308 90044 -87495 -142344 -16855 -24050
11866 -24050 -105043 -95047 -6397 10930 -97101 -128283 -21136 -66519 -146075 -120224 462
11855 462 -100041 -143987 -158091 -149179 -12802 -5852 12407 104742 65215 33755 58145 86262
11843 86262 30694 -7159 48056 27797 118711 8645 -57563 43830 44850 127819 105696
11832A05696k2248j6241m7149k2905Q8788m4021J2923n1736o277l7589p4164L1093
11820h3830L9219O7011m8838j55423J38480Q8583o614j2851q4588K0543j25367
11809a63675j6629J21415K4352n0186n2893O0735R0782m9217k1304K4457Q9239
11798E7076N918l4384J1707j6096j4312l4342m2972M2768j19905N8440R4862Q0844
11786H9604M9551r5386r3948Q611K0065O8497q3978R3096M0201q9709o3966q1219
11774a38581J5102R1973m1028M0993p3857k3591l4514J33535J23304k4613r1112
11763b2389L873r5325j31523M6871P6783k845J3489J12725m6799j17926j10341
11752b73407J27464J34736K6395o6693N8244o4085m478J3582R989r1275j4562
$$ plain form
11832 105696 83448 67207 20058 -2847 85941 41920 54843 3107 -3170 -40759 -114923 -83830
11820 -83830 -44611 22400 -26438 -181861 -43381 45202 38588 25737 -58851 -38308 -163675
11809 -163675 -180304 -58889 -34537 -84723 -137616 -76881 13901 -35316 -56620 -32163 57076
11798 57076 62994 28610 40317 24221 9909 -24433 -67405 -24637 -144542 -86102 8760 89604
11786 89604 139155 43769 -50179 -41568 -21503 46994 -36984 56112 96313 6604 -57362 -138581
11774 -138581 -123479 -31506 -72534 -31541 -105398 -128989 -163503 -29968 93336 68723 -22389
11763 -22389 -18516 -113841 -245364 -198493 -121710 -124555 -111066 1659 -45140 -163066 -273407
11752 -273407 -145943 -11207 15188 -51505 6739 -57346 -61824 -48242 -38253 -129528 -144090
11741a44090L9522M6095K2811m892P8671M434J37921K4491j60775k6809n862L0057
11729D1574O3987n4421j01662J1042N4726o2060M7703q572l0020j0229M9891L4955
11717C6914n2227P7795K4728j6566j13329j50405Q3776k4789L4739l176K0959
11706h1581p428j2429l655L0481M9197m3291Q401m8351M4691o9153K4633R0338
11694a8147R1492j4220j8140n0035m5409N9951P4143p8942k2978m6947L8291K7710
11682c231O1542Q8519j2864j06530m3113n2916p912L076J1533O3465q0299p8048
11670a56778L5413j3940J5149J7195L6747k4057O5702J7107j09928K0054P281
11659i0055O6482m6916j51296j5281O5278J0120l8594J08726N9995j28411m9662
$$ plain form
11741 -144090 -104568 -58473 -35662 -40554 38117 42551 180472 204963 44188 17379 11517 41574
11729 41574 105561 51140 -50522 -39480 15246 -46814 889 -7683 -37703 -47932 1959 36914
11717 36914 -15313 62482 87210 70644 -42685 -193090 -109314 -134103 -99364 -102540 -81581
11706 -81581 -89009 -101438 -105093 -74612 -25415 -68706 -60305 -108656 -63965 -133118 -108485 -18147
11694 -18147 73345 59125 40985 -9050 -54459 5492 79635 693 -22285 -69232 -30941 -3231
11682 -3231 58311 146830 133966 27436 -15677 -68593 -76505 -73429 -61896 1569 -78730 -156778
11670 -156778 -121365 -135305 -120156 -102961 -66214 -90271 -24569 -7462 -117390 -97336 -90055
11659 -90055 -23573 -70489 -221785 -237066 -171788 -161668 -200262 -91536 -31541 -159952 -209614
11648b09614n4963P8143J42460M3268k6096P6361J6370j85221K3427J7765l8234
11637a16334K8019M2677m574j5580M527l0544M7562M5455l1392j6385J43663Q2736
11625A79830j39637j43358P5638p5125j7088O9730Q8130L6295j33216N84l0446
11614h8663o8675N1227M2109P7263l4588l5786j7667m4139o1512n2142O2628N7539
11602a12406K5014p8482j34458l9819J31999J27511l1724m2388j5692K9521r922
11591a50846N7781J19251K8925p9265m687q7409k6295j05731J86175J9162j2260
11580e5199p1132m5679K5967l6931J05732Q4373k0539N1233j0131L2104M495k11332
11568a47039O3675P0669r5805r4631N2099Q7325o317m5652m0375k7202L9609J2197
$$ plain form
11648 -209614 -264577 -186434 -43974 -706 -26802 49559 65929 -119292 -95865 -78100 -116334
11637 -116334 -88315 -45638 -50212 -65792 -61265 -91809 -44247 1208 -30184 -46569 97094 179830
11625 179830 40193 -103165 -27527 -102652 -119740 -50010 38120 74415 -58801 -58217 -88663
11614 -88663 -157338 -106111 -64002 13261 -21327 -57113 -74780 -118919 -180431 -232573 -169945 -112406
11602 -112406 -87392 -165874 -300332 -340151 -208152 -80641 -112365 -154753 -170445 -140924 -150846
11591 -150846 -93065 26186 55111 -24154 -28841 -116250 -142545 -248276 -62101 -42939 -55199
11580 -55199 -126331 -172010 -146043 -182974 -77242 7131 -13408 37825 27694 59798 64293 -147039
11568 -147039 -83364 -12695 -108500 -203131 -151032 -63707 -70024 -115676 -156051 -183253 -143644 -131447
11556a31447P4315O0537j7852j38569K9678N0877q831p5886l7074j7601J99802
11545a2051j7801j77267k788J84088j382k6783K5667J17617q9961k75098N2348
11534b23411J51932o1819m2990K2864O7923o8893o2441J759N9886R8250P7446
11523B0506K3910j19606l1862L2263J1309M644M2873l762k3928o8362o6339J06867
11511g1487M9970m8875q0875R1083K14333j41863l6251j04497M5718r6154L8878
11500a40020R3019n261m3048r195k513o0410J9341O5652R1353P9589p7134j76476
11488a65103r1833j8140J15516J7285P7579L0499q0874j45756M7340J04736K4586
11477h4165M6527O0474j1036j0344p0133j2119J7048L1055N6057N6927k8012o4752
$$ plain form
11556 -131447 -57132 3405 -14447 -153016 -123338 -72461 -81292 -157178 -194252 -211853 -12051
11545 -12051 -29852 -207119 -209907 -25819 -27201 -53984 -28317 89300 -661 -275759 -223411
11534 -223411 -71479 -133298 -176288 -153424 -85501 -154394 -216835 -215076 -155190 -56940 20506
11523 20506 44416 -75190 -107052 -74789 -63480 -58836 -15963 -19725 -43653 -112015 -178354 -71487
11511 -71487 -21517 -70392 -151267 -60184 154149 12286 -23965 -128462 -82744 -178898 -140020
11500 -140020 -47001 -52262 -95310 -104505 -107018 -167428 -148087 -82435 8918 88507 11373 -165103
11488 -165103 -256936 -275076 -159560 -142275 -64696 -34197 -115071 -260827 -213487 -108751 -84165
11477 -84165 -37638 22836 11800 1456 -68677 -80796 -63748 -32693 23364 80291 52279 -12473
11465a2473n7709M3186j1560R1138P9990n6743q3454p1997j6987N8266J0012o7073
11453i5404J1981m293L0009j52681j05719R3126O4546k4176O21O8707M901p030
11441a15412m2635q4314Q2918M1180l237m5968p4366R764P6194J01528O2663M4548
11429E2863l7670m5075j0069N2507L7293N0761m1336p1973q223l4035n0390j18123
11417b23470O8772j35377Q5898P8891j5155M8826j24285J702m3213P0771Q9031
11406i7609l0590r1508p091N55p624k4688L7898L087R154M4175M4378J01383n2319
11393g0799j544K6696k1483k0529l1690m4386O1775J9303K1346q0050P1056M7504
11381b2801J02437k1297j87708N5475P8666L7421Q7769l5461K7674j0277j78895
$$ plain form
11465 -12473 -70182 -26996 -38556 52582 132572 75829 -7625 -79622 -96609 -38343 -28331 -95404
11453 -95404 -83423 -87716 -57707 -210388 -316107 -222981 -158435 -182611 -181990 -113283 -108382 -115412
11441 -115412 -158047 -242361 -159443 -118263 -121500 -167468 -241834 -232070 -155876 -54348 8315 52863
11429 52863 15193 -29882 -39951 12556 49849 100610 59274 -12699 -20922 -54957 -105347 -223470
11417 -223470 -154698 -290075 -204177 -125286 -140441 -91615 -215900 -214198 -257411 -186640 -97609
11406 -97609 -128199 -219707 -226798 -226243 -233867 -258555 -220657 -217570 -208416 -164241 -119863 -18480 -70799
11393 -70799 -72343 -45647 -67130 -87659 -119349 -163735 -101960 -82657 -61311 -141361 -70305 -22801
11381 -22801 79636 58339 -129369 -73894 4772 42193 129962 94501 122175 111898 -66997
11370f6997n2654J8856M8665J2062o0598l1020M0603L3631j01514M207J40712
11359a4047m393j31815O044O3417P8539k15269q2770J28956P6228n4989j21237
11348b71336O9544Q9114o601P56J32151l4842j4980j0191J4569J1401r1084k8321
11336a39820J1036M8696K6088n2885P8077j9427j9798J27151J2422p0542P5536
11325G6534j50942M56l0770k3432n5093n2937R2125N9317o2293m8896N8170J49998
11313A2237m2994p0885j4205O0145o9389m2868R372L3035O9155L3931m8253K2118
11301d8601k4468p1990M7837N391O9869Q7712K6299j01950r6847P149J17915O0623
11289G8939J5218j94418M9654n0870p9505j7898L4385J43946o4585J6352L0274
$$ plain form
11370 -66997 -119651 -100795 -52130 -40068 -100666 -131686 -91083 -57452 -158966 -154759 -14047
11359 -14047 -18440 -150255 -144211 -80794 -2255 -217524 -300294 -171338 -95110 -150099 -271336
11348 -271336 -201792 -112678 -119279 -118523 13628 -21214 -36194 -46385 -31816 -20415 -111499 -139820
11336 -139820 -128784 -80088 -54000 -106885 -28808 -48235 -68033 59118 71540 998 76534
11325 76534 -74408 -73952 -104722 -128154 -183247 -236184 -144059 -84742 -147035 -195931 -137761 12237
11313 12237 -30757 -101642 -115847 -55702 -125091 -167959 -158587 -125552 -56397 -22466 -70719 -48601
11301 -48601 -73069 -145059 -97222 -91831 -21962 65750 92049 -9901 -106748 -99599 18316 78939
11289 78939 94157 -100261 -50607 -101477 -180982 -198880 -164495 -20549 -85134 -68782 -38508
11278c8508r981p9907K0824Q2653N1340j18043m4412O3344k8694n8255j16681
11267b76320J70692P9672j194j14577q3470P0530O6721j27011J0592J95888M3231
11256C4754p2066p1778n2590N5731J3316K8693L0422L5354L6650m6285M1553m8353
11244a4599j5485j6276N2569N5506n2160j10951p8000N3081Q4261l6696L6356
11233d2394O717p4482L1567m6093m6425J08873k764R4653k4394j01146j06831
11222b02719n9331J44978o1172j3282Q0454j52899O5872L3792L3906Q4473N934
11211c9994K7539M713P0169q9676n2851P2013j6596k2637Q4069j37838J702p605
11199a06992n2953p5532J91296J39186r0042j16360J96752j9204j34194L2235
$$ plain form
11278 -38508 -48489 -128396 -107572 -24919 26421 -91622 -136034 -72690 -101384 -159639 -276320
11267 -276320 -105628 -25956 -27150 -141727 -225197 -154667 -87946 -214957 -204365 -8477 34754
11256 34754 -37312 -109090 -161680 -105949 -92633 -63940 -33518 1836 38486 -7799 33754 -14599
11244 -14599 -30084 -46360 6209 61715 9555 -101396 -179396 -126315 -42054 -78750 -42394
11233 -42394 -35677 -110159 -78592 -124685 -171110 -62237 -65001 29652 5258 -95888 -202719
11222 -202719 -262050 -117072 -178244 -191526 -111072 -263971 -198099 -164307 -130401 -45928 -39994
11211 -39994 -12455 -7742 62427 -27249 -80100 -8087 -24683 -47320 36749 -101089 -99387 -106992
11199 -106992 -159945 -235477 -44181 95005 4963 -111397 85355 66151 -68043 -35808
11189c5808P2054n375j06415J8721L8405o7169q0868Q7730j1194J34071K0774
11178F4926j23652j22756O5810q1285J5529o1932N8942J12893j39997r4281M2458
11167b63345Q2776M349K3421J421R2983M969K611l943J42234j6293j21266Q5493
11155C5410J91217j23434j68916o3315N387J00087K729M4453L887J04526m4194
11144H7837q2013K8345R54K1529j14249j03139n342O263J4249j5300J03418j1029
11132f8477j24921Q3826P5640P3824j1218n0428P2004j8322o6563K100p4992j36640
11120b44167J0681Q6111O0082o000k9189J13520l4302p6745P4527J32338N1581
11109A38437m8982j7517k6939J1334j99773R567R1576o8891K55n5831L4273j604
$$ plain form
11189 -35808 36246 30871 -75544 -56823 -18418 -85587 -166455 -78725 -89919 44152 64926
11178 64926 -58726 -181482 -115672 -196957 -181428 -243360 -184418 -71525 -211522 -305803 -263345
11167 -263345 -180569 -176220 -152799 -151378 -58395 -53426 -50815 -54758 87476 71183 -50083 35410
11155 35410 226627 103193 -65723 -129038 -123651 -23564 -20835 23618 27505 132031 87837
11144 87837 5824 34169 35123 56652 -57597 -160736 -166078 -159815 -145566 -160866 -57448 -68477
11132 -68477 -193398 -109572 -33932 39892 28674 -21754 50250 31928 -34635 -32535 -107527 -244167
11120 -244167 -233486 -147375 -87293 -93293 -122482 -8962 -43264 -120009 -45482 86856 138437
11109 138437 89455 71938 44999 56333 -143440 -133873 -42297 -111188 -110933 -166764 -132491 -134095
11097a34095j6293J2644j758J48976o466j15080J6242m559n5349L9432O8467J40852
11085I3013k3715L730j52884L8634J10320j1450J7945P8526L25l023j18039K0505
11073E3887P4238r5831L7180l1461k225j28235J3224J24263J13349m6157p4383
11062C7849l4510O9149j25480o8411P6743l9934N306j50573J07157l5070M3557
11051a14217K1761m9855R3102N230j1641k4315M0724O3597j8441n6508Q3804P6035
11039A09276M5707q2966K4347M1520k1574j04514K7748M3613O3581Q4545q4668
11028A46615q7345K4851J5236K4802K7513q5239o4810R3214j60507p2010L8300
11017i9380P0398M1760J822p4975j1107p147k8064O0313r1806m6275Q2132J04972
$$ plain form
11097 -134095 -150388 -137744 -139502 9474 3008 -112072 -95830 -100389 -155738 -116306 -47839 93013
11085 93013 69298 73028 -79856 -41222 69098 57648 75593 154119 154444 151421 33382 53887
11073 53887 128125 32294 69474 38013 35788 -92447 -79223 45040 158389 112232 37849
11062 37849 3339 72488 -52992 -121403 -44660 -84594 -79288 -229861 -122704 -157774 -114217
11051 -114217 -92456 -142311 -49209 -43979 -55620 -79935 -39211 24386 5945 -50563 33241 109276
11039 109276 154983 72017 96364 137884 116310 11796 39544 83157 146738 231283 146615
11028 146615 59270 84121 99357 124159 151672 66433 1623 94837 -65670 -137680 -99380
11017 -99380 -28982 12778 14600 -60375 -71482 -78629 -106693 -46380 -138186 -184461 -102329 2643
11005B643m8431R5804l0149o5125K6361J8073J18271J1419m8214j8283N3800N7986
10993A74155M927K971O914k8975j00513L1031J07578R7029j3871l0586k8092j16960
10981A05608m0278O5386R3619o0774J4538j13531m509o336k5118o2433j57706
10970a91534O8964N7228M9994r9358J4015k2824J0899l074P2095J04409n1075
10959I739j1512Q5966J03792j29451j16448r181Q0345K9602j00273R1622J65816
10948B00017r1614j03617J7820J24504K2052p4607J0273O1237k1715r1538R9032
10937A51844k7467j55089q7634n5244J5308Q7587O7471J52817p7853j09746j6326
10926e4332K20065J89040q2129m3087j74134q8560j6073M8482P0423O0502j14468
$$ plain form
11005 2643 -45788 50016 19867 -45258 -18897 -824 117447 128866 80652 62369 116169 174155
10993 174155 179082 182053 188967 159992 59479 90510 198088 295117 281246 250660 222568 105608
10981 105608 65330 130716 224335 163561 178099 64568 60059 53723 28605 -33828 -191534
10970 -191534 -122570 -65342 -15348 -114706 -100691 -123515 -112616 -115690 -43595 60814 9739
10959 9739 -1773 84193 187985 58534 -57914 -67095 13250 42852 -57421 34201 200017
10948 200017 108403 4786 22606 147110 169162 94555 104828 166065 144350 52812 151844
10937 151844 124377 -30712 -118346 -173590 -158282 -70695 -3224 149593 71740 -38006 -54332
10926 -54332 165733 354773 272644 229557 55423 -33137 -49210 -728 69695 130197 15729
10915A5729r4103R5010R2094j47619O8911K21701R919p2848j77195N9600J2165
10904H3364m6135m2328O6458J17248o9331j52325R318P3297j0512n1265L0896
10893H685J48878p0114l1456k2350K11799l78j04620j4049P9777p6636j61957
10882c2421m1610J22358Q5923q8194m1471K0910J72339o5236P5199K7427n8956
10871A76268p0416j885R4123m0071j05163m5670Q1037K7744k2265o9327q705R5608
10859A11278J8012j48786P0349Q802p2758O6571K8373o1350q8375J4548j36808
10848a90144J22142M0417Q0194J32901n7984k02210K493J23797K05395j16161
10838A40840r076n058n9352k4573n6518J72004l6183K1046Q1604O9859j4159o4375
$$ plain form
10915 15729 -78374 16636 108730 -38889 30022 251723 261642 188794 11599 71199 83364
10904 83364 37229 -5099 61359 178607 109276 -43049 -33731 39566 29054 -22211 8685
10893 8685 157563 87449 55993 33643 245442 245064 140444 126395 206172 129536 -32421
10882 -32421 -74031 48327 134250 46056 4585 25495 197834 132598 207797 235224 176268
10871 176268 105852 103967 198090 158019 52856 7186 88223 115967 93702 24375 15670 111278
10859 111278 129290 -19496 50853 59655 -13103 53468 81841 20491 -67884 -53336 -190144
10848 -190144 -68002 -27585 52609 185510 127526 -74684 -72191 51606 257001 140840
10838 140840 131764 126706 67354 42781 -13737 158267 122084 143130 224734 294593 280434 216059
10826B16059l6320Q3750j52246M2644M1665P8576J3259j38864M6553O3829L2101
10815B91006q9881K947r0803Q5377l7196J600l4704J53976K1047j07694r6055
10804I9620R0065N2945j20356j15706j2545M5303j9649M4852j2174Q1074p3952
10793E9477M1196M9532O6455r041k2727p5267R7144J18864Q1179j46034l0561
10782B30217o3306q3063p1707j8719K46032Q2880j10652N4431r1448n0448l8829
10771H5388O3293J59461K8379j23114o633l5038m0104r530n5481L4741Q8328n5701
10759A33989q2407l0531p105M2642N8851J9468o639N577j18746Q1906r0255k2327
10747a5577J49533k0026p5894O4286j2634L2325J5907K5581j425L7444M4826m8021
$$ plain form
10826 216059 179739 263489 111243 153887 195552 274128 287387 148523 195076 258905 291006
10815 291006 201125 204072 113269 198646 161450 163050 128346 282322 303369 195675 99620
10804 99620 189685 242630 122274 6568 -5977 39326 19677 64529 52355 133429 59477
10793 59477 100673 150205 216660 207619 184892 109625 206769 325633 406812 260778 230217
10782 230217 166911 83848 12141 -6578 239454 322334 211682 266113 174665 124217 85388
10771 85388 148681 308142 336521 213407 206774 171736 131632 122102 66621 101362 189690 133989
10759 133989 51582 21051 13946 56588 115439 134907 128268 133845 15099 97005 6750 -15577
10747 -15577 133956 113930 38036 102322 89688 122013 137920 163501 162076 199520 244346 196325
10735A96325P1212J21670q601l2471j6244M4280R387j58417P9917n573L7760j44577
10723A94668L0883P4053k0754Q5095p9939Q8895n5777j13377R9171P882q7063
10712B23737M9714j59285J40648p6043j01357Q6189j16815J69076N1344j57783
10702A09425L2923J7105P2333M5833k9190J6206p0356J0038p2739N3857J03814
10691B89249r3984J4021p774j478O2779j9179n1497o369O4756L103K8139K0120
10679C01886j34225n7183k0230j2677n872r165j3736P7634N9890L6681j7268j58702
10667D7033K7189M7390k8461R4428L814M643N9199l2449p6312o8339J62986L2788
10655B73909k2473K5871k1697N1437l5382l7794r700M5102j6976m6662L4696R2259
$$ plain form
10735 196325 267537 389207 380606 348135 331891 376171 385558 227141 307058 301485 339245 194668
10723 194668 225551 299604 278850 363945 284006 372901 317124 203747 302918 310800 223737
10712 223737 273451 114166 254814 178771 77414 163603 46788 215864 267208 109425
10702 109425 142348 159453 231786 277619 248429 264635 194279 204317 131578 185435 289249
10691 289249 195265 209286 201512 200034 262813 243634 192137 185768 250524 253627 281766 301886
10679 301886 167661 110478 90248 77571 71699 62534 48798 126432 186322 223003 205735 47033
10667 47033 74222 121612 93151 187579 191393 196036 255235 222786 146474 78135 241121 273909
10655 273909 251436 277307 255610 307047 271665 233871 224171 269273 252297 205635 240331 332590
10643C32590j02586r7433N4427J6014R667K6630j5164Q3124m6356m0645j541N6581
10631B75308M6046q2628O350J3417J02613l6117j39331O5414N0384M507K0282
10620C26245R4743J9755j15054M4520J54477m3943q7500q2122K0592J31025r2205
10609C70533o4156N8350Q5305O2631M0380n5080j24440O9417j10269j9626J35912
10598D48957l9446j27391o1697J06583n6909L6862J9937K7116k4642J3793p5505
10587B67658J8244n6065m4639J09840q370o2422j8213J4482L8972J9016Q4317
10576C62820N460p0848J11p6108M0475k9911j3641N147J04397l1358l0894J33304
10564C98954r5329J364K2443j7847K550O8711j39581O0471J54530J8576O415m1216
$$ plain form
10643 332590 230004 132571 186998 203012 212679 239309 224145 307269 260913 220268 218727 275308
10631 275308 321354 238726 245076 258493 361106 324989 185658 251072 301456 305963 326245
10620 326245 420988 440743 325689 370209 524686 480743 393243 311121 331713 462738 370533
10609 370533 306377 364727 450032 512663 553043 497963 373523 442940 332671 313045 448957
10598 448957 409511 282120 220423 327006 270097 306959 326896 354012 329370 343163 267658
10587 267658 285902 229837 185198 295038 286668 224246 206033 220515 259487 278503 362820
10576 362820 368280 297432 297543 221435 261910 231999 218358 223505 327902 296544 265650 398954
10564 398954 303625 304989 327432 309585 312135 380846 241265 301736 456266 474842 481257 440041
10552D40041p3483K0013n2477L5330J37131n3190o2038q3822l9301q076J11190
10541C71318l2740M3009L0696j8021J52872L8388p7641k2312k586j1773R9186
10530E70396r6352P4893j38522m4480J52673q7050L1536J41585L947j96129J6804
10519D29301m786J8217l9652L8172J4424j913o5058J5566o4388P6158k9816J9244
10507D05469N25J329m4271n2358j0085J67385Q2882l6932J0197j85399P4178o0433
10495C52487k2777M3839M2808n7653l5510r3448J24907P0880k0231J39641n1831
10484D93112n6927j14429q7827l116Q2878P8405R2219l3843j14782j50565K5468
10473B10593N7717R703Q7710m3146K4385j17832J6631L7573j4163J01699N8584
$$ plain form
10552 440041 366558 386571 334094 369424 506555 453365 391327 307505 268204 260128 371318
10541 371318 338578 381587 412283 394262 547134 585522 507881 485569 482983 471210 570396
10530 570396 474044 548937 410415 365935 518608 431558 463094 604679 608626 412497 429301
10519 429301 424515 442732 403080 441252 455676 453763 388705 404271 339883 416041 386225 405469
10507 405469 405994 407323 363052 310694 300609 467994 550876 513944 524141 338742 412920 352487
10495 352487 329710 373549 416357 358704 323194 229746 354653 425533 405302 544943 493112
10484 493112 436185 321756 233929 230813 313691 392096 484315 450472 335690 185125 210593
10473 210593 268310 278013 365723 322577 346962 229130 245761 283334 269171 370870 429454
10462D29454p4280p293m551p3882n1966Q1061J53376n8627p5470J2232N7135r7683
10450B89506n4040J92540J3886j2359N5271m1667R6749o0410p389R7575j2627
10439E57035J09346o0992o1870j2897p8068R8383r97q7639J45893O9115J7134
10428F94443k30837j08719K21152J08089K1678j25043l8430Q3362n1500p550m9815
10417E16830j0613Q7381q7225r4719j9447q198N8890N0484P7665Q8312j1661j32474
10405E15225n5530R2231j47223O4396J09123m2494r3591q6696l1611J89509P7024
10394E90363k03608K9698N5128J1132m8055L4724K6230q9570L6564J7652o3504
10383C96754N729j02015k6779P8617p5835n935J10732J39678q1683k620m4336
$$ plain form
10462 429454 355174 347881 343330 269448 217482 298543 451919 393292 317822 330054 387189 289506
10450 289506 235466 428006 441892 429533 484804 443137 539886 479476 472087 569662 557035
10439 557035 666381 605389 543519 530622 452554 550937 549940 462301 608194 677309 694443
10428 694443 463606 354887 576039 684128 705806 580763 542333 625695 574195 566645 516830
10417 516830 506217 593598 506373 411654 392207 384009 442899 493383 571048 659360 647699 515225
10405 515225 459695 551926 404703 469099 578222 535728 442137 355441 323830 513339 590363
10394 590363 386755 416453 471581 482713 434658 469382 495612 406042 442606 460258 396754
10383 396754 402483 300468 273689 352306 276471 270536 381268 520946 439263 436643 392307
10372C92307J3356J36191K7124j03177m5380Q6053O6769j65962j18399J38618
10362D27500k6897J3001J1053Q9515P2229k6731n0497J1157K5122k7483O8521
10351E86490N5562J6820j67136K1835l718O506J23778J5234k702n7632P4140M2473
10339G11650k8095q267l8945J76154p1588j44213N4519L9003N5994k1261l6990
10328F87961J3258J05900j00032k6367N1485N0340O7509r316j0967p9129j85339
10317E65303j1788M1225P6405k4541L8276P338M6322M808j15981j6830J11189
10306G21726n6866p8357n8432J9860N6594o4609J1978Q6553j06065k4701L8377
10295E46058K2922M6588o6826M5384J34125R0696J4949o3822k788J7334k9n3216
$$ plain form
10372 392307 405663 541854 568978 465801 420421 506474 573243 407281 288882 427500
10362 427500 400603 413604 424657 514172 586401 559670 509173 520330 545452 517969 586490
10351 586490 642052 658872 491736 513571 509853 516359 640137 655371 652669 595037 669177 711650
10339 711650 683555 675288 636343 812497 740909 596696 651215 690218 746212 724951 687961
10328 687961 701219 807119 707087 680720 732205 782545 850054 840738 829771 750642 565303
10317 565303 553515 594740 671145 646604 684880 692218 738540 743348 627367 610537 721726
10306 721726 664860 586503 528071 547931 604525 539916 551894 638447 532382 507681 546058
10295 546058 568980 615568 548742 594126 728251 818947 833896 770074 767286 784620 784591 731375
10283G31375o3871M5091j4687M5737r4212m7660N8030k5354r152l4312Q0924J11264
10271G83173r2761j05576M7988Q4882l4963m3699O0559j0470j44644j0026Q3626
10260F18089J90036L0153k7934O8032p0541j01651j5413J33164J52438K29q7550
10249H89052P058K5650m0975N392J83406J58130j0884j27695l4073M493J3916
10238A073470J5016j4947R9088O6527j5656j42568m086K6057M6928k4081P6767
10227A202515L563j81021o8911M0281K782O5972N1131K2128N2398j37678K9651
10216A082811m6250q0511J06376P6786J06643j35268l7737K4075P384m5897J61151
10205A219563p086O9701q1133J1903q178m2838J58315j01108J20352L459j09833
$$ plain form
10283 731375 667504 712595 697908 743645 649433 601773 659803 634449 625297 590985 671909 783173
10271 783173 690412 584836 632824 717706 682743 639044 699603 689133 544489 534463 618089
10260 618089 808125 838278 810344 878376 807835 706184 690771 823935 976373 976602 889052
10249 889052 896110 921760 880785 886177 1069583 1227713 1216829 1089134 1055061 1059554 1073470
10238 1073470 1088486 1073539 1172627 1239154 1223498 1080930 1076844 1102901 1149829 1125748 1202515
10227 1202515 1206078 1025057 956146 996427 999209 1065181 1116312 1138440 1190838 1053160 1082811
10216 1082811 1036561 956050 1062426 1139212 1245855 1110587 1072850 1096925 1104309 1058412 1219563
10205 1219563 1212477 1282178 1201045 1212948 1204770 1161932 1320247 1219139 1339491 1342950 1233117
10194A233117j07297L2266N7252P3049l9389P0841K828q0287l5617j1711J25663
10183A320715o8504N053P1005Q1305p2144r7282N7J26222K5357M1914l2878Q1661
10171A482481l6835j34049J77172L2221P2959k9745K5818J6161K1706j37177M7252
10160A537964O0685J10979p360L7019K2027j112J9535k2985k092o1556P0225R9808
10148A863137J3280n8044J8299L2299M7244l8774P2744J54431J6287j06374M3353
10137B057882P6014J9630j1175j6686M9045o1454R8072j7670J48476k1687O5242
10126B385689N2655l6572N9950r2591n4516J6032L5186K9708L6512k5982M3279
10115B449350o9924N3535M9530o9301l7566j1865J0521K7747J03314l8373o5937
$$ plain form
10194 1233117 1125820 1158086 1215338 1288387 1248998 1319839 1322667 1242380 1206763 1195052 1320715
10183 1320715 1252211 1257264 1328269 1409574 1337430 1240148 1240205 1366427 1391784 1433698 1400820 1482481
10171 1482481 1445646 1311597 1488769 1520990 1593949 1564204 1590022 1606183 1627889 1490712 1537964
10160 1537964 1598649 1709628 1702268 1739287 1761314 1760202 1779737 1756752 1754660 1693104 1763329 1863137
10148 1863137 1876417 1818373 1836672 1868971 1916215 1877441 1950185 2104616 2120903 2014529 2057882
10137 2057882 2133896 2153526 2142351 2125665 2174710 2113256 2211328 2193658 2342134 2320447 2385689
10126 2385689 2438344 2401772 2461722 2369131 2314615 2330647 2365833 2395541 2432053 2406071 2449350
10115 2449350 2379426 2432961 2482491 2413190 2375624 2363759 2374280 2402027 2505341 2466968 2401031
10104B401031N0672J86j07200K10905O9127l9178o4749l4658J08922n3776M5234
10093B586516J2928J35600M3624m9485N1488m427J5382J13064q849J40374n9907
10082B976308n9661J28289K8939J0607O8774N9126o303J23506M2569p5357j5575
10071C281222n558R6861K2912R9051K1238K9384R5759M9276k0953P4106O6570
10060C809868N5089O7508j6856n3790J0606M7738l3176N333L6179P9546j6657
10049C991388k7209J13321J10078N0820R0487K6955l5751j838P6382R1053J04965
10038D590651K439j7386P1786J07762O627M5166N1254R1308R3812L3292R4722
10027E171433M0543j852m274J71413J96481j6205L8069L8397R0204Q1884j57787
$$ plain form
10104 2401031 2451703 2451889 2344689 2555594 2624721 2585543 2520794 2486136 2595058 2541282 2586516
10093 2586516 2599444 2735044 2778668 2729183 2780671 2776244 2791626 2904690 2895841 3036215 2976308
10082 2976308 2916647 3044936 3073875 3084482 3153256 3212382 3206079 3329585 3372154 3296797 3281222
10071 3281222 3275664 3372525 3395437 3494488 3515726 3545110 3640869 3690145 3669192 3743298 3809868
10060 3809868 3864957 3932465 3915609 3861819 3872425 3920163 3886987 3892320 3928499 4008045 3991388
10049 3991388 3964179 4077500 4187578 4238398 4328885 4355840 4320089 4318251 4394633 4485686 4590651
10038 4590651 4593090 4575704 4647490 4755252 4761879 4807045 4858299 4949607 5043419 5076711 5171433
10027 5171433 5211976 5210124 5205850 5377263 5573744 5557539 5595608 5634005 5724209 5806093 5648306
10016E648306L1098K82140Q5871n082M265j4378R6101J29366J16813M8332J75837
10005F598669q1154R378P1333J02650J48442M9099J97342J40360K7577q426N4226
9994G309496K56178J44308N4144K15250Q0222O4091L2664P1014J12787J83456
9984H523610J56113K8233M4216K00450J16591O5571K36894K12682Q6792L2364
9974I703516K08538J67852J15671J71514J78020J59263N8508R7237J66607K52937
9964A1279663J36008J13357K12283L00116J83823J69768K15781L15842J79268
9955A3105909O0106J85542K17944K31763J85595L01149K76395J46971K63383R9097
9945A5073854J52371K81918K17004K95160K60904J71526K49180K16149J59772
$$ plain form
10016 5648306 5679404 5961544 6047415 6042333 6046598 6032220 6128321 6257687 6374500 6422832 6598669
10005 6598669 6517515 6526893 6598226 6700876 6849318 6898417 7095759 7236119 7263696 7255270 7309496
9994 7309496 7565674 7709982 7764126 7979376 8059598 8123689 8156353 8227367 8340154 8523610
9984 8523610 8679723 8707956 8752172 8952622 9069213 9134784 9371678 9584360 9671152 9703516
9974 9703516 9912054 10079906 10195577 10367091 10545111 10704374 10762882 10860119 11026726 11279663
9964 11279663 11415671 11529028 11741311 12041427 12225250 12395018 12610799 12926641 13105909
9955 13105909 13166015 13351557 13569501 13801264 13986859 14288008 14564403 14711374 14974757 15073854
9945 15073854 15226225 15508143 15725147 16020307 16281211 16452737 16701917 16918066 17077838
9936A7077838K27641K45816L63363L40163K47976K38908K41961M06792L38020
9927A9728478J97576L39812L50833L33820L64364M10780K74810L10840M19453
9918B2730766M58625L73411M60975M72474M67744M86793M26788M95249N33539
9909B6906364M31957N78362M77385N36703N04815N27385O84923N52177P54190
9900C1954261O27132P04912P66943P59207P96095O83560P89110Q81474Q27315
9891C8790009R83388Q40035R21566J070780R79595J068490J004626J201834J387431
9882D8247754J266601J216440J286083J521553J422867J494941J508821J526864
9874E9491924J768049J627332J619699J909101J839601J929158J915146J971837
$$ plain form
9936 17077838 17305479 17551295 17914658 18254821 18502797 18741705 18983666 19390458 19728478
9927 19728478 19926054 20265866 20616699 20950519 21314883 21725663 22000473 22311313 22730766
9918 22730766 23189391 23562802 24023777 24496251 24963995 25450788 25877576 26372825 26906364
9909 26906364 27338321 27916683 28394068 28930771 29435586 29962971 30647894 31200071 31954261
9900 31954261 32581393 33286305 34053248 34812455 35608550 36292110 37081220 37962694 38790009
9891 38790009 39773397 40613432 41534998 42605778 43585373 44653863 45658489 46860323 48247754
9882 48247754 49514355 50730795 52016878 53538431 54961298 56456239 57965060 59491924
9874 59491924 61259973 62887305 64507004 66416105 68255706 70184864 72100010 74071847
9866G4071847K269797K220009K330977K213940K399556K557517K515125K762311
9858I3341079K707657K809027K953287K979669L158276L297313L299870L511805
9850A18057983L642306L696232L857698M040984M270848M365015M399140M665433
9842A50995639M840043M883413N193049N418387N457053N763054N956373O237047
9834A94744058O313550O492205O798760O901389P183199P151939P270471P363348
9826B50218919P497525P376826P317604P341250P122531O862901O624013O291985
9818C06653554O096239N789951N189280M943684M693140M316071M039316L673665
9810C45394900L510620L198492K977617K688140K655566K495850K295034K111484
$$ plain form
9866 74071847 76341644 78561653 80892630 83106570 85506126 88063643 90578768 93341079
9858 93341079 96048736 98857763 101811050 104790719 107948995 111246308 114546178 118057983
9850 118057983 121700289 125396521 129254219 133295203 137566051 141931066 146330206 150995639
9842 150995639 155835682 160719095 165912144 171330531 176787584 182550638 188507011 194744058
9834 194744058 201057608 207549813 214348573 221249962 228433161 235585100 242855571 250218919
9826 250218919 257716444 265093270 272410874 279752124 286874655 293737556 300361569 306653554
9818 306653554 312749793 318539744 323729024 328672708 333365848 337681919 341721235 345394900
9810 345394900 348905520 352104012 355081629 357769769 360425335 362921185 365216219 367327703
9802C67327703K067351J827990J749042J539410J563011J431418J300667J233158
9794C80039750R37514P98445M52985L07186P8484k42260q37621j330793j906937
9785C78296753k546092l083401l962442m796013n498484o234025o945819p829668
9777C37400809q512212q841015r383481r798797r940171j0008221j0107091j0058142
9769B60751679r872808r780799r404186q944928q852148q491407p916367p617524
9761A89871512p309638p098808o606365o427982o078318n844845n463691n206115
9753A39835750n034619m801105m496749m401577m121620l960703l761914l555829
9745A05701634l488159l137082l149833k978378k896535k834132k671799k520985
$$ plain form
9802 367327703 369395054 371223044 372972086 374511496 376074507 377505925 378806592 380039750
9794 380039750 380977264 381775709 382228694 382535880 382614364 382372104 381534483 380203690 378296753
9785 378296753 375750661 372667260 368704818 363908805 358410321 352176296 345230477 337400809
9777 337400809 328888597 320047582 310664101 300865304 290925133 280916912 270809821 260751679
9769 260751679 250878871 241098072 231693886 222748958 213896810 205405403 197489036 189871512
9761 189871512 182561874 175463066 168856701 162428719 156350401 150505556 145041865 139835750
9753 139835750 134801131 130000026 125503277 121101700 116980080 113019377 109257463 105701634
9745 105701634 102213475 99076393 95926560 92948182 90051647 87217515 84545716 82024731
9737H2024731k443368k249364k187459k166979k116507j935274j801696j864094
9729F5259990j688268j754323j521458j615820j545642j459972j430921j354658
9721E2888928j382631j330758j107966j122991j230644j182475j066639r19876
9713D3544948j054910j042087r29914r03642q53596r35496q60154p19871p89320
9704C5455958q13593p19594p66736o69811p40300o54980m32630n71699o07652
9695B9478963o29201o40921n54339n15688m33673n49947m77143m79370n87302
9686B4611379m02706m60571l80539l69820m13470m45095m87823m50752k31154
9677B0969449m60305k84928k95966l15846l01372k64788l85994l42160k91781
$$ plain form
9737 82024731 79581363 77331999 75144540 72977561 70861054 68925780 67124084 65259990
9729 65259990 63571722 61817399 60295941 58680121 57134479 55674507 54243586 52888928
9721 52888928 51506297 50175539 49067573 47944582 46713938 45531463 44464824 43544948
9713 43544948 42490038 41447951 40518037 39614395 38760799 37825303 36965149 36245278 35455958
9704 35455958 34642365 33922771 33156035 32486224 31745924 31090944 30658314 30086615 29478963
9695 29478963 28849762 28208841 27654502 27138814 26705141 26155194 25678051 25198681 24611379
9686 24611379 24208673 23748102 23367563 22997743 22584273 22139178 21651355 21200603 20969449
9677 20969449 20509144 20224216 19928250 19612404 19311032 19046244 18660250 18318090 18026309
9668A8026309k75846m01770l02461j81016k76606j63065k81430k56861l93395
9659A5493859k25750j37204k24695r4232k69036k81119j82935k08976k66671j89206
9649A3414035o993j20734l11470k16251j00186j95920k36924j54434r9931k25457
9639A1745735k70464j10454j46004j78699j12829j38284r9425j52929k53893k22531
9629A0060223r7363n9030j41821k32814r4516j42722j52637j63466j60090P2511
9619H888275K4639k02058j69681o0745j08768j80205j69206r2352j43254o4344
9609G722301j99246j18325N6095j1985j25323O1649L979j98379j03952J52K0452
9598G107418j00834j70715j42387k9988o8232j21447o8520n5907L7567n5822j58842
$$ plain form
9668 18026309 17750463 17348693 17046232 16865216 16588610 16425545 16144115 15887254 15493859
9659 15493859 15268109 15130905 14906210 14811978 14542942 14261823 14078888 13869912 13603241 13414035
9649 13414035 13407042 13286308 12974838 12758587 12658401 12462481 12225557 12071123 11971192 11745735
9639 11745735 11475271 11364817 11218813 11040114 10927285 10789001 10689576 10536647 10282754 10060223
9629 10060223 9962860 9903830 9762009 9529195 9434679 9291957 9139320 8975854 8815764 8888275
9619 8888275 8912914 8710856 8541175 8480430 8371662 8191457 8022251 7929899 7786645 7722301
9609 7722301 7523055 7404730 7460825 7448840 7323517 7385166 7389145 7190766 7086814 7086966 7107418
9598 7107418 7006584 6835869 6693482 6663494 6595262 6473815 6405295 6349388 6386955 6331133 6172291
9587F172291J0028r074k6565m5341n3304j28846M563n0541j13966r0252j23981
9576E545012p9244j23613j23457p9141J3536K3349p1108k5172j052q5797j29722
9565D863591n3248J15856L3857j17416j07401q174m8497n7438k1460p7600j4565
9554D507505K5303j27561P838K8161l7532k3792q457L5812k0908j80019p4130
9543D132220j5023q0627o7408j86802N2537L2020L686l5440j42643q9698j09110
9532C493712n5464J55235j01684p9971k29305O3671j06041j51763J01546O8249
9522C158185K7838K2415o3305j6326r1418j28967M719J36033k9590j12723J7185
9511B924046j88677r4967L549L0362N4809q505j02084P1006L7675q7185K6783
$$ plain form
9587 6172291 6182319 6173245 6146680 6101339 6048035 5919189 5923752 5873211 5759245 5668993 5545012
9576 5545012 5465768 5342155 5218698 5139557 5153093 5176442 5105334 5080162 5079110 4993313 4863591
9565 4863591 4810343 4926199 4960056 4842640 4735239 4727065 4678568 4621130 4599670 4522070 4507505
9554 4507505 4532808 4405247 4413085 4441246 4403714 4379922 4371465 4407277 4386369 4206350 4132220
9543 4132220 4117197 4036570 3969162 3782360 3834897 3866917 3870603 3835163 3692520 3602822 3493712
9532 3493712 3438248 3593483 3491799 3411828 3182523 3246194 3140153 2988390 3089936 3158185
9522 3158185 3186023 3208438 3145133 3128807 3037389 2908422 2913141 3049174 3019584 2906861 2924046
9511 2924046 2735369 2640402 2643951 2674313 2729122 2720617 2618533 2689539 2727214 2640029 2666812
9500B666812O3356L2845m9115j48878l9801J7477L7237k5845q6167j9543K8052
9489B476430j15394K9290Q8730N1572q1534N6439K5207K4790N738n6344J6913
9478B521837M8145j38211J8774N9654K4170Q92k6056M378J0663r1576N8043P3877
9466B564590j5142O3992K1107q8644J4963q513m0515K113L8695j02848L2703j3255
9454B469246j02611J24091j0288l7385P6015j26910J2970M7645J9863k2019J224
9443B451841O8740k7419j24070j53991J67208O6907j09166l0004J09366P552o5804
9432B361160r1250J44133P0821L9036o4281M9357j8058j55268M9895K0715j2646
9421B393614L8952k6261J29484L1849o5788N8650L9078P9392j10880j35414J6074
$$ plain form
9500 2666812 2730168 2763013 2713898 2565020 2525219 2542696 2579933 2554088 2467921 2448378 2476430
9489 2476430 2361036 2390326 2479056 2530628 2449094 2505533 2530740 2555530 2561268 2504924 2521837
9478 2521837 2569982 2431771 2450545 2510199 2534369 2535261 2509205 2513583 2524246 2432670 2490713 2564590
9466 2564590 2549448 2613440 2634547 2545903 2560866 2552353 2511838 2513951 2552646 2449798 2482501 2469246
9454 2469246 2366635 2490726 2480438 2443053 2519068 2392158 2405128 2452773 2472636 2450617 2451841
9443 2451841 2520581 2493162 2369092 2215101 2382309 2449216 2340050 2310046 2419412 2426964 2361160
9432 2361160 2269910 2414043 2484864 2523900 2459619 2508976 2490918 2335650 2385545 2406260 2393614
9421 2393614 2432566 2406305 2535789 2567638 2501850 2560500 2599578 2678970 2568090 2432676 2448750
9410B448750L1017N4927k0325r2087M2315Q0374L1259j4437N293P8399r228M6107
9398B682364n939m6820N5834k8789k5166k4034k3184J43066j72047K0874J43085
9387B719244M4386j03285J11229P0882M5304J2772j4576l4252P1483J36228j12896
9376B946519M7059m0829J67864p2144j41013L8388o9568l2962J481P0195N3134
9365B968124o9052j87967j4076N9655M533J7011o3437k2616j04123k5498m3333
9354B519221O0439N8483j01132J17634j07611j02879N9135j8492N9364m5396P8042
9343B576808p0055j03911n7917J11258n7779l2636l2349M667l3529J7181j7221
9332B304517q9920O4333J1634p7803m6845K1923M8623o9347j38909K1205m3713
$$ plain form
9410 2448750 2479767 2534694 2514369 2422282 2464597 2544971 2576230 2561793 2567086 2645485 2636257 2682364
9398 2682364 2676425 2629605 2685439 2656650 2631484 2607450 2584266 2727332 2555285 2576159 2719244
9387 2719244 2763630 2660345 2771574 2842456 2887760 2900532 2885956 2851704 2923187 3059415 2946519
9376 2946519 2993578 2952749 3120613 3048469 2907456 2945844 2876276 2843314 2844795 2914990 2968124
9365 2968124 2899072 2711105 2697029 2756684 2761217 2778228 2714791 2692175 2588052 2562554 2519221
9354 2519221 2579660 2638143 2537011 2654645 2547034 2444155 2503290 2484798 2544162 2498766 2576808
9343 2576808 2506753 2402842 2344925 2456183 2398404 2365768 2333419 2338086 2304557 2321738 2304517
9332 2304517 2214597 2278930 2290564 2212761 2165916 2187839 2236462 2167115 2028206 2049411 2005698
9321B005698J16905q1036j1061M0505o5309r5972p5747J06302m9271o3104k4386
9310A803524n0818n8677q576p595J2849k7659o8357j9389l6174j3802J9030n111
9298A539245j5486k9862j03436M7238r8827k8542J50884J2289Q789o4416q515
9287A409361P1126q6793l3312J7304J17261l0556q2004K7104P4046o2951J1647
9276A432233m6669R1730N6619j96644k2402p163M8720k7322o8620K00071N8160
9265A518713j34941j70095L113R0477j06221o2405J09888J21371q3720r7327l122
9254A185731J4841Q3193K9202p5592j4935l1129o6580O5240P0058p5950N7577
9243A241656O2212j01114n1056L5779N0005l7955o7434P6121R2294P4186j65769
$$ plain form
9321 2005698 2122603 2041567 2030506 2071011 2005702 1909730 1833983 1940285 1891014 1827910 1803524
9310 1803524 1752706 1694029 1685453 1677858 1690707 1663048 1594691 1575302 1539128 1525326 1544356 1539245
9298 1539245 1523759 1493897 1390461 1437699 1338872 1310330 1461214 1473503 1482292 1417876 1409361
9287 1409361 1480487 1393694 1360382 1377686 1494947 1464391 1382387 1409491 1483537 1420586 1432233
9276 1432233 1385564 1477294 1533913 1337269 1314867 1307704 1356424 1329102 1260482 1460553 1518713
9265 1518713 1383772 1213677 1216790 1307267 1201046 1138641 1248529 1369900 1286180 1188853 1185731
9254 1185731 1200572 1283765 1312967 1237375 1222440 1191311 1124731 1189971 1260029 1184079 1241656
9243 1241656 1303868 1202754 1151698 1187477 1237482 1199527 1132093 1208214 1300508 1374694 1208925
9232A208925J3780R9257m0651o093M100J4J32363p6465o2785j7001R8575R6619
9220A450638j31691j9567Q7891j10396m0944R5642J60275M6803k39544Q7471N9175
9209A445753q1884j5308Q3711J37296k404j7499m6645Q3876L1883M2109m7232
9198A613656l7995O0626k7230k8107R9245J38722m4901m4744n1908J52247R716
9187A839327j06930k0627J3318O8165l1729l3859Q8156j17519j487L0038j12355
9176A614498J10955R6411l8466r7375N1701K15077k6830j02215L4833l325R3084
9165A948348L8825l3696P865J26917K7977o4510o8219p9933Q8740M6062m6653
9154A991723P4759J42108j23903m7364P011J8480K1898o5228o4878J53498O9258
$$ plain form
9232 1208925 1222705 1321962 1281311 1275218 1279318 1279332 1411695 1335230 1272445 1255444 1354019 1450638
9220 1450638 1318947 1299380 1387271 1276875 1235931 1331573 1491848 1538651 1299107 1386578 1445753
9209 1445753 1363869 1348561 1432272 1569568 1567164 1549665 1503020 1586896 1618779 1660888 1613656
9198 1613656 1575661 1636287 1609057 1580950 1680195 1818917 1774016 1729272 1677364 1829611 1839327
9187 1839327 1732397 1711770 1725088 1793253 1761524 1727665 1815821 1698302 1696815 1726853 1614498
9176 1614498 1725453 1821864 1783398 1686023 1737724 1952801 1925971 1823756 1858589 1855264 1948348
9165 1948348 1987173 1953477 1961342 2088259 2116236 2051726 1983507 1903574 1992314 2038376 1991723
9154 1991723 2066482 2208590 2084687 2037323 2044334 2062814 2084712 2019484 1954606 2108104 2177362
9143B177362j53855k3628N0950M551o2787j52396J07525R419j26535j6530L489
9132A817565N6613q7691j06782O5724J26751k04071j65192k0489P8091J38574
9122A699093p3982P992K6182l6523p6923J6652M5210J89536q3758j05609K8257
9111A636127p514l6948j5081J43871m5658J5333j2948O4997N5901m0547m8776
9100A708757R4306j43296r4822N2607p4821J43422L5113o8694P3609n1223n4491
9089A620467l09N1860J4289L998o0699q0485p7247j40806Q5913J05222m4672L4438
9077A511969p792j4009r0084n6888J788J22702j1298j45492j8420K2170L2928
9066A347574j57761k8136J00165L23j48010l4285P0848J1452J422l517K0622r605
$$ plain form
9143 2177362 2023507 1999879 2050829 2055380 1992593 1840197 1947722 1957141 1830606 1814076 1817565
9132 1817565 1874178 1786487 1679705 1745429 1872180 1668109 1502917 1482428 1560519 1699093
9122 1699093 1625111 1633103 1659285 1622762 1545839 1562491 1607701 1797237 1713479 1607870 1636127
9111 1636127 1628613 1591665 1576584 1720455 1674797 1690130 1677182 1742179 1798080 1757533 1708757
9100 1708757 1803063 1659767 1564945 1617552 1542731 1686153 1721266 1652572 1726181 1674958 1620467
9089 1620467 1620158 1672018 1686307 1690305 1629606 1549121 1471874 1331068 1416981 1522203 1477531 1511969
9077 1511969 1504177 1490168 1400084 1343196 1344984 1467686 1456388 1310896 1292476 1314646 1347574
9066 1347574 1189813 1161677 1261842 1262165 1114155 1079870 1150718 1162170 1163592 1160075 1180697 1171092
9054A171092j32687N0287O4460n9279J0974r4830j18606L0730k6092J7228P1711
9043I84988q794j15217j9950P3158j01576P6185N1590q7428o0506L7368O3061
9032H92879P8026o7697J1182m9367n269M9636j06841l6106L8306j7589n4553J0132
9020G42739R863o4773r3594L4732j5676R9877q0602m6078J3473L2631L3081J951
9008F67624j9063L2668n3886k8692L8048p083K8787j02657l5777M160R4849k3698
8996E95280k8644N2765P3073r0699o5180j9345K8392Q0015K9049J10310j13069
8985F51947j9238M610r0029O3957j2565Q2384M9002j16341n95o3020O0770n184
8973F05698n8193R4343j70440p6104K7388l2553J15830o9163n1245J20386q9415
$$ plain form
9054 1171092 1038405 1088692 1153152 1093873 1104847 1010017 891411 922141 896049 913277 984988
9043 984988 976194 860977 841027 914185 812609 888794 940384 852956 792450 829818 892879
9032 892879 970905 903208 914390 865023 859754 909390 802549 766443 804749 787160 732607 742739
9020 742739 752602 687829 594235 628967 613291 713168 632566 586488 599961 632592 665673 667624
9008 667624 648561 681229 627343 598651 636699 629616 658403 555746 519969 524129 618978 595280
8996 595280 566636 619401 692474 601775 536595 517250 545642 625657 654706 765016 651947
8985 651947 632709 637319 547290 611247 598682 681066 730068 613727 613132 550112 610882 605698
8973 605698 547505 641848 471408 395304 422692 390139 505969 436806 385561 505947 416532
8962D16532p3534l9473J24747Q1409j70245J9884Q3185J23398J7186k00203N7232
8951D40118J09331j31519q3248L6060J62862j67687j51102J64482M3336r3740
8941C28893n8827J42864J00736r6724q449k8195J9150o1326l2296j8065N6036
8930C43797Q2744j61135k2808M3147J7637K9499M0777j8819r7675r0249m7961
8919A18954R4453J42585R1431q6478j10582k5545l2011M5818O7496j23023K8168
8908B11266M6717O46N6290m9316R3699L5150J9267o8271M6834N0496q2504j60899
8896A99375J52054l7889O52O6526M7389M4015p4678j1011L2079o4484l0077l2507
8884B91444P827J23593q8436O899J6241Q0697q6926l4223K0113L5497j08187o3419
$$ plain form
8962 416532 342998 303525 428272 509681 339436 359320 442505 565903 583089 382886 440118
8951 440118 549449 417930 334682 370742 533604 365917 214815 379297 422633 328893
8941 328893 270066 412930 513666 416942 408493 380298 399448 338122 305826 287761 343797
8930 343797 426541 265406 242598 285745 303382 332881 373658 354839 257164 166915 118954
8919 118954 213407 355992 447423 360945 250363 224818 192807 238625 306121 183098 211266
8908 211266 257983 258629 314919 265603 359302 394452 413719 345448 392282 442778 360274 199375
8896 199375 351429 313540 314192 380718 428107 472122 397444 386433 418512 354028 323951 291444
8884 291444 299271 422864 334428 341327 357568 438265 351339 317116 337229 372726 264539 201120
8872B01120N0157K2658K2416N4303J5628m6797j2468j71974k7474J53419L0443
8861B91431j44510J9952O0013N4922J0130p6368P2103J0233l2420j01286l9412
8850A24788R6478m7100n0914L6817r119J22744j99024n8190l0380R7894O1204
8839A45198P926N2004m2293l9596m946J9599r4761J14135r3908m365q4090J47139
8827A22042Q153L7842k9304p5527Q8726m7444l8149J18621J13892p7332o1846
8816A59674p0989J46868j00799m1571Q8151J959n8620p8125J8871N7495l2364
8805I0550O9486P0646j14038n5219l8706J39212j08815o91l0678l5738Q8723P2906
8793A47638j7389L9469l8008L9433L0989l6563J6243K689L5059k0667Q3362j49424
$$ plain form
8872 201120 251277 273935 296351 350654 366282 319485 307017 135043 107569 260988 291431
8861 291431 146921 166873 226886 281808 291938 215570 287673 297906 265486 164200 124788
8850 124788 221266 174166 123252 160069 150950 273694 74670 16480 -13900 83994 145198
8839 145198 153124 205128 162835 123239 118293 137892 43131 157266 63358 58993 -25097 122042
8827 122042 130195 168037 138733 63206 151932 104488 66339 184960 298852 221520 159674
8816 159674 88685 235553 134754 93183 181334 183293 124673 46548 65419 122914 90550
8805 90550 160036 230682 116644 61425 22719 161931 53116 52425 21747 -13991 74732 147638
8793 147638 130249 169718 131710 171143 202132 165569 181812 184501 219560 198893 282255 132831
8781A32831P5717k4409Q1994m122O3966j14652j2541P9380n5521O6666p3066O8171
8769B84414M4642o038p9978m3762j23738J03923J0702q9509q2556r9146J7061
8758f3985N8388P3854N3890K09980k4269j62873o7795j09594r760J17831q695
8747F6972N9158p056j36394m751j3998J32051P5005L0965l8630j45996R3336K813
8735A13475r6206J64147m8510l1963p0904j8514J30815M3625N801m6824p1494
8724G3448K1111J4342k8628P0941r3259Q8544k3252j8817n8878L2619j37373N0185
8712i017M3955N467M9228p8875m7732J65509P7188j06825Q9469M834j641o7003
8700A24557j934K2360L9792q4949r6613P8761l6785l2799N4383L2499P3434k4688
$$ plain form
8781 132831 208548 184139 266133 262011 325977 211325 198784 278164 222643 289309 216243 284414
8769 284414 329056 323018 243040 199278 75540 179463 190165 100656 18100 -81046 -63985
8758 -63985 -5597 68257 122147 332127 307858 144985 77190 -32404 -42164 75667 66972
8747 66972 126130 119074 -17320 -22071 -36069 95982 170987 201952 163322 17326 110662 113475
8735 113475 17269 181416 132906 100943 30039 11525 142340 185965 191766 144942 73448
8724 73448 94559 108901 80273 151214 57955 146499 123247 104430 45552 78171 -59202 -9017
8712 -9017 34938 40405 89633 10758 -36974 128535 205723 98898 188367 193201 191560 124557
8700 124557 122623 144983 184775 99826 3213 81974 45189 12390 66773 99272 172706 148018
8688A48018j6803P021o1064l9946J01096m4630L5743R330l1083K6415K5757P2965
8676B32819q1668n3616L5989J9219M2855l2071k4654M5900n9959j485o7695q3851
8664b8217J23725r3819m4589J25526r3374m9245M8703M8457P5160j62897n4828
8653a05398j64051J65728K04048j36368r9990L7419J2068j36908k6651K34128
8643a5975L1222n0278P5052N072R227p7550n5231J02001Q8956O5057n0505q4509
8631D2539Q8441O247q7253O4731Q299m221n4247m76k4948N097L7179n7122K9025
8618E3291m8496M5453K0220j86099N5802J18373j24201N4757m2767R4001j02314
8607f1980R565L8930J4378j9032r2200K1078O6463Q03R246J0833P0835L0024K11872
$$ plain form
8688 148018 131215 138236 77172 37226 138322 93692 129435 138765 107682 134097 159854 232819
8676 232819 151151 97535 133524 152743 195598 163527 138873 184773 124814 123329 55634 -28217
8664 -28217 95508 1689 -42900 82626 -10748 -59993 -11290 37167 112327 -50570 -105398
8653 -105398 -269449 -103721 100327 -36041 -136031 -98612 -86544 -223452 -250103 -15975
8643 -15975 15247 -35031 40021 45093 54320 -23230 -78461 23540 112496 177553 127048 42539
8631 42539 130980 137227 49974 114705 123004 118783 64536 64060 39112 44209 81388 24266 53291
8618 53291 4795 50248 70468 -115631 -59829 58544 -65657 -10900 -53667 40334 -61980
8607 -61980 -52415 -13485 893 -18139 -110339 -89261 -22798 -21995 -12749 -1916 68919 98943 310815
8594C10815M8271k23173Q0871J4124j16067j05963K72915L13p6762L5685j7077
8583B23952M5455q6463Q7363J03359o1755r5319o5904M640j6924j22018R8119
8572A14505q294M0714o659k9983R6486l1731M3735n5987R52K7476O0757j15716
8560A36255K5592J17935J3611m9646m0772J1021o0455J6686q599M4441O2671k0488
8548B48252p4646N0258m8334P7836r5626n4636J0053J5493J7598M1444J3747k9640
8536A71799n0232o7525N3046J7359N7193L8328J42021k299q030n600k663N9043
8524D02440M549j29562J47940Q8566m6791n2580L4962J28014j24297P4359M0051
8513E67651q1466l0624j11567k6261J27639L783p1458L8660J22194p8257k1880
$$ plain form
8594 310815 359086 135913 216784 230908 114841 8878 281793 282106 205344 241029 223952
8583 223952 269407 182944 270307 373666 311911 216592 150688 155328 138404 16386 114505
8572 114505 106211 146925 140266 110283 206769 175038 218773 162786 163738 191214 251971 136255
8560 136255 161847 279782 293393 243747 202975 213996 153541 170227 161628 206069 268740 248252
8548 248252 173606 223864 175530 253366 157740 103104 113157 128650 146248 187692 201439 171799
8536 171799 121567 54042 107088 124447 181640 219968 361989 359690 351660 346060 343397 402440
8524 402440 406989 277427 425367 513933 467142 414562 449524 577538 453241 527600 567651
8513 567651 486185 455561 343994 317733 445372 449155 377697 416357 538551 460294 438414
8502D38414O0535k891J0596n5251l7082N673l5651M8739J6094n0629J41743J14125
8490F54415Q9326L1805j03017l929K9307M4578J7612j2915J54193j41592j14254
8479F45529P8321Q3998J5187m3430r7639O4252j6314j12346J0397k155J1955J1049
8467F48804O6588j6703o5342j59940k5585J25808N2887N2943p5077N8706m0903
8456F22186r8386J5455J15610R2070L8271j04134L7709J33215p7828k6454M7316
8445G95030J20063K9535m8561q9515N0080j7914j01615J97143M4688j11156r4535
8434G73243R9449r445n7993K6087m8742Q5073R229k878L2336j78313J9941J35236
8422H83223J01992K2553j7362J14341j8032J5517L3967N4841J01226R3926n1402
$$ plain form
8502 438414 498949 496058 506654 451403 414321 419994 384343 433082 449176 398547 540290 654415
8490 654415 743741 775546 672529 668600 697907 742485 760097 747182 901375 759783 645529
8479 645529 723850 807848 823035 779605 681966 746218 729904 617558 627955 625800 637755 648804
8467 648804 715392 698689 633347 473407 447822 573630 626517 679460 604383 663089 622186
8456 622186 523800 539255 654865 746935 785206 681072 718781 851996 774168 747714 795030
8445 795030 915093 944628 896067 806552 856632 838718 737103 934246 978934 867778 773243
8434 773243 872692 863247 805254 831341 782599 867672 876901 874023 906359 728046 747987 883223
8422 883223 985215 1007768 990406 1104747 1086715 1102232 1136199 1191040 1292266 1386192 1334790
8411A334790o3314L6076Q5686K1633K07043J41026n7861j1988M7041J03706J19521
8400A963359K9580Q5835M4699J19371l7626J5434J12031J66891P4610l1640J48855
8389B691399J27605r640J2576L33635K00800J95256J82921K87559L06963J38487
8379D467561J97787K39273K89673K29647K47702N5515N062J96253J94602N2228
8369F175303M6764J8666j01610j87775k12072l37277j48734k50558r2350n0243
8359D860114j11512r4816j54950r1511J2988J2108K6020L688m3245J04867M0263
8348D564014J80652J47078J95836L24815J93552J44845J04198J99890K38347J65093
8338F458320K62464K42784K00416L04861J06818O7407l4556j32688j23434k68365
$$ plain form
8411 1334790 1271476 1307552 1393238 1414871 1621914 1762940 1705079 1693091 1740132 1843838 1963359
8400 1963359 1992939 2078774 2123473 2242844 2205218 2220652 2332683 2499574 2574184 2542544 2691399
8389 2691399 2819004 2809364 2821940 3155575 3356375 3551631 3734552 4022111 4329074 4467561
8379 4467561 4665348 4904621 5194294 5423941 5671643 5727158 5732220 5928473 6123075 6175303
8369 6175303 6222067 6240733 6139123 5951348 5739276 5401999 5253265 5002707 4910357 4860114
8359 4860114 4748602 4653786 4498836 4407325 4420313 4432421 4458441 4462129 4418884 4523751 4564014
8348 4564014 4744666 4891744 5087580 5412395 5605947 5750792 5854990 6054880 6293227 6458320
8338 6458320 6720784 6963568 7163984 7468845 7575663 7643070 7608514 7475826 7352392 7084027
8328G084027k68495m77843n10794m83987k56423l20105l67907k20021j61291j84407
8318C832754k36552k08461Q954q6675k30381k60234q3801p0946j46963q4365n3486
8307B379844l2141q4425m5620j0173O9910n4305j73064N7730M9186j13333o2941
8296A980668m7928L7486J15658n9693m5937k6341J15541L5218j26019l2653K0583
8285A966583n840q3152o1230K8382n5901k2098l5940K8114P462j28377K1118j07144
8273A551977o0657R0955j13591J3402N831M5057O5079j27773Q6904m6569p3007
8262A437608k2319k1915l4408l2279m9922m0120K7095J66761m1644p8742K5476
8251A335591M7808R4929J6205J5480J29423j00450j8284K1425o753Q6069k75315
$$ plain form
8328 7084027 6815532 6337689 5826895 5342908 5086485 4766380 4398473 4178452 4017161 3832754
8318 3832754 3596202 3387741 3396695 3310020 3079639 2819405 2735604 2664658 2517695 2433330 2379844
8307 2379844 2347703 2263278 2217658 2207485 2277395 2223090 2050026 2107756 2156942 2043609 1980668
8296 1980668 1932740 1970226 2085884 2026191 1980254 1953913 2069454 2104672 1978653 1946000 1966583
8285 1966583 1960743 1877591 1816361 1844743 1788842 1766744 1730804 1758918 1766380 1638003 1659121 1551977
8273 1551977 1491320 1582275 1468684 1482086 1487917 1532974 1598053 1470280 1557184 1510615 1437608
8262 1437608 1415289 1393374 1358966 1326687 1276765 1236645 1263740 1430501 1388857 1310115 1335591
8251 1335591 1383399 1478328 1494533 1510013 1639436 1538986 1520702 1542127 1535374 1621443 1346128
8240A346128J07593J67564o2845Q446p7104J16437O6299r226K224n3269J23983
8229A736230r8787l03968J13787J20499m935L9119j16770j9239R2298L07l9174
8218A519367P3982J69784K7359j03106P58j1051j9752n0945J20334L8139J24255
8207A889124J7677j20062R1413J20676N1797J02655M0789k805k4183l9745j45252
8196A982084Q1573J39052j22213k60379K29323M67804k90501n7586L486J35454
8186B308097k3029k0310m4521j10171R1973N696L1544P2582K3583j36621m4069
8175B154754J24143J24470O5394o9942N0620K30780J28220M9125J1031R3751Q5829
8164C048175Q3901O1237J04704J13200j25131m0935J16030J72878O0614R4426
$$ plain form
8240 1346128 1453721 1621285 1558440 1566886 1489782 1606219 1672518 1663292 1665516 1612247 1736230
8229 1736230 1637443 1333475 1447262 1567761 1562826 1601945 1485175 1465936 1558234 1558541 1519367
8218 1519367 1593349 1763133 1790492 1687386 1688144 1677093 1657341 1606396 1726730 1764869 1889124
8207 1889124 1906801 1786739 1878152 1998828 2050625 2153280 2194069 2191264 2167081 2127336 1982084
8196 1982084 2063657 2202709 2080496 1820117 2049440 2517244 2226743 2169157 2172643 2308097
8186 2308097 2285068 2264758 2220237 2110066 2202039 2207735 2239279 2311861 2335444 2198823 2154754
8175 2154754 2278897 2403367 2468761 2398819 2449439 2680219 2808439 2857564 2868595 2962346 3048175
8164 3048175 3132076 3193313 3298017 3411217 3286086 3245151 3361181 3534059 3594673 3689099
8154C689099J79372J72590J26694l5352J27196J59804J33341J49819K28470J50016
8144E081049l6292j27475P8214O1489k4726j19325k39740j38755q302j33849M279
8133D396567J88418J8863l4963p7163k6473j080P7557R5698J66874J1647J47030
8122D962975J81455O8654J85849J84124J74861J98397J64826K63983J55918J08659
8112F649701K36810L08516K50243J00437Q500k6324j15069j54254r9652k41200
8102F917708k55450k95160k67891j79193j24405j87847j34933j76927k85886m3956
8092D966060j66066j52900k6415N2702J4866m91O4765j8052m9272J1744O6370
8081D763311O9023l2776L4400L7579M8821M9912l9414J08441N9018o2832r447
$$ plain form
8154 3689099 3868471 4041061 4167755 4132403 4259599 4419403 4552744 4702563 4931033 5081049
8144 5081049 5044757 4917282 4995496 5056985 5032259 4912934 4673194 4534439 4526137 4392288 4396567
8133 4396567 4584985 4603848 4568885 4491722 4465249 4464169 4541726 4637424 4804298 4815945 4962975
8122 4962975 5144430 5213084 5398933 5583057 5757918 5956315 6121141 6385124 6541042 6649701
8112 6649701 6886511 7195027 7445270 7545707 7554207 7527883 7412814 7258560 7158908 6917708
8102 6917708 6662258 6367098 6099207 5920014 5795609 5607762 5472829 5295902 5010016 4966060
8092 4966060 4799994 4647094 4620679 4673381 4688247 4687756 4752521 4734469 4685197 4696941 4763311
8081 4763311 4832334 4799558 4833958 4871537 4920358 4970270 4930856 5039297 5098315 5035483 5026036
8070E026036K45646N7401k1092q9893k00026k85612l01403k32090j90433k87908
8060C720626k42319r9230j80626k65687m9118o1312r51r4399p1492m026j09080
8049B542386k2793k034q8823r8463r9955j25799o2894R863k4413m3361q0543O546
8037A909717J09264p2890j6321L0328l5p8817q5723n1475R1637l2411l2320o8379
8025A702575n02j2332L218o2862k5247n491P7343N9079k4292o0242m3332k5720
8013A582195M023O2152K6852J00176j05762j5774J09951J28658j0816J70676P7279
8002B129610K1775R2346J12507J05779J90188P5792N7976J12566J40013R4544
7992C133096O1396O9992q0631R2368P5506n54o6346k1564j29770k20487r9585
$$ plain form
8070 5026036 5271682 5329083 5307991 5218098 5018072 4732460 4431057 4198967 4008534 3720626
8060 3720626 3478307 3379077 3198451 2932764 2883646 2822334 2821383 2726984 2655492 2651466 2542386
8049 2542386 2519593 2517559 2428736 2330273 2230318 2104519 2041625 2051488 2027075 1983714 1903171 1909717
8037 1909717 2018981 1946091 1929770 1960098 1960063 1881246 1795523 1744048 1835685 1803274 1770954 1702575
8025 1702575 1702073 1689741 1692959 1630097 1604850 1599359 1676702 1735781 1711489 1651247 1607915 1582195
8013 1582195 1586218 1648370 1675222 1775398 1669636 1653862 1763813 1892471 1881655 2052331 2129610
8002 2129610 2151385 2243731 2356238 2462017 2652205 2727997 2785973 2898539 3038552 3133096
7992 3133096 3194492 3264484 3183853 3276221 3351727 3351173 3284827 3263263 3133493 2913006 2813421
7981B813421J9186p0382j72782q4282j56133j24091r233P0844K1833j5986l0931
7970B261464L0200j7592J26330K9295P860J46837O3943J35964Q4837Q5258q699
7959B945697R5702J06441J97336Q2119N2986M2373n0520j25276j69018j40477
7949C037363j30299j60372j17715j10074p4242r2274k18775K4826p6536l514q9737
7938A988651m5880o2767j28085r3490r1334O5949q0224n6624k9552R1663O6182
7927A624489J2127m3269J65445R458n4714O9483o1478o1502k8844k2754R5832
7916A704273M7266j89970j11845j1311J8204o9069K6310j55727m9822l6066p5959
7905A096284K5933j22711k2032j14450M1793n2934N7323l4078k1370L3923p7597
$$ plain form
7981 2813421 2832607 2762225 2589443 2505161 2349028 2224937 2215704 2286548 2308381 2292395 2261464
7970 2261464 2291664 2274072 2400402 2429697 2437557 2584394 2648337 2784301 2869138 2954396 2945697
7959 2945697 3041399 3147840 3345176 3427295 3480281 3522654 3472134 3346858 3177840 3037363
7949 3037363 2907064 2746692 2628977 2518903 2444661 2352387 2133612 2158438 2081902 2078388 1988651
7938 1988651 1942771 1880004 1751919 1658429 1567095 1633044 1552820 1496196 1466644 1558307 1624489
7927 1624489 1636616 1593347 1758792 1768250 1713536 1783019 1721541 1660039 1631195 1608441 1704273
7916 1704273 1751539 1561569 1449724 1438413 1456617 1387548 1413858 1258131 1208309 1172243 1096284
7905 1096284 1122217 999506 977474 863024 904817 851883 909206 875128 853758 887681 810084
7894H10084n7037L0855K1399n148n5386l840P2350j39129P148L8871j38989N5959
7882F37137K9530j3031M5438J3925o4018l0296j0818j2903J2216l5888L5205n6666
7870E49831q8676L8895l3447j6301O2728l2780P9298j08545j00385J3422l5130
7859C28910o3747J878K603M5707K1406O149J2897n1363n9305j00968k2552J60721
7847B82336N5017j3884J1395J5202n7005n8837q2301L3496O8888p2605q3300J70229
7835B68631K4911q661r8920j4669j6269j2175j2901P2896N3905k7011n2134m8572
7823A29031j1762L0223j5066Q0633O890l4970N9031o6506O242q3889m4731o4858
7811i732J00091M9247j0621j7586J12344j17032k193L0477L6146L5801j26935
$$ plain form
7894 810084 753047 783902 805301 800153 744767 740927 813277 674148 681296 720167 581178 637137
7882 637137 666667 653636 699074 712999 648981 618685 607867 594964 607180 571292 606497 549831
7870 549831 461155 500050 466603 450302 513030 480250 559548 451003 350618 364040 328910
7859 328910 265163 267041 269644 315351 336757 342906 355803 304440 245135 144167 121615 282336
7847 282336 337353 323469 334864 350066 293061 234224 151923 185419 254307 181702 98402 268631
7835 268631 293542 284881 185961 171292 155023 142848 129947 202843 256748 229737 177603 129031
7823 129031 117269 147492 132426 213059 219949 184979 244010 177504 183746 99857 55126 -9732
7811 -9732 90359 139606 128985 111399 223743 106711 104518 134995 171141 206942 80007
7800H0007R3809j38268r9488R7783O6863M9406p3863j25585P7834R862q2825K06601
7788A62136J59732q8295j39913K6023j56830L4588O8568K689O2067o4906m8288
7777A7571O2760n5938P601l6089j03760Q9714N0842l9311j07483N486J23515R0339
7765A05247q8823K9258L207r7999L719R7235P349O7368o3956o0596P9273k9868
7753E1414j28388J19413J78277j51322K8514l9324j2506p4107q9579O3608P8331
7742B4331K7052n2988n9081J9424O1532n8410N4150J7680Q1664j60602j721J02784
7730E5815j6662m0991J354R1460p2791j1521k4652q385O3667O6909j18299P8051
7718F3955M456o4273m5779k792O817k1322J13119M1155o130j10799J4637L2973
$$ plain form
7800 80007 173816 35548 -63940 33843 100706 150112 76249 -49336 28498 38360 -44465 162136
7788 162136 321868 233573 93660 119683 -37147 -2559 66009 68698 130765 65859 17571
7777 17571 80331 24393 31994 -4095 -107855 -18141 32701 -6610 -114093 -108607 14908 105247
7765 105247 16424 45682 48889 -49110 -45391 51844 59193 126561 62605 2009 81282 51414
7753 51414 -76974 42439 220716 69394 97908 58584 46078 -28029 -117608 -54000 24331
7742 24331 51383 -1605 -60686 -41262 20270 -38140 16010 33690 115354 -45248 -46969 55815
7730 55815 39153 -1838 -484 90976 18185 6664 -17988 -26373 37294 104203 -14096 63955
7718 63955 68411 4138 -41641 -44433 -37616 -58938 54181 95336 89206 -21593 -6956 26017
7706B6017K9081Q8547P7j18181O5643n4796k9622n469r2948J68492P7430m018
7694A50253k9917p1509J8358M4916j5532k1101j41804O5258r739O3925Q3614j00123
7682C6599O0556l0582r6879p641n6440n276L1713L3978p8126L6165l8151r3370
7670b07454J59206l4365n132R8780r7804N9368N306R1664j874j07835k5489J7533
7658d8096P0376M4096p5266%M347l617L5850m6974J25762r8928k6432l6509Q9267
7645C3876J08370O9307j20639m5279J0164j5321j29260N925M1461M0687O6656
7634F5947j15656K9313M3119j04521j1993N9877M2976P0630r1858n5827L1054
7623c6939j2218P8011k6752K0074M6467q2853M8457r019j6343m7493o341Q4615
$$ plain form
7706 26017 55098 143645 143722 25541 91184 36388 6766 1297 -91651 76841 154271 150253
7694 150253 120336 48827 67185 112101 96569 75468 -66336 -1078 -10817 53108 136722 36599
7682 36599 97155 66573 -30306 -37947 -94387 -99663 -67950 -33972 -112098 -75933 -114084 -207454
7670 -207454 -48248 -82613 -87745 11035 -86769 -27401 -22095 69569 67695 -40140 -65629 -48096
7658 -48096 22280 66376 -8890 -8890 -4543 -8160 27690 -19284 106478 7550 -18882 -55391 33876
7645 33876 142246 211553 90914 45635 55799 40478 -88782 -82857 -41396 -709 65947
7634 65947 -49709 -20396 22723 -81798 -93791 -33914 9062 79692 -12166 -67993 -36939
7623 -36939 -49157 28854 2102 22176 68643 -14210 34247 25228 8885 -38608 -44949 39666
7611C9666P6526j23842M1226P2709J8351k08387M558K1449L1438J32884j02218
7600D360j76J734p9605J8651O9200P7910M61j09321M8197o4902J7741N3198N7774
7587I5222J14248o2350r0639M7987k7133q2400j31450N9334N1930j82155N6923
7576a50483k9636L705J38023M314L8495k8520j973r5793m469O7614Q4638N5413
7564H1328o3998j58128P8732o2168N2063R3038K4780L1951j01184n8710Q2855
7553E59j8234k288P4148j32452R8676j09877j9350j7063M2153k4593q964Q8693
7541b8592Q768l938J0087L6368j9574l3222p1004J32210r8488O8547M3266r0596
7529d6168n9603O4122K725l9062j872J33142N5600p5671j9375j24206J25505O1124
$$ plain form
7611 39666 116192 -7650 33576 106285 124636 -83751 -79193 -57744 -26306 106578 4360
7600 4360 4184 5918 -73687 -55036 14164 92074 92535 -16786 31411 -33491 -15750 37448 95222
7587 95222 209470 147120 56481 104468 77335 -5065 -136515 -77181 -25251 -207406 -150483
7576 -150483 -180119 -176414 -38391 -34077 4418 -24102 -26075 -121868 -126337 -58723 25915 81328
7564 81328 17330 -140798 -62066 -124234 -72171 20867 45647 77598 -23586 -82296 559
7553 559 -17675 -19963 54185 -78267 20409 -89468 -108818 -125881 -83728 -108321 -117285 -28592
7541 -28592 -19824 -23762 -13675 22693 3119 -30103 -101107 31103 -67385 1162 44428 -46168
7529 -46168 -105771 -41649 -38924 -77986 -79858 53284 108884 33213 13838 -110368 15137 76261
7517G6261j3332L5588r5108l587M8512j33510J23109K1105K4116k1491k0673K5137
7505F6127j36035K570K0374J0113P9812j04653n0712m8699L8187K0544K096R5913
7493d363K6411n1711m9017L4899j3864k1535k3808J30024K9597q1992m1374m4619
7481a11352L2355P2586O4398O6213o7601n9923K6521q0152N2503j0848r726O2489
7469C7463n0067o0056O7055j8052L1298l1656Q6322k2704o3126m2800l6016L3194
7457f9145j7144P637P6684p4528n8447M0306L0599m9741n3034R0756Q6252k6564
7445a6369J1832l1276K2672m1811M1473J57581l9950n243j10239o1305k4709Q858
7433h8486P3383N3132J10786n5835j94390M5430P9668K2472j2946J6534Q9120
$$ plain form
7517 76261 62929 98517 3409 -178 48334 -85176 37933 59038 83154 61663 40990 66127
7505 66127 -69908 -67338 -46964 -36851 42961 -61692 -112404 -161103 -122916 -102372 -100276 -4363
7493 -4363 22048 -29663 -78680 -43781 -57645 -79180 -102988 27036 56633 -25359 -66733 -111352
7481 -111352 -78997 -6411 57987 124200 56599 -3324 23197 -56955 -4452 -15300 -25026 37463
7469 37463 -12604 -72660 -5605 -23657 7641 -24015 62307 39603 -23523 -66323 -102339 -69145
7457 -69145 -86289 -78652 -1968 -76496 -134943 -94637 -64038 -113779 -166813 -76057 10195 -16369
7445 -16369 -4537 -35813 -13141 -54952 -13479 144102 104152 98909 -11330 -72635 -97344 -88486
7433 -88486 -15103 38029 148815 92980 -101410 -55980 23688 46160 33214 49748 138868
7422A38868J433j18280p414k3095N3317p0992l7357O2148J25302q0698k4745m632
7410A3855J26236M276j6309l2811j17830J7149j21382J8654J16125O6342j36605
7399f2300j30588P3980O2945J4488j24814M3139J05900K9132j35975J15564k843
7388a1372p3748L8983r4920J09166L119j21339k0206N5894m8651m4752P1774J63066
7376B7014l5705N414j1803J7161J61930n2205O8390j5578j23767l6593M1642m010
7364D1890K457M0491j4481p145j31462j24682j8460J45538M5108Q6516J4956l1239
7352D9487q0474j12210O4593m4102q79k9125R5183m935j60437J0569J53489K5625
7340c3216K6292j4423l2746k1036r3289m4371J74630J84915q9796j41482m1817
$$ plain form
7422 138868 140301 22021 14607 -8488 44829 -26163 -63520 -1372 123930 43232 18487 13855
7410 13855 140091 144367 128058 95247 -22583 -5434 -126816 -108162 7963 74305 -62300
7399 -62300 -192888 -118908 -55963 -41475 -166289 -123150 -17250 11882 -124093 -8529 -11372
7388 -11372 -85120 -46137 -141057 -31891 -28772 -150111 -170317 -114423 -163074 -207826 -136052 27014
7376 27014 -8691 -3277 -15080 2081 164011 111806 180196 164618 40851 4258 45900 41890
7364 41890 44347 84838 70357 63212 -68250 -192932 -211392 -65854 -20746 65770 80726 49487
7352 49487 -30987 -143197 -78604 -122706 -123585 -152710 -57527 -62462 -222899 -212330 -58841 -33216
7340 -33216 -6924 -21347 -54093 -75129 -168418 -212789 -38159 146756 56960 -84522 -126339
7329a26339R3938j6789p1935J1429J47187N895K1436p6343O3650R106j03556Q293
7317c4028M8743j135j17740q9330Q5574P2150n4755R0827R7859p1961k8374M1363
7305C9193k0772K179n9478l6847j4251k6296m341L1228R5395K9815n9058N480
7293a7753Q3666j50217N236L6359L4768j26156M2780N1851k4128l7272q5515j5070
7281b01451Q2431J8959n0249L9881O4007k58l1495o2681N8453m748j261M2030
7269d6382l9370k8884p565M8387Q2643L5223n2694O0954q3713m7131m164J7349
7257f5347N7750j30m2469M6356L3013j6960r642J82948M6096j27026n2771J9313
7245G1131q5091n1017N8742J473n5801Q4857j03312P057q3362o6992J30542P6443
$$ plain form
7329 -126339 -32401 -49190 -121125 -109696 37491 43386 64822 -11521 52129 61235 -42321 -34028
7317 -34028 14715 13580 -104160 -193490 -107916 -35766 -90521 306 98165 26204 -2170 39193
7305 39193 18421 20600 -38878 -75725 -89976 -116272 -120613 -89385 6010 35825 -23233 -17753
7293 -17753 65913 -84304 -79068 -42709 -7941 -134097 -91317 -39466 -63594 -100866 -186381 -201451
7281 -201451 -119020 -100061 -150310 -110429 -46422 -46680 -78175 -140856 -82403 -87151 -88412 -46382
7269 -46382 -85752 -114636 -122201 -73814 8829 44052 -8642 52312 -31401 -78532 -82696 -65347
7257 -65347 -7597 -7727 -50196 -3840 29173 12213 2571 185519 231615 104589 51818 71131
7245 71131 -13960 -64977 -6235 -4762 -60563 24294 -79018 -71961 -155323 -222315 -91773 -15330
7233a5330M2289j03947l6156o4931r594K7543O8871M6585R5949M6314q3269n225
7221I099M3136J1352j09023q0761L858J42221j8443n9035Q0512K2086J457l9911
7209F548o5473R3776l668k9923j37269L1502M6645p1596Q7761k9312M9333j41303
7197a62979p845Q6647J04354M2765q221j7170q7823j34462N0799q736R4798O3473
7185A5600q9522m1497J16548k8858p0549J4504K79J7281j47223M6794m3248J7961
7173a91930P6441N6410j12882K1084M174o8683j2892k1277N1717J45715L744J01344
7161E2965O1960j03732K723P1207k3848j4185n9161K2146M9777k8383N0076k0358
7149F1187j00373J48361M6259j71430N1056N8641O8743K812j39475q258Q1785
$$ plain form
7233 -15330 26959 -76988 -113144 -178075 -187669 -160126 -91255 -44670 51279 97593 14324 9099
7221 9099 52235 63587 -45436 -126197 -122339 19882 1439 -57596 22916 45002 46459 6548
7209 6548 -58925 34851 31183 1260 -136009 -104507 -57862 -129458 -41697 -71009 -21676 -162979
7197 -162979 -170824 -84177 20177 62942 54721 37551 -50272 -184734 -133935 -142671 -47873 15600
7185 15600 -73922 -115419 1129 -27729 -98278 -83774 -83495 -66214 -213437 -166643 -209891 -191930
7173 -191930 -115489 -59079 -171961 -150877 -146703 -215386 -228278 -249555 -197838 -52123 -48379 52965
7161 52965 114925 11193 13916 85123 61275 47090 -12071 10075 59852 31469 81545 61187
7149 61187 -39186 109175 155434 -15996 35060 93701 162444 165256 25781 17523 99308
7138I9308p744m0360j0856k4662q2147n7760j6897R0084n664p7435l2448K0245
7126a46336N0496K5826K453K7516m6794l2439k3220N1373L458l488L4317q6160
7114a42998J10042N2420p0916q8224R0551L0663o0680L767j5535N3715j03989
7103a41184m7L0296k605K8546J3423j01286j7276J2388l3949N0984J14104j1912
7091e8518p66q063N7907m4919o9257o1906P6866N2749r9653p807J1110K5826N6312
7078g0119j6542N4622J7092o3185R5771p8586j32662J52153N2116N5077j41736
7067g5999p9635N7104q1715r1529l7672J95472L2612j10484j4170j0702Q5092
7056a31626Q3226j5247J43158j79531R24L1302j15056J36950Q7994l5650J20115
$$ plain form
7138 99308 91564 51204 40348 15686 -66461 -124221 -141118 -51034 -56698 -134133 -166581 -146336
7126 -146336 -95840 -70014 -67561 -40045 -86839 -119278 -142498 -91125 -87667 -91155 -56838 -142998
7114 -142998 -32956 19464 -51452 -139676 -49125 -18462 -79142 -75375 -90910 -37195 -141184
7103 -141184 -141231 -110935 -113540 -84994 -71571 -172857 -190133 -177745 -211694 -160710 -46606 -58518
7091 -58518 -59284 -67347 -9440 -54359 -123616 -185522 -108656 -55907 -155560 -163367 -152257 -126431 -70119
7078 -70119 -86661 -32039 -14947 -78132 17639 -60947 -193609 -41456 10660 65737 -75999
7067 -75999 -155634 -98530 -180245 -271774 -309446 -113974 -81362 -191846 -206016 -216718 -131626
7056 -131626 -48400 -63647 79511 -100020 -99096 -67794 -182850 -45900 42094 6444 126559
7045A26559l7270j10466O5121n6716j24044J39411l7768j26368P5600N8276r3461
7034a21126j06753J46453Q0435K1812j20031j34804N5163M5694k2678p903K9052
7023a34686j2561l8784j6533j1141J08961m3691r6607n7664N9313N4673j09348
7012b98068Q1182J05646n3699l6605O2963M4469k4951o4547m017J06081N3401
7001b8145j54614L1026J61704j6747r4143R97J26277P3265j17566j10219J24750
6990c415j02863R4861k3010q7742p8022p3799J20031J36079o3434j77950N7800
6979b01464J1925L4879P6945L4298p3370J9842k21305L3266R9507P3292J5396
6968i6789j25994o2314P7960K1000q124J59761Q6929r3077j77435J90491R7292
$$ plain form
7045 126559 89289 -21177 43944 -12772 -136816 2595 -35173 -161541 -85941 -27665 -121126
7034 -121126 -227879 -81426 -991 20821 -99210 -234014 -178851 -133157 -155835 -163738 -134686
7023 -134686 -147247 -186031 -202564 -213705 -104744 -148435 -245042 -302706 -243393 -188720 -298068
7012 -298068 -216886 -111240 -164939 -201544 -138581 -94112 -119063 -183610 -187627 -81546 -28145
7001 -28145 -182759 -151733 9971 -6776 -100919 -99922 26355 99620 -17946 -128165 -3415
6990 -3415 -106278 -11417 -34427 -122169 -200191 -273990 -153959 -17880 -81314 -259264 -201464
6979 -201464 -189539 -154660 -77715 -43417 -116787 -96945 -318250 -284984 -185477 -112185 -96789
6968 -96789 -222783 -285097 -207137 -186137 -194261 -34500 52429 -40648 -218083 -27592 69700
6957F9700o4576j37369j3019K19713r5083j55108j9277M1738P4845p3272M5764
6946a05944K48924j17837m5012J2484n9152N2091k7254j43813J94178l3938n1033
6935g6306J6954n2983N3389j32273o4027Q6404J76728j2852o2272l3473n2564
6924a53275l0145J52855p2036L0113j0644j24992M9101k8843M0075R8818p2009
6913a20982K178N373m6341l0979J6534Q8492o9687q085Q9709L1019O1387j41513
6901a22895k595R8988l3128L6128q9704K5667R6304j51471P0312J11738j09235
6890f9891q0713J1642M4215j08616j4958Q2619n8063J4252J1456P8678o6116m6314
6878b01809R4103l6522O1931M6585j00293R749o749K8788k5318j19425J94314
$$ plain form
6957 69700 5124 -132245 -145264 74449 -20634 -175742 -195019 -153281 -78436 -151708 -105944
6946 -105944 142980 25143 -19869 -7385 -66537 -14446 -41700 -185513 8665 -25273 -76306
6935 -76306 -59352 -112335 -58946 -191219 -255246 -168842 7886 -4966 -67238 -100711 -153275
6924 -153275 -183420 -30565 -102601 -72488 -83132 -208124 -159023 -187866 -147791 -48973 -120982
6913 -120982 -118804 -113431 -159772 -190751 -174217 -85725 -155412 -163497 -73788 -42769 18618 -122895
6901 -122895 -125490 -26502 -59630 -23502 -113206 -87539 8765 -142706 -72394 39344 -69891
6890 -69891 -150604 -138962 -94747 -203363 -218321 -135702 -193765 -179513 -168057 -89379 -155495 -201809
6878 -201809 -107706 -144228 -82297 -35712 -136005 -126256 -133005 -104217 -129535 -248960 -54646
6867e4646k3688j68655k4690J63902K6964o7770O3414J52523j0966p6154j25353
6856a45119J55239P3553k63047l8086J85519r766p2601J03054J5441J1296j39763
6845a24280Q0107K2775k3775q4803j7028M2580O0074R2046l0934k6168M2814o5599
6833c2191j32114j9335M8358N2198o8236K31J12082n8295n5015m1583j471O9340
6821a26031K9718m9156O822L2739R338J7068J5302q790m9940J2184O0545L0290
6809a9911l2346P8548M3599n3453j08351j15592M5396R0153L2405L4398k9342
6798c4496j22671j58980n2792J80087K00272M8846p9622J5982L8779j50372M3155
6787g1812O3513n4140j9637j43047L7698J10397j0443n1912K8001J0041J0240
$$ plain form
6867 -54646 -78334 -246989 -271679 -107777 -80813 -148583 -85169 67354 56388 -19766 -145119
6856 -145119 10120 83673 -179374 -217460 -31941 -41707 -114308 -11254 4187 15483 -124280
6845 -124280 -44173 -21398 -45173 -129976 -147004 -104424 -44350 47696 16762 -9406 33408 -32191
6833 -32191 -164305 -183640 -135282 -83084 -151320 -151089 -39007 -97302 -152317 -193900 -195371 -126031
6821 -126031 -96313 -145469 -138647 -105908 -96570 -79502 -64200 -72990 -122930 -110746 -50201 -19911
6809 -19911 -52257 26291 69890 16437 -91914 -207506 -162110 -71957 -39552 -5154 -34496
6798 -34496 -157167 -316147 -368939 -188852 11420 60266 -19356 -3374 35405 -114967 -71812
6787 -71812 -8299 -62439 -82076 -225123 -187425 -77028 -87471 -139383 -111382 -101341 -91101
6776i1101j25124O6298J01660n2074N8704j45705Q3859M8819N6702j63355p2453
6765b33770J02217L6437r332K6405K6121P3905p790K933R396m1930o3383k10029
6753b88820P3296P7120P5323J18382j02971Q04n6783J8685J6535K2120P4783j65512
6741a37038m5608J67843q2925j00064P1436r964P958o4753m0809Q2997R0634l311
6729f3604l3679K9401N8817j09541L955L9657O9665L480n0060l8400J1554r3534
6717a72289Q7237L2461O26j537o8073n149l5790N4894K4490M1956o1275R1089
6705a1360p5591n7245J12143R9211k4399k4563p0514l6612N7389k18690O8600
6694a81631n5390J9038K12442m3704J1932j50058P1442O6480k6787O564J11067
$$ plain form
6776 -91101 -216225 -149927 -48267 -100341 -41637 -187342 -103483 -54664 2038 -161317 -233770
6765 -233770 -131553 -95116 -104448 -78043 -51922 21983 14193 17126 26522 -15408 -78791 -288820
6753 -288820 -215524 -138404 -63081 55301 -47670 -46866 -103649 -84964 -68429 -46309 28474 -137038
6741 -137038 -182646 -14803 -97728 -197792 -126356 -136320 -128362 -193115 -233924 -150927 -60293 -63604
6729 -63604 -97283 -67882 -9065 -118606 -114651 -74994 -5329 -1849 -51909 -90309 -78755 -172289
6717 -172289 -85052 -52591 -51965 -53502 -121575 -126724 -162514 -107620 -83130 -41174 -102449 -11360
6705 -11360 -86951 -144196 -32053 67158 42759 18196 -52318 -88930 -31541 -250231 -181631
6694 -181631 -237021 -217983 -5541 -49245 -37313 -187371 -115929 -49449 -76236 -69672 41395
6683D1395p1455q7475p5441R1185N6941m9553L0764q5111j3762n267j5484P9109
6671a04154O0257N1622j6387M6571M7893o6564j5535q2807P4334P0255O5493L8923
6659A69901j7702P4903o4177j03344k3023N9632L5351j34802M1994O3424K189
6648A04346j21826J18664R4971n5479j23569M6814N9654q8067p4871O2514R8198
6637A21349M2138j26941m909N3473L7474o579M0624J20089m4932j00540q9001
6626D2245J4125J26227L8925n6591M063J00177k8131j39908q1552Q5869N9142
6615A64591p6515P8513J2546r2102J2668o2793N7512l7807j3017O8867R5085j7414
6603A90134p7146j4079N1308M2928M7350Q8034j05705j06485L8681q3211k7177
$$ plain form
6683 41395 -30060 -117535 -192976 -101791 -44850 -94403 -63639 -148750 -162512 -167779 -183263 -104154
6671 -104154 -43897 7725 -8662 37909 85802 19238 3703 -79104 -4770 65485 130978 169901
6659 169901 152199 227102 162925 59581 36558 96190 131541 -3261 38733 102157 104346
6648 104346 -17480 101184 196155 140676 17107 63921 123575 35508 -39363 23151 121349
6637 121349 163487 36546 31637 85110 122584 116005 156629 276718 231786 131246 42245
6626 42245 56370 182597 221522 164931 168994 269171 241040 101132 19580 105449 164591
6615 164591 88076 166589 179135 87033 99701 36908 94420 56613 43596 112463 207548 190134
6603 190134 112988 98909 150217 193145 240495 328529 222824 116339 155020 71809 44632
6592D4632J16254P0266M6637n8727k8217M4922K1092J9812Q2012p8856K3219k0090
6580B82956l7696m091J04127O8631Q7495j4448l4017q4947k7412r7235R0283J01694
6568D35340O952J28811N5927J12174N0252p8292J11777J93026J16654L7678r5071
$$ plain form
6592 44632 160886 231152 277789 219062 190845 235767 256859 276671 358683 279827 303046 282956
6580 282956 245260 241169 345296 413927 501422 486974 452957 368010 340598 243363 333646 435340
6568 435340 442292 571103 627030 739204 789456 711164 822941 1015967 1132621 1170299 1075228
$$ [...]
##END NTUPLES=NMR SPECTRUM
##END=
