##TITLE=1H_TG-2327-6
 CDCl3, 8 sc, 
 1.06.2021
##JCAMPDX= 6.0         $$ Bruker NMR JCAMP-DX V2.0
##DATA TYPE= NMR SPECTRUM
##DATA CLASS= NTUPLES
##ORIGIN= UXNMR, Bruker Analytische Messtechnik GmbH
##OWNER= root
$$ XWIN-NMR		Version 3.5
$$ Tue Jun  1 12:38:00 2021 Russian Standard Time (UT+4h)  she@DPX200
##.OBSERVE FREQUENCY= 200.131506
##.OBSERVE NUCLEUS= ^1H
##.ACQUISITION MODE= SIMULTANEOUS
##.ACQUISITION SCHEME= undefined
##.AVERAGES= 8
##.DIGITISER RES= 18
##SPECTROMETER/DATA SYSTEM= spect
##.PULSE SEQUENCE= zg30
##.SOLVENT NAME= CDCl3
##.SHIFT REFERENCE= (INTERNAL, CDCl3, 0, 15.9823)
##AUDIT TRAIL= $$ (NUMBER, WHEN, WHO, WHERE, WHAT)
$$ ##TITLE= Audit trail, XWIN-NMR		Version 3.5
$$ ##JCAMPDX= 5.01
$$ ##ORIGIN= Bruker BioSpin GmbH
$$ ##OWNER= she
$$ F:/spectra/data/she/nmr/H-F/1/pdata/1/auditp.txt
$$ ##AUDIT TRAIL=  $$ (NUMBER, WHEN, WHO, WHERE, WHAT)
(   1,<2021-06-01 12:36:39.32 +0400>,<she>,<DPX200>,
      <created by zg, POWCHK disabled, PULCHK disabled
       configuration hash MD5:
       00 E9 B6 7A A2 85 ED C7 34 08 36 98 17 FE 4E 26
       data hash MD5: 16K
       0D 42 1A B5 BB 8E E5 49 E8 70 38 18 61 6A F2 71>)
(   2,<2021-06-01 12:36:42.12 +0400>,<she>,<DPX200>,
      <Start of raw data processing
       efp BC_mod = 2 LB = 0.24 FT_mod = 6 PKNL = 1 PHC0 = -11481.5 PHC1 = 14.80099 SI = 16K 
       data hash MD5: 16K
       DD 62 30 B3 0B 26 06 AB BB 17 23 BF 27 CD CB 6E>)
(   3,<2021-06-01 12:36:59.67 +0400>,<she>,<DPX200>,
      <pk PHC0 = -0.1119818 PHC1 = -0.2 
       data hash MD5: 16K
       E5 8A 9E 32 88 58 29 49 61 E2 ED 65 FA FA 9E 0E>)
(   4,<2021-06-01 12:37:02.60 +0400>,<she>,<DPX200>,
      <abs ABSG = 5 
       data hash MD5: 16K
       67 30 38 DE 8D E4 58 24 44 F7 07 C9 5A 1A 15 6F>)
$$ ##END=
$$ 
$$ hash MD5
$$ 9D 6F 7D 93 51 67 D6 9C 8C F6 B6 54 88 1A CA 77
##$RELAX= 
##$RELAX= 
##$RELAX= 
##$RELAX= 
##$RELAX= 
##$RELAX= 
$$ Bruker specific parameters
$$ --------------------------
##$DU= <F:/spectra>
##$EXPNO= 1
##$NAME= <H-F>
##$PROCNO= 1
##$TYPE= <nmr>
##$USER= <she>
##$AMP= (0..31)
100 100 100 100 100 100 100 100 100 100 100 100 100 100 100 100 100 100 
100 100 100 100 100 100 100 100 100 100 100 100 100 100 
##$AQSEQ= 0
##$AQ_mod= 1
##$AUNM= <au_zg>
##$AUTOPOS= <>
##$BF1= 200.13
##$BF2= 200.13
##$BF3= 200.13
##$BF4= 200.13
##$BF5= 200.13
##$BF6= 200.13
##$BF7= 200.13
##$BF8= 200.13
##$BYTORDA= 1
##$CFDGTYP= 0
##$CFRGTYP= 5
##$CHEMSTR= <none>
##$CNST= (0..31)
1 1 145 1 1 1 1 1 1 1 1 1 1 1 1 1 1 1 1 1 1 1 1 1 1 1 1 1 1 1 1 1 
##$CPDPRG= <>
##$CPDPRG1= <>
##$CPDPRG2= <>
##$CPDPRG3= <>
##$CPDPRG4= <mlev>
##$CPDPRG5= <mlev>
##$CPDPRG6= <mlev>
##$CPDPRG7= <mlev>
##$CPDPRG8= <mlev>
##$CPDPRGB= <>
##$CPDPRGT= <>
##$D= (0..31)
0 1.2 0 0 0 0 0 0 0 0.06 0 0.03 0 0 0 0 0.0002 0 0 0 0 0 0 0 0 0 0 0 0 
0 0 0 
##$DATE= 1622536598
##$DBL= (0..7)
120 120 120 120 120 120 120 120 
##$DBP= (0..7)
150 150 150 150 150 150 150 150 
##$DBP07= 0
##$DBPNAM0= <>
##$DBPNAM1= <>
##$DBPNAM2= <>
##$DBPNAM3= <>
##$DBPNAM4= <>
$$ [...]
##$SUBNAM3= <"">
##$SUBNAM4= <"">
##$SUBNAM5= <"">
##$SUBNAM6= <"">
##$SUBNAM7= <"">
##$SUBNAM8= <"">
##$SUBNAM9= <"">
##$SW= 16.9725357007746
##$SWIBOX= (0..15)
0 0 2 0 0 0 0 0 0 0 0 0 0 0 0 0 
##$SW_h= 3396.73913043478
##$TD= 16384
##$TD0= 1
##$TE= 0
##$TE2= 300
##$TE3= 300
##$TEG= 300
##$TL= (0..7)
0 120 120 120 120 120 120 120 
##$TP= (0..7)
150 150 150 150 150 150 150 150 
##$TP07= 0
##$TPNAME0= <>
##$TPNAME1= <>
##$TPNAME2= <>
##$TPNAME3= <>
##$TPNAME4= <>
##$TPNAME5= <>
##$TPNAME6= <>
##$TPNAME7= <>
##$TPOAL= (0..7)
0.5 0.5 0.5 0.5 0.5 0.5 0.5 0.5 
##$TPOFFS= (0..7)
0 0 0 0 0 0 0 0 
##$TUNHIN= 0
##$TUNHOUT= 0
##$TUNXOUT= 0
##$USERA1= <user>
##$USERA2= <user>
##$USERA3= <user>
##$USERA4= <user>
##$USERA5= <user>
##$V9= 5
##$VALIST= <valist>
##$VCLIST= <CCCCCCCCCCCCCCC>
##$VD= 0
##$VDLIST= <DDDDDDDDDDDDDDD>
##$VPLIST= <PPPPPPPPPPPPPPP>
##$VTLIST= <TTTTTTTTTTTTTTT>
##$WBST= 1024
##$WBSW= 4
##$XGAIN= (0..3)
0 0 0 0 
##$XL= 0
##$YL= 0
##$YMAX_a= 358275
##$YMIN_a= -389822
##$ZGOPTNS= <>
##$ZL1= 120
##$ZL2= 120
##$ZL3= 120
##$ZL4= 120
##$ABSF1= 15.98128
##$ABSF2= -0.9913816
##$ABSG= 5
##$ABSL= 3
##$ALPHA= 0
##$AQORDER= 0
##$ASSFAC= 0
##$ASSFACI= 0
##$ASSFACX= 0
##$ASSWID= 0
##$AUNMP= <proc_1d>
##$AZFE= 0.1
##$AZFW= 0.1
##$BCFW= 0
##$BC_mod= 2
##$BYTORDP= 0
##$COROFFS= 0
##$CY= -3
##$DATMOD= 1
##$DC= 0
##$DFILT= <>
##$DTYPP= 0
##$F1P= 0
##$F2P= 0
##$FCOR= 1
##$FTSIZE= 16384
##$FT_mod= 6
##$GAMMA= 0
##$GB= 0
##$INTBC= 1
##$INTSCL= 1.334414e-10
##$ISEN= 128
##$LB= 0.24
##$LEV0= 0
##$LPBIN= 0
##$MAXI= 10000
##$MC2= 0
##$MEAN= 0
##$ME_mod= 0
##$MI= 1.114404
##$NCOEF= 0
##$NC_proc= -7
##$NLEV= 6
##$NOISF1= 3.799351
##$NOISF2= 2.8
##$NSP= 0
##$NTH_PI= 0
##$NZP= 0
##$OFFSET= 15.98232
##$PC= 1
##$PHC0= -11481.61
##$PHC1= 14.60099
##$PH_mod= 1
##$PKNL= yes
##$PPARMOD= 0
##$PSCAL= 0
##$PSIGN= 0
##$REVERSE= no
##$SF= 200.130005829312
##$SI= 16384
##$SIGF1= 3
##$SIGF2= 2
##$SINO= 5.538805
##$SIOLD= 16384
##$SREGLST= <1H.CDCl3>
##$SSB= 0
##$STSI= 16384
##$STSR= 0
##$SW_p= 3396.73913043479
##$SYMM= 0
##$S_DEV= 0
##$TDeff= 16384
##$TDoff= 0
##$TI= <>
##$TILT= no
##$TM1= 0
##$TM2= 0
##$TOPLEV= 0
##$USERP1= <user>
##$USERP2= <user>
##$USERP3= <user>
##$USERP4= <user>
##$USERP5= <user>
##$WDW= 1
##$XDIM= 16384
##$YMAX_p= 533789195
##$YMIN_p= -587001
$$ End of Bruker specific parameters
$$ ---------------------------------
##NTUPLES= NMR SPECTRUM
##VAR_NAME=  FREQUENCY,     SPECTRUM/REAL,   SPECTRUM/IMAG
##SYMBOL=    X,             R,               I
##VAR_TYPE=  INDEPENDENT,   DEPENDENT,       DEPENDENT
##VAR_FORM=  AFFN,          ASDF,            ASDF
##VAR_DIM=   16384,         16384,           16384
##UNITS=     HZ,            ARBITRARY UNITS, ARBITRARY UNITS
##FACTOR=    0.207333158178282, 1,           1
##FIRST=     3198.5417611137, 0,             0
##LAST=      -198.197369321092, 0,           0
##MIN=       -198.197369321092, -587001,     0
##MAX=       3198.5417611137, 533789195,     0
$$ Real data points
##PAGE= N=1
##DATA TABLE= (X++(R..R)), XYDATA
$$ [...]
4465B9707129Q3161O6810j53783Q8448K40378J4450L5133j36424j28401O1878
4455B9878779P2756P7975J36128q1273k51971n1615P7511j89255l530j72009k530
4444B9490966L81082L0550j06492j48790r634J52464r9827k1359j55649l6119
4434B9477192n1980K26814r6012o0937J80152k51418q4538r4896Q9279J95202
4424B9528858n124L19323p9875O3479l4183k5358K57753J39613q3951k05577j11137
4413B9763821m2269P3007K19807J6966k52819K00225J18144J96621O3568j31884
4403C0225187R4371J63043J19586J60091N5857J32177J01889J68455R4694L6239
4393C1351589K83762N38216K29453J49502L02351J0311M68349K76591K80012K98903
$$ y = [29707129, 29790290, 29857100, 29703317, 29791765, 30032143, 30046593, 30081726, 29945302, 29816901, 29878779, 29951535, 30029510, 30165638, 30084365, 29832394, 29780779, 29858290, 29669035, 29665505, 29493496, 29490966, 29872048, 29902598, 29796106, 29647316, 29637682, 29790146, 29690319, 29668960, 29513311, 29477192, 29425212, 29652026, 29556014, 29495077, 29675229, 29423811, 29339273, 29244377, 29333656, 29528858, 29523734, 29843057, 29763182, 29826661, 29792478, 29767120, 30024873, 30164486, 30080535, 29874958, 29763821, 29721552, 29794559, 30014366, 30031332, 29778513, 29978738, 30096882, 30293503, 30357071, 30225187, 30319558, 30482601, 30602187, 30762278, 30818135, 30950312, 31052201, 31220656, 31315350, 31351589, 31635351, 32173567, 32403020, 32552522, 32854873, 32865184, 33333533, 33610124, 33890136, 34189039]
4383C4189039L83071O11354O27647N29458O78437P55970O80729O75074J127353
4374D0258132J101799Q66918J034993J337501J441616J035309J068719R20491
4366D9065478J283021J088989P14939K74120K71073L07696k5402j53748j52181
4357E2673985m04782n91333p24295p82669m49582m28937k27700o6838L29k45667
4347D8752511l0777J90634K0678L55331J60913k0636j31266K42239P1159J08698
4337D9719484l87243o11667q69400l59581n58000l80598p12692q81947p72372
4328D4185984j117781j104373j075029j159260r95573r98374r21636p05794p99287
4319C5308877m76225p98475q30869p41996k09214n00698o35331o03032m47230
$$ y = [34189039, 34572110, 35183464, 35811111, 36340569, 37019006, 37774976, 38455705, 39130779, 40258132, 41359931, 42226849, 43261842, 44599343, 46040959, 47076268, 48144987, 49065478, 50348499, 51437488, 52152427, 52426547, 52697620, 53005316, 52979914, 52826166, 52673985, 52269203, 51677870, 50953575, 50170906, 49721324, 49292387, 49064687, 48997849, 48998178, 48752511, 48721734, 48912368, 48933046, 49288377, 49449290, 49428654, 49297388, 49539627, 49610786, 49719484, 49332241, 48720574, 47851174, 47491593, 46933593, 46552995, 45840303, 44958356, 44185984, 43068203, 41963830, 40888801, 39729541, 38733968, 37735594, 36813958, 36108164, 35308877, 34832652, 34034177, 33203308, 32461312, 32252098, 31751400, 31116069, 30513037, 30065807]
4310C0065807l67610m95596m45165n17932n18932m39560n59737k67049j83448
4301B6270778n72067n19843k94252j46753k94038m33702m32807k99691p3026j85139
4291B3019460q3281k74046k84326l33098l84635j68949j67668l46970q2611k49787
4281B0644089K8501p4585j9476k71547J59393k21649m83548j50334q559l8901
4271A9563384k3324k7836M7132Q2838O5305J80998J75803Q1557J4972k2152m99517
4260A9639160M5978O3816L1346q8903R6182k32041o50602o99298k02971m03085
4250A7599582j98288k76010l57769p2988l89128l21339j49667l29985k53034j77314
4240A5074060r6815m59949l07281j76608j73112J1156k26506m2831m11568O370
$$ y = [30065807, 29698197, 29202601, 28757436, 28239504, 27720572, 27281012, 26721275, 26454226, 26270778, 25698711, 25178868, 24884616, 24737863, 24443825, 24010123, 23577316, 23277625, 23204599, 23019460, 22936179, 22662133, 22377807, 22044709, 21660074, 21491125, 21323457, 20976487, 20893876, 20644089, 20672590, 20598005, 20578529, 20306982, 20466375, 20244726, 19761178, 19610844, 19602285, 19563384, 19540060, 19512224, 19559356, 19642194, 19707499, 19888497, 20064300, 20145857, 20160829, 20138677, 19639160, 19685138, 19748954, 19780300, 19691397, 19787579, 19555538, 18904936, 18205638, 18002667, 17599582, 17401294, 17125284, 16767515, 16694527, 16305399, 15984060, 15834393, 15504408, 15251374, 15074060, 14977245, 14517296, 14210015, 14033407, 13860295, 13871451, 13644945, 13602114, 13190546, 13196916]
4230A3196916j79745j47546k5174k52430j11394J754j10354j08353k7563k05480
4220A2030631r2202j63986o1713k11996j10081j02968R5032j55683k96316j52467
4210A0778251k9409K61290J75878l50390l79309l3078m5712N9958k04799j15845
4200A0116835q8076O6436m8753K01394k55420o3835p052m4264o0604k22897j02112
4189I491652j35583n9668J57747l6664p6935r3252k50257q2814k69602P4790q2229
4178H637185q6846J46786j17231j25516j01985n8689L70832j04422p9518p7628
4168H402968O5401J40782q5323k50651k47185L8892j70932J12873l7809n8289
4158G910727L7512j45104j41394N5099Q9674J83576l13356J7169j27508k8163
$$ y = [13196916, 13017171, 12869625, 12844451, 12592021, 12480627, 12482381, 12372027, 12263674, 12236111, 12030631, 11938429, 11774443, 11712730, 11500734, 11390653, 11287685, 11382717, 11227034, 10930718, 10778251, 10748842, 11010132, 11186010, 10835620, 10456311, 10423233, 10377521, 10437479, 10232680, 10116835, 10028759, 10095195, 10046442, 10247836, 9992416, 9928581, 9921529, 9877265, 9816661, 9593764, 9491652, 9356069, 9296401, 9454148, 9417484, 9340549, 9247297, 8997040, 8914226, 8644624, 8719414, 8637185, 8550339, 8697125, 8579894, 8454378, 8352393, 8293704, 8664536, 8560114, 8480596, 8402968, 8468369, 8609151, 8523828, 8273177, 8025992, 8064884, 7893952, 8006825, 7969016, 7910727, 7948239, 7803135, 7661741, 7716840, 7806514, 7990090, 7676734, 7693903, 7566395, 7538232]
4148G538232J82339j65292j5729m27642K15410M8610J35070o8425j23066j1727
4138G307780j59804j16292J76948j59763j19158m8431Q9452r337q8391R5360O8878
4127G037242l41059j30301J02375p8631K22059j37476K5310n1797j17273Q4258
4117F614707K47148j61423j28667j21210j37668J82947k8132K08695j71986p4386
4107F430025j7833n7058K67595K05312n0458j60652k35743j2581Q5480m6101j99064
4096F208922J15480J39176P8533J19970l13369k6590O5879J23849M5758P9168
4086F636776k27351j93982J06627J83291j79716R5222j15169L8634Q8443N8148
4076F490923J75546r8070q8426N3005l84288q4886Q3378J69620l035j04553m0279
$$ y = [7538232, 7720571, 7555279, 7539550, 7111908, 7327318, 7375928, 7510998, 7442573, 7319507, 7307780, 7147976, 7031684, 7208632, 7048869, 6929711, 6881280, 6970732, 6961395, 6873004, 6968364, 7037242, 6696183, 6565882, 6668257, 6589626, 6811685, 6674209, 6699519, 6647722, 6530449, 6614707, 6861855, 6700432, 6571765, 6450555, 6312887, 6495834, 6467702, 6676397, 6504411, 6430025, 6412192, 6355134, 6622729, 6828041, 6777583, 6616931, 6381188, 6368607, 6454087, 6407986, 6208922, 6324402, 6463578, 6542111, 6662081, 6348712, 6322122, 6388001, 6511850, 6557608, 6636776, 6409425, 6215443, 6322070, 6505361, 6325645, 6420867, 6305698, 6344332, 6432775, 6490923, 6666469, 6568399, 6479973, 6532978, 6148690, 6063804, 6147182, 6316802, 6313767, 6209214, 6168935]
4065F168935k91125J39486K64714r8887l3425n9543j14755R9089J38564j79589
4055F033464R1237o8601q4144K07378k42594N0057l827J5297O9723R980l6696
4044F041274K29374j24298j10515q469O2451M8058J36486M6531o7317o8651N6806
4033F241730J04044K53521p4145L5018q2646j05834J78946k3380o5148j97777
4023F264329o3571q72Q6996J59933l6472k2957r6520k34842r5837l4375q5169
4012E840643q5453l1838O1838K1860q1630j58357J0867J40555p3156J0187K4161
4001E679677j63983r083N1989j51211K46993j12316j22697j21921L852L6139P2113
3990E409552l5726Q1862J5639j29300O6717j09402K62080Q2404k7829r4471J39334
$$ y = [6168935, 5877810, 6017296, 6282010, 6183123, 6149698, 6090155, 5975400, 6074489, 6213053, 6033464, 6124701, 6056100, 5971956, 6179334, 5936740, 5986797, 5982970, 5998267, 6067990, 6077970, 6041274, 6270648, 6146350, 6035835, 6027366, 6089817, 6137875, 6274361, 6320892, 6253575, 6184924, 6241730, 6345774, 6599295, 6525150, 6560168, 6477522, 6371688, 6550634, 6527254, 6462106, 6264329, 6200758, 6199886, 6286882, 6446815, 6410343, 6387386, 6290866, 6056024, 5960187, 5925812, 5840643, 5755190, 5723352, 5785190, 5807050, 5725420, 5567063, 5577930, 5718485, 5645329, 5655516, 5679677, 5515694, 5506611, 5558600, 5407389, 5654382, 5542066, 5419369, 5297448, 5301300, 5337439, 5409552, 5373826, 5455688, 5471327, 5342027, 5408744, 5299342, 5561422, 5643826, 5615997, 5521526, 5660860]
3979E660860q6845R7297J11046N8671J24558J04297J26425P6902O3328J01569
3969F438108K26993j62393L6839J8135L40403j71390j2880J86977J73349j40389
3959F933752J63497r9341q7583o2506J75326K56627j22677j43075k31566K34154
3949G016608P910r2562j98300N6472j87428m6798j26642K6645j13620Q7539k36549
3938F193275O235j46680R692M9063O0412j22830l35264j882j59203j48485K2334
3927E426667p1854j18289K44889j5852j43185j89416N3872l7238Q5084k37688
3917D996990j48962M6551L16366o5404j220J71120j79330q0837k6287J25960p7176
3906E077771J50221K1798M7515o8750J84448j66941O678J05147O543J19773O6289
$$ y = [5660860, 5574015, 5671312, 5782358, 5841029, 5965587, 6069884, 6196309, 6273211, 6336539, 6438108, 6665101, 6502708, 6539547, 6557682, 6898085, 6726695, 6713815, 6900792, 7074141, 6933752, 7097249, 6997908, 6910325, 6847819, 7023145, 7279772, 7157095, 7014020, 6782454, 7016608, 7024518, 6931956, 6733656, 6790128, 6602700, 6555902, 6429260, 6455905, 6342285, 6429824, 6193275, 6199510, 6052830, 6062522, 6111585, 6171997, 6049167, 5713903, 5712021, 5552818, 5404333, 5426667, 5354813, 5236524, 5481413, 5465561, 5322376, 5132960, 5186832, 5149594, 5234678, 4996990, 4848028, 4894579, 5210945, 5145541, 5144321, 5315441, 5136111, 5055274, 5028987, 5154947, 5077771, 5227992, 5249790, 5297305, 5228555, 5413003, 5246062, 5252740, 5357887, 5364430, 5484203, 5550492]
3895E550492o5650J33147p0063r6425K82809O3554J3698n3104J89415j63408J85826
3884E970291j27461j01506K52614K04537j77656Q2437j95863j39256n5259m1833
3874E671045O2549j16083R9260m4504J50370k54656j6953N0967R0363J53715j97316
3863E648757j2263p9042L290j2898j09707P949j37481J1396J76909k01666J71344
3852E466588J58611K0549k78303p1469j21578J1621l0490k8031K25753m6980M7085
3841E353356q2545o8344J70829k5265k24698O2708m9865O6971o2059J91396n9865
3830E272619P7702J29525M0850p7373j17986J59721K66343M1791J11870m0841
3820E864221j98802R5285J1006K07894m8122J58469j67700R9530K09420j665J76291
$$ y = [5550492, 5484842, 5617989, 5547926, 5451501, 5734310, 5797864, 5811562, 5758458, 5947873, 5784465, 5970291, 5842830, 5741324, 5993938, 6198475, 6020819, 6103256, 5907393, 5768137, 5712878, 5671045, 5733594, 5617511, 5716771, 5672267, 5822637, 5567981, 5551028, 5601995, 5692358, 5846073, 5648757, 5636494, 5557452, 5560742, 5547844, 5438137, 5446086, 5308605, 5320001, 5496910, 5295244, 5466588, 5625199, 5645748, 5367445, 5295976, 5174398, 5186019, 5155529, 5127498, 5353251, 5306271, 5353356, 5270811, 5202467, 5373296, 5348031, 5123333, 5186041, 5136176, 5203147, 5141088, 5332484, 5272619, 5350321, 5479846, 5520696, 5443323, 5325337, 5485058, 5751401, 5793192, 5905062, 5864221, 5665419, 5760704, 5771710, 5979604, 5931482, 6089951, 5922251, 6021781, 6231201, 6229536, 6405827]
3809F405827N1980j45666J2677J85821o6856j91493K8563K33481j74719J50494
3799F490109k002r373N3382Q4822p1902j88983K63773J96251n2156j30439K21734
3788F855216Q4347O4146L13308j25424N8855Q1117J98831R4491P1938r3362M4884
3777G648347J98605J42669j20908m7943n9573L8095J50915M3024J26004J1613
3767H130848l2236P8689J73112J7484j0828K34766O9091k0049J4086J3649L34984
3756I003596O6011L5614j70995K61819L24021J49119O4784K25747m8584k33670
3746I677462K34082M52546K32805M5273J32342M69921K06369J25868L28618K55006
3736A2160292L22044L09862M74183M49573N25788L73528N55872M69008P63523
$$ y = [6405827, 6457807, 6312141, 6324818, 6510639, 6443783, 6252290, 6280853, 6514334, 6339615, 6490109, 6488107, 6478734, 6532116, 6616938, 6545036, 6356053, 6619826, 6816077, 6763921, 6633482, 6855216, 6939563, 7003709, 7317017, 7191593, 7250448, 7331565, 7530396, 7624887, 7696825, 7603463, 7648347, 7846952, 7989621, 7868713, 7820770, 7761197, 7799292, 7950207, 7993231, 8119235, 8130848, 8098612, 8177301, 8350413, 8367897, 8357069, 8591835, 8660926, 8640877, 8654963, 8668612, 9003596, 9069607, 9105221, 8934226, 9196045, 9520066, 9669185, 9733969, 9959716, 9911132, 9677462, 9911544, 10364090, 10596895, 10642168, 10774510, 11244431, 11450800, 11576668, 11905286, 12160292, 12482336, 12792198, 13266381, 13715954, 14241742, 14615270, 15171142, 15640150, 16403673]
3727A6403673P15817Q93500P48338N95084J039435Q95219Q49032O87986O52018
3718B3480102Q11005P01626M35293O54291J85947P0568M9633n8045q3027J21256
3708B6368649j8625k2630J82486J74388L67348J86249N00453M29729n8J20422
3698B8288411L09666J86984K02035k56482m91036k91757n95987p22416p27769
3689B5901649l51276k28240l36350n29278m78902n01267j92695j27460k72197
3680B2883984J0983K69520J80035L49639R2510N4611M72515M92023Q21647Q39215
3670B6466682P83539J077069J509476J452681J418410J682092J465811J488235
3662C7343995J283927J205331J253865J150656J010896J111241N06315P6426q0280
$$ y = [16403673, 17119490, 18012990, 18761328, 19356412, 20395847, 21291066, 22140098, 22828084, 23480102, 24291107, 24992733, 25428026, 26082317, 26268264, 26338832, 26388465, 26330420, 26247393, 26368649, 26350024, 26327394, 26509880, 26684268, 27051616, 27237865, 27738318, 28168047, 28167989, 28288411, 28598077, 28785061, 28987096, 28730614, 28239578, 27947821, 27351834, 26629418, 25901649, 25550373, 25322133, 24985783, 24456505, 23977603, 23476336, 23283641, 23156181, 22883984, 22894967, 23164487, 23344522, 23694161, 23786671, 23841282, 24313797, 24805820, 25627467, 26466682, 27250221, 28327290, 29836766, 31289447, 32707857, 34389949, 35855760, 37343995, 38627922, 39833253, 41087118, 42237774, 43248670, 44359911, 44866226, 44942652, 44862372]
3653D4862372n71554n77692j96467R602k84748P2497L36260J97708J58743M1901
3643D4048622J40253O8017J32160j13003k72832n90633q83769o37654j334208
3634D0556953j388245j568815j394882j542579j501685j289657j104615j174567
3626B9591908j243819j037716j117148q53881p91265o86956p93232p82410n34578
3617B1750903m70045n36732p90824l03300k74185o60803k66075m5423k41453j43813
3607A8018250k49279k61961j86242r055j55392p1143l21466Q1941N9660j08485
3597A6796828N005j44976j34821K4181j25336O8127J82014j33302j1868J0922
3587A6536774K17996P6172J57215j42784J05580J42036K70297J38809n6025M23447
$$ y = [44862372, 44290818, 43713126, 43516659, 43526261, 43241513, 43314010, 43650270, 43847978, 44006721, 44048622, 44188875, 44256892, 44389052, 44276049, 44003217, 43412584, 42528815, 41891161, 40556953, 39168708, 37599893, 36205011, 34662432, 33160747, 31871090, 30766475, 29591908, 28348089, 27310373, 26193225, 25339344, 24548079, 23861123, 23067891, 22285481, 21750903, 21280858, 20744126, 19953302, 19650002, 19375817, 18715014, 18448939, 18403516, 18162063, 18018250, 17768971, 17507010, 17320768, 17311713, 17156321, 17085178, 16763712, 16845653, 16905313, 16796828, 16801833, 16656857, 16522036, 16546217, 16420881, 16489008, 16671022, 16537720, 16525852, 16536774, 16754770, 16830942, 16988157, 16845373, 16950953, 17092989, 17363286, 17502095, 17446070, 17869517]
3577A7869517K58567L8075L80115M20986L58016P19305L36486L65670P07675Q28951
3567B2283363R44750Q96852Q43633Q80697J105835R87274P49462P54166Q37703
3558C0283735O61378N51041K96307k41870m09898l98544o40210n07014o81042
3549B8913883n02776m33296n23599m73218k34313l60328k83013o1991j00555J61431
3539B6102225J06443J6769L99007O72652M77545P16886O38037R31396J169736
3530C1230696J238857R05200J040882J212038J263701J117068N81778O73216M97999
3521C9761435K83513N6651k74347n03309l35197p38665n32941j006502q54479
3512C5856159o81409n89115l79477n81247l35732l09602m61789k14132J64885
$$ y = [17869517, 18128084, 18166159, 18546274, 18967260, 19325276, 20044581, 20381067, 20746737, 21454412, 22283363, 23228113, 24124965, 24968598, 25849295, 26955130, 27942404, 28691866, 29446032, 30283735, 30945113, 31496154, 31792461, 31550591, 31140693, 30742149, 30101939, 29594925, 28913883, 28411107, 27977811, 27454212, 26980994, 26746681, 26386353, 26103340, 26041349, 25940794, 26102225, 26208668, 26225437, 26624444, 27297096, 27774641, 28491527, 29129564, 30060960, 31230696, 32469553, 33374753, 34415635, 35627673, 36891374, 38008442, 38590220, 39263436, 39761435, 40044948, 40101599, 39827252, 39323943, 38988746, 38250081, 37717140, 36710638, 35856159, 35174750, 34585635, 34206158, 33624911, 33289179, 32979577, 32517788, 32303656, 32468541]
3503C2468541m5333k62386m1900O6484l733J98011k59536j75161n5069J7780j94477
3492C1713221k82279q3782M9996n6905j15166j07692k78586k49621l32265k67708
3482B9989213m29383m18686o49987m80581k43824j89949Q4133n2594J64618J40233
3472B7913193J26735M50975Q7604J43747M43044N02555L40905K9692O9657J69639
3462C0277746q1186m67454l31408m39624p74629n15128q47275q31181m12499o55110
3452B4922252n97057n37672n54561l90640k71744m25414l56744l15224l05976
3443B1167220n6715k66649k56122l48398m3308L35832l0103k31103j94052L7677
3433B0114279L10197L52766J08505R443K08571q3824q7413r085k14592r2602l78432
$$ y = [32468541, 32423208, 32160822, 32118922, 32185406, 32181673, 32379684, 32120148, 31944987, 31889918, 31907698, 31713221, 31430942, 31347160, 31397156, 31340251, 31225085, 31117393, 30838807, 30589186, 30256921, 29989213, 29559830, 29141144, 28491157, 28010576, 27766752, 27576803, 27660936, 27608342, 27772960, 27913193, 28039928, 28490903, 28578507, 28722254, 29165298, 29667853, 30008758, 30038450, 30108107, 30277746, 30196560, 29729106, 29397698, 28958074, 28183445, 27668317, 26821042, 25989861, 25577362, 24922252, 24325195, 23787523, 23232962, 22842322, 22570578, 22145164, 21788420, 21473196, 21167220, 21110505, 20843856, 20587734, 20239336, 20196028, 20531860, 20501757, 20270654, 20076602, 20114279, 20424476, 20777242, 20885747, 20895190, 21103761, 21019937, 20932524, 20923439, 20708847, 20616245, 20237813]
3422B0237813k58362j52624m0934k23932m4840o8241L641j54174k08722L9331
3412A9128956k2945J1520k30923j03848J00695R8030L7665O505n1324r418K8734
3401A8993647J29778m9578Q4031J6514K52472R6730O858J94657J36928K47663
3391B0109700K79761M05620K11022K11501J34136L81487L22313M42779N18331
3382B3016650M50348K92664L75922Q41934N71222M15487P26900P39995M60778
3373B7891900M91632K49008J58489M23705J3822k00758k76167k21873m1047N1462
3363B8540173Q0075l3997K39364N33674P8045N1304J28341Q0755K27012K9521
3353B9954267M404l24640q13272o62494o98684o10629m42007n98420o39399p70205
$$ y = [20237813, 19979451, 19826827, 19785893, 19561961, 19517121, 19448880, 19452521, 19298347, 19089625, 19128956, 19106011, 19117531, 18886608, 18782760, 18883455, 18981485, 19019150, 19025655, 18974331, 18964913, 18993647, 19123425, 19073847, 19157878, 19174392, 19426864, 19523594, 19530452, 19725109, 19862037, 20109700, 20389461, 20795081, 21006103, 21217604, 21351740, 21733227, 22055540, 22498319, 23016650, 23466998, 23759662, 24135584, 24977518, 25548740, 25964227, 26691127, 27431122, 27891900, 28383532, 28632540, 28791029, 29214734, 29228556, 29027798, 28751631, 28529758, 28488711, 28540173, 28620248, 28586251, 28825615, 29359289, 29437334, 29488638, 29616979, 29697734, 29924746, 29954267, 29958671, 29634031, 28820759, 28158265, 27459581, 26848952, 26406945, 25808525, 25169126, 24398921]
3343B4398921n54173l92300l17728l64088n28452j70714j72927l7088m59964j63064
3333B1238423n5565k3291j07093j41194J99557J59442p1765k11724P506J56304
3323B1150600n486P3625K14282K74799L38147N8337L29579o6412M21291R4759
3313B2883521k10039N1711P7765j25491N8396k30795k93200O557k70143j62315
3303B1785967L2295J10329q1778l7518j69447Q5497J34623K89888J50057M1711
3293B2341624K17790N8385L35498k2341j4514J35111K87525K16189J81511p5945
3283B3660833J81717K94952J95657L18246L67798L10129R1951M09029L49227J86034
3273B6365573R9543k90789P1675J21007k4703K05843N1756k464n0361J48530L5180
$$ y = [24398921, 23844748, 23452448, 23134720, 22770632, 22242180, 22071466, 21898539, 21861451, 21401487, 21238423, 21182858, 21159567, 21052474, 20911280, 21110837, 21270279, 21198514, 20986790, 20994296, 21150600, 21145114, 21218739, 21433021, 21707820, 22045967, 22104304, 22433883, 22367471, 22788762, 22883521, 22673482, 22725193, 22802958, 22677467, 22735863, 22505068, 22211868, 22218425, 21948282, 21785967, 21818262, 21928591, 21846813, 21809295, 21639848, 21725345, 21859968, 22149856, 22299913, 22341624, 22559414, 22617799, 22953297, 22930956, 22916442, 23051553, 23339078, 23555267, 23736778, 23660833, 23842550, 24137502, 24333159, 24651405, 25019203, 25329332, 25421283, 25830312, 26179539, 26365573, 26465116, 26174327, 26246002, 26367009, 26342306, 26548149, 26599905, 26597441, 26547080, 26695610, 26730790]
3262B6730790Q2497k24339j79952k53703l66066l03280j18176k55487m09942m31998
3252B4270344k42988j78814j67455k6703n4618o1199k42717J11589Q2749J71508
3242B3661696J40620J3960q0282K50658J98679K65212K16865J50669r9119K3246
3232B4742204J09480k5145J11705J89733R1083m4025k9048J54379J32053M4890
3222B5477309j94442j45963P2422J40249K69231K56887J21049L79370M82104M50368
3212B7308584J12991K12387N91141O21515P64430P28316P47266L84155M95738
3203C1966523O31107P89101P61751O24831N89308P51218Q11794P11364Q11046
3194C8448043J173389J274232J288360Q26292Q46058Q23093Q08079Q49355N90755
$$ y = [26730790, 26813287, 26588948, 26408996, 26155293, 25789227, 25485947, 25367771, 25112284, 24702342, 24270344, 24027356, 23848542, 23681087, 23654384, 23599766, 23538567, 23295850, 23407439, 23490188, 23661696, 23802316, 23816276, 23735994, 23986652, 24185331, 24450543, 24667408, 24818077, 24718958, 24742204, 24851684, 24826539, 24938244, 25127977, 25219060, 25175035, 25145987, 25300366, 25432419, 25477309, 25282867, 25136904, 25209326, 25349575, 25618806, 25875693, 25996742, 26376112, 26858216, 27308584, 27421575, 27633962, 28225103, 28846618, 29611048, 30339364, 31086630, 31470785, 31966523, 32597630, 33386731, 34148482, 34773313, 35362621, 36113839, 36925633, 37636997, 38448043, 39621432, 40895664, 42184024, 43010316, 43856374, 44679467, 45487546, 46336901, 46927656]
3185D6927656Q4571m9003l78619k59349n76727j95187K1022o0126P7080j42360
3175D5448958k8372L18013M92163O73091N79319Q70056J065510J019209J094204
3166E1532151J217382J678012J922110J756269K021657K492972K573297L254259
3158F8448109L745087M092833M826159N409463O058739P193129P892829Q973454
3150A16639802J0377419J1611865J3160895J4362263J5106110J4070417J1986232
3143B07315003J0343954R354061Q854950O463466J489380m924515j0946598j4180985
3135B13768716j4163474j2465895j0948223j0484432j0677869j0571791j0105406
3128A34351626r456384q857800q170082o823686n922466n046756m445927m176212
$$ y = [46927656, 47012227, 46963224, 46584605, 46325256, 45748529, 45553342, 45574364, 45514238, 45591318, 45448958, 45420586, 45738599, 46230762, 46903853, 47483172, 48353228, 49418738, 50437947, 51532151, 52749533, 54427545, 56349655, 58105924, 60127581, 62620553, 65193850, 68448109, 72193196, 76286029, 81112188, 86521651, 92580390, 99773519, 107666348, 116639802, 127017221, 138629086, 151789981, 166152244, 181258354, 195328771, 207315003, 217658957, 227013018, 235867968, 242331434, 243820814, 238896299, 227949701, 213768716, 199605242, 187139347, 176191124, 165706692, 155028823, 144457032, 134351626, 124895242, 116037442, 107867360, 101043674, 95121208, 90074452, 85628525, 81452313]
3120H1452313l456163k818434k648730k205843k021499j836016j663699j472387
3112F3329542j090684j075520j012846j358668j840678j232731q39578p65967
3104E4112870r52108j278657j120599j049575q91498p62918p05800o38848l47204
3095D6365663l79757p02439k32084l97899n5722Q7401k25608k1271k75856m7980
3085D4114448m450k14001r0180j65425j51694m47665j25085L4382J38926L9008
3075D3128264L4902K72890N07402M96107N90001N71842L71424L07515L82584N18980
3065D7181911M46233M43389l29156n93848l61882k81659J17455L93003M45164
3056D7460610O48431O41664R32314J722728K120425K517128J665709K83371L28452
$$ y = [81452313, 77996150, 75177716, 72528986, 70323143, 68301644, 66465628, 64801929, 63329542, 62238858, 61163338, 60150492, 58791824, 56951146, 55718415, 54878837, 54112870, 53160762, 51882105, 50761506, 49711931, 48820433, 48057515, 47351715, 46712867, 46365663, 45985906, 45283467, 45051383, 44653484, 44597762, 44685163, 44459555, 44438284, 44162428, 44114448, 44109998, 43895997, 43805817, 43640392, 43488698, 43041033, 42915948, 42950330, 43089256, 43128264, 43163166, 43436056, 43943458, 44439565, 45029566, 45601408, 45972832, 46280347, 46662931, 47181911, 47628144, 48071533, 47742377, 47148529, 46786647, 46504988, 46622443, 47015446, 47460610, 48109041, 48750705, 49683019, 51405747, 53526172, 56043300, 57709009, 57992380, 58320832]
3047E8320832J693539K395386K796033O56464l282472l599418k302595j462094
3039E5215675q73598J90423n27372j150851p84843o87201m84802m87585j25512
3030E0284334P9544J5671L66812M18289M40332N43797M86353M88642O61307Q91810
3020E4676891O01021L70395P90271O57114P91870Q12810O14060M26826N79429
3011F0320687R66490N44290P32728N99256M08517M89500N64909L43887N26794
3002F5497058K87848K89487n521K83465L15677J87948J45391j69132n3546l10393
2992F6468282j4326k89060n27307l90103m28852o57173o33839m74326m61124p21919
2982F1870253o91360q90860p79011n65960q42536q87526p27284j083867r89726
$$ y = [58320832, 60014371, 62409757, 65205790, 65862254, 62579782, 58980364, 56677769, 55215675, 54342077, 54532500, 54005128, 52854277, 52069434, 51382233, 50897431, 50409846, 50284334, 50363878, 50379549, 50746361, 51164650, 51604982, 52148779, 52635132, 53123774, 53785081, 54676891, 55277912, 55648307, 56438578, 57095692, 57887562, 58700372, 59314432, 59741258, 60320687, 61287177, 61831467, 62564195, 63163451, 63571968, 64061468, 64626377, 64970264, 65497058, 65784906, 66074393, 66068872, 66352337, 66668014, 66855962, 67001353, 66832221, 66778675, 66468282, 66453956, 66164896, 65637589, 65247486, 64818634, 64161461, 63527622, 63053296, 62592172, 61870253, 61178893, 60288033, 59509022, 58943062, 58100526, 57213000, 56485716, 55401849, 54412123]
2973E4412123q93894j209330q61012j035235r82424j059812j152063j068790r79930
2964D5169633j197513j310857j182871r65057r05651j099331q65815j060744p83968
2955C5797826q75862q31861r36461j081420p84206p42857j110877n78602p74034
2946B8081646p37913p94676r10527n71919j87279o19705m61689n94075p36594
2937B2467269l11637o92839o27794k56266k29404n99706m96855m93651j78209
2928A8580908n03934m32447j57861m97102j38601k38931n12088l53737k15111
2919A5531096N3823j83318k67027j37126k65939j50557l16274o190J1833J17421
2909A4387742o6795k61846J52003J57294J7187N3274l3679k70510K40767O5046
$$ y = [54412123, 53518229, 52308899, 51447887, 50412652, 49430228, 48370416, 47218353, 46149563, 45169633, 43972120, 42661263, 41478392, 40513335, 39607684, 38508353, 37642538, 36581794, 35797826, 34921964, 34090103, 33153642, 32072222, 31288016, 30545159, 29434282, 28855680, 28081646, 27343733, 26549057, 25638530, 25066611, 24879332, 24259627, 23797938, 23203863, 22467269, 22155632, 21462793, 20834999, 20578733, 20349329, 19749623, 19252768, 18759117, 18580908, 18076974, 17644527, 17486666, 16989564, 16850963, 16612032, 16099944, 15746207, 15531096, 15584919, 15401601, 15134574, 14997448, 14731509, 14580952, 14264678, 14258488, 14270321, 14387742, 14320947, 14059101, 14211104, 14368398, 14385585, 14438859, 14405180, 14134670, 14375437, 14440483]
2899A4440483j58398j76140j88195L8318k36970m55252l1045j55109l99543k64966
2889A2413183k66674j00858J6264k59725j1607l71245k30603K8932j36564q8906
2879A0992197r4787k23531k12817j91071l4031j42375j3137m09449k65373p3718
2869I331908k0870k10222k47800j38150j03711O9715k73687l27029k07124K86252
2859H159282M5671k74710o1248n8123R4738K0177k13846K62887K25214J28329
2849H328371j21169j35964N7071K72582R142j26815J87332P2279K65382j28821
2839H679390J68044K34905K00405j27746k11943j27494L08851J97877j71379k39005
2829H911905k16943J38486r8115j71869j42729j68363k38216p6073k71875j83717
$$ y = [14440483, 14282085, 14105945, 13917750, 13956068, 13719098, 13263846, 13232801, 13077692, 12678149, 12413183, 12146509, 12045651, 12061915, 11802190, 11790583, 11419338, 11188735, 11217667, 11081103, 10992197, 10897410, 10673879, 10461062, 10269991, 10235960, 10093585, 10080448, 9670999, 9405626, 9331908, 9311038, 9100816, 8853016, 8714866, 8611155, 8680870, 8407183, 8080154, 7873030, 8159282, 8204953, 7930243, 7868995, 7810872, 7905610, 7925787, 7711941, 7974828, 8200042, 8328371, 8207202, 8071238, 8128309, 8400891, 8410033, 8283218, 8470550, 8542829, 8808211, 8679390, 8847434, 9082339, 9282744, 9154998, 8943055, 8815561, 9124412, 9322289, 9150910, 8911905, 8694962, 8833448, 8735333, 8563464, 8420735, 8252372, 8014156, 7938083, 7666208, 7482491]
2819G482491j28731j03488l51733k40794l9555P0425L3490k00841j71033k6892
2809F323339m9739k7689j15898j39149O9038j80033Q7340k2946k04916Q6481j38503
2798E687325k43866Q7438P3308j10213r8712m20548k401J69299L93312j50415
2788E384527j45775J96594K77241l4312j02653j67389J47007P0387n42115m1177
2778E042335j3473J26729N0921O8580j18163q2262j78269j39153j25340R6272
2768D728177O623k0174j85042J17219K88077k65608m12866L62278n5151l256O6099
2757D626376k54991R9870K0248J58614J39387Q0435k1695k542j50557K29426Q871
2746D933442n7061Q6741k2406P214k6505J5150L25846l8180j39293J81347K15219
$$ y = [7482491, 7353760, 7250272, 6898539, 6657745, 6618190, 6688615, 6722105, 6521264, 6350231, 6323339, 6273600, 6245911, 6130013, 5990864, 6059902, 5879869, 5967209, 5944263, 5739347, 5825828, 5687325, 5443459, 5530897, 5604205, 5493992, 5395280, 4974732, 4972331, 5141630, 5534942, 5384527, 5238752, 5435346, 5712587, 5678275, 5575622, 5408233, 5555240, 5625627, 5083512, 5042335, 5028862, 5155591, 5206512, 5275092, 5156929, 5074667, 4896398, 4757245, 4631905, 4728177, 4734800, 4714626, 4529584, 4646803, 4934880, 4669272, 4256406, 4618684, 4563533, 4560277, 4626376, 4371385, 4471255, 4491503, 4650117, 4789504, 4869939, 4848244, 4845702, 4695145, 4924571, 4933442, 4876381, 4963122, 4940716, 4947930, 4921425, 4936575, 5262421, 5224241, 5084948, 5266295, 5481514]
2735E481514N3842j74745o3026m6195j42793R9598j71845K84766J72175j16752
2725E376539j59461j34513K95643J95769k45149l37900j50540K3131n916K6841
2715D884444j33674J35348q4619j56362j43750j96738J03727o6377r5028J26347
2705D373318m4265r749n679j83199K03089q8630o6531J00362j23034K6231O2817
2694D244730J7383j75914j2049K94725M9314o3571k2617J02731J51366j6667k1428
2683D548003j72078P6101J92013k52460J124K7383K24235Q0822p8978k1685q319
2672D616161J23043J44050m8456k33965m7901J46703l0984j27743l4467o878j41907
2661D357656j76824L08390k615L8539J07557L674P5238o2591j86479j85916k7846
$$ y = [5481514, 5535356, 5360611, 5297585, 5251390, 5108597, 5208195, 5036350, 5321116, 5493291, 5376539, 5217078, 5082565, 5378208, 5573977, 5328828, 4990928, 4840388, 4863519, 4857603, 4884444, 4750770, 4886118, 4801499, 4645137, 4501387, 4304649, 4408376, 4341999, 4246971, 4373318, 4329053, 4319304, 4313625, 4130426, 4333515, 4244885, 4178354, 4278716, 4155682, 4181913, 4244730, 4262113, 4086199, 4074150, 4368875, 4418189, 4354618, 4332001, 4434732, 4586098, 4569431, 4548003, 4375925, 4452026, 4644039, 4391579, 4392703, 4420086, 4644321, 4725143, 4646165, 4624480, 4616161, 4739204, 4883254, 4834798, 4600833, 4552932, 4699635, 4668651, 4540908, 4506441, 4499563, 4357656, 4180832, 4489222, 4486607, 4525146, 4632703, 4636377, 4711615, 4649024, 4462545, 4276629, 4248783]
2650D248783N8971J95518q9759O2849j08110L5567p8169J74588j72841l0983l1617
2639D264797M0709M8619Q4726l1059M5044k47765o4750J10186O9109j6552j30849
2628D172215J48054r4148K8529j75617J46673p0348L40421k4419k63349j395K11256
2617D417872J75178Q2647k17250p251R1918K4039j62847p3917L12100m2062j03065
2606D497362J17118N7229j27737J00634j37913r1619J5344R0212N9878Q4115j53040
2595D511583j8713j44431O6576J50171J38493l2639j19048J582J93536Q2413j79789
2584D649734k27993J77630P2904Q5047N6085l22659J04439J56071K1008J19512
2574D891778Q5920O4133q6040Q737o6407K25663K1855M2914K19965j17613o5366
$$ y = [4248783, 4307754, 4503272, 4413513, 4476362, 4368252, 4403819, 4325650, 4500238, 4327397, 4296414, 4264797, 4305506, 4354125, 4438851, 4407792, 4452836, 4205071, 4140321, 4250507, 4319616, 4303064, 4172215, 4320269, 4226121, 4254650, 4079033, 4225706, 4155358, 4495779, 4471360, 4208011, 4206616, 4417872, 4593050, 4675697, 4458447, 4451196, 4543114, 4567153, 4404306, 4330389, 4642489, 4600427, 4497362, 4614480, 4671709, 4543972, 4644606, 4506693, 4415074, 4430418, 4520630, 4580508, 4664623, 4511583, 4492870, 4348439, 4415015, 4565186, 4703679, 4671040, 4551992, 4553574, 4747110, 4829523, 4649734, 4421741, 4599371, 4672275, 4757322, 4813407, 4490748, 4595187, 4751258, 4772266, 4891778, 4977698, 5041831, 4955791, 4964528, 4898121, 5123784, 5145639, 5188553, 5408518, 5290905, 5225539]
2563E225539N1935k0359L0180J09848J01951L3511K1080J74597o6394J81199o4732
2552E778355J05530q3059K35434J59313m4432R023P0911J19482L02918L0695L4434
2541F718604K00810K24685l4842o4433J03051L42555K13682M7180J34066M14516
2531H299874K14318L38697J2459J62578L6640l0706J05204l26857k2353k1937
2521H767917j13617k1128K45084K97660j88529M0794n1470m3430J79395j17618
2511H995058K29881j76335k2942M00560O0100j8738J40393O1891K7471K44293
2501I941632J50376j61209R1089K23013K02709j849j02326M08620J51177L2713
2491A0935945R2178K28096J21144J66014o4031l49627K72667J43186R6275R9021
$$ y = [5225539, 5277474, 5257115, 5287295, 5397143, 5499094, 5532605, 5553685, 5728282, 5661888, 5843087, 5778355, 5883885, 5800826, 6036260, 6195573, 6151141, 6160164, 6231075, 6350557, 6653475, 6684170, 6718604, 6919414, 7144099, 7109257, 7044824, 7147875, 7490430, 7704112, 7751292, 7885358, 8299874, 8514192, 8852889, 8865348, 9027926, 9064566, 9033860, 9139064, 8812207, 8789854, 8767917, 8654300, 8633172, 8878256, 9175916, 8987387, 9028181, 8976711, 8933281, 9112676, 8995058, 9224939, 9048604, 9025662, 9426222, 9486322, 9467584, 9607977, 9669868, 9697339, 9941632, 10092008, 9930799, 10021888, 10244901, 10447610, 10445761, 10343435, 10752055, 10903232, 10935945, 11028123, 11256219, 11377363, 11543377, 11479346, 11129719, 11402386, 11545572, 11641847, 11740868]
2481A1740868O3269J04090J44197R1186L14589R4325K57365J46427q3889K27684
2471A3100111K88641P8414J0611J75375R9182L33333J65688J75540j43786J7078
2461A4300187L27224K65248J85210L87844R236K90587J45619k16087K85152K90875
2451A6271095L15803J6884L44480K38673L06948J13196N3817L0230M86045K83021
2441A8460192M34092J60971L81649K32177J55817J51535K18149M44391K48913
2432B0887886R2771K22371K53409L70841K81106J84258L09135K74137L87278K77831
2422B3541023M09291K84837M30647o1245J74110N23931M89543M39622K47529N65943
2412B7045231N63655K34608M72914M92351M45888O39114N48690N59724M56586
$$ y = [11740868, 11804137, 11908227, 12052424, 12143610, 12458199, 12552524, 12809889, 12956316, 12872427, 13100111, 13388752, 13467166, 13477777, 13653152, 13752334, 14085667, 14251355, 14426895, 14283109, 14300187, 14627411, 14892659, 15077869, 15465713, 15474949, 15765536, 15911155, 15695068, 15980220, 16271095, 16586898, 16603782, 16948262, 17186935, 17493883, 17607079, 17660896, 17691126, 18177171, 18460192, 18894284, 19055255, 19436904, 19669081, 19824898, 19976433, 20194582, 20638973, 20887886, 20980657, 21203028, 21456437, 21827278, 22108384, 22292642, 22601777, 22875914, 23263192, 23541023, 23950314, 24235151, 24665798, 24604553, 24778663, 25302594, 25792137, 26231759, 26479288, 27045231, 27608886, 27843494, 28316408, 28808759, 29254647, 29893761, 30442451, 31002175, 31458761]
2403C1458761N96990O82041L75722L64885M36782L05262O79596L26290L32618
2394C5558947O05710N38155L77223M94475K71424L38713N59766L45667L53961
2385C9444041J31937O45311N22479K94038L28053N23576N13651N49642M54308
2376D3407036M54828M13490P60966P04278M87726P51303O33762R28374R01896
2367D9443659J002152R68536Q28260R77820Q97396J046478J083280J063946J057994
2358E8369521O88426R19345J096159Q78320O08552P48065Q01223N20410O25223
2349F5255244J39215M87091N44269P45645N93905K46894L61082M93631N31258
2340F9398234R50144L75154O04412N19903N66387P73603N42079J116691R56703
$$ y = [31458761, 32055751, 32737792, 33113514, 33478399, 33915181, 34220443, 34900039, 35226329, 35558947, 36164657, 36702812, 37080035, 37574510, 37845934, 38184647, 38744413, 39090080, 39444041, 39575978, 40221289, 40743768, 41037806, 41365859, 41889435, 42403086, 42952728, 43407036, 43861864, 44275354, 45036320, 45740598, 46228324, 46979627, 47613389, 48541763, 49443659, 50445811, 51414347, 52242607, 53220427, 54117823, 55164301, 56247581, 57311527, 58369521, 59057947, 59977292, 61073451, 61951771, 62560323, 63308388, 64109611, 64630021, 65255244, 65394459, 65881550, 66425819, 67171464, 67765369, 68012263, 68373345, 68866976, 69398234, 70348378, 70723532, 71327944, 71847847, 72414234, 73187837, 73729916, 74846607, 75803310]
2331G5803310P88677O05586J101686J374384J116628J126092J416272J486336
2323H4818971J527969J327630J661288J420342J761371J310009J039951J161586
2315I6029117R93125P82255L89748M74275L13642R3717P0530k18269l27498l52305
2305I8248337o48592n83471j133885j082555j233611j267395j369709j482655
2297H9446464j484346j666261j531764j683496j442836j582339j625740j530254
2289G6899428j486025j111623j038041j024384j057639r75880q55870p97813p05522
2280F7846631n55487q14141o06909o28002n30635o00478n47207k75550n38711
2271F2749511q20368m04020k49532K9797k38630m08629K9865O3215J00852R358
$$ y = [75803310, 76591987, 77197573, 78299259, 79673643, 80790271, 81916363, 83332635, 84818971, 86346940, 87674570, 89335858, 90756200, 92517571, 93827580, 94867531, 96029117, 97022242, 97804497, 98194245, 98668520, 98982162, 99075879, 99146409, 98928140, 98600642, 98248337, 97599745, 97016274, 95882389, 94799834, 93566223, 92298828, 90929119, 89446464, 87962118, 86295857, 84764093, 83080597, 81637761, 80055422, 78429682, 76899428, 75413403, 74301780, 73263739, 72239355, 71181716, 70205836, 69349966, 68552153, 67846631, 67291144, 66477003, 65870094, 65242092, 64711457, 64110979, 63563772, 63288222, 62749511, 61929143, 61525123, 61275591, 61305388, 61066758, 60658129, 60687994, 60751209, 60852061, 60861419]
2261F0861419P3435L36928J50788J94933M98615O24531M37008K45763M83537P35243
2251F4642200P38695O38151N81720N52230N63673O27986Q46072J035459Q91969
2242G1118155P36232O79324R88141J100278J100706J163507J365216J670651J472072
2233H1394282J314213J619701K037527J790888J965661K098453K183971K307654
2225I6712350K315243K240139K451523K490336K438413K478817K721618K698691
2217A16547130K522288K742568L026704L181320L437097L490398L330907L701099
2209A41979511M251547M146578M416345M584573N174370N230323N603886O004053
2201A81391186O403710O475742O484890O725290P054064O987356P425208P626374
$$ y = [60861419, 60934854, 61271782, 61422570, 61617503, 62116118, 62740649, 63177657, 63423420, 63906957, 64642200, 65380895, 66019046, 66600766, 67152996, 67716669, 68344655, 69190727, 70226186, 71118155, 71854387, 72533711, 73521852, 74622130, 75722836, 76886343, 78251559, 79922210, 81394282, 82708495, 84328196, 86365723, 88156611, 90122272, 92220725, 94404696, 96712350, 99027593, 101267732, 103719255, 106209591, 108648004, 111126821, 113848439, 116547130, 119069418, 121811986, 124838690, 128020010, 131457107, 134947505, 138278412, 141979511, 146231058, 150377636, 154793981, 159378554, 164552924, 169783247, 175387133, 181391186, 187794896, 194270638, 200755528, 207480818, 214534882, 221522238, 228947446, 236573820]
2193B36573820P644741P603461P597744P557674P567816P575556O962834P003782
2185B96087428P029942O554336O278146N609158N035231M455504L735608L512401
2177C38297754K499842J876383J121072L94869p9979p53420r66210j643814j792037
2168C38954460k555839k778482k641625l251398l610394l558448m020980m325047
2160C12212247m096871l965903m004794m057248m352725m373651m140902m228007
2152B78992146l474005l438505l449738l380152l305504l295559l179095l180712
2144B52288876k822762l228791k853462k678633l027506k825128k490476k337810
2136B30024308k376435k151865j552665j486062j404028r21650o99067l81876
$$ y = [236573820, 244218561, 251822022, 259419766, 266977440, 274545256, 282120812, 289083646, 296087428, 303117370, 309671706, 315949852, 321559010, 326594241, 331049745, 334785353, 338297754, 340797596, 342673979, 343795051, 344189920, 344109941, 343356521, 342390311, 340746497, 338954460, 336398621, 333620139, 330978514, 327727116, 324116722, 320558274, 316537294, 312212247, 308115376, 304149473, 300144679, 296087431, 291734706, 287361055, 283220153, 278992146, 275518141, 272079636, 268629898, 265249746, 261944242, 258648683, 255469588, 252288876, 249466114, 246237323, 243383861, 240705228, 237677722, 234852594, 232362118, 230024308, 227647873, 225496008, 223943343, 222457281, 221053253, 220131603, 219432536, 219050660]
2128B19050660m91503m65177j94349L72048L43726M78292O7709l02011j43352
2119B18716043k85636l12458j23297L11491J2251m26k22121Q2397l19889l36539
2109B17521816o65595j71775r49802j124098r78527j245632j383485j716080j906432
2100B07380390j996007k210174k509551k669543k458915k597372l111196k951037
2092A86876595k671882k420040k747188k918283k975351k977751l065695k993554
2084A64106851k846496k780447k860451k887018k857039k495863k392965k665819
2076A42320753k625536k706019k478169k472657k153546k298919k201438k209655
2068A23174814k294753j751336j909755j569457k036276j829033j733130j459428
$$ y = [219050660, 218559157, 218093980, 217899631, 218271679, 218615405, 219093697, 219161406, 218859395, 218716043, 218430407, 218117949, 217994652, 218306143, 218318394, 218317968, 218095847, 218178244, 217858355, 217521816, 216856221, 216684446, 215734644, 214610546, 213632019, 212386387, 211002902, 209286822, 207380390, 205384383, 203174209, 200664658, 197995115, 195536200, 192938828, 189827632, 186876595, 184204713, 181784673, 179037485, 176119202, 173143851, 170166100, 167100405, 164106851, 161260355, 158479908, 155619457, 152732439, 149875400, 147379537, 144986572, 142320753, 139695217, 136989198, 134511029, 132038372, 129884826, 127585907, 125384469, 123174814, 120880061, 119128725, 117218970, 115649513, 113613237, 111784204, 110051074, 108591646]
2060A08591646j408545j501191j201956j003624q83795o79710q89622m72953q13995
2051I9736255l64419j39542l17673R871p4494J61691K52832M5978L99237O74010
2041A00383746R56751O55311M01053P28250R48558J306526J365964J358374J445824
2032A09550357J493252J876846J679915J980909K035019J793997J829032J763475
2024A24002802K131720K124721J726856J619604J845727J473468J103739J325625
2016A37354262R64887Q29714O62565P2663L10033M2052m2000m44635n35178l05237
2006A38909126o04779q64232j263778r89748r44529j316532j632974j163662j098365
1997A29030527j284820j350431j393865j313442j206346j071819j380017j450529
$$ y = [108591646, 107183101, 105681910, 104479954, 103476330, 102592535, 101912825, 101023203, 100550250, 99736255, 99371836, 99232294, 98914621, 98924492, 98849998, 99011689, 99264521, 99310499, 99709736, 100383746, 101340497, 101995808, 102396861, 103125111, 104073669, 105380195, 106746159, 108104533, 109550357, 111043609, 112920455, 114600370, 116581279, 118616298, 120410295, 122239327, 124002802, 126134522, 128259243, 129986099, 131605703, 133451430, 134924898, 136028637, 137354262, 138319149, 139148863, 139811428, 139884091, 140194124, 140236176, 140194176, 139749541, 139214363, 138909126, 138304347, 137440115, 136176337, 135186589, 134242060, 132925528, 131292554, 130128892, 129030527, 127745707, 126395276, 125001411, 123687969, 122481623, 121409804, 120029787, 118579258]
1989A18579258j453752j411101j595221j708123j788101j771611k113591k130917
1981A04606841k030099j940264k183290k119676k160577k266397k297178j988585
1973H7620775j851768k415936j933345j986729j611221j667291j578251j575175
1965G3001059j687803j577673j395877j162290j187122j053023j169575j064328
1957F2703368o09875n39580q92824r18503j020857n64157p00878o06726p56484
1948E6093484n69116o65224o60274o37263n13212n78868o08026p81843l86955
1939E0692703m90211o75779n58471q29367p8521j74083l55441p73235o58458l34210
1929D5764927n00998q02466k94482k75066n96211m20749o09572m42752o07741
$$ y = [118579258, 117125506, 115714405, 114119184, 112411061, 110622960, 108851349, 106737758, 104606841, 102576742, 100636478, 98453188, 96333512, 94172935, 91906538, 89609360, 87620775, 85769007, 83353071, 81419726, 79432997, 77821776, 76154485, 74576234, 73001059, 71313256, 69735583, 68339706, 67177416, 65990294, 64937271, 63767696, 62703368, 62093493, 61553913, 60661089, 59742586, 58721729, 58157572, 57456694, 56849968, 56093484, 55524368, 54859144, 54198870, 53561607, 53048395, 52469527, 51861501, 51079658, 50692703, 50202492, 49526713, 48968242, 48138875, 48060354, 47886271, 47530830, 46757595, 46099137, 45764927, 45263929, 44461463, 44166981, 43891915, 43295704, 42874955, 42265383, 41822631, 41214890]
1920D1214890o40454n15309k93156o67817o23627p89896l57300m22797l84913
1911C6519621n18766l46585l62009p80666m95184k25708l29193k99195j13201
1902C3049114o80679l12350j35209j13313l68483j96415k49917l32399k29319
1893C0431030j38884l60706j72966k96323k26017j45229k58196k05475q7479O1934
1883B8601689j01058j74738l06158K094j91294j41148j956j72722Q938j58874
1873B7364773l27250o5987K972j31400j94419j06294k06258J39800m2371k24397
1863B6209169j1234j70238j57726k75458P5698K76144O597q3281m7382j7718O1824
1852B5866395R5133j55355J51433J29727j14013L88724L00681L40279K60734L34320
$$ y = [41214890, 40574436, 40059127, 39765971, 39098154, 38474527, 37684631, 37327331, 36904534, 36519621, 36000855, 35654270, 35292261, 34511595, 34016411, 33790703, 33461510, 33162315, 33049114, 32368435, 32056085, 31920876, 31807563, 31439080, 31242665, 30992748, 30660349, 30431030, 30292146, 29931440, 29758474, 29462151, 29236134, 29090905, 28832709, 28627234, 28539755, 28601689, 28500631, 28325893, 28019735, 28021829, 27830535, 27689387, 27687431, 27514709, 27523647, 27364773, 27037523, 26971536, 26974508, 26843108, 26648689, 26542395, 26336137, 26475937, 26433566, 26209169, 26197935, 26027697, 25869971, 25594513, 25670211, 25946355, 25952952, 25869671, 25822289, 25804571, 25866395, 25961528, 25806173, 25957606, 26087333, 25973320, 26362044, 26662725, 27003004, 27263738, 27598058]
1842B7598058M65785K34809J24714O19925L37810L27243K66115K30815M62131
1833C0667405P40917O38040N65174K08946N79441O60347O41454N54766P74782
1824C6031272Q96214N00591N38348R24093R66509Q95302Q92219Q84025J307639
1815D3836212J091938R00933J087791J089715J191508J357334J360412J482032
1807E3397875J141348J251176J319644J375196K023212J692906J688374K299429
1799F6189160K108184K128431K203872K785968K821184L098110L172669L370570
1791H7878148L565902M211986M134279M373627M688536N080619N278904N648696
1783A24860697N898853N979986O255848O839627P059333P132671P523857P367388
$$ y = [27598058, 28063843, 28298652, 28423366, 29043291, 29381101, 29708344, 29974459, 30205274, 30667405, 31408322, 32046362, 32611536, 32820482, 33399923, 34060270, 34701724, 35256490, 36031272, 36927486, 37428077, 37966425, 38890518, 39857027, 40752329, 41644548, 42528573, 43836212, 44928150, 45829083, 46916874, 48006589, 49198097, 50555431, 51915843, 53397875, 54539223, 55790399, 57110043, 58485239, 60508451, 62201357, 63889731, 66189160, 68297344, 70425775, 72629647, 75415615, 78236799, 81334909, 84507578, 87878148, 91444050, 95656036, 99790315, 104163942, 108852478, 113933097, 119212001, 124860697, 130759550, 136739536, 142995384, 149835011, 156894344, 164027015, 171550872, 178918260]
1775A78918260P886987Q520251R335804J0147962J0486436J1567115J2733835
1768B49596650J3560120J5003694J6082473J7206314J8430305J9538809K0485227
1761C69903592K0711122K0690748K0396194K0101358J9281609J7801579J5300979
1754E04187181J2092714Q859642N735236K914422j43719k930784n550391r067461
1746E16096840j2741531j5517062j7303071j8009452j8259368j8066020j7542591
1739C98657745j6854486j6270177j5351245j4647277j3979532j2936793j1879514
1732B96738721j0834498r966139r805498q819681q649082q294049p252800o981634
1724B26135340o558007o802143o390820o245784n957964n791624n735431n452302
$$ y = [178918260, 186805247, 195325498, 204661302, 214809264, 225295700, 236862815, 249596650, 263156770, 278160464, 294242937, 311449251, 329879556, 349418365, 369903592, 390614714, 411305462, 431701656, 451803014, 471084623, 488886202, 504187181, 516279895, 525139537, 530874773, 533789195, 533645476, 530714692, 525164301, 516096840, 503355309, 487838247, 470535176, 452525724, 434266356, 416200336, 398657745, 381803259, 365533082, 350181837, 335534560, 321555028, 308618235, 296738721, 285904223, 275938084, 266132586, 257312905, 248663823, 240369774, 233116974, 226135340, 219577333, 212775190, 206384370, 200138586, 194180622, 188388998, 182653567, 177201265]
1716A77201265n716659n711630n544147n531559n067529m857791m931107m921596
1708A34919247m849931m312750m360741m005910l922570l710339l636969l429954
1700A02690083l086827l044306k977609k919599k592436k224069k154828k201837
1692H1488572k321816k018173j827743j821091j809181j745209j539663j463259
1684F6942437j532196j614556j464732j152212j221316j178196j463872j500092
1676E5815265j058930j288889j228420j104633j566132j150096j145012j023585
1668D6249568q97174j266946r55260r23351q13683q23907r48028r72937q86788
1659C7761494n36023o68414p33585n98926o57995n62233o87813n61185n57965
$$ y = [177201265, 171484606, 165772976, 160228829, 154697270, 149629741, 144771950, 139840843, 134919247, 130069316, 125756566, 121395825, 117389915, 113467345, 109757006, 106120037, 102690083, 99603256, 96558950, 93581341, 90661742, 88069306, 85845237, 83690409, 81488572, 79166756, 77148583, 75320840, 73499749, 71690568, 69945359, 68405696, 66942437, 65410241, 63795685, 62330953, 61178741, 59957425, 58779229, 57315357, 55815265, 54756335, 53467446, 52239026, 51134393, 49568261, 48418165, 47273153, 46249568, 45352394, 44085448, 43130188, 42206837, 41393154, 40569247, 39621219, 38648282, 37761494, 37225471, 36557057, 35823472, 35224546, 34566551, 34004318, 33316505, 32755320, 32197355]
1650C2197355m56395p43071q20926m03924m67526m02912n38813o22492k85059
1641B7456237o62589l23948m82506l83014k69962q66913k75487k63943m34718
1632B3493157l74359n36671m42595l51474l79837l8046l45650n07550m18894k73816
1622A9824265p5452o6470j47674n20830j62408l29861M1132j46512k93272k45338
1612A7877580o09398k37971j66993j73034M9207m34619l52367j31385k23741p2902
1602A5524377j99337k69427k05833j80817m60302j05580r5565l46842j68087k66877
1592A3225710k42729j83004k57448l01558j70156M1411J06177k20020k81093k23409
1582A1493881m4734j18912Q00j55017k37487j3395j09788p9450j60337l22781
$$ y = [32197355, 31740960, 30997889, 30176963, 29773039, 29305513, 28902601, 28363788, 27741296, 27456237, 26793648, 26469700, 25987194, 25604180, 25334218, 24467305, 24191818, 23927875, 23493157, 23118798, 22582127, 22139532, 21788058, 21408221, 21370175, 21024525, 20516975, 20098081, 19824265, 19748813, 19682343, 19534669, 19013839, 18851431, 18521570, 18562702, 18416190, 18122918, 17877580, 17268182, 17030211, 16863218, 16690184, 16739391, 16304772, 15952405, 15821020, 15597279, 15524377, 15325040, 15055613, 14849780, 14668963, 14208661, 14103081, 14007516, 13660674, 13492587, 13225710, 12982981, 12799977, 12542529, 12240971, 12070815, 12112226, 12218403, 11998383, 11717290, 11493881, 11449147, 11330235, 11331035, 11176018, 10938531, 10925136, 10815348, 10735898, 10575561, 10252780]
1572A0252780J30251o1472j62826j55809k83834j53828J8223P3550k16528j44695
1562I295812j80853j6711j60132j31279j81429l10819L200J48566k48460M0869
1552H258764j48763P5802j12022k21802q0845j75789L283j17555L8542O7609k69775
1541G317449j01115r7164n4750o6424k11775R3694Q7407J4103k0755l13715j64302
1530F482653K14764J16131J14940k98544l4660j60400o1657J34583j74080o2771
1520F270959j69864J23131r3866r1617J00582j59422O5332L2614l1774j47298
1510E898777j54352j07043n2567J20797J05418K3196l65459k40611J36255k8414
1500E335997J15093J02319j00687m6945m08560K1221K15447P3614Q9735o1585
$$ y = [10252780, 10383031, 10321559, 10158733, 10002924, 9719090, 9565262, 9583485, 9657035, 9440507, 9295812, 9114959, 9098248, 8938116, 8806837, 8625408, 8314589, 8317789, 8466355, 8217895, 8258764, 8110001, 8185803, 8073781, 7851979, 7771134, 7595345, 7598628, 7481073, 7519615, 7587224, 7317449, 7216334, 7119170, 7064420, 6997996, 6786221, 6879915, 6967322, 6981425, 6960670, 6646955, 6482653, 6697417, 6813548, 6928488, 6629944, 6595284, 6434884, 6373227, 6507810, 6333730, 6270959, 6101095, 6224226, 6130360, 6038743, 6139325, 5979903, 6045235, 6077849, 6046075, 5898777, 5744425, 5637382, 5584815, 5705612, 5811030, 5834226, 5468767, 5228156, 5364411, 5335997, 5451090, 5553409, 5452722, 5405777, 4997217, 5018438, 5233885, 5307499, 5397234, 5335649]
1490E335649j92412J36794m1871J3920K7021J07649J42177n9299J28830l9839
1480E558619J17129n8417j25339Q5955r7343j07238J24332q296P9443L68967P7543
1469F015355k217k0809k01385O2711M6298K34206K20770j82143L38302J35721
1459F646809n0972J64504j31609J3866K86032l539k1439M466L1572J98637k2652
1448G115675l7203k13939j2173j57431r1320j33114Q3384j77938j71624j17202
1438F087115j45455O0418n0213k74764j672l15813k28770J41870k90976j60828
1428D820912r5545O9372P7758p4674j57030P9913j57284j48338J69840j33982
1418D450942j12717k34339k40902K83188j4238J3531Q9582l84576M5250j67732
$$ y = [5335649, 5143237, 5280031, 5238160, 5252080, 5279101, 5386750, 5528927, 5469628, 5598458, 5558619, 5675748, 5617331, 5491992, 5577947, 5480604, 5373366, 5497698, 5489402, 5568845, 5937812, 6015355, 6013138, 5992329, 5790944, 5853655, 5899953, 6134159, 6354929, 6172786, 6511088, 6646809, 6595837, 6760341, 6628732, 6642598, 6928630, 6925091, 6903652, 6908118, 6939690, 7138327, 7115675, 7078472, 6864533, 6852360, 6694929, 6603609, 6470495, 6553879, 6375941, 6204317, 6087115, 5941660, 6002078, 5951865, 5677101, 5675429, 5359616, 5130846, 5272716, 4981740, 4820912, 4725367, 4794739, 4872497, 4797823, 4640793, 4720706, 4563422, 4415084, 4584924, 4450942, 4338225, 4103886, 3862984, 4146172, 4131934, 4145465, 4235047, 3850471, 3895721, 3727989]
1408C727989J15033J6655k98773J5432j86031l223k03467j31287J84880j33421
1398C103787j75623J53012L8251m465k01059J28369K7942J76613o9068j70509
1388C007250Q4765P6405j31136k64063K52814j48321m5589J23021k29862J40737
1378B866021M9927J00637Q5005k02714j2314j99975P2603O0736j64504Q1568L4193
1367B771183Q396k27018n127j92465Q4512J85417N0157P6814l3601k86393K31
1356B432106n3371K27229J58505k54225p046j57756K06373j63486k21764M8774
1346B215339K46647J18336j87657n1764J71047m5137J37627m30853L6998K23142
1336B433725M5166O8854q6207M992j90662K1483o5752k04236R9253K33424R2924
$$ y = [3727989, 3843022, 3859677, 3560904, 3576336, 3390305, 3387082, 3183615, 3052328, 3237208, 3103787, 2928164, 3081176, 3119427, 3114962, 2913903, 3042272, 3070214, 3246827, 3177759, 3007250, 3092015, 3168420, 3037284, 2773221, 3026035, 2877714, 2832125, 2955146, 2725284, 2866021, 2915948, 3016585, 3101590, 2898876, 2886562, 2686587, 2759190, 2819926, 2655422, 2736990, 2771183, 2779579, 2552561, 2547434, 2354969, 2439481, 2624898, 2675055, 2751869, 2718268, 2431875, 2432106, 2378735, 2605964, 2764469, 2510244, 2503198, 2345442, 2551815, 2388329, 2166565, 2215339, 2461986, 2580322, 2392665, 2340901, 2511948, 2466811, 2604438, 2173585, 2210583, 2433725, 2478891, 2547745, 2461538, 2466530, 2275868, 2297351, 2231599, 2027363, 2126616, 2360040, 2452964]
1325B452964j82007l5779n5895n3262J41989J41863j65728n1945j2574m6350J05572
1314B238848k5018q6401r1819q4229m761R431N3845J16127k55245j03474J88509
1303A955813K59180j06071j78276j05761J96277J07443l0083j24568k0714j35987
1293A817253k14082P9726J73653J33301j79448r8761R1982P6851L8358j4102p3880
1282A830851m5899m2677j28647j51063M2616J0353J31737r4150j42740K56730
1272A667111N526m2662j58126O0958j27457j39018K27750R7914l9803j16683q8911
1261A346599R6998J45465j52385J66645L4076k40255j04313j44029J58697J77048
1251A484546j78822J03499J66194J98959l08898k10091K15376P7474j55393M4303
$$ y = [2452964, 2270957, 2235178, 2179283, 2126021, 2268010, 2409873, 2244145, 2192200, 2179626, 2133276, 2238848, 2213830, 2127429, 2035610, 1951381, 1946620, 1956051, 2009896, 2126023, 1870778, 1767304, 1955813, 2214993, 2108922, 1930646, 1824885, 2021162, 2128605, 2098522, 1973954, 1953240, 1817253, 1603171, 1682897, 1856550, 1989851, 1810403, 1711642, 1803624, 1880475, 1918833, 1904731, 1830851, 1784952, 1742275, 1613628, 1462565, 1505181, 1515534, 1647271, 1553121, 1410381, 1667111, 1672637, 1629975, 1471849, 1532807, 1405350, 1266332, 1494082, 1591996, 1552193, 1435510, 1346599, 1443597, 1589062, 1436677, 1603322, 1637398, 1397143, 1292830, 1148801, 1307498, 1484546, 1305724, 1409223, 1575417, 1774376, 1465478, 1255387, 1470763, 1548237, 1392844, 1437147]
1241A437147K03795m2404O5179k87673j08442P0295Q8428j33107l2597j04558
1231A156063M69694q674j57289j62891j70870J54882P5919j14575J54838K62441
1221A659538j11474k20296j82860j5671K62119K96027l80424K4004l06115J66117
1211A190965Q079n973L76816j62673j08165j7994J0795L0641K33773p4244l43851
1200A138169j84042L1405L3561K60537j89301P6640K74998J35653k8818l21952
1190A226850J87069q1864O5000j633o5527p34j10083j38501K09166k975J7092
1179A303860j83703k7310J0716L54702J27493j77930r3357l70895N9488p6318
1169I26746K02161P1623n3476m0558j34524J10755J29500k07124J2663K1158N1543
$$ y = [1437147, 1640942, 1598538, 1663717, 1376044, 1267602, 1337897, 1426325, 1293218, 1260621, 1156063, 1625757, 1617083, 1459794, 1296903, 1126033, 1280915, 1356834, 1242259, 1397097, 1659538, 1548064, 1327768, 1144908, 1129237, 1391356, 1687383, 1306959, 1330963, 1024848, 1190965, 1199044, 1193071, 1569887, 1407214, 1299049, 1281055, 1291850, 1322491, 1556264, 1482020, 1138169, 954127, 985532, 1019093, 1279630, 1090329, 1166969, 1441967, 1577620, 1548802, 1226850, 1413919, 1332055, 1397055, 1395422, 1329895, 1329161, 1219078, 1080577, 1289743, 1286768, 1303860, 1120157, 1092847, 1103563, 1458265, 1585758, 1407828, 1314471, 943576, 1003064, 926746, 1128907, 1200530, 1147054, 1106496, 971972, 1082727, 1212227, 1005103, 1017766, 1038924, 1090467]
1158A090467J78639l9980k8929O4463J13827l30513n475J43900J3053n1226j02370
1147A045856p4479M7667n1648J92289k0405J2984l67406k15449M67932J5142R0951
1136A143434j84668M1592Q2180L3847J00157j14751j8482R0363j16385J38214
1126A195501j45912J30196m8915l1131R453p6513J34993Q7534M7838l13592k39658
1115G49794J59353N6210J3119j48831O4082k9678j56113L76772j5627j61554m6926
1104H60601j64973o1475L23189J34945r7747j63145q930J34258N2120m4223n545
1093I59075j26150J21289P3858l24053K79321Q5100j00858l6930l4269L96418
1083A292801R5901M2850l52263j36124J20396J7378l8415p6558P117L7765N737
$$ y = [1090467, 1269106, 1229126, 1200197, 1264660, 1378487, 1047974, 1042499, 1186399, 1199452, 1148226, 1045856, 971377, 1019044, 967396, 1159685, 1139280, 1152264, 784858, 569409, 1037341, 1052483, 1143434, 958766, 1000358, 1082538, 1116385, 1216542, 1101791, 1083309, 1173672, 1057287, 1195501, 1049589, 1179785, 1130870, 1099739, 1109192, 1032679, 1167672, 1255206, 1303044, 989452, 749794, 909147, 965357, 978476, 829645, 893727, 864049, 707936, 1084708, 1069081, 907527, 860601, 695628, 634153, 957342, 1092287, 994540, 831395, 822465, 956723, 1008843, 964620, 959075, 832925, 954214, 1028072, 704019, 983340, 1068440, 967582, 930652, 896383, 1292801, 1388702, 1431552, 1079289, 943165, 1063561, 1080939, 1042524, 965966, 973083, 1010848, 1016585]
1072A016585K99510J12691j41212k08460l6352N0937N5255K62149j32974q1843
1062A196286j83156j47953J89488J89047J67800l03372k99753M6320L2586L10286
1052A197579j56554j19268J77149j36026L3402m3055Q1563Q1969j69688N572M3635
1041I96278J59178o9642J81017n9007J5904J85552r6779m6662j16554m5438K24389
1030A328236j14070J81641M9913n3990p2929m4745J77582j08116J12007K5901
1020A481430j07571J74598M357N9997J41058J9976j0623j30255O2551j4390J8540
1009A699668J58664J12616j2709p6980j2041K29406K28584N8331R9525Q1955O3011
998B630030K6222R5211K78391P7607O4157n4164n148J79430N5246Q8655J17422
$$ y = [1016585, 1316095, 1428786, 1287574, 1079114, 1042762, 1093699, 1148954, 1411103, 1278129, 1196286, 1013130, 865177, 1054665, 1243712, 1411512, 1108140, 808387, 854707, 887293, 1197579, 1041025, 921757, 1098906, 962880, 996282, 953227, 1034790, 1116759, 947071, 952643, 996278, 1155456, 1085814, 1266831, 1207824, 1223728, 1409280, 1312501, 1265839, 1149285, 1103847, 1328236, 1214166, 1395807, 1445720, 1391730, 1318801, 1274056, 1451638, 1343522, 1455529, 1481430, 1373859, 1548457, 1552814, 1612811, 1753869, 1773845, 1763222, 1632967, 1695518, 1681128, 1699668, 1858332, 1970948, 1958239, 1881259, 1869218, 2098624, 2327208, 2385539, 2485064, 2567019, 2630030, 2656252, 2751463, 3029854, 3107461, 3171618, 3117454, 3112306, 3291736, 3346982, 3435637, 3553059]
987C553059l3669L28098M69785Q9309N0179M9417K84615L18027K89535M34535
977E832890M11855O06256M89843P03812N28863J067583J256305O88299J030839
968A2616545J195910J224841J796568K441552K761467L216360L853907K978900
960C2086050P59829R52613K168900L372906K803977k324019n845429m756790k962192
951B6255845j775919j117303j673841k305836j845094j603378j401968j368225
943A3164281j136301o83654q73921n59736n94960o96641p00169m22137m23291
934G073471k92656l87294m11988l18237m01080m6187k08389j20850k66064j80989
924D439737J13395j80277k08380j13118k31123j11298j36330k18610k22153J2962
$$ y = [3553059, 3519390, 3847488, 4317273, 4406582, 4456761, 4506178, 4790793, 5108820, 5398355, 5832890, 6244745, 6851001, 7340844, 8044656, 8573519, 9641102, 10897407, 11585706, 12616545, 13812455, 15037296, 16833864, 19275416, 22036883, 25253243, 29107150, 32086050, 32845879, 33798492, 35967392, 39340298, 42144275, 39820256, 33974827, 29218037, 26255845, 24479926, 23362623, 21688782, 19382946, 17537852, 15934474, 14532506, 13164281, 12027980, 11344326, 10470405, 9910669, 9315709, 8619068, 7918899, 7496762, 7073471, 6780815, 6393521, 5981533, 5663296, 5262216, 5216029, 5007640, 4886790, 4620726, 4439737, 4553132, 4372855, 4164475, 4051357, 3820234, 3708936, 3572606, 3353996, 3131843, 3144805]
914C144805q9639J13190k55264k24075J51197j15603O3792q0038j34621R5352
904B669096l9211M1761K9294k46510j59870o1696n0256j55166k89695K03053R5164
893B035964M1803j15648k53220Q0471j29663J6014k1239j00373j04524o9341Q5357
882A465601j78567j79129L08887K18459k843l35512R8855r4472q6104j52778K0362
871A082759L4748L0970J37487q1846j14240J77507p5851j82182P7780j30220k32815
860G24097L0459J75542q246M2822k26785K79228r698r3882J72332k45218P4608
849I15259j1636M8368J66274m32581o5015Q9161j0939J39834p7362Q1491l0855
838H11999k70326K66606l818N783j56222R0308k32050j39522J43963l9665K32901
$$ y = [3144805, 3055166, 3168356, 2913092, 2689017, 2840214, 2724611, 2788403, 2708365, 2573744, 2669096, 2629885, 2671646, 2700940, 2454430, 2294560, 2232864, 2182608, 2027442, 1737747, 1940800, 2035964, 2077767, 1962119, 1708899, 1789370, 1659707, 1675721, 1654482, 1554109, 1449585, 1380244, 1465601, 1287034, 1107905, 1416792, 1635251, 1632408, 1296896, 1395751, 1301279, 1215175, 1062397, 1082759, 1117507, 1148477, 1285964, 1204118, 1089878, 1267385, 1191534, 1009352, 1087132, 956912, 724097, 754556, 930098, 921852, 964674, 737889, 1017117, 1007419, 913537, 1085869, 840651, 915259, 903623, 951991, 1118265, 685684, 620669, 709830, 698891, 838725, 761363, 842854, 811999, 541673, 808279, 804461, 810244, 654022, 744330, 512280, 372758, 516721, 477056, 709957]
827G09957m8973k82736L1819m345J69728j93943M1802Q3504j8665J08705j03017
816D93836R1823P584J79541k545l18410K16483K10773k44602J4732o4913J73244
805G57546j10012J5680j19923j66213N2391r1356L12181j9732O7377r1757O279
794F12461P3153k84266j40386L925J91355j06137j8898O2091L4900O332O7498
783E02028o8087L7647Q4030N0973j94847M0490j15875j34918l3161J11842K17810
772D97932j77914m8740J13987n4435j6156j62871p980O4132l161L55452k1027
761E39219K8300j24132k407J67362j22180N1396p2143L0544o7899k43329J2905
750A97636n3291K05172L9164p7402L7306O0315j5077j57059J3155J45307k24902
$$ y = [709957, 660984, 378248, 410067, 405722, 575450, 381507, 423309, 506813, 488148, 596853, 493836, 585659, 593243, 772784, 770239, 451829, 668312, 879085, 634483, 649215, 584302, 757546, 647534, 663214, 543291, 377078, 429469, 338113, 650294, 630562, 697939, 606182, 612461, 685614, 401348, 260962, 264887, 456242, 350105, 331207, 393298, 428198, 434530, 502028, 433941, 471588, 555618, 606591, 411744, 452234, 336359, 201441, 168280, 280122, 497932, 320018, 271278, 385265, 330830, 314674, 151803, 143823, 207955, 204794, 560246, 539219, 567519, 443387, 440980, 608342, 486162, 537558, 465415, 495959, 428060, 184731, 197636, 144345, 349517, 388681, 311279, 348585, 408900, 393823, 236764, 249919, 395226, 170324]
739A70324p0800M4246J26766j79093j81244L56105l61420L08483o6462r3727J20230
728A73408j28567K81283j0011R8842k0694J8459k5259m5431m9080j07839j51680
717C3431K33477k2345n2021p8665J40790p2726j84347K49832j73365J70118j96923
706D7256J38580J64023j75438K9271P9185N5535Q0084j9118j46679k35273K06933
695B24359K7538k51032j10358n8817L66203J02492P8979r6602l10172q787J57700
684A21503Q7622J81317n0150j6410n6849K42467j12836n7849O9477j28715L01
673B79878m0136J37599j03816k6807M2781k5730O7217j72957j19390K84818j36469
662A86988R7097j73655J5890J83852Q4693J4857k52582O7828m794R1913r3245
$$ y = [170324, 99524, 143770, 270536, 91443, -89801, 266304, -95116, 213367, 146905, 53178, 173408, 44841, 326124, 316113, 414955, 394261, 412720, 387461, 342030, 292950, 185111, 33431, 266908, 244563, 192542, 113877, 254667, 181941, -2406, 247426, 74061, 244179, 47256, 185836, 349859, 174421, 203692, 282877, 338412, 418496, 399378, 252699, 17426, 224359, 251897, 865, -109493, -168310, 197893, 300385, 379364, 282762, -27410, -36197, 121503, 209125, 390442, 340292, 323882, 267033, 509500, 396664, 338815, 408292, 279577, 279878, 239742, 377341, 273525, 246718, 289499, 263769, 330986, 158029, 38639, 323457, 186988, 284085, 110430, 126320, 310172, 394865, 409722, 157140, 224968, 220174, 312087, 218842]
651B18842j45665J54320K08996j64818j68781J1590J73747J25605k18687j03610
641I1539k3047J87956j12224J76774p0787m5964j57954O9570Q6800N7545q1675
630A78533k4180K22882j64003r5835P8019m3535p0667N093K1156L68233l34615
619A41081Q0527k22592r7028J11320J55533q3648k9870j06244O0641P427J9937
608C7084O5690m1454k91263M4705J46831K1474R5119j70433R3015J76448j19445
597E7771K8994p030J45443J88228k22526q3650M8997K5840j71016r4938j1304
586i5191Q4091J04345J13123j72259J2713P3592j91576J63837N1288q5235R087
575F7815j81823K09002j02646l1036J66840l6227O2873q7160j54023K27953n2723
$$ y = [218842, 73177, 227497, 436493, 271675, 102894, 114484, 288231, 413836, 195149, 91539, 68492, 256448, 144224, 320998, 250211, 204247, 46293, 115863, 202663, 260208, 178533, 154353, 377235, 213232, 117397, 195416, 151881, 81214, 86307, 107463, 475696, 141081, 221608, -984, -98012, 13308, 168841, 85193, 55323, -50921, 9720, 17147, 37084, 102774, 61320, -229943, -185238, -38407, -16933, 78186, -92247, 768, 177216, 57771, 86765, 79735, 225178, 413406, 190880, 107230, 156227, 182067, 11051, -83887, -95191, -11100, 93245, 206368, 34109, 46822, 120414, -71162, 92675, 143963, 58728, 67815, -114008, 94994, -7652, -38688, 128152, 91925, 154798, 67638, -86385, 141568, 88845]
564H8845k3528R4690L0494R5590j04247j97216J7931j51629J19191M9390n5431
553c5920J69241m2696j02417j4334l820K20274p4728k17693K89073j16831j79938
542a09789k2996J42470m9032j19814L2297M0510J6025K52870Q1832j87801O257
531H2829k5216J51528l12777J59458k0940J4465m3060o3890Q2396P8398K6664
520A29855J6844j48413k62172M6195N3621N5976n4437j86253J02234N3305Q9462
509a03783J89857j77056P5186n188o6083j58350K94725K6373j20306j65209M9740
498a60094J79948n6537J1651R6733k1363k26505j57653k1178J39578P9322j14549
487b50647J3371K42101j29124l6020K00955k29190K23173j8391k24450O4640j52106
$$ y = [88845, 65317, 160007, 190501, 286091, 181844, -15372, 2559, -149070, -29879, 19511, -35920, 133321, 90625, -11792, -26126, -29946, 190328, 115600, -102093, 186980, 70149, -109789, -132785, 9685, -39347, -159161, -126864, -86354, -70329, 182541, 264373, 76572, 82829, 57613, 209141, -103636, 55822, 34882, 49347, 6287, -57603, 24793, 103191, 129855, 146699, -1714, -263886, -217691, -164070, -108094, -162531, -348784, -246550, -193245, -103783, 86074, -90982, -15796, -20984, -87067, -245417, 49308, 75681, -44625, -209834, -160094, 19854, -36683, -25032, 71701, 50338, -176167, -333820, -354998, -215420, -136098, -250647, -237276, 4825, -124299, -160319, 40636, -188554, 34619, 16228, -208222, -143582, -295688]
476b95688J35757M7575n7664J31062o5798J33327l1648n5263J02446k39056m6093
465b41043J05299j02144o0427J18505J1312K3117j95851J5114L7420J53184N1191
454h4323q0005o9059n6302j25362n6432K75382k42111Q2859j86610K87740N519
443b48704j48121j04764P4855K40953j834o4908J01022R6302J43275J47922k45730
432i732K713j22789l2542P3775r9627j56622J64975J47823J0956k46218k58681
421e25969P7991J77186k29638L5393L4831K48276o1841j33321K265J4493J19299
410b41035n5773K5570J03824j72806K86856l4805n6963n230j49073K9381J2199
399b57855R3611M6495J34175j69004q1040k6533M4904l7536j934l2838Q3450l4203
$$ y = [-295688, -159931, -112356, -170020, -38958, -104756, 28571, -3077, -58340, 44106, -194950, -241043, -135744, -237888, -298315, -179810, -168498, -145381, -341232, -326118, -288698, -135514, -84323, -164328, -233387, -289689, -415051, -471483, -196101, -438212, -355353, -541963, -254223, -248704, -396825, -501589, -426734, -185781, -187615, -252523, -151501, -55199, 88076, 235998, -9732, -7019, -129808, -162350, -88575, -188202, -344824, -179849, -32026, -21070, -267288, -525969, -447978, -270792, -500430, -465037, -430206, -181930, -243771, -377092, -374827, -360334, -241035, -296808, -271238, -167414, -340220, -53364, -88169, -145132, -150362, -299435, -270054, -257855, -164244, -117749, 16426, -152578, -233618, -260151, -215247, -252783, -254717, -287555, -204105, -238308]
387b38308l4368L558P6727J15026k65200r8270J39809K86988k50886k75112K86369
376b53667J54486k1773k15302q3654K22485J42594j35471k05121Q9900J15233
366a90290J16117p0637j87495J45667L5403m6138k8856j20064P5046Q8804p3977
355b56420j72916N660J36133J09l8546J47463J50940k01849Q8950P3403k7181
344i4254m5770n1036j19806P9909J79659Q4988o6341l09862o9747j07144n8715
333e78119R9483J73576J88822M5132j12405j10887n0677K52275j80913k06584
323d80297M259N9541K52039N312J39083k89870O8104J5808J08800j20100K4334
312b12987o8547l4366J20444m0151K09785j16452k11690J9878L9642J09827J81513
$$ y = [-238308, -272676, -269118, -192391, -77365, -342565, -440835, -301026, -14038, -264924, -540036, -253667, -99181, -120954, -336256, -419910, -197425, -54831, -190302, -395423, -305523, -190290, -74173, -144810, -332305, -186638, -151235, -197373, -226229, -346293, -271247, -182443, -256420, -429336, -423676, -287543, -287434, -325980, -178517, -27577, -229426, -140476, -67073, -94254, -140024, -191060, -310866, -230957, -51298, 33690, -32651, -342513, -412260, -519404, -578119, -478636, -305060, -116238, -71106, -183511, -294398, -345075, -92800, -273713, -480297, -476038, -416497, -164458, -159146, -20063, -309933, -241829, -226021, -117221, -237321, -212987, -281534, -315900, -195456, -235607, -25822, -142274, -353964, -334086, -294444, -184617, -3104]
301c104k33826o5508q1842l2577r7207N5053J26619J83557o0514j6777j14985
290c41111J9016J6915m8074K6879m3793O9994r7091J8776k3162J37067L3902j20718
278c51400J04252L9961n8039k2516J07732M2480j06924K3680l8030j07894J27782
267b38916j1729P1656j47926n9513R2711o5060R6580q7475r9535J80409L3883
256b34915p0944L1192r7452J58089p7139o654k3505o3865M8482J96978j96694
245c36427j37517K15494N5125n5811j04975J05335p8609j8730O1892l5578j92245
234e22046O9574l9491P664K99289J19589k76318j27199J10470K5382J52112j15585
223b96559j28354J47125R1169n7535j0412o5563K2014M6639o6017L0024O4873
$$ y = [-3104, -236930, -302438, -384280, -416857, -514064, -459011, -332392, -148835, -209349, -226126, -341111, -322095, -305180, -353254, -326375, -370168, -300174, -397265, -378489, -401651, -264584, -230682, -351400, -247148, -207187, -265226, -287742, -180010, -137530, -244454, -220774, -258804, -366698, -238916, -250645, -178989, -326915, -386428, -293717, -358777, -262197, -349672, -449207, -268798, -234915, -305859, -274667, -372119, -214030, -291169, -297823, -321328, -385193, -336711, -139733, -336427, -473944, -258450, -203325, -259136, -364111, -258776, -337385, -356115, -294223, -329801, -522046, -452472, -491963, -484299, -185010, -65421, -341739, -468938, -358468, -333086, -180974, -296559, -424913, -277788, -186619, -244154, -254566, -320129, -298115, -251476, -317493, -287469, -222596]
212b22596n3646m2920j29359n1642j48609J85242K01060k57156j12496J26630
202e05492J11042J2059p176j71633J76413K11455m3503j43572O8207J57637o7839
191b02402k09268L1984J55761p2405j57j24277j11407J73399J55252n3285k8861
180b85666j09386o7763K31454K2141l77R4385r8742k3985R2425l36875K13277
169b69112j29212m080j5761j56014J63153j04649O7525J03988k6564R139l7831
158c99418p791N1426j15192r2154o0018R4892J35517n5871k1789K4076M0321j20708
146e26709j685k73K0589K85682j20120L9564j13332m9759J29713q1044N5365n3330
134d15339J29241m2629j2736P1386k39008J88904p1642l5353P3013m673j2024
$$ y = [-222596, -276242, -319162, -448521, -500163, -648772, -463530, -262470, -519626, -632122, -505492, -394450, -382391, -389567, -561200, -384787, -173332, -216835, -360407, -292200, -134563, -202402, -411670, -379686, -223925, -296330, -296487, -420764, -532171, -358772, -203520, -256805, -285666, -395052, -462815, -231361, -209220, -209597, -115212, -213954, -237939, -145514, -482389, -269112, -398324, -402404, -418165, -574179, -411026, -515675, -448150, -344162, -370726, -361587, -399418, -407209, -355783, -470975, -563129, -623147, -528255, -392738, -448609, -470398, -446322, -406001, -526709, -528394, -528667, -508078, -222396, -342516, -302952, -416284, -466043, -336330, -417374, -362009, -415339, -286098, -328727, -341463, -270077, -509085, -320181, -391823, -427176, -354163, -358836, -370860]
123c70860J08595j07577K6455j56345o9165n940J38289K48912q5858j56594l0261
112d60349Q6812K4345j00721k6027J10742P0044r7403J96965N7992k23069J35167
101b25502K0086M2261j82029J6680n1398P1293P9933k13287M056J68148r7239
90c66998n5173j76861l501J41812K6182k857j26300P5616r057O988R5429J37489
78b57231j51304p1315L365K6189j2027Q7271q2424M5476o1004J48115J3307j07139
66d18721J69942k09336K4496J64980n6110j19877r1846r1106P2005J44833r7985
55e08725r5546M2211n4181J47843R0882r7922p5608p1580J06914Q2776n6767J05964
43c83739q7915l5400j31292N2795M3776K26888o3701n7689O2717j63043M7543
$$ y = [-370860, -262265, -369842, -343387, -499732, -568897, -574837, -436548, -187636, -273494, -430088, -460349, -373537, -349192, -449913, -475940, -365198, -295154, -392557, -195592, -137600, -360669, -225502, -205416, -163155, -345184, -328504, -379902, -308609, -228676, -441963, -437907, -269759, -366998, -422171, -599032, -602533, -460721, -434539, -437396, -563696, -488080, -497137, -490149, -394720, -257231, -408535, -479850, -476485, -450296, -462323, -375052, -457476, -412000, -473004, -324889, -311582, -418721, -248779, -458115, -433619, -268639, -324749, -444626, -536472, -627578, -555573, -410740, -508725, -604271, -562060, -616241, -468398, -377516, -475438, -551046, -622626, -515712, -432936, -489703, -383739, -471654, -507054, -638346, -585551, -541775, -314887, -378588, -436277, -373560, -536603, -489060]
32d89060J73309n9510j99567Q917J55106q7959n0970P5687M3701k4363q7919k3811
20e66439j39898K27377K00190o1099j1224k760j34444J29740n0435j24914Q3135
9d50771o6782o821n0275J51644Q6787j16535o1620K3290J25347
0c65736
$$ y = [-489060, -315751, -375261, -574828, -565911, -410805, -498764, -549734, -474047, -430346, -454709, -542628, -566439, -706337, -478960, -278770, -339869, -351093, -353853, -488297, -358557, -408992, -533906, -450771, -517553, -524374, -574649, -423005, -336218, -452753, -514373, -491083, -365736]
$$ Imaginary data points
##PAGE= N=2
##DATA TABLE= (X++(I..I)), XYDATA
16383h282110J62811R4468J13102M2896K6000J78943K8528O4115p2455K60636
16373g383066K14727Q659J44345q8428J97088J73200M6075O3889N3949O3334L3231
16362f472997L1678K38692R5580l6940K6721K27462N3531J30382R2241j9055N4372
16351e578333J91451J70840N9976L940K2713J50802K81859P7132j34902Q0528
16341d673994J73953J92430j02626J7588R9678J35416J03781q8264J11119K41948
16331c788971R8557J46597n0139o111J44150J38865n1874Q4088l2333R1971P0614
16320c154586k4727K54740J99923L5379l4389J21473J31577n3558R634L21612
16310b192922J78399m9475J29382N659j9483J84748J75617n4966r7388K21186
$$ y = [-8282110, -8119299, -8024831, -7911729, -7868833, -7842833, -7663890, -7635362, -7571247, -7643702, -7383066, -7168339, -7159680, -7015335, -7103763, -6906675, -6733475, -6687400, -6623511, -6569562, -6506228, -6472997, -6441319, -6202627, -6107047, -6143987, -6117266, -5889804, -5836273, -5705891, -5613650, -5632705, -5578333, -5386882, -5216042, -5156066, -5152126, -5129413, -4978611, -4696752, -4619620, -4754522, -4673994, -4500041, -4307611, -4410237, -4392649, -4292971, -4157555, -4053774, -4142038, -4030919, -3788971, -3690414, -3543817, -3593956, -3600067, -3455917, -3317052, -3368926, -3284838, -3317171, -3225200, -3154586, -3179313, -2924573, -2724650, -2689271, -2723660, -2602187, -2470610, -2524168, -2514534, -2192922, -2014523, -2063998, -1934616, -1928957, -1948440, -1763692, -1588075, -1643041, -1740429, -1519243]
16300a519243J6014R6492N5068j05564J84104J15248K62184L9744j10288N3766
16290i12475O8518R1862J38970r7242O4289P1966j0108J52544J89120J5642k9746
16279b56660q7363K88503K03507J5842j46941m2086K12570k8065J55207P1517
16269C86031J03049n1238M1087r8764J11668J30942K65732j8472m0074J50661
16259I80622J00216M7031J6623L3535j17584P0973K53763J4764j03703J36070
16249A432310j06030J45776P3250O5799j08967m9196J71290J32435J46901L4249
16239A937817j3040m1935K03821k8517R854Q6577p4776p2425J63722K23401p4489
16228B320010k7425K62478p9018O0121J7348L0572Q435N2757M5373k02665J53116
$$ y = [-1519243, -1503229, -1406737, -1351669, -1457233, -1273129, -1157881, -895697, -855953, -966241, -912475, -843957, -752095, -613125, -710367, -646078, -574112, -584220, -431676, -242556, -226914, -256660, -344023, -55520, 147987, 163829, 16888, -25198, 187372, 159307, 314514, 386031, 489080, 437842, 478929, 380165, 491833, 622775, 888507, 870035, 829961, 980622, 1080838, 1127869, 1144492, 1178027, 1060443, 1131416, 1385179, 1399943, 1296240, 1432310, 1326280, 1472056, 1545306, 1611105, 1502138, 1452942, 1624232, 1756667, 1903568, 1937817, 1924777, 1882842, 2086663, 2058146, 2068000, 2154577, 2079801, 2007376, 2171098, 2394499, 2320010, 2292585, 2555063, 2476045, 2536166, 2553514, 2584086, 2592521, 2645278, 2690651, 2487986, 2641102]
16217B641102K05739K05282j60777j17858K13760J52350k94633Q527K28524J7089
16207C099105J5568R6627J35500N1602r8512N9238L31035k79288k4923J0547j44128
16196C252371J07707K20634J30992J34613k04577J01202o5400k22222J03369Q5177
16186C643866J686P9525J03807M0505j1743j18176J36206l9910M9937N49r444
16175C876808k58189J10338k2710J41021L42623K66247j76624j53217K63334j47137
16165D242494J92701j68163k8351l3706Q2051o5885O9358L7469J0069j35072O5886
16154D268851R5205R7018K8252j94348q7853J5226J37500p1319J08725M2094N3983
16143D493334j85874J85626N1374J05784P3876J76886l4941r6559o2324J06893
$$ y = [2641102, 2846841, 3052123, 2891346, 2773488, 2987248, 3139598, 2844965, 2853492, 3082016, 3099105, 3114673, 3211300, 3346800, 3398402, 3299890, 3359128, 3690163, 3410875, 3385952, 3396499, 3252371, 3360078, 3580712, 3711704, 3846317, 3641740, 3742942, 3677542, 3455320, 3558689, 3643866, 3645552, 3725077, 3828884, 3869389, 3857646, 3739470, 3875676, 3835766, 3885703, 3886252, 3876808, 3618619, 3728957, 3706247, 3847268, 4189891, 4456138, 4279514, 4126297, 4389631, 4242494, 4435195, 4267032, 4238681, 4204975, 4287026, 4221141, 4290499, 4327968, 4338037, 4202965, 4268851, 4364056, 4461074, 4489326, 4294978, 4207125, 4222351, 4359851, 4288532, 4397257, 4439351, 4493334, 4307460, 4493086, 4544460, 4650244, 4724120, 4901006, 4866065, 4769506, 4707182, 4814075]
16133D814075J90542n7254N696l02039o5547J83446Q7777j21369l9963Q7722j51323
16122D631763J32902L63186j21452q0327k78389p5368K07590q7069j24741J82215
16112D750310K81255o362k26110m8718K40287k26522J01277m7500P0696J24696
16102E013309M8433o1606N12l9399M3669L1825O1251K4548j81887j15809o1237
16091D763609J39029J50246n5929J7552r7018R947J87056q3079l0648j95283m9610
16080D755872L8643q5876K54169P7059j50597L6901K13630j49391m649J07255
16070E093016o344J47141j60856q1306N7750J51185Q5340k10760j2686K17373
16060E279853L9438j34043j24870J25049J34583q2992j36494n9764j7202n5883
$$ y = [4814075, 5004617, 4947363, 4953059, 4651020, 4585473, 4768919, 4856696, 4735327, 4695364, 4783086, 4631763, 4764665, 5127851, 5006399, 4926072, 4647683, 4572315, 4779905, 4692836, 4568095, 4750310, 5031565, 5025203, 4799093, 4750375, 4990662, 4764140, 4865417, 4817917, 4888613, 5013309, 5061742, 5000136, 5000648, 4961249, 5004918, 5036743, 5097994, 5122542, 4940655, 4824846, 4763609, 4902638, 5052884, 4996955, 5014507, 4917489, 4927436, 5114492, 5031413, 5000765, 4805482, 4755872, 4794515, 4708639, 4962808, 5039867, 4889270, 4926171, 5139801, 4990410, 4985761, 5093016, 5086672, 5233813, 5072957, 4991651, 5049401, 5200586, 5285926, 5075166, 5062480, 5279853, 5319291, 5185248, 5060378, 5185427, 5320010, 5237018, 5100524, 5040760, 5023558, 4967675]
16050D967675j8847J75597O0296k746k37844J02755P0216k1499J8076j1684j30890
16039D971105J82303J09549J96718j53148k87104Q078J70523K9136O6733K3732
16029E317625k24884J8623n9340j3738q1078K1336M25055O8893k99616n5651k9258
16018E087967J53104p8950M1465J75971j8321j14177O995J09185l4154j69759
16008E159326j05151k3090K41764J18420j17958j22427N6210J08057p4703N7819
15998E298267N9815K4922k53737L3883N5276N327R015k18389j16338J12304J81639
15987E191984J57549k46969o3377J07424K3840J59856q7097J48156j48805j00319
15977E142242K3702K9959J55823j81447j454R0825l2877M9771O8834j19454p3899
$$ y = [4967675, 4948828, 5124425, 5184721, 5181975, 4944131, 5046886, 5117102, 5095603, 5113679, 5101995, 4971105, 5153408, 5262957, 5459675, 5306527, 5019423, 5027501, 5198024, 5227160, 5293893, 5317625, 5092741, 5111364, 5052024, 5038286, 4957208, 4978544, 5403599, 5472492, 5172876, 5117225, 5087967, 5241071, 5162121, 5203586, 5379557, 5361236, 5247059, 5254054, 5363239, 5329085, 5159326, 5054175, 5031085, 5272849, 5391269, 5273311, 5150884, 5207094, 5315151, 5240448, 5298267, 5358082, 5383004, 5129267, 5163150, 5218426, 5223753, 5232768, 5014379, 4898041, 5010345, 5191984, 5349533, 5102564, 5039187, 5146611, 5170451, 5330307, 5243210, 5391366, 5242561, 5142242, 5165944, 5195903, 5351726, 5170279, 5168825, 5259650, 5226773, 5276544, 5345378, 5225924, 5152025]
15966E152025m3891J64255L1494N6512q8331k5863j67581Q1433J09456q6433j7557
15955E165519j64311Q5213J66200o1723j0817R2103j73440n7382J99494J63571
15945E404427j64054l8774M8270j13932R2937K45149j18088r1453n0004J34040
15935E348518O3758p7379l840O7313k27316j99220l7488J5001K01099o2211J63906
15924E252141j74425j06245K92857p7286K30771j38623j20353K35790L9917j63799
15914E270745p3619J10405L0245l05112K60124J77111j06213j22478j03189N3251
15904E191270q3189m8628M0990k2202Q9250L4075L4192k7505j24564P102j21494
15893D969297n967O0984J34524j1871j19767O5147m6925L1838q3899J67846J86413
$$ y = [5152025, 5108134, 5272389, 5303883, 5360395, 5272064, 5246201, 5078620, 5160053, 5269509, 5183076, 5165519, 5001208, 5086421, 5252621, 5190898, 5180081, 5272184, 5098744, 5041362, 5240856, 5404427, 5240373, 5201599, 5249869, 5135937, 5228874, 5474023, 5355935, 5264482, 5214478, 5348518, 5412276, 5334897, 5331057, 5398370, 5171054, 4971834, 4934346, 4949347, 5150446, 5088235, 5252141, 5077716, 4971471, 5264328, 5187042, 5417813, 5279190, 5158837, 5394627, 5434544, 5270745, 5197126, 5307531, 5337776, 5032664, 5292788, 5469899, 5363686, 5241208, 5138019, 5191270, 5108081, 5059453, 5100443, 5078241, 5167491, 5201566, 5235758, 5208253, 5083689, 5090791, 4969297, 4963330, 5024314, 5158838, 5146967, 5027200, 5092347, 5045422, 5077260, 4993361, 5161207, 5347620]
15882E347620n760J48245j01733K3976K81349j51287k31318k57180o186O7143
15872E114869R4390J30645p6877N1535K6177Q0374Q959k05750j56925J20584K60484
15861E448465j26800j19836r0603J8365J134j40768K88332L3210J03736j49160
15851E266075j2789J79242J37186L7758k41439k18985j74811J93093J44979q150
15841E302159J1356P5853j25734K4455M9973r1969m8475k51716P8273j7028J73081
15830E180228J20287M7574k64643n5863Q4790J85128J86996k08054m3075Q0318
15820E313686q4556K20962j23476k11771p0096O8766Q0770N3471k6025j74573
15810E047158j8905m4822j053J46652K46419j64423n3713K5528P5894o7204q5175
$$ y = [5347620, 5341860, 5490105, 5388372, 5412348, 5693697, 5542410, 5311092, 5053912, 5047726, 5114869, 5209259, 5339904, 5263027, 5314562, 5340739, 5421113, 5430072, 5224322, 5067397, 5187981, 5448465, 5321665, 5201829, 5111226, 5129591, 5130725, 4989957, 5278289, 5311499, 5415235, 5266075, 5253286, 5432528, 5569714, 5607472, 5366033, 5147048, 4972237, 5165330, 5310309, 5302159, 5313515, 5389368, 5263634, 5288089, 5338062, 5246093, 5197618, 4945902, 5024175, 5007147, 5180228, 5300515, 5348089, 5083446, 5027583, 5112373, 5297501, 5484497, 5276443, 5233368, 5313686, 5229130, 5450092, 5326616, 5114845, 5044749, 5113515, 5194285, 5247756, 5221731, 5047158, 5028253, 4983431, 4982378, 5129030, 5375449, 5211026, 5157313, 5182841, 5258735, 5191531, 5106356]
15799E106356K45114M8794K0525o6811j29689M6755K18614n3870k48040J153O2130
15788E251031l0428j9934j8012J48931K7946m9345K2212m9323j20834j25045K08704
15777E245903j9961j90821m8714J36198J98418R8031l9319j6406q1764N4268k03930
15766E131903O098J33111J10942j28990k27926K42558k2123J00826J32958k9297
15756E450060l14014L3572O3202L5423o2414L348n2470J71911K09260p4152O2629
15745E526355q5915K8945k42874m7838N4680J07270R8559k36160l6881K42210
15735E408351j63691M0253J01306K4021j66933J07848l9915k1856j29852p4613
15725E084919J04280K9781J94519P6857j8938r5110R866K7576K00254j76693k42477
$$ y = [5106356, 5351470, 5400264, 5420789, 5353978, 5224289, 5271044, 5489658, 5435788, 5187748, 5188901, 5251031, 5220603, 5200669, 5182657, 5331588, 5359534, 5310189, 5332401, 5283078, 5162244, 5037199, 5245903, 5225942, 5035121, 4986407, 5122605, 5321023, 5419054, 5379735, 5363329, 5281565, 5335833, 5131903, 5138001, 5271112, 5382054, 5253064, 5025138, 5267696, 5245573, 5346399, 5479357, 5450060, 5136046, 5169618, 5232820, 5268243, 5205829, 5209177, 5156707, 5328618, 5537878, 5463726, 5526355, 5440440, 5469385, 5226511, 5178673, 5233353, 5340623, 5439182, 5203022, 5166141, 5408351, 5244660, 5284913, 5386219, 5410240, 5243307, 5351155, 5311240, 5289384, 5159532, 5084919, 5189199, 5218980, 5413499, 5490356, 5471418, 5376308, 5386174, 5413750, 5614004, 5437311, 5194834]
15714E194834J50511J12700Q8465p6328j52444l3410l97630j31299J16946J85865
15704E058210M30424j98412R532J09147j02217j02984N1731J16483K5210j92446
15694E204678j54461K20493J46979J47550m5598m3938k53228o37J17635M4451
15684E383924J16149m5348j23122J59908J36709p2204l46464j06541J06914O0068
15674E269993n6574p819P6994k23277K53127j68228K39010L0327k17369Q9923
15664E286107P6275Q9730k70576L6837J07000N0768K8606J22507q6999k6580N0651
15653E464326q975m4533J83873p5234j87445j46819j10799L40121P0463j28287
15643E356691r8515n4359P3853J08147r7296R1369j63410P1691J5185J6414K26184
$$ y = [5194834, 5345345, 5458045, 5546510, 5470182, 5317738, 5284328, 4886698, 4755399, 4872345, 5058210, 5488634, 5290222, 5299754, 5408901, 5306684, 5203700, 5255431, 5371914, 5397124, 5204678, 5050217, 5270710, 5417689, 5565239, 5519641, 5475703, 5222475, 5221838, 5339473, 5383924, 5500073, 5454725, 5331603, 5491511, 5628220, 5556016, 5209552, 5103011, 5209925, 5269993, 5213419, 5205600, 5282594, 5059317, 5312444, 5144216, 5383226, 5413553, 5196184, 5286107, 5362382, 5452112, 5181536, 5218373, 5325373, 5376141, 5404747, 5527254, 5440255, 5413675, 5464326, 5455351, 5410818, 5594691, 5519457, 5332012, 5185193, 5074394, 5414515, 5484978, 5356691, 5258176, 5203817, 5277670, 5385817, 5288521, 5379890, 5216480, 5288171, 5303356, 5319770, 5545954]
15632E545954M8032k32144p5184J37486q6883J49952M0958j92973q4792L49391
15622E599797K9417J20128m26482N1894j04213k6757K00966j99563l9L2289R5671
15611E373108o7833q3352M3091J07048K7979j1629o0341J42731j45489M7768j05410
15600E267671p8104K81199r7049j00971r693J77344N0674j33738o5469N69R7372
15589E389805p0945N24O9743K59591P3312m05187J02719j1990J13691J30088l07320
15578E344031K3027N219O7185o801o0758j03573J76471j32680K8573J07808l8216
15567E410286J44417P744l43201K4460K57447J1682J72101k21665J21824l3718
15557E551377j53531r6304m7861R9199l0908j45361J59239j44676O1709P3193
$$ y = [5545954, 5593986, 5361842, 5286658, 5424144, 5337261, 5487213, 5528171, 5335198, 5250406, 5599797, 5629214, 5749342, 5322860, 5374754, 5270541, 5243784, 5444750, 5245187, 5245148, 5277437, 5373108, 5305275, 5221923, 5265014, 5372062, 5400041, 5388412, 5328071, 5470802, 5325313, 5373081, 5267671, 5189567, 5470766, 5373717, 5272746, 5263053, 5440397, 5491071, 5357333, 5291864, 5292433, 5389805, 5318860, 5319384, 5389127, 5648718, 5722030, 5316843, 5419562, 5407572, 5521263, 5651351, 5344031, 5367058, 5372277, 5439462, 5432661, 5371903, 5268330, 5444801, 5312121, 5340694, 5448502, 5410286, 5554703, 5562447, 5219246, 5243706, 5501153, 5512835, 5684936, 5463271, 5585095, 5551377, 5397846, 5301542, 5253681, 5352880, 5321972, 5176611, 5335850, 5191174, 5252883, 5326076]
15547E326076N3540R3603K5098J63686j35473p4143j25306k3390K0261J66885
15537E490837P9711J80566k62307j02275j52816k33008K59945K51147j61347O0747
15527E411200P7323K1733K02214j30955j45852L8619j46590J32726J20403j89787
15517E391034J05530j40378J18594R2546p0655k0589m9785m9160O4457R938J4215
15506E465747j6038r3139k0795J14390P7252j0967q4460N0495n6567K2872K60432
15495E709222P7110j70365k49376J942q256K16918m6830k56425O7654j01054M8289
15484E288829J61687N4832J520j42010P9541q1290J38103L4200J26853j86311
15474E475954j40781J26950J26431M3064J5905k01231J8202j01979K3743K55057
$$ y = [5326076, 5379616, 5473219, 5498317, 5662003, 5526530, 5452387, 5327081, 5303691, 5323952, 5490837, 5570548, 5751114, 5488807, 5386532, 5233716, 5000708, 5260653, 5511800, 5350453, 5411200, 5488523, 5510256, 5712470, 5581515, 5435663, 5474282, 5327692, 5460418, 5580821, 5391034, 5496564, 5356186, 5474780, 5567326, 5496671, 5476082, 5426297, 5377137, 5441594, 5451532, 5465747, 5449709, 5356570, 5335775, 5450165, 5527417, 5516450, 5431990, 5482485, 5425918, 5448790, 5709222, 5786332, 5615967, 5366591, 5368533, 5360277, 5577195, 5530365, 5273940, 5341594, 5240540, 5288829, 5450516, 5505348, 5506868, 5364858, 5444399, 5363109, 5501212, 5535412, 5662265, 5475954, 5335173, 5462123, 5588554, 5631618, 5647523, 5446292, 5464494, 5362515, 5386258, 5641315]
15464E641315q3197q2363k04919J07675K08114k9765j37469K8726M45J30419k6600
15453E552381Q2467j1023j27099j00002J62834K5998P9767p7212l6003O7097m18
15442E618787J06926j37873o6922j79074q6373K96079k8474J30916m3962k42477
15432E367553J28558o5317O5997J47044k41012k6387L29948k29039N0424j15570
15422E412199o1123K30217j84536j2503K11856j49897K02303l7358k32469J08162
15412E486851m4748j5049j1956j47377p9688K24469r682R3636m6312r9167P7160
15401E428137L34833k66692m7532L6865r0993o9566m5435K21492m5177J05753
15391E561685O6104r1421q2303j0973L6372k060o2483j44598n3552K36743k9812
$$ y = [5641315, 5558118, 5475755, 5270836, 5378511, 5586625, 5556860, 5419391, 5448117, 5448562, 5578981, 5552381, 5634848, 5623825, 5496726, 5396724, 5559558, 5585556, 5665323, 5588111, 5552108, 5619205, 5618787, 5725713, 5587840, 5520918, 5341844, 5255471, 5551550, 5523076, 5653992, 5610030, 5367553, 5496111, 5430794, 5496791, 5643835, 5402823, 5376436, 5706384, 5477345, 5527769, 5412199, 5351076, 5581293, 5396757, 5384254, 5596110, 5446213, 5648516, 5611158, 5378689, 5486851, 5442103, 5427054, 5415098, 5267721, 5188033, 5412502, 5402820, 5496456, 5450144, 5350977, 5428137, 5762970, 5496278, 5448746, 5485611, 5394618, 5325052, 5279617, 5501109, 5455932, 5561685, 5627789, 5536368, 5454065, 5443092, 5479464, 5477404, 5414921, 5270323, 5216771, 5453514, 5423702]
15380E423702Q5741R9342L9637K6757l12228K79467J14363k05730n3888k31237
15370E265926K35522L7626j61562J4749m546j6366N654J97299J33169j28169o3917
15359E515385k51559K53272J70971j46214J47709k78105P4192J71677p7435J43593
15349E723486j59318k27158j40676M1917K29686j3518K74083k35187J03555j41670
15339E455200J6566J87245m5925r4702j45679K38096J02711k38794j9770J46679
15329E601627R3640J42750r5657m8746k08763N4255j86941J92946k6237K08680
15319E727554j58316k63892J22904o5931Q7541J61041P389j01605j56027J58751
15309E519409L20409k92956Q7565k49408q5460j8509J62056J29735j23170J0647
$$ y = [5423702, 5509443, 5608785, 5648422, 5675179, 5362951, 5642418, 5756781, 5551051, 5497163, 5265926, 5501448, 5539074, 5377512, 5392261, 5387715, 5371349, 5377003, 5574302, 5707471, 5579302, 5515385, 5263826, 5517098, 5688069, 5541855, 5689564, 5411459, 5485651, 5657328, 5579893, 5723486, 5564168, 5337010, 5196334, 5238251, 5467937, 5454419, 5728502, 5493315, 5596870, 5455200, 5471766, 5659011, 5613086, 5518384, 5372705, 5610801, 5713512, 5474718, 5454948, 5601627, 5695267, 5838017, 5742360, 5693614, 5484851, 5539106, 5352165, 5545111, 5518874, 5727554, 5569238, 5305346, 5428250, 5362319, 5449860, 5610901, 5618290, 5516685, 5360658, 5519409, 5839818, 5546862, 5634427, 5385019, 5299559, 5281050, 5443106, 5572841, 5449671, 5460318]
15299E460318k62033K39482L56404l56034K04589K6575j21032l6749j43609K88170
15289E656081k22535J8854J58088J73479l04159N2657P6786r2874Q9993l13567
15279E292803J62180K13339O7658R1211j96480j09254J02516o3385Q9859l9646
15269E610801l1235j1817j69599J31950J45617j66080j98352R7615j08939J59743
15259E459704o1762p251r0615O4809j39964P4873J00662J922J16954n7926Q6505
15248E547911n6226J5880j09551J50489j81897J11212J81472J09303n190k43296
15238E520107k00191L13375o3042M7285L3681j69247O6702l6372J82757M008K7658
15227E726721k8449R427k31613L57111q4401j71694o4233O3215j9439j87286R7857
$$ y = [5460318, 5198285, 5437767, 5794171, 5438137, 5642726, 5669301, 5548269, 5511520, 5367911, 5656081, 5433546, 5452400, 5610488, 5783967, 5479808, 5532465, 5609251, 5516377, 5606370, 5292803, 5454983, 5668322, 5735980, 5827191, 5630711, 5521457, 5623973, 5560588, 5650447, 5610801, 5579566, 5567749, 5398150, 5530100, 5675717, 5509637, 5311285, 5408900, 5299961, 5459704, 5397942, 5390691, 5300076, 5364885, 5224921, 5299794, 5400456, 5402378, 5519332, 5461406, 5547911, 5491685, 5507565, 5398014, 5548503, 5366606, 5477818, 5659290, 5768593, 5763403, 5520107, 5319916, 5633291, 5570249, 5617534, 5651215, 5481968, 5548670, 5512298, 5695055, 5699063, 5726721, 5698272, 5707699, 5476086, 5833197, 5748796, 5577102, 5512869, 5576084, 5556645, 5369359, 5467216]
15216E467216J80537L1665j09226p0359k46829J72948K24254l5111j30493N297
15206E489899j37561J3959J29899J13656k9195N1696j589j07368k1219M7189j2355
$$ y = [5467216, 5647753, 5679418, 5570192, 5499833, 5253004, 5425952, 5650206, 5615095, 5484602, 5489899, 5352338, 5366297, 5496196, 5609852, 5580657, 5632353, 5630764, 5523396, 5502177, 5549366, 5537011]
$$ [...]
##END NTUPLES=NMR SPECTRUM
##END=
