##TITLE=1H_TG-2327-4
 CDCl3, 8 sc, 
 31.05.2021
##JCAMPDX= 6.0         $$ Bruker NMR JCAMP-DX V2.0
##DATA TYPE= NMR SPECTRUM
##DATA CLASS= NTUPLES
##ORIGIN= UXNMR, Bruker Analytische Messtechnik GmbH
##OWNER= root
$$ XWIN-NMR		Version 3.5
$$ Mon May 31 11:27:00 2021 Russian Standard Time (UT+4h)  she@DPX200
##.OBSERVE FREQUENCY= 200.131506
##.OBSERVE NUCLEUS= ^1H
##.ACQUISITION MODE= SIMULTANEOUS
##.ACQUISITION SCHEME= undefined
##.AVERAGES= 8
##.DIGITISER RES= 18
##SPECTROMETER/DATA SYSTEM= spect
##.PULSE SEQUENCE= zg30
##.SOLVENT NAME= CDCl3
##.SHIFT REFERENCE= (INTERNAL, CDCl3, 0, 15.9792)
##AUDIT TRAIL= $$ (NUMBER, WHEN, WHO, WHERE, WHAT)
$$ ##TITLE= Audit trail, XWIN-NMR		Version 3.5
$$ ##JCAMPDX= 5.01
$$ ##ORIGIN= Bruker BioSpin GmbH
$$ ##OWNER= she
$$ F:/spectra/data/she/nmr/H-F/1/pdata/1/auditp.txt
$$ ##AUDIT TRAIL=  $$ (NUMBER, WHEN, WHO, WHERE, WHAT)
(   1,<2021-05-31 11:24:04.59 +0400>,<she>,<DPX200>,
      <created by zg, POWCHK disabled, PULCHK disabled
       configuration hash MD5:
       00 E9 B6 7A A2 85 ED C7 34 08 36 98 17 FE 4E 26
       data hash MD5: 16K
       5A E5 1B 2C C4 4D 5C B8 09 AF C0 73 E1 1D 1A D9>)
(   2,<2021-05-31 11:24:07.25 +0400>,<she>,<DPX200>,
      <Start of raw data processing
       efp BC_mod = 2 LB = 0.24 FT_mod = 6 PKNL = 1 PHC0 = -11118.59 PHC1 = 8.800991 SI = 16K 
       data hash MD5: 16K
       C6 7C 66 BD AE A6 66 05 1F 3C 94 43 4C 1B 8B E9>)
(   3,<2021-05-31 11:24:24.57 +0400>,<she>,<DPX200>,
      <pk PHC0 = -2.281918 PHC1 = 2.8 
       data hash MD5: 16K
       A6 D4 05 CA E3 82 55 59 99 B9 63 64 32 31 8F 65>)
(   4,<2021-05-31 11:24:28.01 +0400>,<she>,<DPX200>,
      <abs ABSG = 5 
       data hash MD5: 16K
       5C CD 2C 1A 0C 90 EE F2 91 C6 6C E7 30 C2 A0 65>)
$$ ##END=
$$ 
$$ hash MD5
$$ 00 B3 F0 9A 28 7F F8 BF 9C 3D E9 BE 86 5C 3E 74
##$RELAX= 
##$RELAX= 
##$RELAX= 
##$RELAX= 
##$RELAX= 
##$RELAX= 
$$ Bruker specific parameters
$$ --------------------------
##$DU= <F:/spectra>
##$EXPNO= 1
##$NAME= <H-F>
##$PROCNO= 1
##$TYPE= <nmr>
##$USER= <she>
##$AMP= (0..31)
100 100 100 100 100 100 100 100 100 100 100 100 100 100 100 100 100 100 
100 100 100 100 100 100 100 100 100 100 100 100 100 100 
##$AQSEQ= 0
##$AQ_mod= 1
##$AUNM= <au_zg>
##$AUTOPOS= <>
##$BF1= 200.13
##$BF2= 200.13
##$BF3= 200.13
##$BF4= 200.13
##$BF5= 200.13
##$BF6= 200.13
##$BF7= 200.13
##$BF8= 200.13
##$BYTORDA= 1
##$CFDGTYP= 0
##$CFRGTYP= 5
##$CHEMSTR= <none>
##$CNST= (0..31)
1 1 145 1 1 1 1 1 1 1 1 1 1 1 1 1 1 1 1 1 1 1 1 1 1 1 1 1 1 1 1 1 
##$CPDPRG= <>
##$CPDPRG1= <>
##$CPDPRG2= <>
##$CPDPRG3= <>
##$CPDPRG4= <mlev>
##$CPDPRG5= <mlev>
##$CPDPRG6= <mlev>
##$CPDPRG7= <mlev>
##$CPDPRG8= <mlev>
##$CPDPRGB= <>
##$CPDPRGT= <>
##$D= (0..31)
0 1.2 0 0 0 0 0 0 0 0.06 0 0.03 0 0 0 0 0.0002 0 0 0 0 0 0 0 0 0 0 0 0 
0 0 0 
##$DATE= 1622445844
##$DBL= (0..7)
120 120 120 120 120 120 120 120 
##$DBP= (0..7)
150 150 150 150 150 150 150 150 
##$DBP07= 0
##$DBPNAM0= <>
##$DBPNAM1= <>
##$DBPNAM2= <>
##$DBPNAM3= <>
##$DBPNAM4= <>
$$ [...]
##$SUBNAM3= <"">
##$SUBNAM4= <"">
##$SUBNAM5= <"">
##$SUBNAM6= <"">
##$SUBNAM7= <"">
##$SUBNAM8= <"">
##$SUBNAM9= <"">
##$SW= 16.9725357007746
##$SWIBOX= (0..15)
0 0 2 0 0 0 0 0 0 0 0 0 0 0 0 0 
##$SW_h= 3396.73913043478
##$TD= 16384
##$TD0= 1
##$TE= 0
##$TE2= 300
##$TE3= 300
##$TEG= 300
##$TL= (0..7)
0 120 120 120 120 120 120 120 
##$TP= (0..7)
150 150 150 150 150 150 150 150 
##$TP07= 0
##$TPNAME0= <>
##$TPNAME1= <>
##$TPNAME2= <>
##$TPNAME3= <>
##$TPNAME4= <>
##$TPNAME5= <>
##$TPNAME6= <>
##$TPNAME7= <>
##$TPOAL= (0..7)
0.5 0.5 0.5 0.5 0.5 0.5 0.5 0.5 
##$TPOFFS= (0..7)
0 0 0 0 0 0 0 0 
##$TUNHIN= 0
##$TUNHOUT= 0
##$TUNXOUT= 0
##$USERA1= <user>
##$USERA2= <user>
##$USERA3= <user>
##$USERA4= <user>
##$USERA5= <user>
##$V9= 5
##$VALIST= <valist>
##$VCLIST= <CCCCCCCCCCCCCCC>
##$VD= 0
##$VDLIST= <DDDDDDDDDDDDDDD>
##$VPLIST= <PPPPPPPPPPPPPPP>
##$VTLIST= <TTTTTTTTTTTTTTT>
##$WBST= 1024
##$WBSW= 4
##$XGAIN= (0..3)
0 0 0 0 
##$XL= 0
##$YL= 0
##$YMAX_a= 382575
##$YMIN_a= -427169
##$ZGOPTNS= <>
##$ZL1= 120
##$ZL2= 120
##$ZL3= 120
##$ZL4= 120
##$ABSF1= 15.98439
##$ABSF2= -0.9882736
##$ABSG= 5
##$ABSL= 3
##$ALPHA= 0
##$AQORDER= 0
##$ASSFAC= 0
##$ASSFACI= 0
##$ASSFACX= 0
##$ASSWID= 0
##$AUNMP= <proc_1d>
##$AZFE= 0.1
##$AZFW= 0.1
##$BCFW= 0
##$BC_mod= 2
##$BYTORDP= 0
##$COROFFS= 0
##$CY= -3
##$DATMOD= 1
##$DC= 0
##$DFILT= <>
##$DTYPP= 0
##$F1P= 0
##$F2P= 0
##$FCOR= 1
##$FTSIZE= 16384
##$FT_mod= 6
##$GAMMA= 0
##$GB= 0
##$INTBC= 1
##$INTSCL= 1.334414e-10
##$ISEN= 128
##$LB= 0.24
##$LEV0= 0
##$LPBIN= 0
##$MAXI= 10000
##$MC2= 0
##$MEAN= 0
##$ME_mod= 0
##$MI= 1.114404
##$NCOEF= 0
##$NC_proc= -6
##$NLEV= 6
##$NOISF1= 3.799351
##$NOISF2= 2.8
##$NSP= 0
##$NTH_PI= 0
##$NZP= 0
##$OFFSET= 15.97921
##$PC= 1
##$PHC0= -11120.87
##$PHC1= 11.60099
##$PH_mod= 1
##$PKNL= yes
##$PPARMOD= 0
##$PSCAL= 0
##$PSIGN= 0
##$REVERSE= no
##$SF= 200.13000645087
##$SI= 16384
##$SIGF1= 3
##$SIGF2= 2
##$SINO= 5.538805
##$SIOLD= 16384
##$SREGLST= <1H.CDCl3>
##$SSB= 0
##$STSI= 16384
##$STSR= 0
##$SW_p= 3396.73913043479
##$SYMM= 0
##$S_DEV= 0
##$TDeff= 16384
##$TDoff= 0
##$TI= <>
##$TILT= no
##$TM1= 0
##$TM2= 0
##$TOPLEV= 0
##$USERP1= <user>
##$USERP2= <user>
##$USERP3= <user>
##$USERP4= <user>
##$USERP5= <user>
##$WDW= 1
##$XDIM= 16384
##$YMAX_p= 313773845
##$YMIN_p= -548379
$$ End of Bruker specific parameters
$$ ---------------------------------
##NTUPLES= NMR SPECTRUM
##VAR_NAME=  FREQUENCY,     SPECTRUM/REAL,   SPECTRUM/IMAG
##SYMBOL=    X,             R,               I
##VAR_TYPE=  INDEPENDENT,   DEPENDENT,       DEPENDENT
##VAR_FORM=  AFFN,          ASDF,            ASDF
##VAR_DIM=   16384,         16384,           16384
##UNITS=     HZ,            ARBITRARY UNITS, ARBITRARY UNITS
##FACTOR=    0.207333158178282, 1,           1
##FIRST=     3197.91938034726, 0,            0
##LAST=      -198.819750087528, 0,           0
##MIN=       -198.819750087528, -548379,     0
##MAX=       3197.91938034726, 313773845,    0
$$ Real data points
##PAGE= N=1
##DATA TABLE= (X++(R..R)), XYDATA
$$ [...]
$$ plain form
4553 10257795 10375437 10446328 10324320 10329138 10221534 9970463 10032006 9686069 9272121 9310387
4543 9310387 9279813 9107644 9191548 9075451 8948981 8907335 8648424 8193355 8433993 8473007
4533 8473007 8527772 8447818 8625695 8811160 8791052 8373599 8094597 7938840 7895498 8168266
4523 8168266 8010774 7961131 8109451 8003599 7794331 7563755 7188626 7244956 7448791 7573984
4513 7573984 7475451 7544842 7730026 7715150 7478030 7535192 7577211 7508380 7567289 7661528 7635513
4502 7635513 7896026 7938623 7714031 7873465 7689738 7560260 7621344 7551265 7399495 7535059
4492 7535059 7954589 7998218 8019404 7942445 7900276 7841442 7911085 7757292 7961434 8042256 7976658
4481 7976658 8044536 8110746 8017642 8008895 8045419 8271409 8466358 8289156 8458585 8653423 8601610
$$ packed form
4553A0257795J17642P0891j22008M818j07604k51071O1543l45937m13948L8266
4543I310387l0574j72169Q3904j16097j26470m1646k58911m55069K40638L9014
4533H473007N4765p9954J77877J85465k0108m17453k79002j55757m3342K72768
4523H168266j57492m9643J48320j05852k09268k30576l75129N6330K03835J25193
4513G573984r8533O9391J85184j4876k37120N7162M2019o8831N8909R4239k6015
4502G635513K60513M2597k24592J59434j83727j29478O1084p0079j51770J35564
4492G535059M19530M3629K1186p6959m2169n8834O9643j53793K04142Q0822o5598
4481G976658O7878O6210r3104q747L6524K25990J94949j77202J69429J94838n1813
$$ plain form
4470 8601610 8454939 8740876 9031978 9086788 8853564 8616135 8944201 9093958 8831578 8860149
4460 8860149 9064650 9139084 9120571 8985337 9013704 9018662 9098363 9302384 9444517 9539814 9452231
4449 9452231 9142302 9271618 9469083 9500768 9548764 9576407 9669036 9627859 9551307 9653972 9760477
4438 9760477 9982370 10252391 10184455 10255680 10174123 9893594 9766751 10167710 10474400 10517450
4428 10517450 10605338 10690817 10927097 10958552 10772640 10574168 10752191 10921774 10721804 10705432
4418 10705432 11020982 11028602 11071965 11260333 11148452 11061749 11219549 11200450 11427826 11615019
4408 11615019 11895053 12121138 12310404 12370217 12491351 12710448 12625684 12987622 12884484 13070514
4398 13070514 13413810 13563941 13842119 14144886 14320318 14537208 15111504 15389813 15795123
$$ packed form
4470H601610j46671K85937K91102N4810k33224k37429L28066J49757k62380K8571
4460H860149K04501P4434j8513j35234K8367M958P9701K04021J42133R5297q7583
4449I452231l09929J29316J97465L1685M7996K7643R2629m1177p6552J02665J06505
4438I760477K21893K70021o7936P1225q1557k80529j26843M00959L06690M3050
4428A0517450Q7888Q5479K36280L1455j85912j98472J78023J69583j99970j6372
4418A0705432L15550P620M3363J88368j11881q6703J57800j9099K27376J87193
4408A1615019K80034K26085J89266N9813J21134K19097q4764L61938j03138J86030
4398A3070514L43296J50131K78178L02767J75432K16890N74296K78309M05310
$$ plain form
4389 15795123 16277844 16794847 17412914 18441399 19242090 20135226 21064165 21975916 22847306
4380 22847306 23619395 24596073 25734418 26883919 27888801 28715127 29425577 29720328 29621293
4371 29621293 29170463 28790136 28378708 27410761 26194327 25027342 24228998 23686088 23603545
4362 23603545 23156996 23060191 23434693 23389041 23469753 23598834 23632763 24218382 24709022 25157973
4352 25157973 25671026 25756920 25852525 25875966 25592989 25169504 24763325 24473088 24170953 23896661
4342 23896661 23395414 22786836 21829586 21089147 20214311 19387113 18478135 17856165 17136660
4333 17136660 16636176 16235454 16012772 15650374 15225200 14940655 14716446 14635224 14578785 14412438
4323 14412438 14307460 14061616 13746013 13776987 13515927 13331715 13249153 12996084 12667910 12759625
$$ packed form
4389A5795123M82721N17003O18067J028485Q00691Q93136R28939R11751Q71390
4380B2847306P72089R76678J138345J149501J004882Q26326P10450K94751r9035
4371B9621293m50830l80327m11428r67947j216434j166985p98344n42910q2543
4362B3603545m46549r6805L74502m5652Q0712J29081L3929N85619M90640M48951
4352B5157973N13053Q5894R5605K3441k82977m23485m06179k90237l02135k74292
4342B3896661n01247o08578r57250p40439q74836q27198r08978o21970p19505
4333A7136660n00484m00722k22682l62398m25174k84545k24209q1222n6439j66347
4323A4412438j04978k45844l15603L0974k61060j84212q2562k53069l28174R1715
$$ plain form
4313 12759625 12388094 12141732 11932698 11617527 11868438 11841364 11503369 11507340 11401540 11332318
4303 11332318 11328234 11242812 11163917 11223825 11463975 11373881 11405721 11379828 11137975 11012702 10966126
4292 10966126 10935213 10998618 11117558 11117082 11133342 11072788 11030838 11042826 10675806 10629551 10803452
4281 10803452 10774821 10722774 10592778 10642344 10574495 10449001 10231408 10163996 10207210 10025029
4271 10025029 9938481 10139724 9998112 9928503 10088662 9990009 9922079 9902025 9767711 9694438
4261 9694438 9660419 9810511 9853995 9803611 9700737 9717483 9752464 9731986 9751319 9578872 9505040
4250 9505040 9702768 9709773 9555047 9403235 9467772 9702263 9755406 9671527 9447347 9580982
4240 9580982 9627458 9319875 9292320 9411455 9353115 9324728 9274657 9324446 9418033 9324317 9408412
$$ packed form
4313A2759625l71531k46362k09034l15171K50911k7074l37995L971j05800o9222
4303A1332318m084q5422p8895N9908K40150r0094L1840k5893k41853j25273m6576
4292A0966126l0913O3405J18940m76J6260o0554m1950J1988l67020m6255J73901
4281A0803452k8631n2047j29996M9566o7849j25494k17593o7412M3214j82181
4271A0025029q6548K01243j41612o9609J60159r8653o7930k0054j34314p3273
4261I694438l4019J50092M3484n0384j02874J6746L4981k0478J9333j72447p3832
4250I505040J97728P005j54726j51812O4537K34491N3143q3879k24180J33635
4240I580982M6476l07583k7555J19135n8340k8387n0071M9789R3587r3716Q4095
$$ plain form
4229 9408412 9557988 9572323 9474272 9383437 9363611 9361627 9264209 9196596 9416710 9332225 9319045
4218 9319045 9441938 9395514 9324751 9191174 9304156 9507536 9530966 9324946 9438203 9581044
4208 9581044 9594726 9532434 9484965 9375129 9436065 9345170 9446853 9606599 9756765 9681177 9633916
4197 9633916 9557243 9564636 9526208 9457959 9554046 9593488 9449878 9641752 9815325 9688224 9648194
4186 9648194 9549964 9582496 9839358 9918521 9737374 9814182 9752101 9411521 9555444 9896277
4176 9896277 9860763 9744911 9811200 9869365 9869223 9746206 9668608 9764996 9766442 9905851 9961667
4165 9961667 9894672 9963953 10108695 10093577 10265179 10231960 9828327 9734836 9906137 9925710 9891121
4154 9891121 9777501 9703345 10176546 10310796 10013130 10179904 10180674 10223910 10184395 10060687 9946010
$$ packed form
4229I408412J49576J4335r8051r0835j9826j984r7418o7613K20114q4485j3180
4218I319045J22893m6424p0763j33577J12982K03380K3430k06020J13257J42841
4208I581044J3682o2292m7469j09836O0936r0895J01683J59746J50166p5588m7261
4197I633916p6673P393l8428o8249R6087L9442j43610J91874J73573j27101m0030
4186I648194r8230L2532K56862P9163j81147P6808o2081l40580J43923L40833
4176I896277l5514j15852O6289N8165j42j23017p7598R6388J446J39409N5816
4165I961667o6995O9281J44742j5118J71602l3219m03633r3491J71301J9573l4589
4154I891121j13620p4156M73201J34250k97666J66774P70M3236l9515j23708j14677
$$ plain form
4143 9946010 10262772 10284283 10280899 10366111 10454156 10306970 10186437 10087873 10169615 10221476 10134584
4132 10134584 10216753 10199756 10009595 10205846 10299272 10189554 10242532 10199516 10222028 10380305
4122 10380305 10297010 10142756 10278581 10217153 9919822 10151143 10260121 10301478 10448216 10480300
4112 10480300 10442713 10294588 10116766 9992002 10146091 10119864 10241639 10466070 10551179 10597215
4102 10597215 10302914 10082925 10270225 10130278 10032478 10117577 10312508 10268259 10337565 10347296
4092 10347296 10399951 10437216 10343984 10148666 10354962 10254061 10169048 10301443 10335591 10342501 10068118
4081 10068118 10102897 10162752 10217122 10037038 10060082 10171492 10329490 10348015 10174357 9950876
4071 9950876 10022921 9912148 10114569 10607066 10559695 10363923 10208604 10096225 10169759 10253449
$$ packed form
4143I946010L16762K1511l384Q5212Q8045j47186j20533r8564Q1742N1861q6892
4132A0134584Q2169j6997j90161J96251R3426j09718N2978m3016K2512J58277
4122A0380305q3295j54254J35825o1428k97331K31321J08978M1357J46738L2084
4112A0480300l7587j48125j77822j24764J54089k6227J21775K24431Q5109M6036
4102A0597215k94301k19989J87300j39947r7800Q5099J94931m4249O9306R731
4092A0347296N2655L7265r3232j95318K06296j00901q5013J32395L4148O910k74383
4081A0068118L4779N9855N4370j80084K3044J11410J57998J8525j73658k23481
4071I950876P2045j10773K02421M92497m7371j95772j55319j12379P3534Q3690
$$ plain form
4061 10253449 9979750 9956672 10126461 10393938 10502407 10527166 10403991 10362379 10439917 10210271
4051 10210271 10120055 10051303 10166732 10325939 10375791 10356610 10412206 10330166 10337371 10380900 10371745
4040 10371745 10228220 10278867 10297425 10234332 10476561 10534311 10457093 10271161 10131772 10062980
4030 10062980 10180567 10111867 10090829 10187646 10195955 9905668 9773883 9746603 9765906 9805732 9861204
4019 9861204 9833710 9735626 9695971 9636562 9528213 9499730 9616630 9595333 9684848 9574024 9431526
4008 9431526 9448675 9248274 9181638 9078748 9124628 9064753 9060624 8981115 9254385 9369425 9359761
3997 9359761 9103866 8986781 8852540 8717874 8685137 8850629 9174358 9297575 9125697 9076673
3987 9076673 9085941 9034933 8975103 8984375 9017656 8794305 8961968 9006576 8984829 8952472 8909576
$$ packed form
4061A0253449k73699k3078J69789K67477J08469K4759j23175m1612P7538k29646
4051A0210271r0216o8752J15429J59207M9852j9181N5596q2040P205M3529r155
4040A0371745j43525N0647J8558o3093K42229N7750p7218j85932j39389o8792
4030A0062980J17587o8700k1038R6817Q309k90287j31785k7280J9303L9826N5472
4019I861204k7494r8084l9655n9409j08349k8483J16900k1297Q9515j10824j42498
4008I431526J7149k00401o6636j02890M5880n9875m129p9509K73270J15040r664
3997I359761k55895j17085j34241j34666l2737J65492L23729J23217j71878m9024
3987I076673R268n1008n9830R272L3281k23351J67663M4608k1747l2357m2896
$$ plain form
3976 8909576 8898157 8984329 8782214 8732261 8737368 8762203 8793976 8724045 8841315 8881998 8734356
3965 8734356 8609586 8554186 8414182 8489604 8473437 8464483 8568891 8599393 8520611 8476435 8314783
3954 8314783 8207371 8289389 8156201 8227304 8282308 8325334 7947006 8022726 7943716 7883852 7892246
3943 7892246 7893244 7703068 7720013 7736661 7743812 7827543 7826615 7802189 7528762 7410382 7439584 7394386
3931 7394386 7318880 7287558 7367666 7362555 7191237 7170474 6946620 6853895 6856593 6940970 7090142
3920 7090142 7079774 7014737 6959774 6832450 6583185 6560949 6749452 6902704 7040158 7070313
3910 7070313 7006654 6801716 6697839 6482571 6398598 6653818 6591964 6401643 6371899 6580512
3900 6580512 6747031 6722822 6704013 6629333 6684559 6430265 6301210 6368486 6611831 6507046
$$ packed form
3976H909576j1419Q6172k02115m9953N107K4835L1773o9931J17270M0683j47642
3965H734356j24770n5400j40004P5422j6167q954J04408L0502p8782m4176j61652
3954H314783j07412Q2018j33188P1103N5004M3026l78328P5720p9010n9864Q394
3943G892246R98j90176J6945J6648P151Q3731r28k4426k73427j18380K9202m5198
3931G394386p5506l1322Q0108n111j71318k0763k23854r2725K698Q4377J49172
3920G090142j0368o5037n4963j27324k49265k2236J88503J53252J37454L0155
3910G070313o3659k04938j03877k15268q3973K55220o1854j90321k9744K08613
3900F580512J66519k4209j8809p4680N5226k54294j29055O7276K43345j04785
$$ plain form
3890 6507046 6334589 6395540 6461749 6406246 6465757 6444239 6625070 6774192 6808517 6688723 6461147
3879 6461147 6583920 6568042 6605968 6630627 6611987 6728197 6755009 6658644 6527539 6461964 6473564
3868 6473564 6513919 6434296 6437481 6313539 6262550 6392914 6307108 6489014 6622628 6581313 6348814
3857 6348814 6388416 6146823 5999749 6125449 6240611 6090300 6353295 6404651 6147739 6003884
3847 6003884 5975661 6019958 5979025 5836476 5728458 5816321 5971839 6042888 6004089 6000176 5925081
3836 5925081 5953698 5761355 5554307 5372437 5428138 5864231 6129303 6121818 6164958 5968212
3826 5968212 5662978 5739006 5526469 5532878 5739920 5981189 5817612 5720868 5950980 6149971
3816 6149971 5926800 5869826 5926673 5899424 5863689 5780286 5861712 5755279 6157917 6081030 5904944
$$ packed form
3890F507046j72457O0951O6209n5503N9511k1518J80831J49122L4325j19794k27576
3879F461147J22773j5878L7926K4659j8640J16210K6812r6365j31105o5575J1600
3868F473564M0355p9623L185j23942n0989J30364q5806J81906J33614m1315k32499
3857F348814L9602k41593j47074J25700J15162j50311K62995N1356k56912j43855
3847F003884k8223M4297m0933j42549j08018Q7863J55518P1049l8799l913p5095
3836E925081K8617j92343k07048j81870N5701M36093K65072p485M3140j96746
3826E968212l05234P6028k12537O409K07042K41269j63577r6744K30112J98991
3816F149971k23171n6974N6847k7249l5735q3403Q1426j06433M02638p6887j76086
$$ plain form
3805 5904944 6061573 6173775 5981555 6024960 5909307 6067725 6301085 6238065 6236323 6523419
3795 6523419 6591754 6376298 6282609 6361677 6238433 6096928 6051705 6044400 5999599 6162553 6435163
3784 6435163 6516018 6464190 6275143 6026551 5955471 6095826 6055714 6116122 6292785 6443065
3774 6443065 6465083 6355917 6261687 6277884 6373232 6305065 6353127 6588089 6810088 6929740 7029788
3763 7029788 7016415 6995490 7221788 7165446 6966711 6884855 7207873 7383333 7135531 7181094
3753 7181094 7499513 7700021 7771324 7698681 7543077 7731687 7894110 7929794 7913976 8183911
3743 8183911 8178105 8206960 8460547 8721049 8923740 9300366 9724647 9916989 10116456 10352390
3733 10352390 10624891 11001291 11517207 11960405 12512407 13056374 13546644 14030667 14915953
$$ packed form
3805E904944J56629J12202j92220M3405j15653J58418K33360o3020j742K87096
3795F523419O8335k15456r3689P9068j23244j41505m5223p305m4801J62954K72610
3784F435163Q0855n1828j89047k48592p1080J40355m0112O0408J76663J50280
3774F443065K2018j09166r4230J6197R5348o8167M8062K34962K21999J19652J00048
3763G029788j3373k0925K26298n6342j98735q1856L23018J75460k47802M5563
3753G181094L18419K00508P1303p2643j55604J88610J62423L5684j5818K69935
3743H183911n806K8855K53587K60502K02691L76626M24281J92342J99467K35934
3733A0352390K72501L76400N15916M43198N52002N43967M90270M84023Q85286
$$ plain form
3724 14915953 15584514 16214178 16931672 17550936 17449529 17213073 16994607 16582079 16065203
3715 16065203 15868657 15585808 15193894 15149244 14918628 14840665 14852641 15108481 15604185 16056137
3705 16056137 16497918 16825115 17513488 18270160 18347096 17970685 17607910 16785123 15852213 15126868
3695 15126868 14511774 13915002 13649053 13369338 12979485 12794487 12589536 12187430 12285877 12410884
3685 12410884 12200407 12328377 12610934 12803412 12943335 13348429 13526472 13919290 14215463
3676 14215463 14666628 15216248 15894741 16457046 17170520 18038331 19099836 19944218 20959735
3667 20959735 22233143 23490371 24708351 25970142 26890389 27359742 27639237 27296360 26331354
3658 26331354 25099977 24072251 23278233 22884389 22705763 22431144 22236514 22560905 22712661
$$ packed form
3724A4915953O68561O29664P17494O19264j01407k36456k18466m12528n16876
3715A6065203j96546k82849l91914m4650k30616p7963J1976K55840M95704M51952
3705A6056137M41781L27197O88373P56672P6936l76411l62775q22787r32910p25345
3695A5126868o15094n96772k65949k79715l89853j84998k04951m02106R8447J25007
3685A2410884k10477J27970K82557J92478J39923M05094J78043L92818K96173
3676A4215463M51165N49620O78493N62305P13474Q67811J061505Q44382J015517
3667B0959735J273408J257228J217980J261791R20247M69353K79495l42877r65006
3658B6331354j231377j027726p94018l93844j78626k74619j94630L24391J51756
$$ plain form
3649 22712661 22947027 23591263 24312534 24870406 25471156 25980826 26265485 26050344 25227262
3640 25227262 23714684 22369402 20943022 19516172 18255353 17321917 16484147 15787538 15153473
3631 15153473 14289927 13542607 13323754 13142493 12663378 12218999 12080646 11921720 11563153
3622 11563153 11340874 11096090 10827107 10688460 10559310 10296158 10238440 10219161 9957901 9837209
3612 9837209 9868495 9507328 9548758 9642091 9531641 9433609 9640416 9600715 9568751 9753053 9516586
3601 9516586 9304767 9254529 9224232 9117319 9154724 9277200 9331436 9376853 9590734 9537721 9576727
3590 9576727 9640395 9653397 9622117 9595120 9743362 9804334 9930195 10070660 10269871 10392155
3580 10392155 10504655 10509598 10514716 10695290 10890511 10919226 11242848 11489297 11655428 12008175
$$ packed form
3649B2712661K34366O44236P21271N57872O00750N09670K84659k15141q23082
3640B5227262j512578j345282j426380j426850j260819r33436q37770o96609o34065
3631A5153473q63546p47320k18853j81261m79115m44379j38353j58926l58567
3622A1563153k22279k44784k68983j38647j29150k63152n7718j9279k61260j20692
3612I837209L1286l61167M1430R3333j10450r8032K06807l9701l1964J84302k36467
3601I516586k11819n0238l0297j06913L7405J22476N4236M5417K13881n3013L9006
3590I576727O3668J3002l1280k6997J48242O0972J25861J40465J99211J22284
3580A0392155J12500M943N118J80574J95221K8715L23622K46449J66131L52747
$$ plain form
3570 12008175 12151918 12247464 12908656 13312123 13401290 14087326 14789597 15119572 15657163 16350123
3560 16350123 16901812 17721261 18389018 18674082 18959342 19099557 18883168 18343730 17660804
3551 17660804 16869068 16279547 15721869 15384650 15064230 14701434 14627134 14467349 14257063 14396596
3541 14396596 14330719 14270291 14661066 15034630 14989247 15328208 15850967 16148822 16950941 17795524
3531 17795524 18221775 18857581 19987385 20839530 21528310 22445309 23354187 24076916 24423127
3522 24423127 24569487 24643977 24726243 24506136 24026694 23423223 22785420 21901389 20918520 20268488
3512 20268488 19710444 19485138 19272914 18826376 18316128 18329834 18335867 18241423 18653874 19334610
3502 19334610 19809971 20255877 20594829 20751810 20877440 21272562 21387529 21613427 22186890
$$ packed form
3570A2008175J43743R5546O61192M03467Q9167O86036P02271L29975N37591O92960
3560A6350123N51689Q19449O67757K85064K85260J40215k16389n39438o82926
3551A7660804p91736n89521n57678l37219l20420l62796p4300j59785k10286J39533
3541A4396596o5877o0428L90775L73564m5383L38961N22759K97855Q02119Q44583
3531A7795524M26251O35806J129804Q52145O88780R16999R08878P22729L46211
3522B4423127J46360P4490Q2266k20107m79442o03471o37803q84031r82869o50032
3512B0268488n58044k25306k12224m46538n10248J3706O033r4444M12451O80736
3502A9334610M75361M45906L38952J56981J25630L95122J14967K25898N73463
$$ plain form
3493 22186890 22585411 22739873 23281397 24080976 24677183 24763824 24335227 23688044 22647684
3484 22647684 21089304 19378157 18362294 17691625 17256142 16635943 16396717 16155819 16112091
3475 16112091 16183888 16124148 15969303 16154240 16544774 16602525 16872108 17351688 17655644 17818151
3465 17818151 17865381 17733433 17742470 17455678 16768973 16543007 16437843 15943717 15490140 14797168
3455 14797168 14181342 13731143 13273628 12893546 12632943 12683596 12704287 12304015 12015529 11974362
3445 11974362 11583608 11319417 11324037 11250677 11091762 11236896 11319811 11250915 11470577 11626496
3435 11626496 11871712 11893316 12148861 12399003 12800308 12728053 12879538 12858080 12667317 12277946
3425 12277946 11942920 11792350 11593561 11458338 11121695 11114740 11086370 10937594 10779671 10839650
$$ packed form
3493B2186890L98521J54462N41524P99579N96207Q6641m28597o47183j040360
3484B2647684j558380j711147j015863o70669m35483o20199k39226k40898m3728
3475A6112091P1797n9740j54845J84937L90534N7751K69583M79580L03956J62507
3465A7818151M7230j31948R037k86792o86705k25966j05164m94126m53577o92972
3455A4797168o15826m50199m57515l80082k60603N0653K0691m00272k88486m1167
3445A1974362l90754k64191M620p3360j58915J45134Q2915o8896K19662J55919
3435A1626496K45216K1604K55545K50142M01305p2255J51485k1458j90763l89371
3425A2277946l35026j50570j98789j35223l36643o955k8370j48776j57923N9979
$$ plain form
3415 10839650 10754747 10733636 10967067 10948112 11125412 11253579 11057200 11106147 11207739 11170201
3405 11170201 11149800 11114798 11046074 11128776 11301595 11473290 11473640 11455539 11446080 11476568 11614886
3394 11614886 11597566 11778582 11986547 12099298 12420162 12605061 12727906 12896878 13351736 13858282
3384 13858282 14447915 14755289 15206436 15867300 16400679 16497109 16638533 16540232 16273104 16025018
3374 16025018 15713922 15529498 15284154 15404919 15226513 15342014 15598091 15369161 15411648 15652625
3364 15652625 16052816 16625332 17014921 17193051 17225860 17040141 16366480 15715628 14908174 14349791
3354 14349791 13881303 13431614 12976971 12683966 12629005 12527004 12433205 12044253 12172153 12293624
3344 12293624 12108765 11826932 11805898 12061049 12315445 12133826 12006731 12163070 12394682 12201858
$$ packed form
3415A0839650q4903k1111K33431j8955J77300J28167j96379M8947J01592l7538
3405A1170201k0401l5002o8724Q2702J72819J71695L50j8101r459L0488J38318
3394A1614886j7320J81016K07965J12751L20864J84899J22845J68972M54858N06546
3384A3858282N89633L07374M51147O60864N33379R6430J41424r8301k67128k48086
3374A6025018l11096j84424k45344J20765j78406J15501K56077k28930M2487K40977
3364A5652625M00191N72516L89589J78130L2809j85719o73661o50852q07454n58383
3354A4349791m68488m49689m54643k93005n4961j02001r3799l88952J27900J21471
3344A2293624j84859k81833k1034K55151K54396j81619j27095J56339K31612j92824
$$ plain form
3334 12201858 12085299 12127470 12202307 12262277 12185054 12369973 12591404 12659832 12755420 12724875 12745888
3323 12745888 13092721 13232370 13124730 13264497 13580224 13699656 13868782 14168641 14244485 14258531
3313 14258531 14499710 14387805 14373714 14617114 14579862 14967758 15298113 15439145 15694761 15760948
3303 15760948 15966515 16478332 16938428 17322160 18040850 18769670 19577288 19984714 20017918 19741391
3293 19741391 19146773 18272591 17523783 16927967 16265458 15778496 15528828 15401481 15614745
3284 15614745 15959193 15949504 16201549 16318621 16370567 16547410 16414509 16173749 16197586 16220063
3274 16220063 16228603 16069479 16151190 16491534 16769007 16689943 16777206 17007459 16898362 16693035
3264 16693035 16361611 16282903 16352512 16293772 16023198 16018811 16042805 15973364 16000417 16358407 16584287
$$ packed form
3334A2201858j16559M2171P4837N9970p7223J84919K21431O8428R5588l0545K1013
3323A2745888L46833J39649j07640J39767L15727J19432J69126K99859P5844J4046
3313A4258531K41179j11905j4091K43400l7252L87896L30355J41032K55616O6187
3303A5760948K05567N11817M60096L83732P18690P28820Q07618M07426L3204k76527
3293A9741391n94618q74182p48808n95816o62509m86962k49668j27347K13264
3284A5614745L44448r689K52045J17072N1946J76843j32901k40760K3837K2477
3274A6220063Q540j59124Q1711L40344K77473p9064Q7263K30253j09097k05327
3264A6693035l31424p8708O9609n8740k70574m387K3994o9441K7053L57990K25880
$$ plain form
3253 16584287 17100467 17485857 17560245 18000174 18265717 18574593 18953811 19471596 19945994 20416983
3243 20416983 20519563 20022368 19355995 18535217 17659006 16921505 16300228 16009761 15797537
3234 15797537 15529773 15656063 15533050 15380334 15339162 15319794 15350297 15487879 15453253 15378740
3224 15378740 15383295 15512676 15643760 15747491 15802212 15838165 16004933 16303167 16624134 16912374
3214 16912374 17133060 17098146 17379280 17361221 17630498 18081734 18513020 18808696 19024606 19570207
3204 19570207 19923923 19998345 20169727 20764797 21084815 21477351 22047193 22804253 23308396 24150877
3194 24150877 24877765 25622201 26529445 26880140 26900566 26745437 26349511 25579450 24647188 24015167
3184 24015167 23858937 23802301 23608377 23496990 23621450 24180772 24608542 24862484 25468470 26002700
$$ packed form
3253A6584287N16180L85390P4388M39929K65543L08876L79218N17785M74398M70989
3243B0416983J02580m97195o66373q20778q76211p37501o21277k90467k12224
3234A5797537k67764J26290j23013j52716m1172j9368L0503J37582l4626p4513
3224A5378740M555J29381J31084J03731N4721L5953J66768K98234L20967K88240
3214A6912374K20686l4914K81134j8059K69277M51236M31286K95676K15910N45601
3204A9570207L53716P4422J71382N95070L20018L92536N69842P57060N04143Q42481
3194B4150877P26888P44436R07244L50695K0426j55129l95926p70061r32262o32021
3184B4015167j56230n6636j93924j11387J24460N59322M27770K53942O05986N34230
$$ plain form
3174 26002700 26515277 27226249 28051644 28701208 29666646 30686389 31779511 32789525 34035441
3165 34035441 35748749 37466854 39305780 41650945 44338945 47261381 50463642 53750351
3157 53750351 57803805 62516881 67631493 73226182 79718005 87277725 95816731 105470971
3149 105470971 115765895 126404021 135830203 141806457 142621145 137503233 126661569 112694868
3141 112694868 98641211 86283330 76310465 68562323 62163520 56756556 52350399 48756523
3133 48756523 45555142 42945510 40482296 38616843 37018058 35530382 34342901 33277886
3125 33277886 32181574 31323207 30661539 30140644 29784808 29310150 29331503 29349057 29074326 28657022
3115 28657022 28082174 27188204 26173131 25128617 24178886 23427377 23286698 22950197 22591417
$$ packed form
3174B6002700N12577P10972Q25395O49564R65438J019743J093122J010014J245916
3165C4035441J713308J718105J838926K345165K688000K922436L202261L286709
3157E3750351M053454M713076N114612N594689O491823P559720Q539006R654240
3149A05470971J0294924J0638126R426182N976254Q14688n117912j0841664j3966701
3141A12694868j4053657j2357881r972865p748142o398803n406964m406157l593876
3133D8756523l201381k609632k463214j865453j598785j487676j187481j065015
3125C3277886j096312q58367o61668n20895l55836m74658K1353J7554k74731m17304
3115B8657022n74848q93970j015073j044514r49731p51509j40679l36501l58780
$$ plain form
3106 22591417 22375585 22435118 22339563 22216922 22168413 22061442 22024619 22006057 21910383 21789527
3096 21789527 21484185 21324916 21147640 21063012 21013168 21073945 21277755 21609941 21766664 22167189
3086 22167189 22647858 22825243 23080319 23583708 23945091 24396609 25157641 25921380 27151340
3077 27151340 28107028 28786169 29075736 28487742 26814715 24937314 23389724 22657346 22011338
3068 22011338 21560081 21186039 20713935 20334207 19851957 19313705 19039225 18798691 18653283
3059 18653283 18511023 18531044 18633680 18655832 18546442 18589590 18667566 18715960 18839348 19154662
3049 19154662 19255568 19656635 19726895 19814262 20140398 20402997 20442795 20768485 21086839 21381163
3039 21381163 21924024 22234217 22692581 23229228 23774681 24148133 24829578 25266676 25782917
$$ packed form
3106B2591417k15832N9533r5555j22641m8509j06971l6823j8562r5674j20856
3096B1789527l05342j59269j77276q4628m9844O0777K03810L32186J56723M00525
3086B2167189M80669J77385K55076N03389L61383M51518P61032P63739J229960
3077B7151340R55688O79141K89567n87994j673027j877401j547590p32378o46008
3068B2011338m51257l74042m72104l79728m82250n38252k74480k40534j45408
3059A8653283j42260K0021J02636K2152j09390M3148P7976M8394J23388L15314
3049A9154662J00906M01067P0260Q7367L26136K62599L9798L25690L18354K94324
3039B1381163N42861L10193M58364N36647N45453L73452O81445M37098N16241
$$ plain form
3030 25782917 26161735 26600125 27069781 27705801 28207595 28530491 28820518 29367632 29944564
3021 29944564 30529223 30997358 31723999 32202689 32353457 32550072 33076936 33492930 34017904
3012 34017904 34299812 34383370 34697409 34956219 35114231 35080280 34960813 35070045 35305453 35237238
3002 35237238 35195389 35094842 35049450 35141227 35336499 35108791 34945287 34707466 34158898 33680627
2992 33680627 33273480 32734678 32174329 31882791 31733945 31314223 30767346 30072977 29668064
2983 29668064 29449641 29072803 28443371 27816932 27277530 26547260 25977846 25383999 24624610
2974 24624610 23897358 23201208 22531415 22019397 21542779 21233775 20594186 19986366 19495423
2965 19495423 18659879 17848181 17132259 16651185 16424346 16169917 15806485 15549035 15406741
$$ packed form
3030B5782917L78818M38390M69656O36020N01794L22896K90027N47114N76932
3021B9944564N84659M68135P26641M78690J50768J96615N26864M15994N24974
3012C4017904K81908Q3558L14039K58810J58012l3951j19467J09232K35408o8215
3002C5237238m1849j00547m5392R1777J95272k27708j63504k37821n48568m78271
2992C3680627m07147n38802n60349k91538j48846m19722n46877o94369m04913
2983B9668064k18423l76838o29432o26439n39402p30270n69414n93847p59389
2974B4624610p27252o96150o69793n12018m76618l09004o39589o07820m90943
2965A9495423q35544q11698p15922m81074k26839k54429l63432k57450j42294
$$ plain form
2956 15406741 14860346 14307631 13722247 13354254 13162806 12847947 12615939 12482755 12257032
2947 12257032 11800563 11375056 11298257 11102317 10698819 10435825 10184837 9965483 9810869 9750301
2937 9750301 9560124 9283291 9079915 8817966 8599309 8489216 8451837 8295582 8287178 8232607
2927 8232607 7910675 7835637 7809750 7600983 7371567 7476824 7359223 7455809 7484940 7312856
2917 7312856 7204738 7085244 6894810 6880846 6980957 6915979 6850614 7076877 7150641 7178957
2907 7178957 7131350 7184629 7293849 7235261 7123888 6837914 6541740 6478478 6479981 6243766 6147635
2896 6147635 6028614 5703616 5518044 5558146 5264380 5129063 5267902 5222549 5278455 5563861
2886 5563861 5415918 5206772 5262194 5135803 4990523 4916029 4838294 4757161 4578369 4387839
$$ packed form
2956A5406741n46395n52715n85384l67993j91448l14859k32008j33184k25723
2947A2257032m56469m25507p6799j95940m03498k62994k50988k19354j54614o0568
2937I750301j90177k76833k03376k61949k18657j10093l7379j56255q404n4571
2927H232607l21932p5038k5887k08767k29416J05257j17601R6586K9131j72084
2917G312856j08118j19494j90434j3964J00111o4978o5365K26263P3764K8316
2907G178957m7607N3279J09220n8588j11373k85974k96174o3262J503k36215r6131
2896F147635j19021l24998j85572M0102k93766j35317J38839m5353N5906K85406
2886E563861j47943k09146N5422j26391j45280p4494p7735q1133j78792j90530
$$ plain form
2876 4387839 4404567 4337694 4421191 4522033 4340482 4214901 4090599 3747352 3675802 3903545
2866 3903545 3667057 3601798 3941195 3939418 3924487 3783404 3750565 3793071 3873514 3853654 3722877
2855 3722877 3936706 3825128 3673296 3856052 4171424 4294351 4241489 4360160 4277497 4247247
2845 4247247 4094062 4087460 4130419 4336443 4659317 4541037 4596598 4553911 4568016 4614770 4640721
2834 4640721 4502866 4383780 4305861 3934851 3861100 4011095 3853850 3730375 3524011 3440186
2824 3440186 3496551 3571647 3424021 3293626 3413070 3580537 3381778 3114776 3124721 3069473
2814 3069473 3097847 3205710 3099433 3155417 3217820 3270131 2865465 2882075 3183834 3031845
2804 3031845 3036163 3043608 3152672 3152246 3052951 2600755 2639068 2814055 2790073 2644211 2752045
$$ packed form
2876D387839J6728o6873Q3497J00842j81551j25581j24302l43247p1550K27743
2866C903545k36488o5259L39397j777j4931j41083l2839M2506Q0443j9860j30777
2855C722877K13829j11578j51832J82756L15372J22927n2862J18671q2663l0250
2845D247247j53185o602M2959K06024L22874j18280N5561m2687J4105M6754K5951
2834D640721j37855j19086p7919l71010p3751J49995j57245j23475k06364q3825
2824C440186N6365P5096j47626j30395J19444J67467j98759k67002R945n5248
2814C069473K8374J07863j06277N5984O2403N2311m04666J6610L01759j51989
2804C031845M318P445J09064m26r9295m52196L8313J74987k3982j45862J07834
$$ plain form
2793 2752045 2880030 2795123 2550203 2577458 2693029 2722814 2756464 2761521 2574392 2567626 2651879
2782 2651879 2603066 2745156 2710777 2653839 2703995 2654037 2428934 2361102 2434963 2363983 2661357
2771 2661357 2689973 2445118 2412150 2519006 2425399 2442966 2715712 2644149 2796512 2593374
2761 2593374 2415938 2315562 2543850 2563510 2447162 2539018 2819786 3040330 2949889 2772324
2751 2772324 2597925 2540817 2575330 2735123 2565181 2321682 2606030 2611448 2654126 2726286 2781694
2740 2781694 2822811 2830135 2602709 2662253 2974960 2869029 2817386 2952630 3072693 2996235 2933820
2729 2933820 2714299 2735491 3045436 3105273 2884807 2620577 2544701 2493506 2433069 2438065 2573334
2718 2573334 2666445 2704978 2679542 2342489 2162453 2444531 2490329 2254051 2382746 2458076
$$ packed form
2793B752045J27985q4907k44920K7255J15571K9785L3650N057j87129o766Q4253
2782B651879m8813J42090l4379n6938N0156m9958k25103o7832P3861p0980K97374
2771B661357K8616k44855l2968J06856r3607J7567K72746p1563J52363k03138
2761B593374j77436j00376K28288J9660j16348R1856K80768K20544r0441j77565
2751B772324j74399n7108L4513J59793j69942k43499K84348N418M2678P2160N5408
2740B781694M1117P324k27426N9544L12707j05931n1643J35244J20063p6458o2415
2729B933820k19521K1192L09945N9837k20466k64230p5876n1195o0437M996J35269
2718B573334R3111L8533k5436l37053j80036K82078M5798k36278J28695P5330
$$ plain form
2708 2458076 2427212 2464049 2426283 2360396 2526473 2595873 2518706 2357433 2293869 2142237 2281387
2697 2281387 2305405 2279738 2415677 2645012 2502189 2311120 2030955 2131713 2386658 2491839
2687 2491839 2315092 2315402 2390402 2463192 2535989 2459413 2492071 2309563 2246946 2340763 2388968
2676 2388968 2278168 2379461 2615850 2687784 2804341 3020145 2743882 2505010 2245361 2226177
2666 2226177 2507990 2692069 2648083 2818478 2999589 2866677 2773546 2642384 2599174 2675848
2656 2675848 2671906 2655877 2448734 2295351 2270346 2529225 2741999 2764455 2645853 2587817 2532040
2645 2532040 2391048 2368755 2625263 2644479 2460814 2212945 2334849 2348396 2352299 2356955 2576823
2634 2576823 2874579 2545576 2347419 2144974 2215267 2222075 2263983 2448996 2664590 2585453
$$ packed form
2708B458076l0864L6837l7766o5887J66077O9400p7167j61273o3564j51632J39150
2697B281387K4018k5667J35939K29335j42823j91069k80165J00758K54945J05181
2687B491839j76747L10P5000P2790P2797p6576L2658j82508o2617R3817M8205
2676B388968j10800J01293K36389P1934J16557K15804k76263k38872k59649j9184
2666B226177K81813J84079m3986J70395J81111j32912r3131j31162m3210P6674
2656B675848l942j6029k07143j53383k5005K58879K12774K2456j18602n8036n5777
2645B532040j40992k2293K56508J9216j83665k47869J21904J3547L903M656K19868
2634B576823K97756l29003j98157k02445P0293O808M1908J85013K15594p9137
$$ plain form
2624 2585453 2533527 2532878 2459358 2386658 2345210 2280298 2144022 2504997 2616490 2481106 2393678
2613 2393678 2580669 2839172 3046324 2862691 2511028 2609390 2581655 2591126 2714009 2651598
2603 2651598 2573330 2761407 2659788 2608551 2697665 2978615 3204323 3061237 2892651 2764251
2593 2764251 2790559 2622861 2570661 2721391 3003988 3257761 3333713 2896263 2818055 2732045
2583 2732045 2524359 2633965 2694951 2691882 2979303 3161376 3213379 3065277 2753563 2706954
2573 2706954 2802922 2929535 2797894 2906667 2780174 2899375 2947347 3020990 2977009 3088364
2563 3088364 3112105 3349557 3450225 3395935 3306871 3288129 3344831 3408434 3405902 3182480 3156605
2552 3156605 3404194 3657964 3857077 3644772 3654359 3911728 3933785 3863101 3719650 3828434
$$ packed form
2624B585453n1926o49p3520p2700m1448o4912j36276L60975J11493j35384q7428
2613B393678J86991K58503K07152j83633l51663R8362k7735R471J22883o2411
2603B651598p8268J88077j01619n1237Q9114K80950K25708j43086j68586j28400
2593B764251K6308j67698n2200J50730K82597K53773P5952m37450p8208q6010
2583B732045k07686J09606O0986l069K87421J82073N2003j48102l11714m6609
2573B706954R5968J26613j31641J08773j26493J19201M7972P3643m3981J11355
2563C088364K3741K37452J00668n4290q9064j8742N6702O3603k532k23422k5875
2552C156605K47589K53770J99113k12305R587K57369K2057p0684j43451J08784
$$ plain form
2542 3828434 4286411 4559449 4495534 4426556 4661318 4535021 4478976 4526880 4765622 4927695
2532 4927695 4901127 5021423 5223849 5396022 5339888 5324682 5147995 5182795 5113999 5189146 5148069
2521 5148069 5229643 5093193 5170822 5125073 5324526 5245792 5261573 5377515 5514076 5559423 5820258
2510 5820258 6006227 6075796 6035771 6027071 6032717 6053224 6051560 6207307 6394639 6311071 6322618
2499 6322618 6428141 6621908 6417447 6476526 6657549 6799009 6641693 6676130 6844705 7114389
2489 7114389 7290888 7113065 7239945 7200912 7089045 7191490 7159302 7200954 7530721 7673137
2479 7673137 7751427 7768319 7673949 7502966 7539181 7667697 7761833 7836319 7926425 8078512 8166054
2468 8166054 8282254 8263995 8267704 8169018 8232487 8290557 8402133 8539543 8662309 8566597 8811236
$$ packed form
2542C828434M57977K73038o3915o8978K34762j26297n6045M7904K38742J62073
2532D927695k6568J20296K02426J72173n6134j5206j76687L4800o8796P5147m1077
2521E148069Q1574j36450P7629m5749J99453p8734J5781J15942J36561M5347K60835
2510E820258J85969O9569m0025q700N646K0507j664J55747J87332q3568J1547
2499F322618J05523J93767k04461N9079J81023J41460j57316L4437J68575K69684
2489G114389J76499j77823J26880l9033j11867J02445l2188M1652L29767J42416
2479G673137P8290J6892r4370j70983L6215J28516R4136P4486R0106J52087Q7542
2468H166054J16200j8259L709r8686O3469N8070J11576J37410J22766r5712K44639
$$ plain form
2457 8811236 9104295 9164621 9023977 8984582 9031226 9089987 9369411 9380901 9442814 9654406 9823773
2446 9823773 9769007 9938452 10122002 10286360 10503382 10826262 10850055 10863923 11076547 11124395
2436 11124395 11167029 11236455 11305243 11302060 11554932 11892517 12200106 12254037 12183438 12391055 12680849
2425 12680849 12915290 12901119 13122820 13574748 13820485 14045505 14103491 14581193 14756919 14754009
2415 14754009 14790796 15095166 15517544 15979843 16166804 16439905 16859112 17036001 16989396 17089836
2405 17089836 17433979 17768033 18081761 18168408 18182624 18437298 18778397 18883445 18945937 19253789
2395 19253789 19616017 19762874 19783678 20043602 20559124 20825718 21058626 21484558 22078552 22259559
2385 22259559 22529900 22629724 22981460 23394248 23998372 24543216 25056970 25569146 26006367 26500763
$$ packed form
2457H811236K93059O0326j40644l9395M6644N8761K79424J1490O1913K11592J69367
2446I823773n4766J69445J83550J64358K17022L22880K3793J3868K12624M7848
2436A1124395M2634O9426O8788l183K52872L37585L07589N3931p0599K07617K89794
2425A2680849K34441j4171K21701M51928K45737K25020N7986M77702J75726k910
2415A4754009L6787L04370M22378M62299J86961K73101M19207J76889m6605J00440
2405A7089836L44143L34054L13728Q6647J4216K54674L41099J05048O2492L07852
2395A9253789L62228J46857K0804K59924N15522K66594K32908M25932N93994J81007
2385B2259559K70341R9824L51736M12788O04124N44844N13754N12176M37221M94396
$$ plain form
2375 26500763 26729632 27276375 27927845 28669581 29319512 29662846 30217583 31051089 31889402
2366 31889402 32444035 33218582 33974265 34726574 35262700 35838910 36361257 36937344 37627642
2357 37627642 38211789 39065624 39405220 39794451 40096395 40337309 40501795 40836442 40989921
2348 40989921 41082992 41113407 41075355 40924195 40990196 41063816 40884416 40714257 40797983 40793608 40826920
2337 40826920 40910619 41107078 41362361 41519946 41544944 41493874 41469598 41570332 42002155 42330871
2327 42330871 42840711 43607623 44267360 44928577 45834686 46845207 47809913 48803958 49490608
2318 49490608 50527825 51445554 51916311 52232707 52515876 52976015 53140895 53270136 53090334
2309 53090334 53186074 52912876 52669513 52428842 52412586 52102936 51941305 51732248 51290344 50684140
$$ packed form
2375B6500763K28869N46743O51470P41736O49931L43334N54737Q33506Q38313
2366C1889402N54633P74547P55683P52309N36126N76210N22347N76087O90298
2357C7627642N84147Q53835L39596L89231L01944K40914J64486L34647J53479
2348D0989921R3071L0415l8052j51160O6001P3620j79400j70159Q3726m375L3312
2337D0826920Q3699J96459K55283J57585K4998n1070k4276J00734M31823L28716
2327D2330871N09840P66912O59737O61217R06109J010521R64706R94045O86650
2318D9490608J037217R17729M70757L16396K83169M60139J64880J29241j79802
2309E3090334R5740k73198k43363k40671j6256l09650j61631k09057m41904o06204
$$ plain form
2299 50684140 50159849 49847058 49130720 48362410 47763456 47204513 46191897 44887695 44026155
2290 44026155 43087273 41955879 40726027 39779950 38889797 37888357 37181402 36761280 36290302
2281 36290302 35620994 34974303 34470742 34339790 34011723 33878630 33847143 33903643 33894578 33879881
2271 33879881 33900082 33629056 33513086 33582021 33659199 33937880 34139930 34331432 34807040 35045919
2261 35045919 35068573 35365373 35478244 35728372 36181332 36615792 36994550 37116048 37279959 37696975
2251 37696975 38159097 38486886 38591541 38871976 39419017 40020781 40351202 40717947 41126100
2242 41126100 41822535 42438927 43010869 43500654 44314041 45043189 45797271 46615659 47606639
2233 47606639 48837221 49804399 50967774 52182303 53420928 54735894 56403134 57768865
$$ packed form
2299E0684140n24291l12791p16338p68310n98954n58943j012616j304202q61540
2290D4026155r38882j131394j229852r46077q90153j001440p06955m20122m70978
2281C6290302o69308o46691n03561j30952l28067j33093l1487N6500r065j4697
2271C3879881K0201k71026j15970O8935P7178K78681K02050J91502M75608K38879
2261C5045919K2654K96800J12871K50128M52960M34460L78758J21498J63911M17016
2251C7696975M62122L27789J04655K80435N47041O01764L30421L66745M08153
2242D1126100O96435O16392N71942M89785Q13387P29148P54082Q18388R90980
2233D7606639J230582R67178J163375J214529J238625J314966J667240J365731
$$ plain form
2225 57768865 59247915 61155959 62735871 64514178 66212226 68129624 70377173 72429403
2217 72429403 74513922 76918094 79248072 81406342 83751758 86350687 89264691 92425819
2209 92425819 95861744 99053073 102951376 107047871 110876725 114932101 119193358 123490533
2201 123490533 127760206 132026720 136312471 140953407 145759512 149936366 153886602 157943483
2193 157943483 161868693 165648722 169206923 172714289 176204911 179388145 182252034 184338775
2185 184338775 185878105 187128483 187785972 188086341 187962896 187521256 186737524 185835263 184668343
2176 184668343 183130811 181620814 180034337 178313133 176119535 174280999 172174017 169850157
2168 169850157 167446017 164993129 162625844 160154883 157509417 155133261 153076294 150833465
$$ packed form
2225E7768865J479050J908044J579912J778307J698048J917398K247549K052230
2217G2429403K084519K404172K329978K158270K345416K598929K914004L161128
2209I2425819L435925L191329L898303M096495L828854M055376M261257M297175
2201A23490533M269673M266514M285751M640936M806105M176854L950236M056881
2193A57943483L925210L780029L558201L507366L490622L183234K863889K086741
2185A84338775J539330J250378O57489L00369j23445m41640p83732r02261j166920
2176A84668343j537532j509997j586477j721204k193598j838536k106982k323860
2168A69850157k404140k452888k367285k470961k645466k376156k056967k242829
$$ plain form
2160 150833465 148745761 146926501 145119107 143340500 141739529 140201416 138941147 137839860
2152 137839860 136755440 135671290 134723203 133609141 132656418 131353368 130235249 129212331
2144 129212331 128057845 126651024 125249428 123698317 121948201 120141060 118156397 116261696
2136 116261696 114498996 112940814 111243443 109702653 108217467 107047680 106431705 105560923
2128 105560923 104885773 104437952 104102114 103501727 103066308 102819261 102658781 102385530 102228802
2119 102228802 102092059 102137354 102156447 102212067 102390298 102566766 102917196 103105329 103399744 103826236
2109 103826236 104346967 104517124 104761886 104847976 104805772 104594228 104262937 103920321 103556142 102728070
2099 102728070 101729948 100767774 99533865 98163175 96833267 95355577 94001887 92606566
$$ packed form
2160A50833465k087704j819260j807394j778607j600971j538113j260269j101287
2152A37839860j084420j084150r48087j114062r52723j303050j118119j022918
2144A29212331j154486j406821j401596j551111j750116j807141j984663j894701
2136A16261696j762700j558182j697371j540790j485186j169787o15975q70782
2128A05560923o75150m47821l35838o00387m35419k47047j60480k73251j56728
2119A02228802j36743M5295J9093N5620J78231J76468L50430J88133K94415M26492
2109A03826236N20731J70157K44762Q6090m2204k11544l31291l42616l64179q28072
2099A02728070r98122r62174j233909j370690j329908j477690j353690j395321
$$ plain form
2091 92606566 91187388 89569678 88277557 86698436 85244854 83735280 82083699 80487250
2083 80487250 78845228 77251597 75445182 73696328 72212438 70947691 69446660 68064911
2075 68064911 66460481 64859420 63606374 62556267 61299426 60289746 59552668 58679887
2067 58679887 57787459 57131824 56347148 55562557 55042184 54497789 54006341 53498329 52853462
2058 52853462 52326189 51932208 51803805 51823667 51757093 51579978 51474642 51347328 51379642 51341498
2048 51341498 51630678 52086008 52599252 52933713 53425034 53927582 54440882 55209941 56273252
2039 56273252 57269215 58143006 59193714 60343791 61625835 63114883 64636411 66130918
2031 66130918 67799921 69011435 70071107 71074236 72259169 73306558 74352809 75162145
$$ packed form
2091I2606566j419178j617710j292121j579121j453582j509574j651581j596449
2083H0487250j642022j593631j806415j748854j483890j264747j501031j381749
2075F8064911j604430j601061j253046j050107j256841j009680p37078q72781
2067E8679887q92428o55635p84676p84591n20373n44395m91448n08012o44867
2058E2853462n27273l93981j28403J9862o6574j77115j05336j27314L2314l8144
2048E1341498K89180M55330N13244L34461M91321N02548N13300P69059J063311
2039E6273252R95963Q73791J050708J150077J282044J489048J521528J494507
2031F6130918J669003J211514J059672J003129J184933J047389J046251Q09336
$$ plain form
2023 75162145 76088406 76787908 77245786 77425163 77844876 77937417 77747992 77456209 77234894 76869000
2013 76869000 76424975 75999859 75486186 74936283 74160415 73469298 72485707 71536505 70821243
2004 70821243 69943123 69020169 68406447 67635268 67018093 66320436 65551455 64721409 63831712
1995 63831712 63036794 62205183 61229867 60112615 58971695 57910964 56641277 55397095 54100882
1986 54100882 52710926 51261077 49924703 48279267 46563023 45313252 44193934 42888824
1978 42888824 41627390 40751439 40040993 39033269 37940334 36990464 36200257 35574769 34907323
1969 34907323 34171802 33480169 32922751 32308427 31898841 31435278 30995241 30572913 30236879
1960 30236879 29732492 29337022 28934869 28524557 28140215 27965968 27854577 27697187 27255640
$$ packed form
2023G5162145R26261O99502M57878J79377M19713R2541j89425k91783k21315l65894
2013G6869000m44025m25116n13673n49903p75868o91117r83591r49202p15262
2004G0821243q78120r22954o13722p71179o17175o97657p68981q30046q89697
1995F3831712p94918q31611r75316j117252j140920j060731j269687j244182j296213
1986E4100882j389956j449849j336374j645436j716244j249771j119318j305110
1978D2888824j261434q75951p10446j007724j092935r49870p90207o25488o67446
1969C4907323p35521o91633n57418o14324m09586m63563m40037m22328l36034
1960C0236879n04387l95470m02153m10312l84342j74247j11391j57390m41547
$$ plain form
1951 27255640 26869008 26532502 26229678 25921626 25528501 25145072 24976492 24968951 24646720 24503284
1941 24503284 24232049 24052269 23895803 23452998 22860995 22817614 22619318 22410388 22218574 22172952
1931 22172952 21911496 21684669 21268175 20682768 20249342 20294736 20125134 19663794 19411321 19289202
1921 19289202 18991458 18485517 18271609 18044359 17882725 17924781 17779309 17649339 17639895 17281713
1911 17281713 16954361 16643550 16413645 16267932 16205786 16217049 16099987 16206364 16205574 16030120
1901 16030120 15962969 15876233 15520638 15225335 15134802 15195010 15413067 15420051 15239780 14939752
1891 14939752 14904325 14642311 14236390 14053898 14231888 14296789 14380742 14331422 14423171 14336616
1881 14336616 14128391 13931803 13884939 13845309 13672901 13797913 14161041 14213112 14184747 14167121
$$ packed form
1951B7255640l86632l36506l02824l08052l93125l83429j68580p541l22231j43436
1941B4503284k71235j79780j56466m42805n92003m3381j98296k08930j91814m5622
1931B2172952k61456k26827m16494n85407m33426M5394j69602m61340k52473j22119
1921A9289202k97744n05941k13908k27250j61634M2056j45472j29970r444l58182
1911A7281713l27352l10811k29905j45713o2146J1263j17062J06377p90j75454
1901A6030120o7151q6736l55595k95303r0533O0208K18057O984j80271l00028
1891A4939752l5427k62014m05921j82492J77990O4901Q3953m9320R1749q6555
1881A4336616k08225j96588m6864l9630j72408J25012L63128N2071k8365j7626
$$ plain form
1871 14167121 14015578 13985664 13894513 13924671 13866367 13955732 14198280 14053091 13983225 14000441 14072603
1860 14072603 14245218 14305509 14318447 14627516 14843641 14725381 14641483 14718821 14959899 15197753
1850 15197753 15207140 15371285 15664337 16014046 16169082 16190517 16528918 16792599 17036946 17229400
1840 17229400 17580344 17917078 18445532 18774825 19061991 19245364 19577815 19781385 19903975
1831 19903975 20195854 20792364 21232994 21579031 22053680 22379138 22794604 23047066 23372250
1822 23372250 23850282 24410281 24737061 25144540 25782392 26441332 27026036 27684427 28472242
1813 28472242 29453753 30091848 30562260 31250185 32279179 33346345 34074342 34946995 36286331
1804 36286331 37324200 38358309 39647732 40958146 42320455 43945105 45592915 47132662
$$ packed form
1871A4167121j51543k9914r1151L0158n8304Q9365K42548j45189o9866J7216P2162
1860A4072603J72615O0291J2938L09069K16125j18260q3898P7338K41078K37854
1850A5197753R387J64145K93052L49709J55036K1435L38401K63681K44347J92454
1840A7229400L50944L36734N28454L29293K87166J83373L32451K03570J22590
1831A9903975K91879N96510M40630L46037M74649L25458M15466K52462L25184
1822B3372250M78032N59999L26780M07479O37852O58940N84704O58391P87815
1813B8472242R81511O38095M70412O87925J028994J067166P27997Q72653J339336
1804C6286331J037869J034109J289423J310414J362309J624650J647810J539747
$$ plain form
1796 47132662 48986159 50826726 52976771 55379520 58074014 60832730 63629612 66655994
1788 66655994 70128099 73834735 77882724 82247761 86902352 91976160 97358940 102604127
1780 102604127 107692252 113063457 118630115 124190405 130275697 136804858 143803592 151753816
1772 151753816 160638056 170646258 181902886 193921431 206941286 221053539 235807350
1765 235807350 250714609 265275610 278608992 289772282 298638526 304915684 309119210
1758 309119210 311796380 313462079 313773845 311884352 306733374 298108974 286072457 271554574
1750 271554574 255588732 239477767 224369658 210564306 197698142 186193204 176252743
1743 176252743 167451985 159485912 152314038 146137582 140676120 135826490 131169776 126926078
$$ packed form
1796D7132662J853497J840567K150045K402749K694494K758716K796882L026382
1788F6655994L472105L706636M047989M365037M654591N073808N382780N245187
1780A02604127N088125N371205N566658N560290O085292O529161O998734P950224
1772A51753816Q884240J0008202J1256628J2018545J3019855J4112253J4753811
1765B35807350J4907259J4561001J3333382J1163290Q866244O277158M203526
1758C09119210K677170J665699L11766j889493n150978q624400j2036517j4517883
1750B71554574j5965842j6110965j5108109j3805352j2866164j1504938r940461
1743A76252743q800758p966073p171874o176456n461462m849630m656714m243698
$$ plain form
1735 126926078 123151391 119382463 115686358 112548043 109612836 106427264 103357059 100314528
1727 100314528 97267955 94218544 91440664 88795005 86063478 83076668 80106532 77357191
1719 77357191 74530947 71518424 68203647 65279583 62804627 60255558 58019144 55969662
1711 55969662 53920405 52311628 50533287 48738456 47064926 45379911 43944520 42666677
1703 42666677 41302505 40210926 39209830 38313843 37589636 36574748 35477698 34688814 33947943
1694 33947943 33059321 32351695 31640799 30791194 30171541 29535833 28575742 27847841 27228295
1685 27228295 26391405 25638336 24969011 24476438 23899629 23125859 22518878 22233691 21550540
1676 21550540 20813209 20319839 20144984 19832777 19170688 18785960 18398104 18165867 17666279
$$ packed form
1735A26926078l774687l768928l696105l138315k935207l185572l070205l042531
1727A00314528l046573l049411k777880k645659k731527k986810k970136k749341
1719G7357191k826244l012523l314777k924064k474956k549069k236414k049482
1711E5969662k049257j608777j778341j794831j673530j685015j435391j277843
1703D2666677j364172j091579j001096q95987p24207j014888j097050p88884p40871
1694C3947943q88622p07626p10896q49605o19653o35708r60091p27901o19546
1685B7228295q36890p53069o69325m92573n76809p73770o06981k85187o83151
1676B1550540p37331m93370j74855l12207o62089l84728l87856k32237m99588
$$ plain form
1667 17666279 17246620 16842948 16476737 16171780 15653642 15370412 15288586 15006938 14591050 14561522
1657 14561522 14103170 13630228 13488464 13249996 13105511 12920515 12598698 12386955 12159558
1648 12159558 12007947 11858381 11527798 11114053 10990990 10966297 10860396 10689762 10417519 10124713
1638 10124713 10205047 9974600 9802220 9722310 9449594 9283199 8995842 8854948 8950243 8791406
1628 8791406 8366642 8383052 8274970 8287386 8340141 8076241 7764674 7721144 7604923 7271875
1618 7271875 7208740 7033768 6897151 6979618 6612603 6355799 6387205 6200407 6058122 6046834
1608 6046834 6079092 6068598 5888947 5543418 5407958 5392907 5237366 5094431 5207246 5204396
1598 5204396 5312718 5418192 5043239 5000292 4879266 4755830 4626716 4522218 4470187 4717998
$$ packed form
1667A7666279m19659m03672l66211l04957n18138k83230q1826k81648m15888k9528
1657A4561522m58352m72942j41764k38468j44485j84996l21817k11743k27397
1648A2159558j51611j49566l30583m13745j23063k4693j05901j70634k72243k92806
1638A0124713Q0334k30447j72380p9910k72716j66395k87357j40894R5295j58837
1628H791406m24764J6410j08082J2416N2755k63900l11567m3530j16221l33048
1618G271875o3135j74972j36617Q2467l67015k56804L1406j86798j42285j1288
1608F046834L2258j0494j79651l45529j35460j5051j55541j42935J12815k850
1598E204396J08322J05474l74953m2947j21026j23436j29114j04498n2031K47811
$$ plain form
1588 4717998 4602245 4575974 4503317 4265886 4292984 4218544 4113515 4290739 4389549 4381622 4457805
1577 4457805 4142060 3918658 3798322 3744369 3770630 3675453 3845165 4006182 4037616 3852040
1567 3852040 3680557 3560952 3792822 3764738 3669398 3687836 3600555 3637502 3690201 3532639 3264660
1556 3264660 3214044 3227084 3247487 3273770 3236794 3001745 3078106 3047767 2926020 2864796 2817217
1545 2817217 2599751 2719761 2798108 2786565 2793439 2548135 2565231 2758240 2803829 2816752 2763618
1534 2763618 2694955 2477315 2329582 2466666 2426260 2382395 2277237 2351513 2513282 2577933
1524 2577933 2445072 2178703 2140052 2179276 2200793 2019082 2113068 1984811 1957993 2200545
1514 2200545 2389180 2307063 2195420 2002738 1944663 1961944 1993057 1821324 1778611 1753688 1947484
$$ packed form
1588D717998j15753k6271p2657k37431K7098p4440j05029J77224R8810p927P6183
1577D457805l15745k23402j20336n3953K6261r5177J69712J61017L1434j85576
1567C852040j71483j19605K31870k8084r5340J8438q7281L6947N2699j57562k67979
1556C264660n0616J3040K0403K6283l6976k35049P6361l0339j21747o1224m7579
1545B817217k17466J20010P8347j1543O874k45304J7096J93009M5589J2923n3134
1534B763618o8663k17640j47733J37084m0406m3865j05158P4276J61769O4651
1524B577933j32861k66369l8651L9224K1517j81711R3986j28257k6818K42552
1514B200545J88635q2117j11643j92682n8075J7281L1113j71733m2713k4923J93796
$$ plain form
1503 1947484 2211456 2171201 1919398 1773157 1930018 1926715 1777371 1655955 1871402 2013768
1493 2013768 1948102 2057027 2104477 1971748 1843039 1681068 1735786 1836965 1851205 1799932
1483 1799932 1982532 2046500 1992459 1998562 1975627 2117879 2235905 2282166 2158996 2018505 2004684
1472 2004684 2160052 2044146 1879522 2185872 2483643 2688254 2663034 2592375 2655433 2817775
1462 2817775 2714746 2610891 2587899 2871380 2851403 2913208 2862045 2841363 2824206 2588521 2358581
1451 2358581 2349544 2463952 2478922 2581694 2489415 2540496 2455276 2110181 1796264 1794082 1718369
1440 1718369 1804404 1810247 1901124 1910982 1897320 2032596 1903379 1655256 1448859 1630816 1605798
1429 1605798 1605714 1717083 1765502 1678638 1613200 1505443 1394231 1420121 1190618 1239111 1382800
$$ packed form
1503A947484K63972m0255k51803j46241J56861l303j49344j21416K15447J42366
1493B013768o5666J08925M7450j32729j28709j61971N4718J01179J4240n1273
1483A799932J82600O3968n4041O103k2935J42252J18026M6261j23170j40491j3821
1472B004684J55368j15906j64624L06350K97771K04611k5220p0659O3058J62342
1462B817775j03029j03855k2992K83481j9977O1805n1163k0682j7157k35685k29940
1451B358581r037J14408J4970J02772r2279N1081q5220l45095l13917k182p5713
1440A718369Q6035N843R0877R858j3662J35276j29217k48123k06397J81957k5018
1429A605798q4J11369M8419q6864o5438j07757j11212K5890k29503M8493J43689
$$ plain form
1418 1382800 1473405 1239561 1118880 1213692 1154294 1083298 1136606 1177872 1306234 1222299 1196452
1407 1196452 1255431 1329426 1181881 996595 1029205 1079182 1070572 1107286 1236161 941627 1037657
1396 1037657 1238457 1299034 1134302 963092 783299 899855 1156707 1175314 1065691 1059908
1386 1059908 857459 764785 786052 797105 728872 763795 971206 994628 1060342 909654 632956
1375 632956 637647 739424 650108 761560 690177 689950 653300 742478 757086 703727 603533 594071
1363 594071 645932 693585 777123 515936 731427 695613 844474 771219 462038 425553 670810
1352 670810 671567 460154 646794 642320 531869 366098 377952 634532 747773 641236 715705
1341 715705 617198 559072 602078 526987 577838 647587 685646 483076 466232 577440 691133
$$ packed form
1418A382800R0605k33844j20681R4812n9398p0996N3308M1266J28362q3935k5847
1407A196452N8979P3995j47545j85286L2610M9977q610L6714J28875k94534R6030
1396A037657K00800O0577j64732j71210j79793J16556K56852J8607j09623n783
1386A059908k02449r2674K1267J1053o8233L4923K07411K3422O5714j50688k76698
1375F32956M691J01777q9316J11452p1383k27l6650Q9178J4608n3359j00194r462
1363E94071N1861M7653Q3538k61187K15491l5814J48861p3255l09181l6485K45257
1352F70810P57k11413J86640m474j10451j65771J1854K56580J13241j06537P4469
1341G15705r8507n8126M3006p5091N0851O9749L8059k02570j6844J11208J13693
$$ plain form
1330 691133 591950 496063 494859 491274 351488 178714 300559 561533 777939 608100 436004
1319 436004 365303 369567 304252 167747 40772 329466 568879 666741 522290 570275 529732
1308 529732 432136 561167 567594 226499 87821 315130 429069 505017 415174 208084 375689
1297 375689 351724 348878 288139 54684 269266 498647 437886 444948 485180 493849 270981
1286 270981 94058 127409 438498 514890 364534 255712 227418 339222 393425 369313 130620
1275 130620 216958 331748 231442 208003 226538 301911 399895 368456 449701 340703 378716
1264 378716 244600 589383 695070 682194 668473 642965 401951 235459 240880 -66934 -19941
1253 -19941 316164 452882 484603 573727 723713 575292 362112 321929 460623 395387 341076
$$ packed form
1330F91133r9183r5887j204l585j39786j72774J21845K60974K16406j69839j72096
1319D36004p0701M264o5315j36505j26975K88694K39413R7862j44451M7985m0543
1308E29732r7596J29031O427l41095j38678K27309J13939P5948q9843k07090J67605
1297C75689k3965k846o0739k33455K14582K29381o0761P062M0232Q669k22868
1286B70981j76923L3351L11089P6392j50356j08822k8294J11804N4203k4112k38693
1275A30620Q6338J14790j00306k3439J8535P5373R7984l1439Q1245j08998L8013
1264C78716j34116L44783J05687j2876j3721k5508k41014j66492N421l07814M6993
1253a9941L36105J36718L1721Q9124J49986j48421k13180m0183J38694o5236n4311
$$ plain form
1242 341076 418809 476144 661524 559670 553533 464001 446777 313812 246594 79580 157461
1231 157461 394861 383592 306894 450909 472152 431694 391547 353573 423833 510756 290944
1220 290944 -6322 -152994 58190 436676 367958 297970 468771 559203 391829 232714
1210 232714 116613 -15515 54411 254341 490999 498606 363577 385130 439856 395509 213419
1199 213419 29244 50626 -22190 -59179 65989 61441 140578 323073 384844 310321 314666
1188 314666 125481 -124159 -134499 -256754 -151568 185227 194180 270694 280280 385985 459195
1177 459195 328764 187812 163436 152436 65455 84934 163747 201443 173774 243372 226456
1166 226456 -27007 -63070 -5525 210239 282685 354897 404651 422487 188936 -38076 114922
$$ packed form
1242C41076P7733N7335J85380j01854o137q9532j7224j32965o7218j67014P7881
1231A57461K37400j1269p6698J44015K1243m0458m0147l7974P0260Q6923k19812
1220B90944k97266j46672K11184L78486o8718o9988J70801R0432j67374j59115
1210B32714j16101j32128O9926J99930K36658P607j35029K1553N4726m4347j82090
1199B13419j84175K1382p2816l6989J25168m548P9137J82495O1771p4523M345
1188C14666j89185k49640j0340j22255J05186L36795Q953P6514R586J05705P3210
1177D59195j30431j40952k4376j1000q6981J9479P8813L7696k7669O9598j6916
1166B26456k53463l6063N7545K15764P2446P2212M9754J7836k33551k27012J52998
$$ plain form
1155 114922 60375 -4086 48284 233534 238091 61395 261632 242715 60043 98234 260937
1144 260937 380779 546866 394622 175825 178603 77443 258492 214995 212713 243749 192952
1133 192952 163809 228458 135897 20584 62229 113694 273972 274850 -16435 91496 342273
1122 342273 301778 415103 302997 108502 262449 383042 381148 221489 189304 226549 131406
1111 131406 61791 344083 392317 276571 307099 488798 515277 228119 1793 126365
1101 126365 164779 214955 221057 261948 450353 369033 319606 451499 288467 107288 350892
1090 350892 380893 289580 432494 507232 616801 787032 552617 609761 733817 643555 428265
1079 428265 425179 479037 475605 544618 540593 662687 602450 319872 359798 465120 435823 220746
$$ packed form
1155A14922n4547o4461N2370J85250M557j76696K00237j8917j82672L8191J62703
1144B60937J19842J66087j52244k18797K778j01160J81049m3497k282L1036n0797
1133A92952k9143O4649r2561j15313M1645N1465J60278Q78k91285J07931K50777
1122C42273m0495J13325j12106j94495J53947J20593j894j59659l2185L7245r5143
1111A31406o9615K82292M8234j15746L0528J81699K6479k87158k26326J24572
1101A26365L8414N0176O102M0891J88405q1320m9427J31893j63032j81179K43604
1090C50892L0001r1313J42914P4738J09569J70231k34415N7144J24056r0262k15290
1079D28265l086N3858l432O9013m025J22094o0237k82578L9926J05322k9297k15077
$$ plain form
1067 220746 374825 623666 511953 285813 164148 264938 385793 476521 585261 564143
1057 564143 433231 552231 392438 412059 546431 467704 429404 325564 441642 603814
1047 603814 654250 548939 600764 772882 911684 804248 724451 666055 723345 895129 956485
1036 956485 913080 855275 863809 895417 957570 853283 970504 860390 958153 1163047 790704
1025 790704 586585 984779 1136124 1204488 1325337 1199772 1167160 1285475 1383972 1319944
1015 1319944 1363813 1449163 1551060 1630509 1514367 1367584 1295437 1257514 1451924 1705475
1005 1705475 1904539 1876947 1651806 1719668 2013348 2103202 2097315 2342705 2426930 2516823 2556967
994 2556967 2429452 2629713 2888020 3065574 3329460 3590190 3690978 3939554 4143154 4336940
$$ packed form
1067B20746J54079K48841j11713k26140j21665J00790J20855R0728J08740k1118
1057E64143j30912J19000j59793J9621J34372p8727l8300j03840J16078J62172
1047F03814N0436j05311N1825J72118J38802j07436p9797n8396N7290J71784O1356
1036I56485m3405n7805Q534L1608O2153j04287J17221j10114R7763K04894l72343
1025G90704k04119L98194J51345O8364J20849j25565l2612J18315R8497o4028
1015A319944M3869Q5350J01897P9449j16142j46783p2147l7923J94410K53551
1005A705475J99064k7592k25141O7862K93680Q9854n887K45390Q4225Q9893M0144
994B556967j27515K00261K58307J77554K63886K60730J00788K48576K03600J93786
$$ plain form
984 4336940 4624483 4858832 5191487 5508265 5754196 6143861 6861225 7552259 8230178 9115049
974 9115049 9852238 10577300 11365436 12198039 13441529 14829285 16206299 17845995 20211164
965 20211164 22673441 25687893 29607696 34368263 39729046 44812675 47963505 46553176
957 46553176 40701754 32495160 25256245 20450255 17349549 15063596 13189237 11650003
949 11650003 10509415 9616204 8906789 8320520 7839081 7591940 7366936 6974371 6513666
940 6513666 5902438 5150057 4702970 4219676 3989989 4093326 3941346 3652620 3561016 3364888
930 3364888 3253957 3178337 2904418 2617529 2692296 2808833 2677824 2812900 2748086 2435574
920 2435574 2097810 2149516 2242582 2168831 2078996 2127053 2009896 1995227 2099942 1830335 1379649
$$ packed form
984D336940K87543K34349L32655L16778K45931L89665P17364O91034O77919Q84871
974I115049P37189P25062P88136Q32603J243490J387756J377014J639696K365169
965B0211164K462277L014452L919803M760567N360783N083629L150830j410329
957D6553176n851422q206594p238915m805990l100706k285953j874359j539234
949A1650003j140588q93211p09415n86269m81439k47141k25004l92565m60705
940F513666o11228p52381m47087m83294k29687J03337j51980k88726r1604j96128
930C364888j10931p5620k73919k86889P4767J16537j31009J35076o4814l12512
920B435574l37764N1706R3066p3751q9835M8057j17157j4669J04715k69607m50686
$$ plain form
909 1379649 1317101 1406479 1489589 1454067 1357497 1314329 1349772 1436526 1276843 1306544 1133233
898 1133233 1136232 1177835 1064485 1012896 1101520 896308 792502 864701 1102037 1230461 1050026
887 1050026 859100 1040348 963499 636338 440460 636296 813256 730853 621894 641223
877 641223 778278 656980 469393 497846 674949 636421 382421 386004 610714 760241 764740
866 764740 586374 587282 557280 434512 417945 463592 229113 232024 480811 545049 558609 448202
854 448202 268072 400876 270535 88880 -20970 24683 235916 282145 383367 451289
844 451289 369481 318972 292508 360338 293711 171944 95625 220100 446459 370263 146538
833 146538 91493 266199 226715 290454 309941 334863 339054 276721 91672 135776 248391
$$ packed form
909A379649o2548Q9378Q3110l5522r6570m3168L5443Q6754j59683K9701j73311
898A133233K999M1603j13350n1589Q8624k05212j03806P2199K37336J28424j80435
887A050026j90926J81248p6849l27161j95878J95836J76960q2403j08959J9329
877F41223J37055j21298j87587K8453J77103l8528k54000L583K24710J49527M499
866G64740j78366R08l0002j22768j6567M5647k34479K911K48787O4238J3560j10407
854D48202j80130J32804j30341j81655j09850M5653K11233M6229J01222O7922
844D51289q1808n0509k6464O7830o6627j21767p6319J24475K26359p6196k23725
833A46538n5045J74706l9484O3739J9487K4922M191o2333j85049M4104J12615
$$ plain form
822 248391 21928 50103 93266 105731 -10918 -103295 -106861 182722 198867 108097 239036
811 239036 349082 178812 -68869 -136635 -2115 -10299 -269765 -304502 -135298 57404 246599
800 246599 226537 123572 144451 232357 229697 94329 8464 -13049 291160 224203 20929
789 20929 -79900 -198955 -221322 -174919 -127309 -110623 130452 202197 319808 105126 -42984
778 -42984 -235109 -58696 15698 -76104 -72760 84111 313949 204985 43083 -78945 -34670
767 -34670 -205534 -32984 -21049 -83659 -69335 124363 -29289 -24505 -22900 188643 156961
756 156961 -60345 -121144 -10518 89584 77847 34266 40443 77981 -20133 30586 -56075
745 -56075 164 14860 17730 -57404 19758 1418 -75776 -54474 9988 -75246 9105 3050
$$ packed form
822B48391k26463K8175M3163J2465j16649r2377l566K89583J6145r0770J30939
811B39036J10046j70270k47681o7766J34520q184k59466l4737J69204J92702J89195
800B46599k0062j02965K0879Q7906k660j35368q5865k1513L04209o6957k03274
789B0929j00829j19055k2367M6403M7610J6686K41075P1745J17611k14682j48110
778d2984j92125J76413P4394r1802L344J56871K29838j08964j61902j22028M4275
767c4670j70864J72550J1935o2610J4324J93698j53652M784J605K11543l1682
756A56961k17306o0799J10626J00102j1737m3581O177L7538r8114N0719q6661
745e6075N6239J4696K870p5134P7162j8340p7194K1302O4462q5234Q4351o055
$$ plain form
733 3050 39949 -38377 -130281 30629 43200 -133184 -292024 -130292 -8321 -2663 48836
722 48836 185354 -8688 -149209 -342675 -466200 -451201 -320542 -109231 79704 171101
712 171101 157280 155640 30374 -179554 -341876 -352261 -217462 -186321 -71212 -35880 -20414
701 -20414 113826 -43516 -120734 27349 -93620 -131007 -37596 -25678 95896 328901 144976
690 144976 -137392 -250297 -303175 -96015 50395 32672 221095 260859 95694 -28424
680 -28424 919 262507 229712 68637 109198 120690 86278 213454 218017 159572 -17575
669 -17575 160826 217417 257531 97238 -218496 -100558 5060 -125819 -214836 -78506 -40689
658 -40689 -257491 -78063 14831 100270 116756 -291713 -157552 -19212 -57327 -276151 -204293
$$ packed form
733C050L6899p8326r1904J60910J2571j76384j58840J61732J21971N658N1499
722D8836J36518j94042j40521j93466j23525J4999J30659K11311J88935R1397
712A71101j3821j640j25266k09928j62322j0385J34799L1141J15109L5332J5466
701b0414J34240j57342p7218J48083j20969l7387R3411J1918J21574K33005j83925
690A44976k82368j12905n2878K07160J46410j7723J88423L9764j65165j24118
680b8424K9343K61588l2795j61075M0561J1492l4412J27176M563n8445j77147
669a7575J78401N6591M0114j60293l15734J17938J05618j30879q9017J36330L7817
658d0689k16802J79428R2894Q5439J6486m08469J34161J38340l8115k18824P1858
$$ plain form
647 -204293 46793 168483 122656 -104773 -258557 -269928 -103341 -93336 -45737 145114 134749
636 134749 89149 63874 -78081 -224809 -308188 -371300 -379452 -334624 -367043 -121718 119461
625 119461 55649 98392 106211 -102974 -147938 -92007 -59117 -64741 -100526 -153921 3398 -105984
613 -105984 -181998 -202688 -305168 -47085 127192 -35819 -294893 -144225 38870 -157578
603 -157578 -237221 -106197 216366 288274 -62914 -308648 -164645 -258904 -334050 -160481 -48599
592 -48599 -11656 -105001 -132202 5148 -113069 -326646 -353090 -164325 -123930 -140815 95370
581 95370 181832 313597 165156 161663 57217 -316894 -507942 -439744 -84716 -14165 131956
570 131956 195700 213775 139434 12532 3723 -93781 -39800 -107403 86006 40624 -232688
$$ packed form
647b04293K51086J21690m5827k27429j53784j1371J66587J0005M7599J90851j0365
636A34749m5600k5275j41955j46728q3379o3112q152M4828l2419K45325K41179
625A19461o3812M2743P819k09185m4964N5931L2890n624l5785n3395J57319j09382
613a05984p6014k0690j02480K58083J74277j63011k59074J50668J83095j96448
603a57578p9643J31024L22563P1908l51188k45734J44003r4259p5146J73569J11882
592d8599L6943r3345k7201J37350j18217k13577k6444J88765M0395j6885K36185
581I5370Q6462J31765j48441l493j04446l74111j91048O8198L55028P0551J46121
570A31956O3744J8075p4341j26902q809r7504N3981o7603J93409m5382k73312
$$ plain form
559 -232688 -365238 -142250 -130349 -87786 -47678 -46786 150013 97702 45376 -135275 -42212
548 -42212 10780 -23156 -112889 -348625 -321116 -285297 -129561 -41979 -109555 -174753 -158001 -176022
536 -176022 -231181 -112698 -245930 -220012 -92107 69608 -37543 -198240 -373921 -362758
526 -362758 -101212 -69121 -99970 -71840 -89190 784 66096 -78353 33202 -158814 -211978
515 -211978 -131249 -140147 -256171 -186266 -270162 -296869 -173108 -46115 -105419 -105992 -179608 -130495
503 -130495 -132807 -154214 -103109 -152340 -243151 -224009 -89510 -49519 74949 111220 148716 -34178
491 -34178 -218984 -267254 -223708 -84311 -32528 34746 87534 1416 -303855 -365785 -94614
480 -94614 156409 113455 -17278 138419 -80834 -162128 -150694 -217257 -116051 105013 128432
$$ packed form
559b32688j32550K22988J1901M2563M0108Q92J96799n2311n2326j80651R3063
548d2212N2992l3936q9733k35736K7509L5819J55736Q7582o7576o5198J6752j8021
536a76022n5159J18483j33232K5918J27905J61715j07151j60697j75681J1163
526c62758K61546L2091l0849K8130j7350Q9974O5312j44449J11555j92016n3164
515b11978Q0729q898j16024O9905q3896k6707J23761J26993n9304n73p3616M9113
503a30495k312k1407N1105m9231r0811J9142J34499L9991J24468L6271L7496j82894
491c4178j84806m8270M3546J39397N1783O7274N2788q6118l05271o1930K71171
480i4614K51023m2954j30733J55697k19253q1294J1434o6563J01206K21064K3419
$$ plain form
469 128432 107877 -21269 -176183 -32375 66366 -97185 -149877 -110319 -7785 -96185 -259769
458 -259769 -196175 177311 63726 -343191 -269056 -97901 -81978 88068 -73693 -9976 97504
447 97504 -299272 -394383 -311424 -262637 -161815 -56454 40588 5515 -3030 -170087 -190040
436 -190040 -150884 -137500 67767 -68836 -156453 -4783 88351 -123519 -33060 -2003 59368
425 59368 181020 -51885 -377338 -333342 -195523 23060 72551 -35635 -31200 68767 -105102
414 -105102 -302492 -248085 -95563 -32184 76599 55152 162686 25076 -122222 48462
404 48462 115774 49044 -189695 -136354 -223812 -144202 -128363 -112145 -138528 -30302 -116929 -160474
392 -160474 -68547 -107804 -216218 -149275 166682 37374 -117356 -19399 -102967 -3651 -85837
$$ packed form
469A28432k0555j29146j54914J43808R8741j63551n2692L9558J02534q8400j63584
458b59769O3594L73486j13585m06917P4135J71155J5923J70046j61761O3717J07480
447I7504l96776r5111Q2959M8787J00822J05361R7042l5073q545j67057j9953
436a90040L9156J3384K05267j36603q7617J51670R3134k11870R0459L1057O1371
425E9368J21652k32905l25453M3996J37819K18583M9491j08186M435R9967j73869
414a05102j97390N4407J52522O3379J08783k1447J07534j37610j47298J70684
404D8462O7312o6730k38739N3341q7458P9610J5839J6218k6383J08226q6627m3545
392a60474R1927l9257j08414O6943L15957j29308j54730R7957q3568R9316q2186
$$ plain form
381 -85837 -93833 53384 63541 -14260 -103388 -130384 17471 146321 17710 6315 70984
370 70984 -7172 -11510 -66955 -109787 36938 243552 352201 200245 39340 -7397 -21557
359 -21557 -274271 -479323 -249516 -130841 -144829 -319914 -320194 -207855 -161866 -194304 -57939
348 -57939 206301 99068 -70156 -124669 -67733 6185 95230 -110970 -250825 -177646 33793
337 33793 74188 85651 127673 113544 -119979 -178324 -166299 -118445 -211945 -82322 9344 131576
325 131576 108734 -83365 -256084 -259866 -83557 19084 212650 70801 -53014 -171465
315 -171465 -195622 -69373 40898 153926 316762 319013 128103 13492 -124788 -141719 -105411
304 -105411 -41283 17959 -2905 -63918 47135 -26956 -125105 -129264 -135368 -140628 -264571 -272311
$$ packed form
381h5837p996J47217J0157p7801q9128k6996J47855J28850j28611j1395O4669
370G0984p8156m338n5445m2832J46725K06614J08649j51956j60905m6737j4160
359b1557k52714k05052K29807J18675j3988j75085k80J12339M5989l2438J36365
348e7939K64240j07233j69224n4513N6936P3918Q9045k06200j39855P3179K11439
337C3793M0395J1463M2022j4129k33523n8345J2025M7854r3500J29623R1666J22232
325A31576k2842j92099j72719l782J76309J02641J93566j41849j23815j18451
315a71465k4157J26249J10271J13028J62836K251j90910j14611j38280j6931L6308
304a05411O4128N9242k0864o1013J11053p4091r8149m159o104n260j23943p740
$$ plain form
292 -272311 -292028 -253416 -77182 -153523 -167493 97211 22941 -157956 -155708 -190752 -175669
281 -175669 -82109 -107666 -156338 -97525 32587 -22496 -141926 -91771 73464 81048 -151521
270 -151521 -188468 -112872 94921 34468 -52391 -121943 21887 41904 -269227 -370447 -123621
259 -123621 222951 110193 -124606 -243345 -90549 -110846 -265370 -473046 -242057 -122586
249 -122586 8724 76469 -191649 -41658 173307 23650 -63139 -163960 -123420 -161653 -148582
238 -148582 -84196 -38440 -8467 -271436 -205493 -125227 2031 128459 -5221 -119771 -52868
227 -52868 -67017 -124395 -194401 -360345 -177088 -58363 -21499 -33294 -23505 -227113 -92913
216 -92913 -97548 -209853 -200244 -111857 -261480 -197484 -38576 -16790 48115 37280 -13579 -69665
$$ packed form
292b72311j9717L8612J76234p6341j3970K64704p4270j80897K248l5044J5083
281a75669R3560k5557m8672N8813J30112n5083j19430N0155J65235P584k32569
270a51521l6947P5596K07793o0453q6859o9552J43830K0017l11131j01220K46826
259a23621L46572j12758k34799j18739J52796k0297j54524k07676K30989J19471
249a22586J31310O7745k68118J49991K14965j49657q6789j00821M0540l8233J3071
238a48582O4386M5756K9973k62969O5943Q0266J27258J26428j33680j14550O6903
227e2868j4149n7378p0006j65944J83257J18725L6864j1795R789k03608J34200
216i2913m635j12305R609Q8387j49623O3996J58908K1786O4905j0835n0859n6086
$$ plain form
204 -69665 -38660 -163251 -128610 -148002 -92526 -104803 -29071 -84870 -112261 -255116 -329889 -214450
192 -214450 -111452 7540 101870 98849 -26483 -41790 -147592 -6264 -127256 -268134 -272390
181 -272390 -122188 99316 9183 -283987 -360759 -227875 -91473 97505 -287107 -480354
171 -480354 -367439 -134993 -74087 -8540 -88909 170128 56333 -189422 -173460 -30258 -64837
160 -64837 -170297 -189754 -109127 -68006 -123915 -113616 -160832 -30474 -40418 -160375 -383204
149 -383204 -290950 -63072 105475 15238 30696 156864 157963 15714 -223339 -431533 -205947
138 -205947 -26917 -53119 -19559 -53380 -4834 -100754 -238500 -129329 95417 -12164 -120939
127 -120939 -36811 47541 6494 -241133 -353819 -206539 76120 139150 27517 -115807 -85515
$$ packed form
204f9665L1005j24591L4641j9392N5476j2277P5732n5799k7391j42855p4773J15439
192b14450J02998J18992R4330l021j25332j5307j05802J41328j20992j40878m256
181b72390J50202K21504r0133k93170p6772J32884J36402J88978l84612j93247
171d80354J12915K32446O0906O5547q0369K59037j13795k45755J5962J43202l4579
160f4837j05460j9457Q0627M1121n5909J0299m7216J30358r944j19957k22829
149c83204R2254K27878J68547r0237J5458J26168J099j42249k39053k08194K25586
138b05947J79030k6202L3560l3821M8546r5920j37746J09171K24746j07581j08775
127a20939Q4128Q4352m1047k47627j12686J47280K82659O3030j11633j43324L0292
$$ plain form
116 -85515 -76093 -251510 -94590 -38021 -221779 -367870 -389388 -303970 66975 -74565 -264530
105 -264530 -155316 -74728 -187377 -231188 -351862 -247348 -18689 -26412 -150548 -196281 -94101
94 -94101 -34315 -13866 -63750 -47459 -31839 -198418 -234900 -183707 -140848 -55527 -115383 -122651
82 -122651 -77345 -128927 -252556 -247169 -272014 -175506 -7319 -12101 -138064 40742 -37665 -217003
70 -217003 -258273 -135225 -174276 -250982 -328438 -144585 -112397 -242365 -416817 -268780 -7940
59 -7940 65085 -184196 -347672 -221769 -99083 -217802 -308699 -274568 -192898 -174984 -93454
48 -93454 -44219 -62397 -117419 -204291 -230066 -169840 -150051 -129607 -213499 -280835 -159035 108546
36 108546 22570 -180278 -213384 -314966 -239223 -333911 -149661 -40558 65497 30151 -50432
$$ packed form
116h5515R422j75417J56920N6569j83758j46091k1518Q5418L70945j41540j89965
105b64530J09214Q0588j12649m3811j20674J04514K28659p723j24136m5733J02180
94i4101N9786K0449m9884J6291J5620j66579l6482N1193M2859Q5321n9856p268
82a22651M5306n1582j23629N387k4845R6508J68187m782j25963J78806p8407j79338
70b17003m1270J23048l9051p6706p7456J83853L2188j29968j74452J48037K60840
59g940P3025k49281j63476J25903J22686j18719r0897L4131Q1670J7914Q1530
48i3454M9235j8178n5022q6872k5775O0226J9789K0444q3892o7336J21800K67581
36A08546q5976k02848l3106j01582P5743r4688J84250J09103J06055l5346q0583
$$ plain form
25 -50432 -56451 -49610 -201013 -164115 -35851 -94009 -245338 -280450 -205782 -64606 8578 -45481
13 -45481 -182125 -78593 -106909 -152174 -209384 -376330 -352591 -173195 -112948 -180498 -202402
2 -202402 -109399 -81441
0 -81441
$$ packed form
25e0432o019O841j51403L6898J28264n8158j51329l5112P4668J41176P3184n4059
13d5481j36644J03532k8316m5265n7210j66946K3739J79396O0247o7550k1904
2b02402R3003K7958
0h1441
$$ Imaginary data points
##PAGE= N=2
##DATA TABLE= (X++(I..I)), XYDATA
$$ plain form
16383 -4574642 -4499103 -4437986 -4518301 -4453070 -4254710 -4051804 -4101124 -4081161 -3986310 -4000975 -4030421
16372 -4030421 -4041552 -4008657 -3897827 -3801395 -3724759 -3656262 -3569760 -3637963 -3597707 -3418711 -3409285
16361 -3409285 -3276136 -3293907 -3311980 -3318397 -3376487 -3209244 -3109342 -3198411 -3337021 -3245413 -2994861
16350 -2994861 -3060827 -3006133 -2806136 -2642254 -2526289 -2574575 -2826849 -2632865 -2551091 -2679867
16340 -2679867 -2632235 -2433373 -2291080 -2277206 -2222608 -2224720 -2292611 -2319366 -2349861 -2349360 -2229776
16329 -2229776 -2044329 -1910164 -1828975 -1760571 -1866932 -1803693 -1665499 -1787548 -1925097 -1773046
16319 -1773046 -1704109 -1717655 -1545816 -1426300 -1287747 -1210894 -1061784 -1144395 -1301767 -1261834
16309 -1261834 -1349218 -1332614 -1138012 -1031033 -1125670 -1063056 -1073169 -1004859 -993816 -923178 -974722
$$ packed form
16383d574642P5539O1117q0315O5231J98360K02906m9320J9963R4851j4665k9446
16372d030421j1131L2895J10830R6432P6636O8497Q6502o8203M0256J78996R426
16361c409285J33149j7771j8073o417n8090J67243R9902q9069j38610R1608K50552
16350b994861o5966N4694J99997J63882J15965m8286k52274J93984Q1774j28776
16340b679867M7632J98862J42293J3874N4598k112o7891k6755l0495N01J19584
16329b229776J85447J34165Q1189O8404j06361O3239J38194j22049j37549J52051
16319a773046O8937j3546J71839J19516J38553P6853J49110q2611j57372L9933
16309a261834q7384J6604J94602J06979r4637O2614j0113O8310J1043P0638n1544
$$ plain form
16298 -974722 -853209 -848152 -789805 -754225 -626427 -632946 -676696 -616095 -517919 -498396 -511983
16287 -511983 -481984 -424571 -327761 -233366 -210716 -131236 -53199 -190881 -301500 -395939 -368682
16276 -368682 -284192 -173929 -121069 -77691 2348 52153 116804 258280 259954 143490 240208
16265 240208 205499 55664 17072 263320 571808 575458 348886 483729 549254 477810 551644
16254 551644 536951 718575 691359 537106 578918 718428 784295 657213 717621 958608
16244 958608 1088688 1062173 770465 653577 715957 937212 930678 860999 994018 940493 1000997
16233 1000997 1134928 1066720 1115787 1153634 1092184 1103122 1195486 1261140 1356866 1316238 1395051
16222 1395051 1357154 1334995 1297147 1139028 1099632 1384304 1439535 1463134 1518002 1564709 1501432
$$ packed form
16298i74722J21513N057N8347L5580J27798o519m3750O0601R8176J9523j3587
16287e11983K9999N7413R6810R4395K2650P9480P8037j37682j10619r4439K7257
16276c68682Q4490J10263N2860M3378Q0039M9805O4651J41476J674j16464R6718
16265B40208l4709j49835l8592K46248L08488L650k26572J34843O5525p1444P3834
16254E51644j4693J81624k7216j54253M1812J39510O5867j27082O0408K40987
16244I58608J30080k6515k91708j16888O2380K21255o534o9679J33019n3525O0504
16233A000997J33931o8208M9067L7847o1450J0938R2364O5654R5726m0628P8813
16222A395051l7897k2159l7848j58119l9396K84672N5231K3599N4868M6707o3277
$$ plain form
16211 1501432 1565937 1555553 1593471 1582519 1693779 1582874 1454913 1530431 1579132 1603719 1684429
16200 1684429 1633943 1510314 1668671 1833806 1917214 2033893 1946665 1979188 2116960 2092017
16190 2092017 1858690 1700951 1735486 1701502 1779542 1819272 1990520 2046504 2110734 2106633 2024547
16179 2024547 1790587 1720770 1793081 1911090 2028243 2311726 2182579 2050834 2426660 2345362
16169 2345362 1877935 1768194 1894793 2092047 2380686 2207388 2107242 2376774 2363204 2302867
16159 2302867 2211674 2236346 2188872 2246127 2167213 2289779 2486392 2511290 2346966 2374161 2421688
16148 2421688 2284656 2333723 2261719 2155599 2266507 2518745 2366140 2322837 2274233 2520901
16138 2520901 2719291 2512002 2374010 2442524 2368621 2215418 2385517 2334908 2413897 2691657
$$ packed form
16211A501432O4505j0384L7918j0952J11260j10905j27961P5518M8701K4587Q0710
16200A684429n0486j23629J58357J65135Q3408J16679q7228L2523J37772k4943
16190B092017k33327j57739L4535l3984P8040L9730J71248N5984O4230m101q2086
16179B024547k33960o9817P2311J18009J17153K83483j29147j31745L75826q1298
16169B345362m67427j09741J26599J97254K88639j73298j00146K69532j3570o0337
16159B302867r1193K4672m7474N7255p8914J22566J96613K4898j64324K7195M7527
16148B421688j37032M9067p2004j06120J10908K52238j52605m3303m8604K46668
16138B520901J98390k07289j37992O8514p3903j53203J70099n0609P8989K77760
$$ plain form
16128 2691657 2461024 2454826 2544058 2429608 2541413 2574476 2451080 2608551 2685140 2416587
16118 2416587 2485124 2474972 2528878 2585715 2708533 2449327 2276533 2454356 2374975 2333100
16108 2333100 2446326 2479080 2669993 2701476 2688705 2915207 2819628 2507995 2665065 2646017
16098 2646017 2571698 2564226 2398542 2293687 2570332 2705088 2885627 2906318 2464920 2355444
16088 2355444 2449709 2348555 2266933 2401417 2494527 2595343 2605828 2619247 2583274 2646462 2763826
16077 2763826 2928990 2810196 2693628 2583329 2556041 2514230 2415605 2509855 2809621 2914529
16067 2914529 2724316 2735692 2724706 2645702 2536018 2562457 2698650 2704626 2752571 2713110 2794316
16056 2794316 2831108 2694299 2621073 2700679 2682391 2385551 2417647 2811039 2887818 2684015
$$ packed form
16128B691657k30633o198Q9232j14450J11805L3063j23396J57471P6589k68553
16118B416587O8537j0152N3906N6837J22818k59206j72794J77823p9381m1875
16108B333100J13226L2754J90913L1483j2771K26502r5579l11633J57070j9048
16098B646017p4319p472j65684j04855K76645J34756J80539K0691m41398j09476
16088B355444R4265j01154q1622J34484R3110J00816J0485J3419l5973O3188J17364
16077B763826J65164j18794j16568j10299k7288m1811r8625R4250K99766J04908
16067B914529j90213J1376j0986p9004j09684K6439J36193N976M7945l9461Q1206
16056B794316L6792j36809p3226P9606j8288k96840L2096L93392P6779k03803
$$ plain form
16046 2684015 2588179 2664078 2630482 2637412 2546578 2635225 2883913 2774344 2429458 2528459 2653267
16035 2653267 2517775 2680153 2648031 2532376 2838681 2900292 2736310 2725656 2754363 2704713
16025 2704713 2693214 2625543 2595597 2643407 2538853 2646901 2916210 2846644 2595102 2486129
16015 2486129 2618432 2614907 2609693 2515197 2573383 2547004 2637215 2916263 2975935 2739703 2795968
16004 2795968 3048162 2828041 2610742 2583359 2543734 2858165 2838749 2427419 2613676 2875686
15994 2875686 2753784 2439664 2505809 2810491 2796257 2604055 2706277 2853768 2893947 2631060
15984 2631060 2595775 2723879 2704893 2512074 2623000 2922338 2709762 2576549 2738676 2816939
15974 2816939 2688373 2767688 2748771 2634693 2890674 2944823 2763502 2725341 2821027 2618425
$$ packed form
16046B684015r5836P5899l3596O930r0834Q8647K48688j09569l44886R9001J24808
16035B653267j35492J62378l2122j15655L06305O1611j63982j0654K8707m9650
16025B704713j1499o7671k9946M7810j04554J08048K69309o9566k51542j08973
16015B486129J32303l525n214r4496N8186k6379R0211K79048N9672k36232N6265
16004B795968K52194k20121k17299k7383l9625L14431j9416m11330J86257K62010
15994B875686j21902l14120O6145L04682j4234j92202J02222J47491M0179k62887
15984B631060l5285J28104j8986j92819J10926K99338k12576j33213J62127P8263
15974B816939j28566P9315j8917j14078K55981N4149j81321l8161R5686k02602
$$ plain form
15964 2618425 2461788 2558882 2687691 2709639 2831810 2785913 2652854 2629073 2509556 2551912
15954 2551912 2494662 2568725 2629057 2728121 2832545 2696677 2763454 2647646 2573181 2615520 2831663
15943 2831663 2516044 2580005 2722640 2531083 2484426 2724715 3036793 2944307 2827825 2642208
15933 2642208 2688594 2507068 2483281 2643105 2684294 2633228 2786034 2783376 2642808 2649654 2570109
15922 2570109 2628295 2766305 2687384 2894249 3023528 2807317 2662451 2646481 2678923 2652347
15912 2652347 2753576 2649844 2754465 2988895 2852161 2582011 2629218 2643046 2532244 2809450
15902 2809450 2712877 2687294 2847008 2920452 2860095 2706921 2565956 2667940 2605988 2467176
15892 2467176 2728708 2756331 2710327 2536192 2631913 2530946 2559162 2319780 2359374 2766676
$$ packed form
15964B618425j56637R7094J28809K1948J22171m5897j33059k3781j19517M2356
15954B551912n7250P4063O0332R9064J04424j35868O6777j15808p4465M2339K16143
15943B831663l15619O3961J42635j91557m6657K40289L12078r2486j16482j85617
15933B642208M6386j81526k3787J59824M1189n1066J52806k658j40568O846p9545
15922B570109N8186J38010p8921K06865J29279k16211j44866j5970L2442k6576
15912B652347J01229j03732J04621K34430j36734k70150M7207J3828j10802K77206
15902B809450r6573k5583J59714P3444o0357j53174j40965J01984o1952j38812
15892B467176K61532K7623m6004j74135R5721j00967K8216k39382L9594M07302
$$ plain form
15882 2766676 2870922 2821431 2788425 2889567 2753071 2684889 2598992 2546103 2639188 2649573 2590019
15871 2590019 2708091 2618780 2479693 2490492 2713820 2812703 2887007 2994617 2776601 2754706
15861 2754706 2581470 2747898 3034511 2793769 2696700 2712318 2872180 2715878 2605300 2743732
15851 2743732 2841554 2817936 2647997 2776791 2923703 2804356 2771386 2887529 2805784 2709951
15841 2709951 2547708 2383432 2575663 2510366 2535680 2611184 2853795 2807851 2858532 2757301
15831 2757301 2813541 2844424 2796939 2597674 2546053 2724870 2678227 2636144 2680593 2871191 2817980
15820 2817980 2842519 2729150 2811616 2512108 2582016 2708675 2901081 2955233 2780231 2584746
15810 2584746 2822666 2774630 2649366 2720561 2702037 2757678 2777456 2637978 2818726 2887500
$$ packed form
15882B766676J04246m9491l3006J01142j36496o8182q5897n2889R3085J0385n9554
15871B590019J18072q9311j39087J0799K23328R8883P4304J07610k18016k1895
15861B754706j73236J66428K86613k40742r7069J5618J59862j56302j10578J38432
15851B743732R7822k3618j69939J28794J46912j19347l2970J16143q1745r5833
15841B709951j62243j64276J92231o5297K5314P5504K42611m5944N0681j01231
15831B757301N6240L0883m7485j99265n1621J78817m6643m2083M4449J90598n3211
15820B817980K4539j13369Q2466k99508O9908J26659J92406N4152j75002j95485
15810B584746K37920m8036j25264P1195j8524N5641J9778j39478J80748O8774
$$ plain form
15800 2887500 2567489 2687999 2782271 2742096 2729787 2804877 2847549 3000381 2793524 2676004
15790 2676004 2646354 2514241 2496205 2475320 2591085 2727537 2816849 2829791 2792613 2783079 2613607
15779 2613607 2517307 2634828 2605767 2625453 2890859 2785059 2824182 2807484 2762266 2872126
15769 2872126 2965046 2581442 2567554 2875642 2853599 2825692 2746065 2591574 2744460 2842022
15759 2842022 2668431 2531563 2709022 2808637 3027926 2989516 2825548 2822331 2640336 2597491
15749 2597491 2606108 2873126 2939907 2874785 2778978 2913385 3026471 2911474 2779055 2779143 2883862
15738 2883862 2705375 2480603 2479922 2554324 2763596 2799287 2783893 2734999 2528070 2637734 2885561
15727 2885561 2953382 2838843 2781618 2559431 2560134 2844772 2669915 2662772 2874520 2902586 2907279
$$ packed form
15800B887500l20011J20510R4272m0175j2309P5090M2672J52832k06857j17520
15790B676004k9650j32113j8036k0885J15765J36452Q9312J2942l7178r534j69472
15779B613607r6300J17521k9061J9686K65406j05800L9123j6698m5218J09860
15769B872126R2920l83604j3888L08088k2043k7907p9627j54491J52886R7562
15759B842022j73591j36868J77459R9615K19289l8410j63968l217j81995m2845
15749B597491Q617K67018O6781o5122r5807J34407J13086j14997j32419Q8J04719
15738B883862j78487k24772o81P4402K09272L5691j5394m8894k06929J09664K47827
15727B885561O7821j14539n7225k22187P03K84638j74857p143K11748K8066M693
$$ plain form
15716 2907279 2781367 2639597 2728053 2825803 2886446 2818158 2887749 2905550 2809767 2553620 2494605
15705 2494605 2804604 2769298 2765985 2863257 2915428 2884873 2832590 2723614 2632785 2664570 2796240
15694 2796240 2664359 2698662 2940949 3055886 3058164 2856312 2639960 2645438 2819476 2781112
15684 2781112 2908023 2968309 2963718 2857430 2849976 2896087 2647469 2481980 2764215 2891441
15674 2891441 3010258 2871569 2805715 2930866 2896225 2547525 2513466 2789851 2721588 2586016
15664 2586016 2601800 2640891 2735466 2642787 2727937 2983619 3084149 2932217 2797331 2812913
15654 2812913 2778499 2716737 2646993 2491989 2617415 2715144 2744467 2991630 2965702 2982288 2856684
15643 2856684 2767540 2700615 2565932 2493606 2767733 2921272 2777101 2664913 2837628 2918458
$$ packed form
15716B907279j25912j41770Q8456R7750O0643o8288O9591J7801r5783k56147n9015
15705B494605L09999l5306l313R7272N2171l0555n2283j08976r0829L1785J31670
15694B796240j31881L4303K42287J14937K278k01852k16352N478J74038l8364
15684B781112J26911O0286m591j06288p454M6111k48618j65489K82235J27226
15674B891441J18817j38689o5854J25151l4641l48700l4059K76385o8263j35572
15664B586016J5784L9091R4575r2679Q5150K55682J00530j51932j34886J5582
15654B812913l4414o1762o9744j55004J25426R7729K9323K47163k5928J6586j25604
15643B856684q9144o6925j34683p2326K74127J53539j44171j12188J72715Q0830
$$ plain form
15633 2918458 2834629 2777555 2794588 2732726 2736235 2731015 2882971 2777684 2706282 2861393 3091823
15622 3091823 2888091 2643208 2474784 2470722 2765893 2791470 2785932 2838338 2881915 2900599 3008320
15611 3008320 2676470 2558892 2580184 2608144 2516821 2618999 2633172 2643899 2850327 2821713
15601 2821713 2902190 2925696 2762275 2659518 2670448 2565977 2622147 2843444 2720157 2777716
15591 2777716 2885200 2718037 2770221 2915087 2823962 2911777 2931425 2875645 2735557 2507493
15581 2507493 2628124 2818055 2815654 2904994 3005682 3043096 3080022 2939955 2773107 2868112
15571 2868112 2905872 2638126 2692356 2766751 2796619 2735265 2783862 2771539 2789868 2929332 2753730
15560 2753730 2575984 2730661 2842810 2921753 2788810 2723651 2695569 2674445 2656201 2598450
$$ packed form
15633B918458q3829n7074J7033o1862L509n220J51956j05287p1402J55111K30430
15622C091823k03732k44883j68424m062K95171K5577n538N2406M3577J8684J07721
15611C008320l31850j17578K1292K7960r1323J02178J4173J0727K06428k8614
15601B821713Q0477K3506j63421j02757J0930j04471N6170K21297j23287N7559
15591B777716J07484j67163N2184J44866r1125Q7815J9648n5780j40088k28064
15581B507493J20631J89931k401Q9340J00688L7414L6926j40067j66848R5005
15571B868112L7760k67746N4230P4395K9868o1354M8597j2323J8329J39464j75602
15560B753730j77746J54677J12149P8943j32943o5159k8082k1124j8244n7751
$$ plain form
15550 2598450 2608122 2669795 2709420 2774179 2550380 2657210 2847970 2834898 2784586 2699858 2748477
15539 2748477 2789201 2725958 2691776 2736462 2858078 2844117 2819507 2696556 2655205 2682293 2769835
15528 2769835 2889870 2845583 2818424 2610758 2604042 2685086 2706346 2579831 2760302 2925648
15518 2925648 2937953 2853954 2759509 2787651 2847386 2530369 2500064 2790814 3050316 2976098 2879027
15507 2879027 3025700 2935229 2753700 2501243 2478873 2491190 2735187 2952471 3071572 3194496
15497 3194496 3066229 2814432 2741597 2664315 2648700 2738264 2749250 2740736 2794380 2979763 2935462
15486 2935462 2643972 2507163 2684784 2896096 2960242 2703304 2593903 2882766 3006173 2767889
15476 2767889 2574351 2792707 2985147 2721814 2593930 2863769 3022325 2924046 2777371 2757337
$$ packed form
15550B598450R672O1673L9625O4759k23799J06830J90760j3072n0312q4728M8619
15539B748477M0724o3243l4182M4686J21616j3961k4610j22951m1351K7088Q7542
15528B769835J20035m4287k7159k07666o716Q1044K1260j26515J80471J65346
15518B925648J2305q3999r4445K8142N9735l17017l0305K90750K59502p4218r7071
15507B879027J46673r0471j81529k52457k2370J2317K43997K17284J19101J22924
15497C194496j28267k51797p2835p7282j5615Q9564J0986q514N3644J85383m4301
15486B935462k91490j36809J77621K11312O4146k56938j09401K88863J23407k38284
15476B767889j93538K18356J92440k63333j27884K69839J58556r8279j46675k0034
$$ plain form
15466 2757337 2848582 2836528 2581756 2569614 2757855 2837626 2941293 2689712 2882832 2994584
15456 2994584 2979443 2631038 2726995 2744665 2797691 2701282 2579726 2759830 2890091 2864076
15446 2864076 2862271 2704463 2760225 2891247 2928236 2878113 2933494 3120344 2896356 2904852 2800771
15435 2800771 2660731 2663690 2724188 2714869 3012340 3014542 2886002 2958637 2876416 2763045 2768400
15424 2768400 2672556 2765346 2898861 3022722 2845981 2856462 2756646 2810873 2715949 2514067
15414 2514067 2661509 2860749 2775754 2746209 2737202 2925985 2947362 2709009 2656839 2773018
15404 2773018 2745489 2628632 2531862 2699361 3084445 3053333 2762141 2731119 3049788 3104769
15394 3104769 2911049 2796619 2771597 2883443 2801298 2541363 2562625 2821598 3018770 2797120
$$ packed form
15466B757337R1245j2054k54772j2142J88241P9771J03667k51581J93120J11752
15456B994584j5141l48405R5957J7670N3026r6409j21556J80104J30261k6015
15446B864076j805j57808N5762J31022L6989n0123N5381J86850k23988Q496j04081
15435B800771j40040K959O0498r319K97471K202j28540P2635q2221j13371N355
15424B768400r5844R2790J33515J23861j76741J0481r9816N4227r4924k01882
15414B514067J47442J99240q4995k9545r007J88783K1377k38353n2170J16179
15404B773018k7529j16857r6770J67499L85084l1112k91192l1022L18669N4981
15394C104769j93720j14430k5022J11846q2145k59935K1262K58973J97172k21650
$$ plain form
15384 2797120 2735726 2880217 3008626 2884111 2594680 2607072 2805222 2784480 2759203 2750076
15374 2750076 2820637 2897372 2832190 2812281 2669375 2832781 2921950 2899221 2807410 2566231 2623273
15363 2623273 2706267 2776429 2940562 2936278 2902150 2748903 2691057 2581149 2611089 3045554 3085164
15352 3085164 3030621 3016838 3045716 2821681 2687942 2792795 2987718 3207750 3080254 2837389
15342 2837389 2856211 2848581 2858091 2873798 2817137 2707522 2808414 2865100 2892149 2872398 2923180
15331 2923180 3179849 3065333 2673299 2592601 2679306 2600188 2711455 2864250 2978818 3030815
15321 3030815 3000946 2574094 2649013 2790837 2654071 2730767 2947477 3125092 3008320 2912869
15311 2912869 2792259 2775293 2693721 2749646 3089378 3024925 2879167 2849319 2931419 2907961 2827337
$$ packed form
15384B797120o1394J44491J28409j24515k89431J2392J98150k0742k5277r127
15374B750076P0561P6735o5182j9909j42906J63406Q9169k2729r1811k41179N7042
15363B623273Q2994P0162J64133m284l4128j53247n7846j09908K9940M34465L9610
15352C085164n4543j3783K8878k24035j33739J04853J94923K20032j27496k42865
15342B837389J8822p630R510J5707n6661j09615J00892N6686K7049j9751N0782
15331B923180K56669j14516l92034q0698Q6705p9118J11267J52795J14568N1997
15321C030815k9869m26852P4919J41824j36766P6696K16710J77615j16772r5451
15311B912869j20610j6966q1572N5925L39732o4453j45758k9848Q2100k3458q0624
$$ plain form
15300 2827337 2819062 2913333 2896544 2808739 2820962 2714352 2638204 2759652 3141688 2986468 2786580
15289 2786580 2759101 2730613 2888208 2846755 2626587 2730335 2972663 3017230 2777945 2701527
15279 2701527 2968353 3128469 2853313 2472847 2683463 2981704 2792836 2673747 2791533
15270 2791533 3005360 3019522 3074405 3177984 3107409 2970703 2794794 2994708 3053138 3000652
15260 3000652 2879234 2696739 2851466 3053187 3153960 3104881 2955782 3143177 3077190 2741074
15250 2741074 2773916 2626400 2545981 2755278 3037083 3004937 2962660 3001881 2883414 2757325
15240 2757325 2555039 2515286 2707381 2839258 3053246 3035318 2994345 2784823 2805727 2766267
15230 2766267 2599474 2696886 2564587 2634297 2803292 3091329 3191726 3067560 2954643 3007732
$$ packed form
15300B827337q275R4271j6789q7805J2223j06610p6148J21448L82036j55220j99888
15289B786580k7479k8488J57595m1453k20168J03748K42328M4567k39285p6418
15279B701527K66826J60116k75156l80466K10616K98241j88868j19089J17786
15270B791533K13827J4162N4883J03579p0575j36706j75909J99914N8430n2486
15260C000652j21418j82495J54727K01721J00773m9079j49099J87395o5987l36116
15250B741074L2842j47516q0419K09297K81805l2146m2277L9221j18467j26089
15240B757325k02286l9753J92095J31877K13988j7928m0973k09522K0904l9460
15230B766267j66793R7412j32299O9710J68995K88037J00397j24166j12917N3089
$$ plain form
15220 3007732 2914216 2760367 2753244 2746537 2769334 3069432 3202885 2999273 2772682 2874340
15210 2874340 2696870 2585072 2758312 2841087 2953595 2953313 2783921 2978327 3128766 2858725
15200 2858725 2797302 2876227 2768774 2654029 2657279 2616252 2788882 2959172 3027949 2916024
15190 2916024 2916118 3050430 2903254 2834638 2715894 2811523 2960535 3022985 2886121 2831059 2658165
15179 2658165 2785907 2878926 2823522 3127544 3161252 3018735 2966689 2913837 2855754 3213799
$$ packed form
15220C007732r3516j53849p123o707K2797L00098J33453k03612k26591J01658
15210B874340j77470j11798J73240Q2775J12508k82j69392J94406J50439k70041
15200B858725o1423P8925j07453j14745L250m1027J72630J70290O8777j11925
15190B916024R4J34312j47176o8616j18744R5629J49012O2450j36864n5062j72894
15179B658165J27742R3019n5404L04022L3708j42517n2046n2852n8083L58045
$$ [...]
##END NTUPLES=NMR SPECTRUM
##END=
