##TITLE=1H_TG-2327-2
 CDCl3, 8 sc, 
 31.05.2021
##JCAMPDX= 6.0         $$ Bruker NMR JCAMP-DX V2.0
##DATA TYPE= NMR SPECTRUM
##DATA CLASS= NTUPLES
##ORIGIN= UXNMR, Bruker Analytische Messtechnik GmbH
##OWNER= root
$$ XWIN-NMR		Version 3.5
$$ Mon May 31 11:31:15 2021 Russian Standard Time (UT+4h)  she@DPX200
##.OBSERVE FREQUENCY= 200.131506
##.OBSERVE NUCLEUS= ^1H
##.ACQUISITION MODE= SIMULTANEOUS
##.ACQUISITION SCHEME= undefined
##.AVERAGES= 8
##.DIGITISER RES= 18
##SPECTROMETER/DATA SYSTEM= spect
##.PULSE SEQUENCE= zg30
##.SOLVENT NAME= CDCl3
##.SHIFT REFERENCE= (INTERNAL, CDCl3, 0, 15.9844)
##AUDIT TRAIL= $$ (NUMBER, WHEN, WHO, WHERE, WHAT)
$$ ##TITLE= Audit trail, XWIN-NMR		Version 3.5
$$ ##JCAMPDX= 5.01
$$ ##ORIGIN= Bruker BioSpin GmbH
$$ ##OWNER= she
$$ F:/spectra/data/she/nmr/H-F/1/pdata/1/auditp.txt
$$ ##AUDIT TRAIL=  $$ (NUMBER, WHEN, WHO, WHERE, WHAT)
(   1,<2021-05-31 11:30:11.09 +0400>,<she>,<DPX200>,
      <created by zg, POWCHK disabled, PULCHK disabled
       configuration hash MD5:
       00 E9 B6 7A A2 85 ED C7 34 08 36 98 17 FE 4E 26
       data hash MD5: 16K
       CE A6 D3 15 CA FB 72 A7 C4 4E 14 C5 B4 35 10 6E>)
(   2,<2021-05-31 11:30:13.12 +0400>,<she>,<DPX200>,
      <Start of raw data processing
       efp BC_mod = 2 LB = 0.24 FT_mod = 6 PKNL = 1 PHC0 = -11120.87 PHC1 = 11.60099 SI = 16K 
       data hash MD5: 16K
       E5 B3 73 F4 4D CC 30 90 1F B5 F6 CC B7 2B A7 9C>)
(   3,<2021-05-31 11:30:31.26 +0400>,<she>,<DPX200>,
      <pk PHC0 = 1.725545 PHC1 = 1.490116e-08 
       data hash MD5: 16K
       87 A4 73 87 FE 1D 6E F1 E7 B8 0F 7F 4A A6 A6 BA>)
(   4,<2021-05-31 11:30:36.46 +0400>,<she>,<DPX200>,
      <abs ABSG = 5 
       data hash MD5: 16K
       C1 55 28 A8 15 7B 93 F6 C0 8A 4F D1 AE D4 76 EA>)
$$ ##END=
$$ 
$$ hash MD5
$$ 48 75 B1 47 E7 7B 89 52 94 81 A6 CA 31 DF 2A 42
##$RELAX= 
##$RELAX= 
##$RELAX= 
##$RELAX= 
##$RELAX= 
##$RELAX= 
$$ Bruker specific parameters
$$ --------------------------
##$DU= <F:/spectra>
##$EXPNO= 1
##$NAME= <H-F>
##$PROCNO= 1
##$TYPE= <nmr>
##$USER= <she>
##$AMP= (0..31)
100 100 100 100 100 100 100 100 100 100 100 100 100 100 100 100 100 100 
100 100 100 100 100 100 100 100 100 100 100 100 100 100 
##$AQSEQ= 0
##$AQ_mod= 1
##$AUNM= <au_zg>
##$AUTOPOS= <>
##$BF1= 200.13
##$BF2= 200.13
##$BF3= 200.13
##$BF4= 200.13
##$BF5= 200.13
##$BF6= 200.13
##$BF7= 200.13
##$BF8= 200.13
##$BYTORDA= 1
##$CFDGTYP= 0
##$CFRGTYP= 5
##$CHEMSTR= <none>
##$CNST= (0..31)
1 1 145 1 1 1 1 1 1 1 1 1 1 1 1 1 1 1 1 1 1 1 1 1 1 1 1 1 1 1 1 1 
##$CPDPRG= <>
##$CPDPRG1= <>
##$CPDPRG2= <>
##$CPDPRG3= <>
##$CPDPRG4= <mlev>
##$CPDPRG5= <mlev>
##$CPDPRG6= <mlev>
##$CPDPRG7= <mlev>
##$CPDPRG8= <mlev>
##$CPDPRGB= <>
##$CPDPRGT= <>
##$D= (0..31)
0 1.2 0 0 0 0 0 0 0 0.06 0 0.03 0 0 0 0 0.0002 0 0 0 0 0 0 0 0 0 0 0 0 
0 0 0 
##$DATE= 1622446210
##$DBL= (0..7)
120 120 120 120 120 120 120 120 
##$DBP= (0..7)
150 150 150 150 150 150 150 150 
##$DBP07= 0
##$DBPNAM0= <>
##$DBPNAM1= <>
##$DBPNAM2= <>
##$DBPNAM3= <>
##$DBPNAM4= <>
$$ [...]
##$SUBNAM3= <"">
##$SUBNAM4= <"">
##$SUBNAM5= <"">
##$SUBNAM6= <"">
##$SUBNAM7= <"">
##$SUBNAM8= <"">
##$SUBNAM9= <"">
##$SW= 16.9725357007746
##$SWIBOX= (0..15)
0 0 2 0 0 0 0 0 0 0 0 0 0 0 0 0 
##$SW_h= 3396.73913043478
##$TD= 16384
##$TD0= 1
##$TE= 0
##$TE2= 300
##$TE3= 300
##$TEG= 300
##$TL= (0..7)
0 120 120 120 120 120 120 120 
##$TP= (0..7)
150 150 150 150 150 150 150 150 
##$TP07= 0
##$TPNAME0= <>
##$TPNAME1= <>
##$TPNAME2= <>
##$TPNAME3= <>
##$TPNAME4= <>
##$TPNAME5= <>
##$TPNAME6= <>
##$TPNAME7= <>
##$TPOAL= (0..7)
0.5 0.5 0.5 0.5 0.5 0.5 0.5 0.5 
##$TPOFFS= (0..7)
0 0 0 0 0 0 0 0 
##$TUNHIN= 0
##$TUNHOUT= 0
##$TUNXOUT= 0
##$USERA1= <user>
##$USERA2= <user>
##$USERA3= <user>
##$USERA4= <user>
##$USERA5= <user>
##$V9= 5
##$VALIST= <valist>
##$VCLIST= <CCCCCCCCCCCCCCC>
##$VD= 0
##$VDLIST= <DDDDDDDDDDDDDDD>
##$VPLIST= <PPPPPPPPPPPPPPP>
##$VTLIST= <TTTTTTTTTTTTTTT>
##$WBST= 1024
##$WBSW= 4
##$XGAIN= (0..3)
0 0 0 0 
##$XL= 0
##$YL= 0
##$YMAX_a= 945791
##$YMIN_a= -490419
##$ZGOPTNS= <>
##$ZL1= 120
##$ZL2= 120
##$ZL3= 120
##$ZL4= 120
##$ABSF1= 15.97921
##$ABSF2= -0.9934521
##$ABSG= 5
##$ABSL= 3
##$ALPHA= 0
##$AQORDER= 0
##$ASSFAC= 0
##$ASSFACI= 0
##$ASSFACX= 0
##$ASSWID= 0
##$AUNMP= <proc_1d>
##$AZFE= 0.1
##$AZFW= 0.1
##$BCFW= 0
##$BC_mod= 2
##$BYTORDP= 0
##$COROFFS= 0
##$CY= -3
##$DATMOD= 1
##$DC= 0
##$DFILT= <>
##$DTYPP= 0
##$F1P= 0
##$F2P= 0
##$FCOR= 1
##$FTSIZE= 16384
##$FT_mod= 6
##$GAMMA= 0
##$GB= 0
##$INTBC= 1
##$INTSCL= 1.334414e-10
##$ISEN= 128
##$LB= 0.24
##$LEV0= 0
##$LPBIN= 0
##$MAXI= 10000
##$MC2= 0
##$MEAN= 0
##$ME_mod= 0
##$MI= 1.114404
##$NCOEF= 0
##$NC_proc= -5
##$NLEV= 6
##$NOISF1= 3.799351
##$NOISF2= 2.8
##$NSP= 0
##$NTH_PI= 0
##$NZP= 0
##$OFFSET= 15.98439
##$PC= 1
##$PHC0= -11119.14
##$PHC1= 11.60099
##$PH_mod= 1
##$PKNL= yes
##$PPARMOD= 0
##$PSCAL= 0
##$PSIGN= 0
##$REVERSE= no
##$SF= 200.13000541488
##$SI= 16384
##$SIGF1= 3
##$SIGF2= 2
##$SINO= 5.538805
##$SIOLD= 16384
##$SREGLST= <1H.CDCl3>
##$SSB= 0
##$STSI= 16384
##$STSR= 0
##$SW_p= 3396.73913043479
##$SYMM= 0
##$S_DEV= 0
##$TDeff= 16384
##$TDoff= 0
##$TI= <>
##$TILT= no
##$TM1= 0
##$TM2= 0
##$TOPLEV= 0
##$USERP1= <user>
##$USERP2= <user>
##$USERP3= <user>
##$USERP4= <user>
##$USERP5= <user>
##$WDW= 1
##$XDIM= 16384
##$YMAX_p= 463160404
##$YMIN_p= -319498
$$ End of Bruker specific parameters
$$ ---------------------------------
##NTUPLES= NMR SPECTRUM
##VAR_NAME=  FREQUENCY,     SPECTRUM/REAL,   SPECTRUM/IMAG
##SYMBOL=    X,             R,               I
##VAR_TYPE=  INDEPENDENT,   DEPENDENT,       DEPENDENT
##VAR_FORM=  AFFN,          ASDF,            ASDF
##VAR_DIM=   16384,         16384,           16384
##UNITS=     HZ,            ARBITRARY UNITS, ARBITRARY UNITS
##FACTOR=    0.207333158178282, 1,           1
##FIRST=     3198.95610904501, 0,            0
##LAST=      -197.78302138978, 0,            0
##MIN=       -197.78302138978, -319498,      0
##MAX=       3198.95610904501, 463160404,    0
$$ Real data points
##PAGE= N=1
##DATA TABLE= (X++(R..R)), XYDATA
$$ [...]
6176B09955P4171O6009m3626l2823J6281M3999N144N6368l8332k8996N0008K0014
$$ 209955 284126 350135 306509 273686 289967 333966 339110 395478 357146 328150 378158 398172
6164C98172m4869j00266o7184N5659J4901J4003K4372k0106J0803K6552j08472
$$ 398172 353303 253037 185853 241512 256413 270416 294788 274682 285485 312037 203565
6153B03565K9308j1278j40732o8600N1820l6059r37n1493k7376K9347l8252P0646
$$ 203565 232873 221595 80863 12263 64083 28024 27087 -24406 -51782 -22435 -60687 9959
6141I959R7230k0625m7332K3749l8345j1617J804n973n1619r911L768n5893o1379
$$ 9959 107189 86564 39232 62981 24636 13019 14823 8850 -42769 -52680 -48912 -104805 -166184
6128a66184P3534N2242L5315o1198n9770P0935J6138R986J0037O1689k9777l5342
$$ -166184 -92650 -40408 -5093 -66291 -126061 -55126 -38988 -29002 -18965 42724 12947 -22395
6116b2395L7K8961j3480n6977L0377l0370r3075J8430L7144r419M7662n1312P7180
$$ -22395 -22358 6603 -6877 -63854 -33477 -63847 -156922 -138492 -101348 -110767 -63105 -114417 -37237
6103c7237K2831p3416M7739K5311p0213P4303N227M7984k0357j22777l8636m769
$$ -37237 -14406 -87822 -40083 -14772 -84985 -10682 -5455 42529 22172 -100605 -139241 -144010
6091a44010l8589R2703K7480k2926l270P1607k0126M3282j4902j7987K3780k2562
$$ -144010 -182599 -89896 -62416 -85342 -88612 -17005 -37131 6151 -8751 -26738 -2958 -25520
6079b5520m4019n0494J8813j9920P409L2270j6010m2590l953J17631l0385K2960
$$ -25520 -69539 -120033 -101220 -121140 -113731 -81461 -97471 -140061 -144014 -26383 -56768 -33808
6067c3808K6296m8493m710k0437K1952N1966n6713j5740P9916j19056L4480K8524
$$ -33808 -7512 -56005 -60715 -81152 -59200 -7234 -63947 -79687 229 -118827 -84347 -55823
6055e5823N499k3285k4873j6408N620O3610L7368K2345j1078O250M5533m6895
$$ -55823 -50324 -73609 -98482 -114890 -109270 -45660 -8292 14053 2975 9225 54758 7863
6043G863o4369p2222J392J18497p988n4467L8551m4879q139j4323O0993J20992
$$ 7863 -56506 -128728 -127336 -8839 -16827 -71294 -32743 -77622 -85761 -100084 -39091 81901
6031H1901j07040o319K5000k1170R6734j12648k9701o561o4089P5044P0435l7814
$$ 81901 -25139 -31458 -6458 -27628 69106 -43542 -73243 -79804 -143893 -68849 1586 -36228
6019c6228J32564J3413o1724l9907L6296J4160O3560j4923j0144k3121k7706m3997
$$ -36228 96336 109749 48025 8118 44414 58574 122134 107211 97067 73946 46240 2243
6007B243O6421o530m800o1892L2231R2812m8648j5309l0828P3490k0913P032M2316
$$ 2243 68664 62134 57334 -4558 27673 120485 71837 56528 25700 99190 78277 85309 127625
5994A27625q4864j5829L6646J3641j8894k5679k0647l849K552K1807L5129j4265
$$ 127625 42761 26932 63578 77219 58325 32646 11999 8150 10702 32509 67638 53373
5982E3373O6863j8344J657L1342N2976j8757J20495M4916n3848r9614k851q2409
$$ 53373 120236 101892 103549 134891 187867 169110 289605 334521 280673 181059 178208 95799
5970I5799K3558J35583m9691j4611l2440J3410J18888l3658k5315M3650k8478
$$ 95799 119357 254940 205249 190638 158198 171608 290496 256838 231523 275173 246695
5959B46695L51Q492j7376R6685k2925J2919N9806p3488M8880M1310n3496j1432
$$ 246695 247046 255538 238162 334847 311922 324841 384647 311159 360039 401349 347853 336421
5947C36421j6169N6213J6149O2269Q5227J5298o5172L3657K6610o177K0564J2823
$$ 336421 320252 376465 392614 454883 540110 555408 490236 523893 550503 544326 564890 577713
5935E77713J8822N7863J1469l4115K851k1470J19621Q1331r345R7193j1891L9479
$$ 577713 596535 654398 665867 631752 634603 613133 732754 814085 804740 901933 890042 929521
5923I29521N4293o4950N4056J11746m5997K979Q1645j7285K1761m4099N6926J9664
$$ 929521 983814 918864 972920 1084666 1038669 1041648 1123293 1106008 1127769 1083670 1140596 1160260
5911A160260j16903R4980R2905j23670p678K0071l4421l9104p0246l3864j05891
$$ 1160260 1043357 1138337 1231242 1107572 1099894 1119965 1085544 1046440 976194 942330 836439
5900H36439k9479O8601p5223l4740k570l845K562k7715j10041K079o1996k2958
$$ 836439 806960 875561 800338 765598 763028 759183 761745 734030 623989 626068 564072 541114
5888E41114N4135r1291n1210R1862q4784j11106Q5910j3345j44406L4879J4465
$$ 541114 595249 503958 452748 544610 459826 348720 434630 421285 276879 311758 326223
5877C26223l2613J3721m8992N0853n5439L0497P5561o5907n0290J6726j0769Q0447
$$ 326223 293610 307331 258339 309192 253753 284250 359811 293904 243614 260340 249571 330018
5865C30018q8635l3888R8983j36238P39j8946j52934m314P4570L027N2617m4989
$$ 330018 241383 207495 306478 170240 170979 152033 -901 -5215 69355 72382 124999 80010
5853H0010l2806l5542K7537J1333q692K4086r976j0199O9008N9204j03055L1082
$$ 80010 47204 11662 39199 50532 41840 65926 55950 45751 114759 173963 70908 101990
5841A01990M3698j20493k5905M3685o83M5277k4429p6686Q6078k76j11271R8706
$$ 101990 145688 25195 -710 42975 42292 87569 63140 -13546 72532 72256 -39015 59691
5829E9691J03885o8684p17k2626k0373K782L2936M0448l5301n4483J8470l0072
$$ 59691 163576 94892 94175 71549 51176 53958 86894 127342 92041 37558 56028 25956
5817B5956J6292R1631o8030L7534o2529O177j713p0428J06065k5185k1132K7756
$$ 25956 42248 133879 65849 103383 40854 47031 45318 -25110 80955 55770 34638 62394
5805F2394j06567J153L3093k2950J8618K3271M390R4962o5722Q9307n2343o2347
$$ 62394 -44173 -43020 -9927 -32877 -14259 9012 13402 108364 42642 131949 79606 17259
5793A7259O8037o5671M0810L5011k1728J35242M3998n4636L4560m370p7529r4551
$$ 17259 85296 19625 60435 95446 73718 208960 252958 198322 232882 228512 150983 56432
5781E6432L5502j8456k4269L3357N9628n56O3175j0485n1640m379P8865k4460
$$ 56432 91934 73478 49209 82566 142194 141638 204813 194328 142688 138309 217174 192714
5769A92714p9237O776J2862o6916L1271p4404j9093P3522k0370L4257L054k5046
$$ 192714 113477 120253 133115 66199 97470 23066 3973 77495 57125 91382 94436 69390
5757F9390L080l9595l1388N5614l0209l007P9551p423M6049j473l3416k6698J398
$$ 69390 72470 32875 1487 57101 26892 23885 103436 96013 142062 140589 107173 80475 81873
5744H1873L7963N891L4266o7884j08211M8137l427Q7000k8204o7678k2798L4158
$$ 81873 119836 125727 159993 92109 -16102 32035 28608 115608 87404 19726 -3072 31086
5732C1086J2218j0145k6807n1170M7295o4042M1980O252N0911j02647p5141O7048
$$ 31086 43304 33159 6352 -44818 2477 -61565 -19585 -13333 37578 -65069 -140210 -73162
5720g3162M2432n3655J4410L7996K3967n7894M4067K6628j0002K8280M06l5275
$$ -73162 -30730 -84385 -69975 -31979 -8012 -65906 -21839 4789 -5213 23067 23473 -11802
5708a1802m9723j12124J18096R2406j49339l9470O5941L0522n205m6383j1651
$$ -11802 -61525 -173649 -55553 36853 -112486 -151956 -86015 -55493 -60698 -107081 -118732
5697a18732K3866M7803K2024n1912l6757K2896j1492O5782n5944J3963K9039l2805
$$ -118732 -94866 -47063 -25039 -76951 -113708 -90812 -102304 -36522 -92466 -78503 -49464 -82269
5685h2269M5068M1793o0996n6852Q130j0568M5352l4096J1956L1439L7021k4378
$$ -82269 -37201 4592 -56404 -113256 -105126 -115694 -70342 -104438 -92482 -61043 -24022 -48400
5673d8400M978J1767j0982N137j7856m2284J10311n9179r9790K5095j2042m2299
$$ -48400 -43422 -31655 -42637 -37500 -55356 -97640 12671 -46508 -146298 -121203 -133245 -175544
5661a75544Q5686J2805K7952r9687l291J54908j07282L8129K7543j15887J5121
$$ -175544 -89858 -77053 -49101 -148788 -152079 2829 -104453 -66324 -38781 -154668 -139547
5650a39547N2468N0598O925p4694k0491l1452K5787M6156J5760L1106r6522M4534
$$ -139547 -87079 -36481 -29556 -104250 -124741 -156193 -130406 -84250 -68490 -37384 -133906 -89372
5638h9372L7942k7315J8158j7427K3885k4709l6902R4864m0803m4421M9328J3776
$$ -89372 -51430 -78745 -60587 -78014 -54129 -78838 -115740 -20876 -61679 -106100 -56772 -42996
5626d2996j2367m0551o2696J22507p1442q0464Q5662m5917m443J93823k5951n9972
$$ -42996 -55363 -95914 -158610 -36103 -107545 -188009 -102347 -148264 -152707 41116 15165 -44807
5614d4807m8305j7602J17273r420p860M0231K5779q1686l6371Q4813l6277p0174
$$ -44807 -93112 -110714 6559 -2861 -10721 29510 55289 -26397 -62768 22045 -14232 -84406
5602h4406L5737N4543P870j18570O8343O5181k1900N5482K3338k571m9892o5970
$$ -84406 -48669 5874 13744 -104826 -36483 28698 6798 62280 85618 83047 33155 -32815
5590c2815L6201j4366J3611J7156K7174R85k0923j7899P678J23m3113P0367J1068
$$ -32815 3386 -10980 2631 19787 46961 47946 27023 9124 16802 16925 -26188 44179 55247
5577E5247p8976K1528N9430L1615l6027q3546M3205K5375n6761n895M3318p335
$$ 55247 -23729 -2201 57229 88844 52817 -30729 12476 37851 -18910 -24805 18513 11178
5565A1178m0323j8092K6324k179l4167J6585k2637P0908k0448K1972J8778j25640
$$ 11178 -29145 -47237 -20913 -23092 -57259 -40674 -63311 7597 -12851 9121 27899 -97741
5553i7741M1861P5985m8021N8033k9343l3967J01990m0379p158N2061k6509N2643
$$ -97741 -55880 20105 -27916 30117 774 -33193 68797 28418 21260 73321 46812 99455
5541I9455k7038P787j0717l1389M2955J5386l0378n211M0349m6160j11732P8670
$$ 99455 72417 80204 69487 38098 81053 96439 66061 60850 101199 55039 -56693 21977
5529B1977o742j9676L1489N289L1598k7834K4785K9394m6661P8868q307r5019
$$ 21977 15235 -4441 27048 32337 63935 36101 60886 90280 43619 122487 114180 19161
5517A9161J7511J9578p271O6993r6338q2163N1477o1663Q17O3784K4973N8079
$$ 19161 36672 56250 48979 115972 19634 -62529 -11052 -72715 -71898 -8114 16859 74938
5505G4938n3867k6484O6918n361N7957j3123q6201l6650N819j4998J7350j5449
$$ 74938 21071 -5413 61505 56144 114101 100978 14777 -21873 -16054 -31052 -13702 -29151
5493b9151j13582L9534L1694m5327M6579K6487K2272K6004j8128n6462O8480q3094
$$ -29151 -142733 -103199 -71505 -116832 -70253 -43766 -21494 4510 -13618 -70080 -1600 -84694
5481h4694J2063P0029J619n6296n7755j2688O4128J9097K0635k3005J7910k0124
$$ -84694 -72631 -2602 -983 -57279 -115034 -127722 -63594 -44497 -23862 -46867 -28957 -49081
5469d9081Q886L2305l1415n1236J8914J3777J8456P1845n0623j4351K3888m2698
$$ -49081 -40195 -7890 -39305 -90541 -71627 -57850 -39394 32451 -18172 -32523 -8635 -51333
5457e1333J3364p1202J2437P9845j20486N8458L7770J5053J9825p4003M4761n298
$$ -51333 -37969 -109171 -96734 -16889 -137375 -78917 -41147 -26094 -6269 -80272 -35511 -40809
5445d0809o5478L4981M62j5251N8957J5137m1792j5958j5148M4883k0437l2457
$$ -40809 -106287 -71306 -70844 -86095 -27138 -12001 -53793 -69751 -84899 -40016 -60453 -92910
5433i2910R9050N4412n3474m0014L88K8338K155o4823j5060l0773K1350k5011
$$ -92910 6140 60552 7078 -32936 -32548 -4210 -2055 -66878 -81938 -112711 -91361 -116372
5421a16372N5519L2187l3722j8205j16322O0219n314L3422L712k9708j3921r742
$$ -116372 -60853 -28666 -62388 -80593 -196915 -136696 -142010 -108588 -104876 -134584 -148505 -158247
5409a58247Q05N3898J4482P452L3969j1344M6014l1823m5809M0407O4000q8886
$$ -158247 -157442 -103544 -89062 -81610 -47641 -58985 -12971 -44794 -90603 -50196 13804 -75082
5397g5082o8015L6607m4697K3570J03324r1831n9683P8915N8252o3099L0413N3105
$$ -75082 -143097 -106490 -151187 -127617 -24293 -116124 -175807 -96892 -38640 -101739 -71326 -18221
5385a8221n5569q5080L6262L5563p3433N0590R4597m7680m1321N3595N0812q8640
$$ -18221 -73790 -158870 -122608 -87045 -160478 -109888 -15291 -62971 -104292 -50697 115 -88525
5373h8525n6752j4059K7763q095L6360O2835p2551k8926j0373N8815L5472L3169
$$ -88525 -145277 -159336 -131573 -139668 -103308 -40473 -113024 -141950 -152323 -93508 -58036 -24867
5361b4867J7749j9546n7219L3891P2217j37163N459O2238k2285P8M2368j7821
$$ -24867 -7118 -26664 -83883 -49992 22225 -114938 -109479 -47241 -69526 -69448 -27080 -44901
5349d4901q4735J24124J8140j8624p2842N3743M0880m7427P3423p8090p7231Q6653
$$ -44901 -129636 -5512 12628 -5996 -78838 -25095 15785 -31642 41781 -36309 -113540 -26887
5337b6887q4270j8501Q0565l462M9654J7582j6663M3533q1474l3231P7679j935
$$ -26887 -111157 -129658 -49093 -52555 -2901 14681 -1982 41551 -39923 -73154 4525 2590
5325B590k1783L4383O629j0456j1198K945M9731j7898j26621R5555l4093k1484
$$ 2590 -19193 15190 21819 11363 165 3110 52841 34943 -91678 3877 -30216 -51700
5313e1700N8464k1786j0558J02477N3887j2413q7640J3837K2928o1729J07806
$$ -51700 6764 -15022 -25580 76897 130784 118371 30731 44568 67496 5767 113573
5302A13573j5071m9169N3242J4290n5453l6154K0688K9106n3784O781P5508j996
$$ 113573 98502 49333 102575 116865 61412 25258 45946 75052 21268 28049 103557 101561
5290A01561p7581M7210m5121m9922L6716K5952L644K9103K1510O581l8389O4744
$$ 101561 23980 71190 26069 -23853 12863 38815 42459 71562 93072 99653 61264 126008
5278A26008K4685j00313k0298Q4787P299m2073K6109L5148j8557q196L5995J4230
$$ 126008 150693 50380 30082 114869 122168 80095 106204 141352 122795 114599 150594 164824
5266A64824n3528P6343m6171j6590j1336M3386J715k3203n4332N8345k474n4934
$$ 164824 111296 187639 141468 124878 113542 156928 158643 135440 81108 139453 136979 82045
5254H2045N2334J5944j8298K320O4565k5599o8617N6739J13642j01439O837J47771
$$ 82045 134379 150323 132025 134345 198910 173311 104694 161433 275075 173636 180473 328244
5242C28244n2959m2224K6197o6414Q9831K2908p1050N4246R728j71620L2052K2356
$$ 328244 275285 233061 259258 192844 282675 305583 234533 288779 298507 126887 158939 181295
5230A81295o3766p1249n5958K7015K2967M5579Q3888j9168l8300L4474j11614
$$ 181295 117529 46280 -9678 17337 40304 85883 169771 150603 112303 146777 35163
5219C5163o4515L1455o1038O5773J3833M051P9965m3828p5676N2670Q886K4199
$$ 35163 -29352 2103 -58935 6838 20671 24722 104687 60859 -14817 37853 46739 70938
5207G0938m7169p6185P4131K9515P641L664K1754o0045j2723L2823k1927L0680
$$ 70938 23769 -52416 21715 51230 58871 62535 84289 24244 11521 44344 22417 53097
5195E3097J2331j33787K7529R5746Q1758p7447k4362J06116N8813J0526J7993
$$ 53097 65428 -68359 -40830 54916 136674 59227 34865 140981 199794 210320 228313
5184B28313l0723M848r999j8397J1849m0229m5915O3993k2760K6478M141m8189
$$ 228313 197590 202438 192439 174042 185891 145662 99747 163740 140980 167458 171599 123410
5172A23410N0223M228R6119m4402m7866J1110l2779p8479P6329p4477l4667n4172
$$ 123410 173633 177861 273980 229578 181712 192822 160043 81564 157893 83416 48749 -5423
5160e423p6611Q6694k2117j7061N0106l6540J2165o1600P4398O4214p8892k6820
$$ -5423 -82034 4660 -17457 -34518 15588 -20952 -8787 -70387 4011 68225 -10667 -37487
5148c7487O1011n2038m2254J22933q6639p8991r420K8430L5263l1497O090O7379
$$ -37487 23524 -28514 -70768 52165 -34474 -113465 -122885 -94455 -59192 -90689 -84599 -17220
5136a7220k1688L6380O1865n218l2186n3292K295R5752q2710r362J42018j12846
$$ -17220 -38908 -2528 59337 54119 21933 -31359 -29064 66688 -16022 -25384 116634 3788
5124C788q3106P7090k0704o2125m8233P5844j1894L696R6537J21049n7189p2863
$$ 3788 -79318 -2228 -22932 -85057 -133290 -57446 -69340 -65644 30893 151942 94753 21890
5112B1890N8223q8197N0755k2517j0075K4184n4762m6685R1741j4211P032J198
$$ 21890 80113 -8084 42671 20154 10079 34263 -20499 -67184 24557 10346 17378 18576
5100A8576K5679n2123m8392J14360L9060q0388R62J3196k004P996N3275k6119
$$ 18576 44255 -7868 -56260 58100 97160 16772 17734 30930 28926 36922 90197 64078
5088F4078l7907k764q1119P3510M6540q651J1165j0411j2830J268p661J0898j3983
$$ 64078 26171 23407 -57712 15798 62338 53687 64852 54441 41611 42879 35218 46116 32133
5075C2133M1955O6215l2634P385p0207k9325M1713o198m121P772m5884K8930O320
$$ 32133 74088 140303 107669 115054 44847 15522 57235 51037 46916 54688 8804 37734 44054
5062D4054l3714J03778p7219Q769Q0149n6283k7816P2334l9253l3822l4371R8323
$$ 44054 10340 114118 36899 45668 125817 69534 41718 114052 74799 40977 6606 104929
5050A04929j3729m5215L1229Q7070q6222J6153Q033l2192N2654j11693K3388Q578
$$ 104929 91200 45985 77214 164284 78062 94215 102248 70056 122710 11017 34405 42983
5038D2983k9330Q6481M889j18626O7253J0717p7164M7228K2504M0333Q1411j03632
$$ 42983 13653 100134 105023 -13603 53650 64367 -12797 34431 56935 97268 178679 75047
5026G5047j4115N5738l1304m5213P6278l6563j14410J3918P9879O227r7959R1999
$$ 75047 60932 116670 85366 40153 116431 79868 -34542 -20624 59255 65482 -32477 59522
5014E9522K0962o4813P6267K6864n3307Q7129L1001K7198L2506j5850l0856q7123
$$ 59522 80484 15671 91938 118802 65495 152624 183625 210823 243329 227479 196623 109500
5002A09500q1381j1002L8596L2232K0818J7301O3431o3322q1258L5939K8634R8277
$$ 109500 28119 17117 55713 87945 108763 126064 189495 126173 44915 80854 109488 207765
4990B07765J4775n0406K3068L9283o5980o9476l8854m62L4619o2608o8888J07469
$$ 207765 222540 172134 195202 234485 168505 99029 60175 59713 94332 31724 -37164 70305
4978G0305J2102j5637Q4664j5823l2894K8872L3196k8903J7498R5538m1559k01
$$ 70305 82407 66770 151434 135611 102717 131589 164785 135882 153380 248918 207359 207158
4966B07158n6714n668M4293n2089M5697N8059o8780p7792J56778J2097j07539
$$ 207158 150444 144776 189069 136980 182677 240736 171956 94164 250942 263039 155500
4955A55500N5280N2983j3181N2447N4381j4473r4268M6183L4972l6119m4137N8393
$$ 155500 210780 263763 250582 303029 357410 342937 248669 294852 329824 293705 249568 307961
4943C07961L3797n7423M0509N0835M2280k6768m3050Q8631J6620L2096O5752n3694
$$ 307961 341758 284335 324844 375679 417959 391191 348141 436772 453392 485488 551240 497546
4931D97546O8424r0486p4994J06764r5421k8967Q86J2788m2045l8463Q9829j9999
$$ 497546 565970 475484 400490 507254 411833 382866 383752 396540 354495 316032 405861 385862
4919C85862j8160j3703p0755J4993l6422L0700k772k3450O115L4863k4132j5850
$$ 385862 367702 353999 283244 298237 261815 292515 289743 266293 272408 307271 283139 267289
4907B67289q8424L2254j3646o4824J20014l5927q7702R8606N2333l1522l8086
$$ 267289 178865 211119 197473 132649 252663 216736 129034 227640 279973 248451 210365
4896B10365N204N0371l1996o0308k298l7958J6330J52328K6067p5238n7142k4063
$$ 210365 215569 265940 233944 173636 171338 133380 149710 302038 328105 252867 195725 171662
4884A71662Q3060K6450l1114q1308o8404L6532K6501M1542N0855O4123j4302o4939
$$ 171662 254722 281172 250058 168750 100346 136878 163379 204921 255776 319899 305597 240658
4872B40658J10050l0229l7193O0959o8031N711K2840j6274p2145k5159M3763K0142
$$ 240658 350708 320479 283286 344245 276214 281925 304765 288491 216346 191187 234950 255092
4860B55092n8450m7149J38047k5098k5069J30440K2087J042N0847k092j29651
$$ 255092 196642 149493 287540 262442 237373 367813 389900 390942 441789 439697 310046
4849C10046O9747L3999p6382l9870J9773r644L355K0382O817j118M9367l4168
$$ 310046 379793 413792 337410 297540 317313 307669 311024 331406 338223 337105 386472 352304
4837C52304J7948J6192k181l6991Q0483o1588K2400L8542l440q9367N7367M1122
$$ 352304 370252 386444 384263 347272 427755 366167 388567 427109 423669 334302 391669 432791
4825D32791J852L7661P845J6021k5795N3725J1913O6839M7494j6787N315O5204
$$ 432791 434643 472304 480149 496170 470375 524100 536013 602852 650346 633559 638874 704078
4813G04078O4741M4254o9991k216L7815J6367J11988L8792K4938P6655L3860m1599
$$ 704078 768819 813073 743082 740866 778681 795048 907036 945828 970766 1047421 1081281 1039682
4801A039682J6188n7752j2780k6353k3706k372q3621k1759Q795r7988j23820N769
$$ 1039682 1055870 998118 985338 958985 935279 932907 849286 827527 836322 738334 614514 620283
4789F20283n7685K9268k0015P3476k1638k6141K8516R2484k2341k2514J10763
$$ 620283 562598 591866 571851 645327 623689 597548 626064 718548 696207 673693 784456
4778G84456J7834j06116j6984n280Q023l1407m693J7967p3582N0520J00121l4981
$$ 784456 802290 696174 679190 673910 681933 650526 645833 663800 590218 640738 740859 705878
4766G05878o9549R6136J13790j33879K7923K5075l9965K3578L296R5807l2367
$$ 705878 636329 732465 846255 712376 740299 765374 725409 748987 752283 848090 815723
4755H15723k6686Q1645M932p1835o4633j3031J11539n713M3123M6873M114Q7452
$$ 815723 789037 870682 875614 803779 739146 726115 837654 831941 875064 921937 926051 1013503
4743A013503M4249M5395K2759m9520p0844k3294L7594O2990O791q175j4965J5840
$$ 1013503 1057752 1103147 1125906 1076386 1005542 982248 1019842 1082832 1089623 1081448 1066483 1082323
4731A082323q577N0211L9713K1631M8209l8472L9618K7690J112K3686P5332j8644
$$ 1082323 1073746 1123957 1163670 1185301 1233510 1195038 1234656 1262346 1263458 1287144 1362476 1343832
4719A343832K3111O7501n7747J45127R7946n1711L4946k9548P6883J09188M9873
$$ 1343832 1366943 1434444 1376697 1521824 1619770 1568059 1603005 1573457 1650340 1759528 1809401
4708A809401J6913L6936Q4935j642K8781Q4855N861O8926L2497k7275J12898J8419
$$ 1809401 1826314 1863250 1948185 1946543 1975324 2060179 2066040 2134966 2167463 2140188 2253086 2271505
4696B271505J16788L6679j00726J04182J50217m700L3942J7847J06203J1366K0865
$$ 2271505 2388293 2424972 2324246 2428428 2578645 2573945 2607887 2625734 2731937 2743303 2764168
4685B764168M0878l7900O4890J8618k3864J444K3087R9967P6028O8796J25045
$$ 2764168 2805046 2767146 2832036 2850654 2826790 2828234 2851321 2951288 3027316 3096112 3221157
4674C221157L052l1749M9689R0867N3078O3456J61846O5712l4614J39265Q4925
$$ 3221157 3224209 3192460 3242149 3333016 3386094 3449550 3611396 3677108 3642494 3781759 3866684
4663C866684Q793J9830J22444O4581P1770J78505J29078J81242J56291J74035
$$ 3866684 3875477 3895307 4017751 4082332 4154102 4332607 4461685 4642927 4799218 4973253
4653D973253J05959J45929J97594K25118L02225K90790L97454L26609N03820M84912
$$ 4973253 5079212 5225141 5422735 5647853 5950078 6240868 6638322 6964931 7468751 7953663
4643G953663M04320N43295N69659Q29705P86523Q51452J071205J031890J156182
$$ 7953663 8357983 8901278 9470937 10300642 11087165 11938617 13009822 14041712 15197894
4634A5197894J259176J337173J287144J317596J242440J040602Q71181N15770
$$ 15197894 16457070 17794243 19081387 20398983 21641423 22682025 23553206 24068976
4626B4068976J79930m8594o34430r13368j011083j259922j391190j513731j481766
$$ 24068976 24248906 24200312 23565882 22652514 21641431 20381509 18990319 17476588 15994822
4617A5994822j425359j303091j093247j006577r38443q30493o54241n20902m99431
$$ 15994822 14569463 13266372 12173125 11166548 10228105 9397612 8743371 8222469 7723038
4608G723038m76793l66758m05658l23200l09933l22101k68528k20710k39277k31341
$$ 7723038 7246245 6879487 6473829 6150629 5840696 5518595 5250067 5029357 4790080 4558739
4598D558739j83804j95394k48637p4248r8042j94260j15830j00130r9179j13959
$$ 4558739 4374935 4179541 3930904 3856656 3758614 3564354 3448524 3348394 3249215 3135256
4588C135256p2554j33587n2756k1104r5988j14359o745p7529j30391k1656q2561
$$ 3135256 3062702 2929115 2876359 2855255 2759267 2644908 2638163 2560634 2430243 2408587 2326026
4577B326026j08466J5972n3916o8377j11674o1767n9484J4775r817m1537j556
$$ 2326026 2217560 2233532 2179616 2111239 1999565 1937798 1878314 1893089 1883272 1841735 1840179
4566A840179m4114K703p0648r5640M6129k5753J6152L5323n0635L1052Q923q1294
$$ 1840179 1796065 1798768 1728120 1632480 1678609 1652856 1669008 1704331 1653696 1684748 1693671 1612377
4554A612377k5143l8685n4683N5245L4491O6919q6467j13600J8786j4622l1851
$$ 1612377 1587234 1548549 1493866 1549111 1583602 1650521 1564054 1450454 1469240 1454618 1422767
4543A422767K9989q3007n1510L8228j9597l433J28647L3670j37412J8423m284
$$ 1422767 1452756 1369749 1318239 1356467 1336870 1333437 1462084 1495754 1358342 1376765 1372481
4532A372481J02292M981O4951N2388r726j1368l98O7083M1766K775L3626j4507
$$ 1372481 1474773 1479754 1544705 1597093 1587367 1575999 1575601 1642684 1684450 1687225 1720851 1706344
4520A706344j591m9143k4877k2529l5466p0096p3827m0412j335o79l1227n525
$$ 1706344 1704753 1655610 1630733 1608204 1572738 1502642 1428815 1388403 1387068 1386389 1355162 1349637
4508A349637j3358N4517r7707l5720O5606R185j09277N4408K3997L667n6354L4624
$$ 1349637 1336279 1390796 1293089 1257369 1322975 1332160 1222883 1277291 1301288 1304955 1248601 1283225
4496A283225L5219o0472R1965M3365o0510l803j463Q5785N574q4051M0028k503
$$ 1283225 1318444 1257972 1349937 1393302 1332792 1328989 1327526 1413311 1418885 1334834 1374862 1372359
4484A372359J715r634j1844j3541M9822L5563R54M8004O2871Q815k7038L1363
$$ 1372359 1374074 1364440 1352596 1339055 1388877 1424440 1425394 1473398 1536269 1545084 1518046 1549409
4472A549409J73385J28183m928M0275J15636J64773J14166P5828P8301P3238J64516
$$ 1549409 1722794 1850977 1846049 1886324 2001960 2166733 2280899 2356727 2435028 2508266 2672782
4461B672782J62953n1911N5685n0329j66045j33183q3404J5495K2483n283N9788
$$ 2672782 2835735 2783824 2839509 2789180 2623135 2489952 2406548 2422043 2444526 2439243 2499031
4450B499031n5239m2504k2284L5404J60469R8137O8642J75301J41222Q4998K10719
$$ 2499031 2443792 2401288 2379004 2414408 2574877 2673014 2741656 2916957 3058179 3143177 3353896
4439C353896J66615J08017K11840K24648K49793J47026J88098K71186K11091L01486
$$ 3353896 3520511 3628528 3840368 4065016 4314809 4461835 4649933 4921119 5132210 5433696
4429E433696L04710L12520K81805L44231L39229K96300J94974Q0230j05587k21137
$$ 5433696 5738406 6050926 6332731 6676962 7016191 7312491 7507465 7587695 7482108 7260971
4419G260971l09938l56114n59084l81904l77927m93330l23451l76886l60266j95431
$$ 7260971 6951033 6594919 6035835 5653931 5276004 4782674 4459223 4082337 3722071 3526640
4409C526640k16454k24831q7333p9561k06106o1658k4662q556k6599k8437k6260
$$ 3526640 3310186 3085355 2998022 2918461 2712355 2650697 2626035 2617479 2590880 2562443 2536183
4398B536183o4651j23108o3311K2533J19482m1094J5096n748k0782K6776o3258
$$ 2536183 2471532 2348424 2285113 2307646 2427128 2386034 2401130 2395382 2374600 2401376 2338118
4387B338118j8192K6953O3235P2577K6181K8252J0535o524L3088K635m797O957
$$ 2338118 2319926 2346879 2410114 2482691 2508872 2537124 2547659 2541135 2574223 2576858 2572061 2579018
4375B579018J08617M6074P1966M1097j0416P1652R1683P2603J23380J24086K03117
$$ 2579018 2687635 2733709 2805675 2846772 2836356 2908008 2999691 3072294 3195674 3319760 3522877
4364C522877J56525J29168J79257L43363K16162K61680M06985K92564M39713L94247
$$ 3522877 3679402 3808570 3987827 4331190 4547352 4809032 5216017 5508581 5948294 6342541
4354F342541M04762M92365L47141L57403K24762J46270l2421r4170m5447n5792
$$ 6342541 6747303 7239668 7586809 7944212 8168974 8315244 8282823 8188653 8143206 8087414
4344H087414j31635N9447M8046N9294J02870K27821J28355J25432J54624J99501
$$ 8087414 7955779 8015226 8063272 8122566 8225436 8453257 8581612 8707044 8861668 9061169
4334I061169P4750J4228j24934j24941o076k7770r158J7736r944K7281l0626j66352
$$ 9061169 9135919 9150147 9025213 8900272 8894196 8866426 8857268 8875004 8865060 8892341 8861715 8695363
4322H695363k37057j56159j95864k62735j31155m9590p2849j36686L3153j22028
$$ 8695363 8458306 8302147 8106283 7843548 7712393 7662803 7589954 7453268 7486421 7364393
4312G364393l7709l6721j41586j21733j51214k43587j56048k53691k55267k05899
$$ 7364393 7326684 7289963 7148377 7026644 6875430 6631843 6475795 6222104 5966837 5760938
4302E760938j43230k18468k08415j83356j78678j26758l9863r3540j4371o2909
$$ 5760938 5617708 5399240 5190825 5007469 4828791 4702033 4662170 4568630 4554259 4491350
4292D491350n2507q4133o8901M8094l8870j2321L8192Q4939K0134J417P3102l4921
$$ 4491350 4438843 4354710 4285809 4333903 4295033 4282712 4320904 4405843 4425977 4427394 4500496 4465575
4280D465575K6962J31134R8324p333N4545J07634O2714Q5040L8852k079J57037
$$ 4465575 4492537 4623671 4721995 4714662 4769207 4876841 4939555 5024595 5063447 5061368 5218405
4269E218405R0150K0018J53510N9462P0335J48537J09315J20108J31116O0495
$$ 5218405 5308555 5328573 5482083 5541545 5611880 5760417 5869732 5989840 6120956 6181451
4259F181451p4661O7410K16236Q5939P2652P2139O7146Q3874J00390J49757K01292
$$ 6181451 6106790 6174200 6390436 6476375 6549027 6621166 6688312 6772186 6872576 7022333 7223625
4248G223625J61136J48467K44172J59236K51444K23872K62686K71144L04398L31821
$$ 7223625 7384761 7533228 7777400 7936636 8188080 8411952 8674638 8945782 9250180 9582001
4238I582001K87486M31267L74233M68506M70849M16587N19978N70700O16448O10165
$$ 9582001 9869487 10300754 10674987 11143493 11614342 12030929 12550907 13121607 13738055 14348220
4228A4348220Q41240R88649R26451J017057J208190J291743J452218J821671J973177
$$ 14348220 15189460 16178109 17104560 18121617 19329807 20621550 22073768 23895439 25868616
4219B5868616K253274K606975K850944L276981L759341M209952M836409N271989
$$ 25868616 28121890 30728865 33579809 36856790 40616131 44826083 49662492 54934481
4211E4934481N789255O251373O637033O804687O684138O214731N823488N236426
$$ 54934481 60723736 66975109 73612142 80416829 87100967 93315698 99139186 104375612
4203A04375612M055988K569643Q50106p90608j920721l460209n078114o126622
$$ 104375612 108431600 111001243 111851349 111060741 109140020 105679811 100601697 94475075
4195I4475075o789236p071129p015898o806534o529407o061145n468337m695508
$$ 94475075 87685839 80614710 73598812 66792278 60262871 54201726 48733389 44037881
4187D4037881m150800l724776l137072k744021k410611k017268j787996j617299
$$ 44037881 39887081 36162305 33025233 30281212 27870601 25853333 24065337 22448038
4179B2448038j444470j233082j112843j002295q16285q24489p74166p74393o13855
$$ 22448038 21003568 19770486 18657643 17655348 16839063 16014574 15240408 14466015 13852160
4170A3852160n46869n13371m71715m60190l51990m33287l72530l08193m33641
$$ 13852160 13305291 12791920 12320205 11860015 11508025 11074738 10702208 10394015 9960374
4161I960374k62298l38356l14917k02066l85809l34899l09615k15819k45824k36062
$$ 9960374 9698076 9359720 9044803 8842737 8456928 8122029 7812414 7596595 7350771 7114709
4151G114709k05462k12602k69278j93871k52930k81402k39267r8326k11858p291
$$ 7114709 6909247 6696645 6427367 6233496 5980566 5699164 5459897 5361571 5149713 5142422
4141E142422o3178j79459j23752r7029r4098j19722p7065j60092m5967l6396o5951
$$ 5142422 5079244 4899785 4776033 4679004 4584906 4465184 4388119 4228027 4182060 4145664 4079713
4130D079713l4049j14508K20M121n6904o5314q7061J8769j06206m9674q171j68977
$$ 4079713 4045664 3931156 3931376 3935497 3878593 3813279 3726218 3744987 3638781 3589107 3580936 3411959
4118C411959j43679l197r0450j93595k5197l2126p9162k8906l9665m2183q5746
$$ 3411959 3268280 3265083 3174633 2981038 2955841 2923715 2844553 2815647 2775982 2733799 2648053
4107B648053j23325m3987j07550q0103N9294l0815l20n2367K1343r2549n9656
$$ 2648053 2524728 2480741 2373191 2293088 2352382 2321567 2321247 2268880 2290223 2197674 2138018
4096B138018l7932j262p8240n2006r877j30746N0347M1837p0681P3009m7559o7905
$$ 2138018 2100086 2098824 2020584 1968578 1958701 1827955 1878302 1920139 1849458 1922467 1874908 1807003
4084A807003m4196m1244n2792L7717J11351j10655l1249P4950l1995j22076J5388
$$ 1807003 1762807 1721563 1668771 1706488 1817839 1707184 1675935 1750885 1718890 1596814 1612202
4073A612202P3123k4765K1795K3861l2479j25217J5399P234j10419j9161l2111
$$ 1612202 1685325 1660560 1682355 1706216 1673737 1548520 1563919 1571153 1460734 1441573 1409462
4062A409462n7620r3945n650L6155n7470N531o3985n4123P570p6252k0093L6322
$$ 1409462 1351842 1257897 1252247 1288402 1230932 1236463 1172478 1118355 1125925 1049673 1029580 1065902
4050A065902L0899k8061M2352j108j55733M6100L9558p5049P233L5490o723j6088
$$ 1065902 1096801 1068740 1111092 1109984 954251 1000351 1039909 964860 972093 1007583 1000860 984772
4038I84772J2962l1493j3111L012L521j28294j8640K9106N4553L8425J7473l1784
$$ 984772 997734 966241 953130 956142 959663 831369 812729 841835 896388 934813 952286 920502
4026I20502m5794n3866j9481r150j8137k6792L5179J3106L3925J5540K5448k114
$$ 920502 874708 820842 801361 792211 774074 747282 782461 795567 829492 845032 870480 868366
4014H68366p0862l5879R9490l2199k0918L5807Q0186k2852K7629P221N1103j5053
$$ 868366 797504 761625 861115 828916 807998 843805 923991 901139 928768 935989 987092 972039
4002I72039J04184K051k4890L2623k2491Q1306q4304K6766K8100J2229k5248o3068
$$ 972039 1076223 1078274 1053384 1086007 1063516 1144822 1060518 1087284 1115384 1127613 1102365 1039297
3990A039297j1384l9248o4325P4640n9233p8900P1055R9923k3223J512O3430O0815
$$ 1039297 1027913 988665 924340 998980 939747 860847 931902 1031825 1008602 1010114 1073544 1134359
3978A134359N2157J02978J64705L7100J5554J03154M671R7438l0707J68530j9441
$$ 1134359 1186516 1289494 1454199 1491299 1506853 1610007 1614678 1712116 1681409 1849939 1830498
3967A830498j21885K7573K1361L5480m8558j8940J804o367P7590M2502j5819j3112
$$ 1830498 1708613 1736186 1757547 1793027 1744469 1725529 1727333 1720966 1798556 1841058 1825239 1812127
3955A812127q775j1678L0467J4993p1414n0564l6329n4651n2626j50067n8894
$$ 1812127 1803352 1791674 1822141 1837134 1765720 1715156 1678827 1624176 1571550 1421483 1362589
3944A362589j1573q356K7063k5320o7159J6671k7701n409N8390m2738L172L1892
$$ 1362589 1351016 1342660 1369723 1344403 1277244 1293915 1266214 1260805 1319195 1276457 1279629 1311521
3932A311521o9201K0503Q776l4777j0471m3635P8053O8360k8395J0991M5195n0452
$$ 1311521 1242320 1262823 1271599 1236822 1226351 1182716 1260769 1329129 1300734 1311725 1356920 1306468
3920A306468M7868k1943j36862M3177o2723p9664Q6160o5125o5820P224P955k4455
$$ 1306468 1354336 1332393 1195531 1238708 1175985 1096321 1182481 1117356 1051536 1058760 1066715 1042260
3908A042260M1544r2563p2479p994l3084n0085p0546L0181k4960o7747O1970P4726
$$ 1042260 1083804 991241 918762 910768 877684 827599 757053 787234 762274 694527 756497 831223
3896H31223n4614m2952J16995K4985J7654o0490M8071Q8819J9532Q1063M2321
$$ 831223 776609 733657 850652 875637 893291 832801 880872 969691 989223 1070286 1112607
3885A112607J9217O8585J46895R842Q77P8065k0729J13303L444o2789R4423j10408
$$ 1112607 1131824 1200409 1347304 1357146 1358023 1436088 1415359 1528662 1532106 1469317 1563740 1453332
3873A453332R5623L4898p891R2407O1963K9925l0262q093M3620l2607p2298k4574
$$ 1453332 1548955 1583853 1575962 1668369 1730332 1760257 1729995 1721902 1765522 1732915 1660617 1636043
3861A636043k0961k7582p9485m549m6138k5111P5343m3852O596Q7494j897M3615
$$ 1636043 1615082 1587500 1508015 1503466 1457328 1432217 1507560 1463708 1470304 1557798 1555901 1599516
3849A599516l9922j9609K1857j75039o9029J2394n814o7056k8050m8747j15449
$$ 1599516 1559594 1539985 1561842 1386803 1317774 1330168 1324354 1257298 1229248 1180501 1065052
3838A065052p2278J0452m3000o1159j6255r1132M6981m5010Q590K3112k1575n3997
$$ 1065052 992774 1003226 960226 899067 882812 791680 838661 793651 802241 825353 803778 749781
3826G49781M974L1893o3314j23240M0388m2359k462N4079o3062J2413K8820m867
$$ 749781 754755 786648 723334 600094 640482 598123 595661 649740 586678 599091 627911 623044
3814F23044L2898J8801l54O9415J27077j7579p0570j9090m4367k642k7362K3342
$$ 623044 655942 674743 674389 743804 870881 853302 782732 763642 719275 716633 689271 712613
3802G12613n3671l0371L2585K3917k6711Q5945l711j9000N8886l0748N5247K2270
$$ 712613 658942 628571 661156 685073 658362 744307 740596 721596 780482 749734 804981 827251
3790H27251j848j0639p595M5321o0132Q9528J04323P0991m8533n7093R7986m3947
$$ 827251 825403 814764 807169 852490 792358 881886 986209 1057200 1008667 951574 1049560 1005613
3778A005613R9004N6974J8316R6160P0092O635K2337J501p1361N6648M8077q1591
$$ 1005613 1104617 1161591 1179907 1276067 1346159 1352794 1375131 1376632 1305271 1361919 1409996 1328405
3766A328405k2533J03739M6747R796R5863K9718j7549N1225L4073j9623K9254
$$ 1328405 1305872 1409611 1456358 1466154 1562017 1591735 1574186 1625411 1659484 1639861 1669115
3755A669115O6382q243j19937Q8809o6320o7047J03019n8266j9704J5901p835
$$ 1669115 1735497 1727254 1607317 1696126 1629806 1562759 1665778 1607512 1587808 1603709 1595874
3744A595874l2000O7339l032J8375M3297k7523q853n3468J7952l5110k8901L5414
$$ 1595874 1563874 1631213 1628181 1646556 1689853 1662330 1653477 1600009 1617961 1582851 1553950 1589364
3732A589364O112N1438J0496L9048N0258M4676n998L4609O9315l843O5705N8448
$$ 1589364 1595476 1646914 1657410 1696458 1746716 1791392 1785394 1820003 1889318 1885475 1951180 2009628
3720B009628J2415j272Q8199J45807o1643O0951J21113o2852M7361J60862P2152
$$ 2009628 2022043 2020771 2108970 2254777 2193134 2254085 2375198 2312346 2359707 2520569 2592721
3709B592721M0443R6346J40428J17257R9615J29314J34331L5046J65497M7086
$$ 2592721 2633164 2729510 2869938 2987195 3086810 3216124 3350455 3385501 3550998 3598084
3699C598084J12909K18214M8143R8742J35488J13123R7880J54956J12028P5579
$$ 3598084 3710993 3929207 3977350 4076092 4211580 4324703 4422583 4577539 4689567 4765146
3689D765146J92239J08886Q7954P5498P5051M908N9371K789p3158J8642k7228
$$ 4765146 4957385 5066271 5154225 5229723 5304774 5309682 5369053 5371842 5298684 5317326 5290098
3678E290098j35230j11438n1203j97935j44237q5722j76139j16835r6068j73629
$$ 5290098 5154868 5043430 4992227 4794292 4650055 4564333 4388194 4271359 4175291 4001662
3668D001662j46765j50353j75698L7028j08639j36872n3643l1800k0128j38604
$$ 4001662 3854897 3704544 3528846 3565874 3457235 3320363 3266720 3234920 3214792 3076188
3658C076188o0053M7386J0026o266J0159k2819Q4604N4105L9447P1688L8793O4062
$$ 3076188 3016135 3063521 3073547 3067281 3077440 3054621 3139225 3193330 3232777 3304465 3343258 3407320
3646C407320O0418o2790J4237J44886N6981M8036Q2988R2095K18860J26492J66711
$$ 3407320 3467738 3404948 3419185 3564071 3621052 3669088 3752076 3844171 4063031 4189523 4356234
3635D356234K71780K15223K21491K40816L91080K92883K92185L31351L31793M80053
$$ 4356234 4628014 4843237 5064728 5305544 5696624 5989507 6281692 6613043 6944836 7424889
3625G424889L62236M57976N74660O35335N93961P35323Q22326P67669P81016Q75951
$$ 7424889 7787125 8245101 8819761 9455096 10049057 10784380 11606706 12374375 13155391 14031342
3615A4031342Q12830N50158M78426K40814k48469n29736q24086r80704j025674
$$ 14031342 14844172 15394330 15872756 16113570 15865101 15335365 14511279 13530575 12504901
3606A2504901r33758q27825q44069p32885o33347o32008l90177m45735l87807
$$ 12504901 11571143 10743318 9899249 9166364 8533017 7901009 7510832 7065097 6677290
3597F677290k48986l19754k97605j82749j98028k22958k43003j75929j59435j17971
$$ 6677290 6428304 6108550 5810945 5628196 5430168 5207210 4964207 4788278 4628843 4510872
3587D510872o5051j53713j35282m4555q975J4561j29761J8780L1666l2566O4756
$$ 4510872 4445821 4292108 4156826 4112271 4103296 4117857 3988096 4006876 4038542 4005976 4070732
3576D070732K1246j2322K2833k165m8054R2217K765j28197J03452J28027N8158
$$ 4070732 4091978 4079656 4102489 4100324 4052270 4144487 4147252 4019055 4122507 4250534 4308692
3565D308692N2868J13049J90535J08611Q5775K08101L40524J55041L44104L10521
$$ 4308692 4361560 4474609 4665144 4773755 4859530 5067631 5408155 5563196 5907300 6217821
3555F217821L18923M06009L96959M64013N41347N78565O51437O78550P82094R18127
$$ 6217821 6536744 6942753 7339712 7803725 8345072 8923637 9575074 10253624 11035718 11953845
3545A1953845R03997Q65134P68870N74644L06973o0518n69800p58097j060989
$$ 11953845 12857842 13722976 14491846 15066490 15373463 15312945 14743145 13985048 12924059
3536A2924059j119521j037774j006322q55888p69403o44433n57757l90812m40769
$$ 12924059 11804538 10766764 9760442 8904554 8135151 7490718 6932961 6542149 6101380
3527F101380k96812l19324k73821k51207k00171j27890j78196k08088p0621m6749
$$ 6101380 5804568 5485244 5211423 4960216 4760045 4632155 4453959 4245871 4175250 4128501
3517D128501o9496l4246L6442L8660k7910j755L8336n6181k9137O4309J15196
$$ 4128501 4059005 4024759 4061201 4099861 4071951 4070196 4108532 4052351 4023214 4087523 4202719
3506D202719l7759J129O2640O1164K0811k6756L4674Q9699k2456q4134k7830n730
$$ 4202719 4164960 4166089 4228729 4289893 4310704 4283948 4318622 4408321 4385865 4301731 4273901 4268171
3494D268171k2245k1148O6427j04528m8794J68537o1189l2907O4811j3473l6843
$$ 4268171 4245926 4224778 4291205 4186677 4137883 4306420 4245231 4212324 4277135 4263662 4226819
3483D226819L8878Q784j0728M324M1754N2234j7759Q8764N0039K7368K26407Q732
$$ 4226819 4265697 4274481 4263753 4268077 4309831 4362065 4344306 4433070 4483109 4510477 4736884 4745616
3471D745616N3724J83383O5740J17193Q1146R8324J28203J38857P1652K48834
$$ 4745616 4799340 4982723 5048463 5165656 5246802 5345126 5473329 5612186 5683838 5932672
3461E932672K54702J79291K86719K46871J71409K43730J96385L44593K99971L40664
$$ 5932672 6187374 6366665 6653384 6900255 7071664 7315394 7511779 7856372 8156343 8497007
3451H497007M84997M80605M41540Q90032Q05264P84614J080269J069770J338894
$$ 8497007 8982004 9462609 9904149 10794181 11599445 12384059 13464328 14534098 15872992
3442A5872992J478080J562984J903714K218483K605445K910568L087976L093655
$$ 15872992 17351072 18914056 20817770 23036253 25641698 28552266 31640242 34733897
3434C4733897K797664K462125K409949K042127J125381m15429k245205l573790
$$ 34733897 37531561 39993686 42403635 44445762 45571143 45155714 42910509 39336719
3426C9336719l689704l374219l231429l222381l044160k551036k041214j817998
$$ 39336719 35647015 32272796 29041367 25818986 22774826 20223790 18182576 16364578
3418A6364578j354038j139751j094518q03560p15458o53023n56549n38912l94872
$$ 16364578 15010540 13870789 12776271 11972711 11257253 10604230 10047681 9508769 9113897
3409I113897m03429l12361k12319k56673j00776j99275j16193j54749q0899j19019
$$ 9113897 8710468 8398107 8185788 7929115 7828339 7629064 7512871 7358122 7277223 7158204
3399G158204j58883j00273j02045q6814o1532j2613l4794j02625r6955n7550k0523
$$ 7158204 6999321 6899048 6797003 6710189 6648657 6636044 6601250 6498625 6401670 6344120 6323597
3388F323597p5774K9140j44112j07593j25140j74268l6325j29802q2960l5726
$$ 6323597 6247823 6276963 6132851 6025258 5900118 5725850 5689525 5559723 5476763 5441037
3378E441037j92689j78857j04779j47994n3390L7338j21132r5849o2305N4882
$$ 5441037 5248348 5069491 4964712 4816718 4763328 4800666 4679534 4583685 4521380 4576262
3368D576262J3835J4419L3047J08600M7511q8499q0111K8740L9926q054k3250
$$ 4576262 4590097 4604516 4637563 4746163 4793674 4705175 4625064 4653804 4693730 4685676 4662426
3357D662426m5595M2187J5501M2788M4712L6044J64634J23489k7473J3164R6897
$$ 4662426 4616831 4659018 4674519 4717307 4762019 4798063 4962697 5086186 5058713 5071877 5168774
3346E168774M9403N1356r428J1950J16886M6354J52966Q8799J55192J66918K00777
$$ 5168774 5218177 5269533 5260105 5272055 5388941 5435295 5588261 5677060 5832252 5999170 6199947
3335F199947J23887J21988J97188K55138J65544J90331J65567K60211K61885J87469
$$ 6199947 6323834 6445822 6643010 6898148 7063692 7254023 7419590 7679801 7941686 8129155
3325H129155J19535J04647Q0172J00107N0582L8600j1334j9849Q8800q5101q477
$$ 8129155 8248690 8353337 8433509 8533616 8584198 8622798 8611464 8591615 8680415 8595314 8586837
3314H586837j260j02532o9008k3649j286j04874j8479L5112k8871J0369R6585
$$ 8586837 8585577 8483045 8414037 8390388 8389102 8284228 8265749 8300861 8271990 8282359 8378944
3303H378944J871j1165J08267J23457M4043K3797J71597P2645q1820J31186J48453
$$ 8378944 8380815 8369650 8477917 8601374 8645417 8669214 8840811 8913456 8831636 8962822 9111275
3292I111275P3182J76506R0171J67884P0006N4715K43003K60338J44820K65884
$$ 9111275 9184457 9360963 9451134 9619018 9689024 9743739 9986742 10247080 10391900 10657784
3282A0657784J81470K71703L67863K52618L67971M01651M04518M79118L75723
$$ 10657784 10839254 11110957 11478820 11731438 12099409 12501060 12905578 13384696 13760419
3273A3760419L62063M73469N26799N09509N94153N55805N76086O57509O68873
$$ 13760419 14122482 14595951 15122750 15632259 16226412 16782217 17358303 18015812 18684685
3264A8684685P86094Q43167R44683J172010J181829J378581J578514J713053J930211
$$ 18684685 19470779 20313946 21258629 22430639 23612468 24991049 26569563 28282616 30212827
3255C0212827K187164K368750K801676L296010L562313M344331M946814N437101
$$ 30212827 32399991 34768741 37570417 40866427 44428740 48773071 53719885 59156986
3247E9156986N762924N799071O056312N913705O238833O439527N481894M078457
$$ 59156986 64919910 70718981 76775293 82688998 88927831 95367358 100849252 104927709
3239A04927709L326766L486366L912836L618055K284225J0120m312818q937342
$$ 104927709 108254475 111740841 115653677 119271732 121555957 121566077 117253259 108315917
3231A08315917j0596440j0553702r900571q581926o942405n457504m447260l613543
$$ 108315917 97719477 87165775 77265204 68683278 61740873 56283369 51836109 48222566
3223D8222566k923393k364244k012405j474705j062089p74428n86481l22534q3882
$$ 48222566 45299173 42934929 40922524 39447819 38385730 37611302 37024821 36702287 36618405
3214C6618405J79211L89464O04566R38700J373375J608793J629159J798632K044930
$$ 36618405 36797616 37187080 37791646 38730346 40103721 41712514 43341673 45140305 47185235
3205D7185235K340011K285837J518393N95951K5844r64472j946757k116665k032376
$$ 47185235 49525246 51811083 53329476 53925427 53951271 52986799 51040042 48923377 46891001
3196D6891001j743584j194773o52636N7680L71556P26869J169948J405819J916522
$$ 46891001 45147417 43952644 43300008 43357688 43729244 44456113 45626061 47031880 48948402
3187D8948402K358594K799107L367024L782950L899811L854015L656577L942190
$$ 48948402 51306996 54106103 57473127 61256077 65155888 69009903 72666480 76608670
3179G6608670M076729L818256K908202J127342o60037j991122l141896m386864
$$ 76608670 80685399 84503655 87411857 88539199 87879162 85888040 82746144 78359280
3171G8359280n365816n859465n980182n550599m940538m389225l791925l033026
$$ 78359280 72993464 67133999 61153817 55603218 50662680 46273455 42481530 39448504
3163C9448504k581873k228420j991643j734536j580887j462535j317643j129919
$$ 39448504 36866631 34638211 32646568 30912032 29331145 27868610 26550967 25421048
3155B5421048r42627r38597q32605o93843p32042p27159m38716m62367n81147
$$ 25421048 24478421 23539824 22707219 22013376 21281334 20554175 20115459 19653092 19071945
3146A9071945m27647l65167k16893k03866q9566j11677k08354k2850J8791j41405
$$ 19071945 18644298 18279131 18062238 17858372 17768806 17657129 17448775 17425925 17444716 17303311
3136A7303311L7770O4338j17927j06251p130L9442m6271l4609K2678N6733J27102
$$ 17303311 17341081 17405419 17287492 17181241 17174111 17213553 17167282 17132673 17155351 17212084 17339186
3125A7339186J92338K01779K49472K56498K86665K34889J17603J8652k8503j42136
$$ 17339186 17531524 17733303 17982775 18239273 18525938 18760827 18878430 18897082 18868579 18726443
3115A8726443j65849m8912R7185J07025q699J61481Q8132J84744M01645N05795
$$ 18726443 18560594 18511682 18608867 18715892 18707193 18868674 18956806 19141550 19543195 20048990
3105B0048990N82714N99902Q10284P63188R15549J072067J192336J266265J340205
$$ 20048990 20631704 21231606 22041890 22805078 23720627 24792694 25985030 27251295 28591500
3096B8591500J571922J548250J698265J590303J183163O79103J41216k64188p41885
$$ 28591500 30163422 31711672 33409937 35000240 36183403 36862506 37003722 36739534 35997649
3087C5997649j083589j342889j175689j004924r58744p58094o71628n36894m35137
$$ 35997649 34914060 33571171 32395482 31390558 30431814 29673720 29002092 28465198 28030061
3078B8030061k97624j00786j96383j83819P3103J85446J14041J77811K84106M21261
$$ 28030061 27732437 27631651 27435268 27251449 27324552 27509998 27624039 27801850 28085956 28507217
3068B8507217L97611L47572M24283L74600L88221N52544N54460O43666P08898
$$ 28507217 28904828 29252400 29676683 30051283 30439504 30992048 31546508 32190174 32899072
3059C2899072Q41912Q92806Q11751Q27384J060322J014410J214145J267621J426698
$$ 32899072 33740984 34633790 35445541 36272925 37333247 38347657 39561802 40829423 42256121
3050D2256121J577623J669563J888509K175494K173147K404166K633836K930632
$$ 42256121 43833744 45503307 47391816 49567310 51740457 54144623 56778459 59709091
3042E9709091L171754L618045M004373M429664N129345O131139O984524Q072236
$$ 59709091 62880845 66498890 70503263 74932927 80062272 86193411 93177935 101250171
3034A01250171R101821J0624366J2032133J3786483J5153544J6758516J8471076
$$ 101250171 110351992 120976358 133008491 146794974 161948518 178707034 197178110
3027A97178110K0343183K2263115K5082412K7432453K8954793L0244933L0828156
$$ 197178110 217521293 239784408 264866820 292299273 321254066 351498999 382327155
3020C82327155K8446462J9216756J7072511J6097520j5014301m8665329m4909343
$$ 382327155 410773617 429990373 447062884 463160404 448146103 399480774 354571431
3013C54571431l5837488l9464976l8329673l1478645k5080082k0115891j6842611
$$ 354571431 318733943 279268967 240939294 209460649 184380567 164264676 147422065
3006A47422065j3977314j1889690r950808q831165p520308o423344n599189n191600
$$ 147422065 133444751 121555061 111604253 102773088 95252780 88829436 83230247 78038647
2998G8038647m781618m228692l466108l154534k795358k464730k286223k215198
$$ 78038647 73257029 69028337 65562229 62407695 59612337 57147607 54861384 52646186
2990E2646186j961992j775616j722124j570478j388822j210263j097111j188636
$$ 52646186 50684194 48908578 47186454 45615976 44227154 43016891 41919780 40731144
2982D0731144j062365j013908j061506q88808q98708r33241p79779o36385p74864
$$ 40731144 39668779 38654871 37593365 36704557 35805849 34872608 34092829 33456444 32681580
2973C2681580o04422p28323q46573p65063p13323n82702o48323n71676n72877
$$ 32681580 32077158 31348835 30502262 29737199 29023876 28441174 27792851 27221175 26648298
2964B6648298n20713m77558m48836n40418m80796l80336m74508l42049k90830
$$ 26648298 26127585 25650027 25201191 24660773 24179977 23799641 23325133 22983084 22692254
2955B2692254l15673l28545k96474k02445k25481j63954o2145j58622p8024j54532
$$ 22692254 22376581 22048036 21751562 21549117 21323636 21159682 21097537 20938915 20860891 20706359
2945B0706359N0105Q4607K8149K5572J27412J68121K44679L10861L69525L68499
$$ 20706359 20756464 20841071 20869220 20894792 21022204 21190325 21435004 21745865 22115390 22483889
2935B2483889N17313O77735P23953O20098N27526K54307j62370n63767q84295
$$ 22483889 23001202 23678937 24402890 25022988 25550514 25804821 25642451 25078684 24194389
2926B4194389j076346j230205j192067j232600j252474r85474r02657q12818o74401
$$ 24194389 23118043 21887838 20695771 19463171 18210697 17225223 16322566 15509748 14835347
2917A4835347n87245n69707n17578l76220l21208m74944j97592k50595l33875
$$ 14835347 14248102 13678395 13160817 12784597 12463389 11988445 11790853 11540258 11206383
2908A1206383k76288k32572k11484j65675N694j4013p5811o0957j7062J7997J1499
$$ 11206383 10930095 10697523 10486039 10320364 10326058 10312045 10236234 10175277 10158215 10176212 10187711
2897A0187711M8421J12053R9277J45939Q5088n550N7531q5331J9218K0770o4181
$$ 10187711 10236132 10348185 10447462 10593401 10678489 10672939 10730470 10645139 10664357 10685127 10620946
2886A0620946k45680j00828j14925j74842k41106j45674n0244j17432p2709l1012
$$ 10620946 10375266 10274438 10159513 9984671 9743565 9597891 9547647 9430215 9357506 9326494
2876I326494L9824J45231K28259J46869K09076K50753K98183M55900M58503L00848
$$ 9326494 9366318 9511549 9739808 9886677 10095753 10346506 10644689 11100589 11559092 11859940
2866A1859940M77990O20307N91893N62958P61930P56438O50960M48284K24741
$$ 11859940 12337930 12958237 13550130 14113088 14875018 15631456 16282416 16730700 16955441
2857A6955441j52956n85914q23897r46415r69830r70785p64009o64271n96319
$$ 16955441 16802485 16216571 15392674 14446259 13476429 12505644 11741635 11077364 10481045
2848A0481045n78242m61675l10733l58542l55392k75058l33436k94073l01360
$$ 10481045 9902803 9441128 9130395 8771853 8416461 8141403 7807967 7513894 7212534
2839G212534j11281j15303j80135j2735J4841j58796r3504O0216j6437k2513m1011
$$ 7212534 7101253 6985950 6805815 6793080 6807921 6649125 6555621 6615837 6599400 6576887 6535876
2828F535876J7937p4180l8091n986M4159K2752k9401r8112K825j6104K2617J9323
$$ 6535876 6553813 6479633 6441542 6435556 6479715 6502467 6473066 6374954 6377779 6361675 6384292 6403615
2816F403615j2875m6934K8972Q2830k9285j67984P5286Q3656n0366l8533J3497
$$ 6403615 6390740 6343806 6372778 6455608 6426323 6258339 6333625 6417281 6366915 6328382 6341879
2805F341879N4784O3422N6881N8236K2217N8194J31586J36647P3210m5716O9462
$$ 6341879 6396663 6460085 6516966 6575202 6597419 6655613 6787199 6923846 6997056 6951340 7020802
2794G020802N9952n3865m3972J9927N7368n1552N1797J68284N0350l3555J45307
$$ 7020802 7080754 7026889 6982917 7002844 7060212 7008660 7060457 7228741 7279091 7245536 7390843
2783G390843j831J1086J15351J42253J22645J01054J49019P7739J22761K92948
$$ 7390843 7389012 7400098 7515449 7657702 7780347 7881401 8030420 8108159 8230920 8523868
2773H523868J34682R9227J73403K03982J85488L41245K59708L34161K96122L74754
$$ 8523868 8658550 8757777 8931180 9135162 9320650 9661895 9921603 10255764 10551886 10926640
2763A0926640M42499M49560N06494N91268N69550M76544O72144P92029P03049
$$ 10926640 11369139 11818699 12325193 12916461 13486011 13962555 14634699 15426728 16129777
2754A6129777O94605P18317P62595O09518O42675Q55428O21155Q38837P81625
$$ 16129777 16824382 17542699 18305294 18914812 19557487 20412915 21034070 21872907 22654532
2745B2654532J005612J021972J110901J252147J473893J645853J913185K214776
$$ 22654532 23660144 24682116 25793017 27045164 28519057 30164910 32078095 34292871
2737C4292871K412777K724261L237069L728152M257320M792981N409099N837230
$$ 34292871 36705648 39429909 42666978 46395130 50652450 55445431 60854530 66691760
2729F6691760N923035N637171M835133K846978J57535j854034l581556n745877
$$ 66691760 72614795 78251966 83087099 85934077 86091612 84237578 80656022 74910145
2721G4910145o969048o733112n953491n311115m431792l513884k762064k188644
$$ 74910145 67941097 61207985 55254494 49943379 45511587 41997703 39235639 37046995
2713C7046995j686395j228872q71591p20328n05363j39838n50p67K04931L27117
$$ 37046995 35360600 34131728 33260137 32539809 32034446 31894608 31894058 31893291 32098222 32425339
2703C2425339M16386M91562L36304J29763k2895m19476q35409j092298j274651
$$ 32425339 32841725 33333287 33669591 33799354 33776459 33356983 32521574 31429276 30154625
2694C0154625j341059j366811j206927j076506r66157p43903o45949o21003l73100
$$ 30154625 28813566 27446755 26239828 25163322 24197165 23453262 22807313 22186310 21813210
2685B1813210m94168l42099k21299k61560k31442k65929k98642l05274l04376
$$ 21813210 21319042 20976943 20755644 20494084 20262642 19996713 19698071 19392797 19088421
2676A9088421j70833j46469k70913j63574k51272k28955q0253j96801q8208j6960
$$ 19088421 18917588 18771119 18500206 18336632 18085360 17856405 17776152 17579351 17491143 17474183
2666A7474183O0078p164O8002J93237K25310K13773K55609K75359M75607N70871
$$ 17474183 17534261 17527097 17595099 17788336 18013646 18227419 18483028 18758387 19233994 19804865
2656A9804865O06266O95884Q62617Q69991Q45398J107121J281931J290591J446787
$$ 19804865 20411131 21107015 21969632 22839623 23685021 24792142 26074073 27364664 28811451
2647B8811451J751219J812627J903603K133818K251239K119584K203005K236345
$$ 28811451 30562670 32375297 34278900 36412718 38663957 40783541 42986546 45222891
2639D5222891K046565J932744J709518J474990J204331N95465K22772j96060n68331
$$ 45222891 47269456 49202200 50911718 52386708 53591039 54186504 54409276 54213216 53644885
2630E3644885r02192j093063j153296j324158j392656j484929j518815j543078
$$ 53644885 52742693 51649630 50496334 49172176 47779520 46294591 44775776 43232698
2622D3232698j574582j450902j548760j596674j639647j710714j716079j649568
$$ 43232698 41658116 40207214 38658454 37061780 35422133 33711419 31995340 30345772
2614C0345772j605840j602522j439971j405569j307444j174500j004420r22554
$$ 30345772 28739932 27137410 25697439 24291870 22984426 21809926 20805506 19882952
2606A9882952r22841p73527o82608q14588o42816n14866n92413n62876l43706
$$ 19882952 18960111 18186584 17503976 16689388 16046572 15531706 14939293 14376417 14032711
2597A4032711m43099l83251l63768l51879l63394m25683k32320k51054l21456
$$ 14032711 13589612 13206361 12842593 12490714 12127320 11701637 11469317 11218263 10896807
2588A0896807l04271k60506k53144k73136k96709k83346k48942k07344k42710
$$ 10896807 10592536 10332030 10078886 9805750 9509041 9225695 8976753 8769409 8526699
2579H526699n6749j72142j34630o8612k0903l3802j72883q3880K1976n6099M1604
$$ 8526699 8469950 8297808 8163178 8094566 8073663 8039861 7866978 7783098 7805074 7748975 7790579
2568G790579J39395N3190J23941J30863J10602K38758J62139J36512J76955K19243
$$ 7790579 7929974 7983164 8107105 8237968 8348570 8587328 8749467 8885979 9062934 9282177
2558I282177K23950J12209K11645J03247O0866J20497M2978n1232q3447k07958
$$ 9282177 9506127 9618336 9829981 9933228 9994094 10114591 10157569 10106337 10022890 9814932
2548I814932m55430m15490l30329m45320k82346k86321k37433k05825k28686j59039
$$ 9814932 9359502 8944012 8613683 8168363 7886017 7599696 7362263 7156438 6927752 6768713
2538F768713j51437j34455p5032q5543j28477p9704j15020p0529n5652j13108
$$ 6768713 6617276 6482821 6407789 6322246 6193769 6114065 5999045 5928516 5872864 5759756
2528E759756j0430k7665n9822n5362q4389j28706l2051p2030j7746M7725N4801
$$ 5759756 5749326 5721661 5661839 5606477 5522088 5393382 5361331 5289301 5271555 5319280 5374081
2517E374081j598n9105K7477N9378p9874R4019J35165m4164l8982J22872R6334
$$ 5374081 5372483 5313378 5340855 5400233 5320359 5414378 5549543 5505379 5466397 5589269 5685603
2506E685603J07367J0716r2227n1900r0234m917l339n0992m8373m7060J4683J7157
$$ 5685603 5792970 5803686 5711459 5659559 5569325 5564408 5561069 5510077 5461704 5414644 5429327 5446484
2494E446484j0793M516m8958L0164J01686P6226l2100J19185P0713L5321M7271
$$ 5446484 5435691 5440207 5391249 5421413 5523099 5599325 5567225 5686410 5757123 5792444 5839715
2483E839715J08701J03922J48093O8876J78999J77406K58487K02427J04891J55383
$$ 5839715 5948416 6052338 6200431 6269307 6448306 6625712 6884199 7086626 7191517 7346900
2473G346900J94434J29252J60208L28989L26761J94014J66590K33588J83743O0930
$$ 7346900 7541334 7670586 7830794 8159783 8486544 8680558 8847148 9080736 9264479 9325409
2463I325409L1912j1783k6233j55864j57172j83801j75925r0347k21632j38059
$$ 9325409 9357321 9345538 9319305 9163441 9006269 8822468 8646543 8556196 8334564 8196505
2453H196505r8487j18209m8539n7164o9505m6923r8222m9316J6687N7942n6594
$$ 8196505 8098018 7979809 7931270 7874106 7804601 7757678 7659456 7610140 7626827 7684769 7628175
2442G628175K356P0890J73682J92254P4123M5642K0046J94554J31825J05028K54955
$$ 7628175 7630531 7701421 7875103 8067357 8141480 8187122 8207168 8401722 8533547 8638575 8893530
2431H893530J98684J01210K73002K73408J89584K81636L20893K34333K84013L53765
$$ 8893530 9092214 9193424 9466426 9739834 9929418 10211054 10531947 10766280 11050293 11404058
2421A1404058L30185M07928L73094L87745M31520L85350M66702M53050N30209
$$ 11404058 11734243 12142171 12515265 12903010 13334530 13719880 14186582 14639632 15169841
2412A5169841M67642N06486O57772N67872O34936O62374P16765P88215R48968
$$ 15169841 15637483 16143969 16801741 17369613 18004549 18666923 19383688 20171903 21120871
2403B1120871J016998J215749J385584J537244J770130J898661J948763K261076
$$ 21120871 22137869 23353618 24739202 26276446 28046576 29945237 31894000 34155076
2395C4155076K474995K731074K952163L307829L559205M163185M590832M848675
$$ 34155076 36630071 39361145 42313308 45621137 49180342 53343527 57934359 62783034
2387F2783034N104601M936049M202819K865910Q08560j612054l729175n243838
$$ 62783034 67887635 72823684 77026503 79892413 80700973 79088919 75359744 70115906
2379G0115906o007713o165779n756524n019485m354923l738632l102959k661556
$$ 70115906 64108193 57942414 52185890 47166405 42811482 39072850 35969891 33308335
2371C3308335k222618j970956j750843j521216j410554j239505r97730r58508
$$ 33308335 31085717 29114761 27363918 25842702 24432148 23192643 22194913 21236405
2363B1236405q16529o63378n97186n33787m38590l26295l10608l12855k66990
$$ 21236405 20419876 19756498 19159312 18625525 18186935 17860640 17550032 17237177 16970187
2354A6970187k19325j18029j27067j92315j89594j46933q1593r7189q1927j38723
$$ 16970187 16750862 16632833 16505766 16313451 16123857 15976924 15895331 15798142 15716215 15577492
2344A5577492L1335k3000o5804J13562K7940L5087p615J21010L3497M6727J01085
$$ 15577492 15608827 15585827 15520023 15633585 15661525 15696612 15688997 15810007 15843504 15890231 15991316
2333A5991316J40652J55711K07200K23265K15637K23647J84584J47111K43599
$$ 15991316 16131968 16287679 16494879 16718144 16933781 17157428 17342012 17489123 17732722
2324A7732722K55095K68214L11221K92389M12787M46217M85470M96952N87002
$$ 17732722 17987817 18256031 18567252 18859641 19272428 19718645 20204115 20701067 21288069
2315B1288069O46964P88987Q96676R32491R40767J076771J309524J438903J649549
$$ 21288069 21935033 22724020 23620696 24553187 25493954 26570725 27880249 29319152 30968701
2306C0968701J851143J996595K286046K634626K798356L020866L413094L695013
$$ 30968701 32819844 34816439 37102485 39737111 42535467 45556333 48969427 52664440
2298E2664440M037608M381391M872734N290120N534955N767484N663556N064967
$$ 52664440 56702048 61083439 65956173 71246293 76781248 82548732 88212288 93277255
2290I3277255L901727K254371J84084j894190l712047m994248n817947o063918
$$ 93277255 97178982 99433353 99617437 97723247 94011200 89016952 83199005 77135087
2282G7135087n975214n624480n052244m348698l708717l257265k829846k482019
$$ 77135087 71159873 65535393 60483149 56134451 52425734 49168469 46338623 43856604
2274D3856604k072208j952796j608140j272786j173992j145504r71261o94611
$$ 43856604 41784396 39831600 38223460 36950674 35776682 34631178 33659917 32965306
2266C2965306o22194n02702l61421k34823j57382M4944O8839M8837J66854K72559
$$ 32965306 32343112 31840410 31478989 31244166 31086784 31131728 31200567 31249404 31416258 31688817
2256C1688817M26355M35463M62132O46302P24296R27753J016997J120847J294266
$$ 31688817 32115172 32550635 33012767 33659069 34383365 35311118 36328115 37448962 38743228
2247C8743228J454249J723327J904642K192206K443516K740061L135544L554171
$$ 38743228 40197477 41920804 43825446 46017652 48461168 51201229 54336773 57890944
2239E7890944L970853M350736M838249N149483N050031M723183L843153K412835
$$ 57890944 61861797 66212533 71050782 76200265 81250296 85973479 89816632 92229467
2231I2229467Q17675o44253k065751l515519m430115m662665m511202m140348
$$ 92229467 93047142 92402889 90337138 86821619 82391504 77728839 73217637 69077289
2223F9077289l343510k701651k149675j597139j012023o33805m39398m9780J30906
$$ 69077289 65733779 63032128 60882453 59285314 58273291 57639486 57200088 57150308 57281214
2214E7281214K86276K41300Q8954r5018l62363o76888r92277j440125j559183
$$ 57281214 57567490 57808790 57897744 57802726 57440363 56763475 55771198 54331073 52771890
2205E2771890j682111j669063j682083j634606j442623j352020j291834r28038
$$ 52771890 51089779 49420716 47738633 46104027 44661404 43309384 42017550 41089512
2197D1089512q94878p89561m99854n78661m07489l37881k03364j35019k83520
$$ 41089512 40194634 39405073 38905219 38326558 37919069 37581188 37377824 37242805 36959285
2188C6959285j18841k8233j38763l4305O570P6918j4383K8568J35639K14229L22837
$$ 36959285 36840444 36812211 36673448 36639143 36645713 36722631 36708248 36736816 36872455 37086684 37409521
2177C7409521M48833M78858N26457O08654N79947M38628J56852j32575n04035
$$ 37409521 37858354 38337212 38863669 39472323 40052270 40490898 40647750 40515175 40011140
2168D0011140r27377j274164j637153j689471j818561j807702j689802j598960
$$ 40011140 39083763 37809599 36172446 34482975 32664414 30856712 29166910 27567950
2160B7567950j461994j306887j181161j099597r90847q03444o83522q23219p14634
$$ 27567950 26105956 24799069 23617908 22518311 21527464 20724020 20040498 19217279 18502645
2151A8502645n76326n38803m73159n08282l22149l63109m84772k20568k46869
$$ 18502645 17926319 17387516 16914357 16406075 16083926 15720817 15236045 15015477 14768608
2142A4768608k92717j54350j68938k09878k76485j06409r7082j92758k67674j43652
$$ 14768608 14475891 14321541 14152603 13942725 13666240 13559831 13462749 13269991 13002317 12858665
2132A2858665p6505j99380j83184k31266k28782k69635k29614o8808k72677k80900
$$ 12858665 12782160 12582780 12399596 12168330 11939548 11669913 11440299 11371491 11098814 10817914
2122A0817914j09580k51499k12637j40612k17438j03034p2446q9465p9192n9975
$$ 10817914 10708334 10456835 10244198 10103586 9886148 9783114 9710668 9621203 9542011 9482036
2112I482036k8588k0080l4043o6994M3043l7293J4458P8695l2676k7332M7465
$$ 9482036 9453448 9433368 9399325 9332331 9375374 9338081 9352539 9431234 9398558 9371226 9418691
2101I418691K5557k7857p3411P6671k2828j02014j4488K1067r1240q2487j52542
$$ 9418691 9444248 9416391 9342980 9419651 9396823 9294809 9280321 9301388 9210148 9127661 8975119
2090H975119k7630q2725r9959n2837k7172N140Q1027O8444K6601J24219J15074
$$ 8975119 8947489 8864764 8764805 8711968 8684796 8689936 8770963 8839407 8866008 8990227 9105301
2079I105301O7938J52388Q6438J94350J28195Q5304K19497J93564J51305K96650
$$ 9105301 9173239 9325627 9412065 9606415 9734610 9819914 10039411 10232975 10384280 10680930
2069A0680930K65033K60654K96851J49427L1993j90777l10354m52254m72330k96703
$$ 10680930 10945963 11206617 11503468 11652895 11684888 11494111 11183757 10731503 10259173 9962470
2059I962470l64021l56917j37209j23912j49063j76307k9288o2632j8983J8436
$$ 9962470 9598449 9241532 9104323 8980411 8831348 8655041 8625753 8563121 8544138 8562574
2049H562574J7602o0945O5259K15946R9783K9011J95359K10565J84346K87096
$$ 8562574 8580176 8519231 8584490 8800436 8900219 8929230 9124589 9335154 9519500 9806596
2039I806596K81434K47151M65094N15493M67064M13660L96924M20449J31811K5375
$$ 9806596 10088030 10335181 10800275 11315768 11782832 12196492 12593416 13013865 13145676 13171051
2029A3171051K0162j86225j47767k3733Q5143J04585J32004K75586L84138K59461
$$ 13171051 13191213 13004988 12857221 12833488 12918631 13023216 13155220 13430806 13814944 14074405
2019A4074405L88482M45406M53344L57739O21565P35520N77545P18186R18437
$$ 14074405 14462887 14908293 15361637 15719376 16340941 17076461 17654006 18372192 19290629
2010A9290629P98376Q32444J118271J235892J184876J352881J488301J354044
$$ 19290629 20089005 20921449 22039720 23275612 24460488 25813369 27301670 28655714
2002B8655714J421993J542198J262764J179858J019843O90406L08522o1414l88480
$$ 28655714 30077707 31619905 32882669 34062527 35082370 35772776 36081298 36019884 35631404
1993C5631404q42511j220173j373318j528710j636857j643325j703404j464909
$$ 35631404 34788893 33568720 32195402 30666692 29029835 27386510 25683106 24218197
1985B4218197j543407j467341j224049j099552j023377r83306p92429o48614p55160
$$ 24218197 22674790 21207449 19983400 18883848 17860471 16877165 16084736 15436122 14680962
1976A4680962o79903n63353o57413o17980m75800m30042l32421m32005l93138
$$ 14680962 14001059 13437706 12780293 12162313 11686513 11256471 10924050 10492045 10098907
1967A0098907k60813k55412k05547j35759k39781j82618j59525n9120N9038j03614
$$ 10098907 9838094 9582682 9377135 9241376 9001595 8818977 8659452 8600332 8659370 8555756
1957H555756o8835Q5280o763J81535J40954J86440J46032L29178L81170K77352
$$ 8555756 8486921 8572201 8565438 8746973 8887927 9074367 9220399 9549577 9930747 10208099
1947A0208099L53811M54298K84155N4353n0297j78327l61172l32715k46175k26134
$$ 10208099 10561910 11016208 11300363 11354716 11304419 11126092 10764920 10432205 10186030 9959896
1937I959896j92581p5841j17861k18106j40765k26861k96092l25271k05843k30066
$$ 9959896 9767315 9691474 9573613 9355507 9214742 8987881 8691789 8366518 8160675 7930609
1927G930609l55228j13273r5365r4997k4612j17403N6131L5180J5850J01362J40980
$$ 7930609 7575381 7462108 7366743 7271746 7247134 7129731 7185862 7221042 7236892 7338254 7479234
1916G479234J24066K23429K98475K34176J57327L04852J80636o9365k51168k82148
$$ 7479234 7603300 7826729 8125204 8359380 8516707 8821559 9002195 8932830 8681662 8399514
1906H399514l45351l58184j59801o7183k10410j28930N4985M393q3602j0643M8052
$$ 8399514 8054163 7695979 7536178 7468995 7258585 7129655 7184640 7189033 7105431 7094788 7142840
1895G142840r3414j06084m8090j10078r4092j43515j41195j25666l23910k09471
$$ 7142840 7049426 6943342 6895252 6785174 6691082 6547567 6406372 6280706 5956796 5747325
1885E747325j71194j96898q5544j70011m5607r5050j32472k8165M185j31322L0032
$$ 5747325 5576131 5379233 5293689 5123678 5078071 4983021 4850549 4822384 4826569 4695247 4725279
1874D725279K9736n1629N7913O1488l1543j0034j26821q5928n3582j2668o0085
$$ 4725279 4755015 4703386 4761299 4822787 4791244 4781210 4654389 4568461 4514879 4502211 4442126
1863D442126j95780p9484o0684j59293j77521L7258n89k3506r4813p2034M3876
$$ 4442126 4246346 4166862 4106178 3946885 3769364 3806622 3806033 3782527 3687714 3615680 3659556
1852C659556j7753J9617J6981m094M1907J14324Q561R0325J30577P5134J25589
$$ 3659556 3641803 3661420 3678401 3674307 3716214 3830538 3839099 3929424 4060001 4135135 4260724
1841D260724R3411P4856K06288K12685J40864J61461J81280J49135J15171J07603
$$ 4260724 4354135 4428991 4635279 4847964 4988828 5150289 5331569 5480704 5595875 5703478
1831E703478j28138j43231j93151p5482j72410j91452K2654q1289o1019L0961
$$ 5703478 5575340 5432109 5238958 5163476 4991066 4799614 4822268 4740979 4679960 4710921
1821D710921o3108j6768P7303J08543J17751Q9271J20776M2745r450J22027R686
$$ 4710921 4647813 4631045 4708348 4816891 4934642 5023913 5144689 5187434 5177984 5300011 5309697
1810E309697q8947K3257n5289j06629N2477q3026m805J09494R3241J9954J38993
$$ 5309697 5220750 5244007 5188718 5082089 5134566 5051540 5046735 5156229 5249470 5269424 5408417
1799E408417J75034J05435R7702K39065K89277K48873L60516M06359L74855M94654
$$ 5408417 5583451 5688886 5786588 6025653 6314930 6563803 6924319 7330678 7705533 8200187
1789H200187N24712N12593O02280P04743P82150R44884R51195J034068J217348
$$ 8200187 8724899 9237492 9839772 10544515 11326665 12271549 13222744 14256812 15474160
1780A5474160J314121J426735J520304J653195J697032J585303J513590J118240
$$ 15474160 16788281 18215016 19735320 21388515 23085547 24670850 26184440 27302680
1772B7302680O02252K75160j37786o93552j057196j271596j462497j609960j575363
$$ 27302680 27904932 28180092 28042306 27348754 26291558 25019962 23557465 21947505 20372142
1763B0372142j465876j529411j352095j223157j036305r43811q16963p84899o47132
$$ 20372142 18906266 17376855 16024760 14801603 13765298 12821487 12004524 11219625 10572493
1754A0572493n80398n66232n08374l38634m70982l89280k65116k09881l19331
$$ 10572493 9992095 9425863 8917489 8578855 8107873 7718593 7453477 7243596 6924265
1745F924265k80907p7346k20301k97492j74430j54070j70582k18134j89765j58491
$$ 6924265 6643358 6566012 6345711 6048219 5873789 5719719 5549137 5331003 5141238 4982747
1735D982747j66126k02743j12647n0896j33451j39761n3870j37039k04695j43277
$$ 4982747 4816621 4613878 4501231 4450335 4316884 4177123 4123253 3986214 3781519 3638242
1725C638242p7979n3659j62556j00392l932j48971j79831k8905q8808k4616M800
$$ 3638242 3560263 3506604 3344048 3243656 3239724 3090753 2910922 2882017 2793209 2768593 2773393
1714B773393q9868n1273o0792n0236j11619J8812L1869j03296m4689j7806L5532
$$ 2773393 2683525 2632252 2571460 2521224 2409605 2428417 2460286 2356990 2312301 2294495 2330027
1703B330027p1187j7344p1807j16194L2415J1093m2720m8568L3621j32422n6989
$$ 2330027 2258840 2241496 2169689 2053495 2085910 2097003 2054283 2005715 2039336 1906914 1849925
1692A849925O9574l6659l1404j27064J3942j01115N560l031l9418l3932j1767
$$ 1849925 1919499 1882840 1851436 1724372 1738314 1637199 1642759 1639728 1600310 1566378 1554611
1681A554611m1888m8113M733l7244r2857k806K5493o1929K5516k1593k6412o0389
$$ 1554611 1512723 1464610 1469343 1432099 1339242 1336436 1361929 1300000 1325516 1303923 1277511 1217122
1669A217122n3154l1504o971J1871l2319k4618K6038p1811L2609J895r3124o7419
$$ 1217122 1163968 1132464 1125493 1137364 1105045 1080427 1106465 1034654 1067263 1069158 976034 908615
1657I08615L2648L4953r5086J802M8241j16765r805Q5072k9238j6974M3950L1564
$$ 908615 941263 976216 881130 882932 931173 814408 804603 889675 860437 843463 887413 918977
1645I18977k1938n0668m3092M2725l8380K4119K8347N777k7089q4618k3352n1968
$$ 918977 897039 846371 803279 846004 807624 831743 860090 865867 838778 754160 730808 678840
1633F78840r457N3609L1064l5901j15535N2039J7012r0296N5673J37384m6745
$$ 678840 669383 722992 754056 718155 602620 654659 671671 581375 637048 774432 727687
1622G27687q8380k3023q801n2026p0809M5415P9386n4979m8498O3281M7829p50
$$ 727687 639307 616284 607483 555457 484648 530063 609449 554470 505972 569253 617082 616332
1610F16332m3933o0448N7277j8198l3185L3251j077k8322l0086p2426N7503n8161
$$ 616332 572399 511951 569228 551030 517845 551096 550019 521697 491611 419185 476688 418527
1598D18527n2868P4184m7516N8220j0241L0160L6445J1379L4251j33789o0729
$$ 418527 365659 439843 392327 450547 440306 470466 506911 518290 552541 418752 358023
1587C58023m054j4411M2466N5237k4903p4094O4132l4083o7961o162N201l5963
$$ 358023 353969 339558 382024 437261 412358 338264 402396 368313 300352 294190 299391 263428
1575B63428L0683p199L8360L6874r9739K0544O6998r075K29q2533m2712J2636
$$ 263428 294111 286912 325272 362146 262407 282951 349949 340874 341103 258570 215858 228494
1563B28494P2352p488k1653j6653p869m4119k7249N1153k4005O6190K1470k10
$$ 228494 300846 293358 271705 255052 247183 203064 175815 226968 202963 269153 290623 290413
1551B90413M4029r0739J4467k4668l8724m319O433j419j5646O3922J6244q060
$$ 290413 334442 243703 258170 233502 194778 190459 196892 195473 179827 243749 259993 251933
1539B51933l0939j7328N1018l2367j540o608n1084j186M6259m943k5660j3458
$$ 251933 220994 203666 254684 222317 220777 214169 163085 161899 208158 203215 177555 164097
1527A64097K0881L6581j17421P46M0608P238K0907k0943l3673j9856J8461J9706
$$ 164097 184978 221559 104138 104884 145492 152730 173637 152694 119021 99165 117626 137332
1515A37332J19090K2281j07284J4730O1881J7223j25552j00380R6894K298o8604
$$ 137332 256422 278703 171419 186149 248030 265253 139701 39321 136215 138513 69909
1504F9909M7947L9399N5928j1749j126J18394n3125q6207O7860m8967r8624O2813
$$ 69909 117856 157255 213183 201434 200308 318702 265577 179370 247230 198263 99639 162452
1492A62452K5352o0710n38k1717j3257j3616L0520J1447O7716j4130L8217l2349
$$ 162452 187804 127094 126556 104839 91582 77966 108486 119933 187649 173519 211736 179387
1480A79387n1448K2604n021R3082L5291n0313o3884K9764M756J7329m9043Q241
$$ 179387 127939 150543 145522 238604 273895 223582 159698 189462 194218 211547 162504 170745
1468A70745O2580j01091o5911P361Q5160N2053o4444P5448l6150n3301P1446j9527
$$ 170745 233325 132234 66323 73684 158844 210897 146453 221901 185751 132450 203896 184369
1456A84369j5095j3239R3573L7132j73532Q392m9506r6604J00163m711J0616J02445
$$ 184369 169274 156035 249608 286740 113208 121600 72094 -24510 75653 70942 81558 184003
1444A84003j01096P472J42820p5395n0547o0021k6578L6336K4635N4209n6465
$$ 184003 82907 90379 233199 157804 107257 47236 20658 56994 81629 135838 79373
1433G9373J4465L2294o7267lm9659j3462j3831N5285P5442p3310O781N9099k0636
$$ 79373 93838 126132 58865 58862 9203 -4259 -18090 37195 112637 39327 46108 105207 84571
1420H4571q892o336O5758r583l1055l1020J9438Q724n4785n7730N0184p2550j2273
$$ 84571 75679 69343 135101 125518 94463 63443 82881 91605 36820 -20910 29274 -43276 -55549
1407e5549P7406k4029K7835N0093n2947j4993K3553L2718l4149m4906K0801J4088
$$ -55549 21857 -2172 25663 75756 22809 7816 31369 64087 29938 -14968 5833 19921
1395A9921m5198L4328N5162k2984J6201J090K4288p9231l0516R8927M8986o6518
$$ 19921 -25277 9051 64213 41229 57430 58520 82808 3577 -26939 71988 120974 54456
1383E4456J3053m2641k6173m724L4784M0100k3490n3149O1471M9373q6297J2212
$$ 54456 67509 24868 -1305 -6029 28755 68855 45365 -7784 53687 103060 16763 28975
1371B8975j4739q1953l8523P8632M6452m6292M909K8680L0666M1149L078K80j2706
$$ 28975 14236 -67717 -106240 -27608 18844 -27448 -22539 6141 36807 77956 81034 81314 68608
1358F8608m8340p718l1107l6187L3016O0801k5873p6904O560M8404l6445J66l8231
$$ 68608 20268 12550 -18557 -54744 -21728 39073 13200 -63704 -57144 -8740 -45185 -45019 -83250
1345h3250R5299K6309j36828K5557k9039O7123O8664j02094J02112K9473r588
$$ -83250 12049 38358 -98470 -72913 -101952 -34829 33835 -68259 33853 63326 53738
1334E3738l2833q135l7775N4156j7208n8497m5859L523O6463q6847M0251J09177
$$ 53738 20905 12770 -25005 29151 11943 -46554 -92413 -88890 -22427 -109274 -69023 40154
1322D0154n5507J5062J0158k2084j4126K3654j3202j2983M7669o5324J4499n8155
$$ 40154 -15353 -291 9867 -12217 -26343 -2689 -15891 -28874 18795 -46529 -32030 -90185
1310i0185q4193R3304j2727J7673q904m737L222P826L9470j041k5924M5500K7656
$$ -90185 -174378 -81074 -93801 -76128 -85032 -89769 -86547 -78721 -39251 -40292 -66216 -20716 6940
1297F940o9870K9206k616j7414q580L0473m7320q989J345J3808O051L2607m5063
$$ 6940 -62930 -33724 -36340 -53754 -62334 -31861 -79181 -88170 -86825 -73017 -66966 -34359 -79422
1284g9422N3051M5747q5813J4529O5272K3480k1841k0979l7276l4479K9335m2989
$$ -79422 -26371 19376 -66437 -51908 13364 36844 15003 -5976 -43252 -77731 -48396 -91385
1272i1385j7113M9908m3132m7856R8949R8661k9029j7590N8511o5835l6921P9301
$$ -91385 -108498 -58590 -101722 -149578 -50629 48032 19003 1413 59924 -5911 -42832 36469
1260C6469k2930j39081Q4888K0698J9876L1432n0226n3091R185M7184r929k3871
$$ 36469 13539 -125542 -40654 -19956 -80 31352 -18874 -71965 -62780 -15596 -25525 -49396
1248d9396M752O156j0381N3408l3126L1339L9889r133l592j7735L399j8069O7700
$$ -49396 -44644 -38488 -48869 4539 -28587 2752 42641 33508 29916 12181 15580 -2489 65211
1235F5211m5190k0528n7524N3881L9177j02170q475P9339r202M8074m9748j0501
$$ 65211 20021 -507 -58031 -4150 35027 -67143 -75618 3721 -5481 42593 -7155 -17656
1223a7656M5180m7215k3663N5093J5469l7259R775l4657L1580q3329J10272O4165
$$ -17656 27524 -19691 -43354 11739 27208 -10051 -276 -34933 -3353 -86682 23590 87755
1211H7755j41786L6452Q4275m0362k8661P0195K453o1212J5231m2017k5770J4543
$$ 87755 -54031 -17579 66696 26334 -2327 67868 70321 9109 24340 -17677 -43447 -28904
1199b8904J08355m7092o6687P6361J0015j01694J81322q6656o0522L1575L3763
$$ -28904 79451 32359 -34328 42033 52048 -49646 131676 45020 -15502 16073 49836
1188D9836L9852m6009p4995M2333M0110o6566J8599p210N5431l5945n9612O1946
$$ 49836 89688 43679 -31316 11017 51127 -15439 3160 -4050 51381 15436 -44176 17770
1176A7770m3765k2190O1105N3247N8974q1118j5119j7416o0764l3278O8508Q204
$$ 17770 -25995 -48185 12920 66167 125141 44023 28904 11488 -49276 -82554 -14046 -5842
1164e842l3012N7861j7679p0715J12563m6381k8495l0097q877J54393O3749l7812
$$ -5842 -38854 19007 1328 -69387 43176 -3205 -31700 -61797 -70674 83719 147468 109656
1152A09656j4359q2322j2265O882l1681R6386j33272L1119O7843m6744K4657Q0105
$$ 109656 95297 12975 710 7592 -24089 72297 -60975 -29856 37987 -8757 15900 96005
1140I6005j03756K1682N0054o9161K7763p4781P7311L2480j26582M1766K2376
$$ 96005 -7751 13931 63985 -5176 22587 -52194 25117 57597 -68985 -27219 -4843
1129d843j30255Q3001J05010p7342m0574k8816m4217O1712O8239j946j4661R72
$$ -4843 -135098 -52097 52913 -24429 -65003 -93819 -138036 -76324 -8085 -10031 -24692 -23720
1117b3720Q2064n5592L2176J1654q8184P9184m1679o9605K9920N5897J10107n9810
$$ -23720 58344 2752 34928 46582 -41602 37582 -4097 -73702 -43782 12115 122222 62412
1105F2412n9320K7521j7478M6749j7092l1152k2864J5737o5728k6856M4491N6637
$$ 62412 3092 30613 13135 59884 42792 11640 -11224 4513 -61215 -88071 -43580 13057
1093A3057N433K8528L2583o4946J0241L599P8793l3561o2807J2866l8943Q3944
$$ 13057 18490 47018 79601 14655 24896 28495 107288 73727 10920 23786 -15157 68787
1081F8787j16634k0913J32205o5584n055N6506M9627j7029k2668O2951k0420j2444
$$ 68787 -47847 -68760 63445 -2139 -7194 49312 98939 81910 59242 122193 101773 89329
1069H9329j47l3191m8273J03507M0457j6540Q385j15532O6722J04824n2928k670
$$ 89329 89182 55991 7718 111225 151682 135142 143527 27995 94717 199541 146613 143943
1057A43943L1831P1017m9211l0090N2754r0697j7261O578J4156q90K9449M6565
$$ 143943 175774 246791 197580 167490 220244 129547 112286 118864 133020 132130 161579 208144
1045B08144q6099L5005K8367l9736K094M4004K89n723J2522N8094n5757k273J9054
$$ 208144 122045 157050 185417 145681 147775 191779 192068 186345 198867 256961 201204 198931 217985
1032B17985n7778J7972N1339l4768P7266n425k1385m1495J18093o054r1280J14116
$$ 217985 160207 178179 229518 194750 272016 266591 245206 203711 321804 315750 224470 338586
1020C38586L8372K4204M225l3142o0359O0306M4598q9494N4232R2457q3826k6956
$$ 338586 376958 401162 405387 372245 311886 372192 416790 327296 381528 473985 390159 363203
1008C63203k4456M6387q938Q4770K1792r503q1130P0055o0301N096J17445N2526
$$ 363203 338747 385134 376196 460966 482758 473255 392125 462180 401879 406975 524420 576946
996E76946O0769N7165j13755M4510O6915J09237P652J1115L462Q5002Q7006J07912
$$ 576946 637715 694880 581125 625635 692550 801787 809439 820554 824016 909018 996024 1103936
984A103936M0547O0217J71384m0197O8313J24666M2945J54383J84669J49273J33128
$$ 1103936 1144483 1204700 1376084 1335887 1404200 1528866 1571811 1726194 1910863 2060136 2193264
973B193264K18293L76323L08048K82164L75308L19797K47807L49929M30741M20653
$$ 2193264 2411557 2787880 3095928 3378092 3753400 4073197 4321004 4670933 5101674 5522327
963E522327O54479P45042Q88000J070293J164924J549804J968423K165437K281369
$$ 5522327 6176806 6921848 7809848 8880141 10045065 11594869 13563292 15728729 18010098
954A8010098J069062j251433k048184k738675k379007j757196j400046j080416
$$ 18010098 19079160 17827727 15779543 13040868 10661861 8904665 7504619 6424203
946F424203p05967o47360m79511l87709l31792k48418k71589j45523j21757k48880
$$ 6424203 5718236 5070876 4591365 4203656 3871864 3623446 3351857 3206334 3084577 2835697
936B835697j71025k42569k85235j26067j40319j26480K7464j35263j21446p8090
$$ 2835697 2664672 2422103 2136868 2010801 1870482 1744002 1771466 1636203 1514757 1436667
926A436667j04413m3286q7513l8174m8775o669K9055m1743k2636M294n7565q085
$$ 1436667 1332254 1288968 1201455 1163281 1114506 1107837 1136892 1095149 1072513 1076807 1019242 1011157
914A011157j2131k1409n4600K678M2537j05524j68313L9846K4187p0529l7841
$$ 1011157 999026 977617 923017 925695 968232 862708 694395 734241 758428 687899 650058
903F50058K2981k5765q7478J1654n107j54549P9814R285j6458N331o4860j1490
$$ 650058 673039 647274 559796 571450 566343 411794 491608 500893 484435 489766 424906 413416
891D13416R55l7139J7086o0587J9540N1578j5955K3839j7991k4978O628L391l8756
$$ 413416 414371 377232 394318 333731 353271 404849 388894 412733 394742 369764 376392 379783 341027
878C41027K2841L4866k3788j1492q8206L527m1889R592l9264r962N3743n8359
$$ 341027 363868 398734 374946 363454 275248 278775 236886 246478 207214 197252 250995 192636
866A92636j1189Q741m5251O2998l4350N7373J41l4125L6067k3361N6494J1391
$$ 192636 181447 190188 144937 207935 173585 230958 231099 196974 233041 209680 266174 277565
854B77565q8085q8820p747j047K3807n3886M9412M7983k5270K3412o3575m3053
$$ 277565 189480 100660 92913 91866 115673 61787 111199 159182 133912 157324 93749 50696
842E0696J7838M7304P527N6584M1169m4054q1630k0269j486m6382K6321m21L4836
$$ 50696 68534 115838 123365 179949 221118 177064 95434 75165 73679 27297 53618 53197 88033
829H8033M6246N1219l3575r1749P7156m5716q7244R7701N9274r9288K7451K2284
$$ 88033 134279 185498 151923 60174 137330 91614 4370 102071 161345 62057 89508 111792
817A11792j7316j986K2826l7662j37064N8755N4331J5300J0693m3468N0080J00707
$$ 111792 94476 92490 115316 77654 -59410 -655 53676 68976 79669 36201 86281 186988
805A86988p0408j9251J7881m5717m8523O1041M2128k3101k8196M5310j34247k6606
$$ 186988 116580 97329 115210 69493 20970 82011 124139 101038 72842 118152 -16095 -42701
793d2701N2937o358j1817J3072k9429m2095Q411K5156q27j0193J8749K6433k2926
$$ -42701 10236 3878 -7939 5133 -24296 -66391 -57980 -32824 -33651 -43844 -25095 1338 -21588
780b1588J07509K441k8304K9179L1995j52458n7454J03059n3072J7123K4941m7382
$$ -21588 85921 88362 60058 89237 121232 -31226 -88680 14379 -38693 -21570 3371 -44011
768d4011J6971k4452J1622M5268n8330m919M8683L9337o158k908K4019l9583j3119
$$ -44011 -27040 -51492 -39870 5398 -52932 -57851 -9168 30169 24011 21103 45122 5539 -7580
755g580l0302j4054J6457L8148O0995L0685L2735q4260o0899l2529j5664m6837
$$ -7580 -37882 -51936 -35479 2669 63664 94349 127084 42824 -18075 -50604 -66268 -113105
743a13105M0035J047K9122M2930K1865k5776l6013q844J3434o2687q9655Q4062
$$ -113105 -73070 -72023 -42901 29 21894 -3882 -39895 -48739 -35305 -97992 -187647 -103585
731a03585J04808j5519O5357N0149q2741j13476L5910K6657l5904o2938J2996
$$ -103585 1223 -14296 51061 101210 18469 -95007 -59097 -32440 -68344 -131282 -118286
720a18286j978K2004O6358j1032j1391j5112Q6333j3957l7547M7110m5682J6625
$$ -118286 -120264 -98260 -31902 -42934 -54325 -69437 16896 2939 -34608 12502 -33180 -16555
708a6555p046p145n0386l6818M0722j0288J4445j0395K1939L8780Q2327o7711
$$ -16555 -23601 -30746 -81132 -117950 -77228 -87516 -73071 -83466 -61527 -22747 59580 -8131
696h131q8244K1998K8394Q210l0438K3567J01079l4027l5800k3477P1L0257p8858
$$ -8131 -96375 -74377 -45983 -37773 -68211 -44644 56435 22408 -13392 -36869 -36798 -6541 -85399
683h5399K3454O0256j11605j6733J30634k5123j35444O9094K9171k0181R9916
$$ -85399 -61945 -1689 -113294 -130027 607 -24516 -159960 -90866 -61695 -81876 18040
672A8040M116j142K4686M8927O540o2699o9881K062J0557J6551K2856l2298K4750
$$ 18040 22156 21014 45700 94627 101167 38468 -31413 -29351 -18794 -2243 20613 -11685 13065
659A3065O2955m9832K3302r9840J4265J0268l0950n474J2775p3820L8358l3460
$$ 13065 76020 26188 49490 -50350 -36085 -25817 -56767 -62241 -49466 -123286 -84928 -118388
647a18388l5270Q6620L7799N3343K3520j06130K3880N5493l8331k9541o5968j6163
$$ -118388 -153658 -67038 -29239 24104 47624 -58506 -34626 20867 -17464 -47005 -112973 -129136
635a29136m031K5213L0252K5095K4594Q0457m6948p034N312m9061J286m6470K3867
$$ -129136 -133167 -107954 -77702 -52607 -28013 52444 5496 -1538 3774 -45287 -44001 -90471 -66604
622f6604R8556n0290m5001q54P2965m2765L383J7780m4136j1974O5803j7637q7615
$$ -66604 31952 -18338 -63339 -64193 8772 -33993 -30610 -12830 -56966 -68940 -3137 -20774 -108389
609a08389r301P3257o1452K6225o133K0918L7382l3374o3659N6479P9866o3259
$$ -108389 -117690 -44433 -105885 -79660 -85793 -64875 -27493 -60867 -124526 -68047 11819 -51440
597e1440K339l6390l578L7511j6760K8952k4271k969M6078K4368N804j01801m1342
$$ -51440 -49101 -85491 -89069 -51558 -68318 -39366 -63637 -66606 -20528 3840 9644 -92157 -133499
584a33499J8509L293R558M0023k6456J857N6739j18341K4249J16541j6079K1717
$$ -133499 -114990 -111697 -102139 -62116 -88572 -86715 -29976 -148317 -124068 -7527 -23606 -1889
572a889j7693r1549k1416M2961k3030J7137j6352m251R3840m1254J0309M7758
$$ -1889 -19582 -111131 -132547 -89586 -112616 -95479 -111831 -116082 -22242 -63496 -53187 -5429
560e429n3507N373M8503l4343K3833P261k7824M5843L1499K8925j2075j6118n1286
$$ -5429 -58936 -53563 -5060 -39403 -15570 -8309 -36133 9710 41209 70134 58059 41941 -9345
547i345n6416L1928j4093n867O836J501j8714L819j2727k4319n7783P7398P3002
$$ -9345 -65761 -33833 -47926 -53793 -46957 -45456 -64170 -60351 -73078 -97397 -155180 -77782 -4780
534d780L290M3511o8921P38J9881p4891r6178M9264J0259L6151q222O7172K6198
$$ -4780 -1490 42021 -26900 -26162 -6281 -81172 -177350 -128086 -117827 -81676 -89898 -22726 3472
521C472k5744j6624l3796P7468j4886l5280J7824M6900M6918l1612p7487o4807
$$ 3472 -22272 -38896 -72692 4776 -10110 -45390 -27566 19334 66252 34640 -42847 -107654
509a07654N7564P5097k5529k963p8527n6281j0365J07958J8029q2682j2852K62
$$ -107654 -50090 25007 -522 -3485 -82012 -138293 -148658 -40700 -22671 -105353 -118205 -117943
497a17943L2045j3717j3656N231O4732J1242o1091J6384P909p4996N2950J0311
$$ -117943 -85898 -99615 -113271 -108040 -43308 -32066 -93157 -76773 -68864 -143860 -90910 -80599
485h0599O7293j6917L0828n811M0298m0098K7097m8078n8974L0085j793K0023
$$ -80599 -13306 -30223 605 -5206 35092 -5006 22091 -25987 -84961 -54876 -56669 -36646
473c6646m7671l7137q580m9226K1231N3682L8474j8561m953Q0022K914k5769K2494
$$ -36646 -84317 -121454 -130034 -179260 -158029 -104347 -65873 -84434 -89387 -9365 -6451 -32220 -9726
460i726M5975j22010l2801J01997p7178J6073O4454K3103p4073k6775K0223j37946
$$ -9726 36249 -85761 -118562 -16565 -93743 -77670 -13216 9887 -64186 -90961 -70738 -208684
448b08684Q696K860O8195Q1332J280J0800K4795m8577R006M5127p684p8110J0301
$$ -208684 -199988 -197128 -128933 -47601 -46321 -35521 -10726 -59303 -50297 -5170 -12854 -90964 -80663
435h0663J22088n4337j35519L2511o5016o8879R6725K2333O9543K5518J8282Q6108
$$ -80663 41425 -12912 -148431 -115920 -180936 -249815 -153090 -130757 -61214 -35696 -17414 68694
423F8694j4205K7232q8178j03090Q424N4139k0064P4516m2636l0635K9868l5316
$$ 68694 54489 81721 -6457 -109547 -101123 -46984 -67048 7468 -35168 -65803 -35935 -71251
411g1251j3572j8247K3961k9007Q227R0921L3013M6789r6181l7012K5115J5762
$$ -71251 -84823 -103070 -79109 -108116 -99889 -8968 24045 70834 -25347 -62359 -37244 -21482
399b1482j9650m1937J3564J9902q5993M5267K9528m3349L3075k9291k1232J9292
$$ -21482 -41132 -83069 -69505 -49603 -135596 -90329 -60801 -104150 -71075 -100366 -121598 -102306
387a02306m7573R1690J26132k287p4866m5988O4787r9869j1983Q0391p2622p671
$$ -102306 -149879 -58189 67943 65656 -9210 -55198 9589 -90280 -102263 -21872 -94494 -102165
375a02165m7976l1038J3687N376L5542M847p4038P6388R4458m9380Q0808l2353
$$ -102165 -150141 -181179 -167492 -162116 -126574 -121727 -195765 -119377 -24919 -74299 6509 -25844
363b5844j0573M9114o6878j9068K5927p8030P2923j412k0274L2394K503j8954
$$ -25844 -36417 12697 -54181 -73249 -47322 -125352 -52429 -53841 -74115 -41721 -39218 -58172
351e8172m9333M0638L7231j047M0553O6868m4911r6595N8922J0898j02442R415
$$ -58172 -107505 -66867 -29636 -30683 9870 76738 31827 -64768 -5846 5052 -97390 -87975
339h7975J4623p6323M6872J2425N0166M4463r1802L1445l9391k4684N3730M922
$$ -87975 -73352 -149675 -102803 -90378 -40212 4251 -87551 -56106 -95497 -120181 -66451 -61529
327f1529J517k2455l1207N5677j8336n2697J2059K2827L3713j3687L5054M4490
$$ -61529 -60012 -82467 -113674 -57997 -76333 -129030 -116971 -94144 -60431 -74118 -39064 5426
315E426P007j20647K9013j5870J650M1324n2927l3513K6513r396K7270L4798M42
$$ 5426 12433 -108214 -79201 -95071 -93421 -52097 -105024 -138537 -112024 -121420 -94150 -59352 -58910
302e8910m4146l7421n09M7903K6754j6905L9399k9463n882L1957L540k345l3306
$$ -58910 -103056 -140477 -140986 -93083 -66329 -83234 -43835 -73298 -79180 -47223 -43683 -46028 -79334
289g9334m6007O2403K3388q1830N6944O4170m5721p9652N2139j8630K3698j5953
$$ -79334 -125341 -62938 -39550 -121380 -64436 -266 -45987 -125639 -73500 -92130 -68432 -84385
277h4385n1486K4021N1364M6412p489m5673l4162L5561o686n0483j7917n3743
$$ -84385 -135871 -111850 -60486 -14074 -21563 -67236 -101398 -65837 -72523 -123006 -140923 -194666
265a94666N8398O3560n4375m6542o980L8853P6178R588k2912J3156q9078L2111
$$ -194666 -136268 -72708 -127083 -173625 -180605 -141752 -65574 -55986 -78898 -65742 -154820 -122709
253a22709N1690j3769j6979l5587N216K1067j01230L3043O9929J4915J0574n151
$$ -122709 -71019 -84788 -101767 -137354 -132138 -111071 -212301 -179258 -109329 -94414 -83840 -88991
241h8991R52J6921l3158R840O1493q294j5019m0240k3976j1511k2451M7585R5152
$$ -88991 -88039 -71118 -104276 -94436 -32943 -41237 -56256 -96496 -120472 -131983 -154434 -106849 -11697
228a1697O3491o7443k2929l056k6221k9723m5288J2111L2143q448O5998n3218
$$ -11697 51794 -15649 -38578 -41634 -67855 -97578 -142866 -130755 -98612 -107060 -41062 -94280
216i4280k5894K0387J7409r0721N4618k3218j0025L0487m470j1789J9851L9770
$$ -94280 -120174 -99787 -82378 -173099 -118481 -141699 -151724 -121237 -125707 -137496 -117645 -77875
204g7875L4384m1165j3761L2794q2599K2464K6172L5061n3701n8396N5032K9635
$$ -77875 -43491 -84656 -98417 -65623 -148222 -125758 -99586 -64525 -118226 -176622 -121590 -91955
192i1955r791m9935N11K022L5001Q6561j5548p3858l7347K1508j1973N0548J8396
$$ -91955 -101746 -151681 -151170 -149148 -114147 -27586 -43134 -116992 -154339 -132831 -144804 -94256 -75860
179g5860J4289J9393l1138L4996J5859n2474M2905L7225q3224r569m1483k3868
$$ -75860 -61571 -42178 -73316 -38320 -22461 -74935 -32030 5195 -78029 -87598 -129081 -152949
167a52949J6132J2234M7923l9987M0281J6070p7576j3345q472j726O2085l1422
$$ -152949 -136817 -124583 -76660 -116647 -76366 -60296 -137872 -151217 -159689 -161415 -99330 -130752
155a30752l8767K5500N8297j2522k3630j4268k8509M3998j1954k2096J31799R409
$$ -130752 -169519 -144019 -85722 -98244 -121874 -136142 -164651 -120653 -132607 -154703 -22904 -13495
143a3495p9703K8548R680k6828m7558l9397M1284K0879p1299N792Q5785l0100
$$ -13495 -93198 -64650 -54970 -81798 -129356 -168753 -127469 -106590 -177889 -172097 -86312 -116412
131a16412k0811q283J8765n788L3064L8049k3143o9444L4480K0606M9839r7989
$$ -116412 -137223 -145506 -126741 -132529 -99465 -61416 -84559 -154003 -119523 -98917 -49078 -147067
119a47067m952O4905r848l8266M0311L8857n6621q9158P5393Q135o4014O1356
$$ -147067 -152019 -87114 -96962 -135228 -94917 -56060 -112681 -201839 -126446 -118311 -182325 -120969
107a20969M2979j01370l4209R6414J0584o1783j6025N4473k492l8692J4006K8923
$$ -120969 -77990 -179360 -213569 -117155 -106571 -168354 -184379 -129906 -132398 -171090 -157084 -128161
95a28161n143l5454L800K9027k7502K1668Q1831J6666r7110M4242K8945K585J1445
$$ -128161 -133304 -168758 -164958 -135931 -163433 -141765 -59934 -43268 -140378 -96136 -67191 -64606 -53161
82e3161l5682o1859J16M3940K6332n5261n5706K592R1673K4962J451j3247J9552
$$ -53161 -88843 -150702 -150586 -106646 -80314 -135575 -191281 -188689 -97016 -72054 -70603 -83850 -64298
69f4298l4415r8670O9069M9459J1999J0716n4837j7294m4740j5810J3695j6484
$$ -64298 -98713 -197383 -128314 -78855 -66856 -56140 -110977 -128271 -173011 -188821 -175126 -191610
57a91610l3966J7933j4279L2227N7601k6053L6862O8698l0138K7553J4930l1355
$$ -191610 -225576 -207643 -221922 -189695 -132094 -158147 -121285 -52587 -82725 -55172 -40242 -71597
45g1597n1930n681j3716k2056k2219L3814l4912q396J088L7706Q525j2378R633
$$ -71597 -123527 -129208 -142924 -164980 -187199 -153385 -188297 -196693 -195605 -157899 -149374 -161752 -152119
32a52119L7398L940N675k9077l798j5798o2165Q1014K192l9633n957J2555l6875
$$ -152119 -114721 -110781 -105106 -134183 -137981 -153779 -215944 -134930 -132738 -172371 -178328 -165773 -202648
19b02648n9362L6576N5499Q6033L4180n464n71j3791p63K3585l0116o9368Q837
$$ -202648 -262010 -225434 -169935 -83902 -49722 -55186 -55757 -69548 -70311 -46726 -76842 -146210 -137373
6a37373j7999L1032k4899q1823M5833O548
$$ -137373 -155372 -124340 -149239 -231062 -185229 -178681
0a78681
$$ -178681
$$ Imaginary data points
##PAGE= N=2
##DATA TABLE= (X++(I..I)), XYDATA
16383b370943m872K0854L3525K6437p465L2470M52L3115M0267M0508L0995L9261
$$ -2370943 -2375815 -2354961 -2321436 -2294999 -2302464 -2269994 -2269542 -2236427 -2196160 -2155652 -2124657 -2085396
16371b085396k8296M2317L4225R1434N1221n3442N9810M4553j4883J3809R0237
$$ -2085396 -2113692 -2071375 -2037150 -1945716 -1894495 -1947937 -1888127 -1843574 -1858457 -1844648 -1754411
16360a754411n546K0931P7412M6214J2204K1050Q2755J7099o341N3283M3449L9248
$$ -1754411 -1759957 -1739026 -1661614 -1615400 -1603196 -1582146 -1499391 -1482292 -1488633 -1435350 -1391901 -1352653
$$ [...]
##END NTUPLES=NMR SPECTRUM
##END=
