##TITLE=1H_TG-2326
 CDCl3,8 sc, 
 6.04.2021
##JCAMPDX= 6.0         $$ Bruker NMR JCAMP-DX V2.0
##DATA TYPE= NMR SPECTRUM
##DATA CLASS= NTUPLES
##ORIGIN= UXNMR, Bruker Analytische Messtechnik GmbH
##OWNER= root
$$ XWIN-NMR		Version 3.5
$$ Tue Apr  6 10:39:40 2021 Russian Standard Time (UT+4h)  she@DPX200
##.OBSERVE FREQUENCY= 200.131506
##.OBSERVE NUCLEUS= ^1H
##.ACQUISITION MODE= SIMULTANEOUS
##.ACQUISITION SCHEME= undefined
##.AVERAGES= 8
##.DIGITISER RES= 18
##SPECTROMETER/DATA SYSTEM= spect
##.PULSE SEQUENCE= zg30
##.SOLVENT NAME= CDCl3
##.SHIFT REFERENCE= (INTERNAL, CDCl3, 0, 15.9657)
##AUDIT TRAIL= $$ (NUMBER, WHEN, WHO, WHERE, WHAT)
$$ ##TITLE= Audit trail, XWIN-NMR		Version 3.5
$$ ##JCAMPDX= 5.01
$$ ##ORIGIN= Bruker BioSpin GmbH
$$ ##OWNER= she
$$ F:/spectra/data/she/nmr/H-F/1/pdata/1/auditp.txt
$$ ##AUDIT TRAIL=  $$ (NUMBER, WHEN, WHO, WHERE, WHAT)
(   1,<2021-04-06 10:38:26.54 +0400>,<she>,<DPX200>,
      <created by zg, POWCHK disabled, PULCHK disabled
       configuration hash MD5:
       00 E9 B6 7A A2 85 ED C7 34 08 36 98 17 FE 4E 26
       data hash MD5: 16K
       1A B2 FB 62 C5 5F C6 A9 DE BC C3 80 12 D6 70 00>)
(   2,<2021-04-06 10:38:30.14 +0400>,<she>,<DPX200>,
      <Start of raw data processing
       efp BC_mod = 2 LB = 0.24 FT_mod = 6 PKNL = 1 PHC0 = -11031.45 PHC1 = 13.40092 SI = 16K 
       data hash MD5: 16K
       9D A9 47 A1 82 82 16 6C 67 93 CC 85 9F E6 F7 F4>)
(   3,<2021-04-06 10:38:50.01 +0400>,<she>,<DPX200>,
      <pk PHC0 = -90.50018 PHC1 = 2.2 
       data hash MD5: 16K
       45 D5 83 7B 18 F6 86 FF 46 F6 02 72 53 BD 3B 2D>)
(   4,<2021-04-06 10:38:53.89 +0400>,<she>,<DPX200>,
      <abs ABSG = 5 
       data hash MD5: 16K
       30 08 11 02 0F 6B C3 D6 CA F3 BC DA 13 F3 1E 01>)
$$ ##END=
$$ 
$$ hash MD5
$$ 7E 74 7E EA D8 7F 2F F2 33 F3 F9 EF 0A 6A E0 24
##$RELAX= 
##$RELAX= 
##$RELAX= 
##$RELAX= 
##$RELAX= 
##$RELAX= 
$$ Bruker specific parameters
$$ --------------------------
##$DU= <F:/spectra>
##$EXPNO= 1
##$NAME= <H-F>
##$PROCNO= 1
##$TYPE= <nmr>
##$USER= <she>
##$AMP= (0..31)
100 100 100 100 100 100 100 100 100 100 100 100 100 100 100 100 100 100 
100 100 100 100 100 100 100 100 100 100 100 100 100 100 
##$AQSEQ= 0
##$AQ_mod= 1
##$AUNM= <au_zg>
##$AUTOPOS= <>
##$BF1= 200.13
##$BF2= 200.13
##$BF3= 200.13
##$BF4= 200.13
##$BF5= 200.13
##$BF6= 200.13
##$BF7= 200.13
##$BF8= 200.13
##$BYTORDA= 1
##$CFDGTYP= 0
##$CFRGTYP= 5
##$CHEMSTR= <none>
##$CNST= (0..31)
1 1 145 1 1 1 1 1 1 1 1 1 1 1 1 1 1 1 1 1 1 1 1 1 1 1 1 1 1 1 1 1 
##$CPDPRG= <>
##$CPDPRG1= <>
##$CPDPRG2= <>
##$CPDPRG3= <>
##$CPDPRG4= <mlev>
##$CPDPRG5= <mlev>
##$CPDPRG6= <mlev>
##$CPDPRG7= <mlev>
##$CPDPRG8= <mlev>
##$CPDPRGB= <>
##$CPDPRGT= <>
##$D= (0..31)
0 1.2 0 0 0 0 0 0 0 0.06 0 0.03 0 0 0 0 0.0002 0 0 0 0 0 0 0 0 0 0 0 0 
0 0 0 
##$DATE= 1617691106
##$DBL= (0..7)
120 120 120 120 120 120 120 120 
##$DBP= (0..7)
150 150 150 150 150 150 150 150 
##$DBP07= 0
##$DBPNAM0= <>
##$DBPNAM1= <>
##$DBPNAM2= <>
##$DBPNAM3= <>
##$DBPNAM4= <>
$$ [...]
##$SUBNAM3= <"">
##$SUBNAM4= <"">
##$SUBNAM5= <"">
##$SUBNAM6= <"">
##$SUBNAM7= <"">
##$SUBNAM8= <"">
##$SUBNAM9= <"">
##$SW= 16.9725357007746
##$SWIBOX= (0..15)
0 0 2 0 0 0 0 0 0 0 0 0 0 0 0 0 
##$SW_h= 3396.73913043478
##$TD= 16384
##$TD0= 1
##$TE= 0
##$TE2= 300
##$TE3= 300
##$TEG= 300
##$TL= (0..7)
0 120 120 120 120 120 120 120 
##$TP= (0..7)
150 150 150 150 150 150 150 150 
##$TP07= 0
##$TPNAME0= <>
##$TPNAME1= <>
##$TPNAME2= <>
##$TPNAME3= <>
##$TPNAME4= <>
##$TPNAME5= <>
##$TPNAME6= <>
##$TPNAME7= <>
##$TPOAL= (0..7)
0.5 0.5 0.5 0.5 0.5 0.5 0.5 0.5 
##$TPOFFS= (0..7)
0 0 0 0 0 0 0 0 
##$TUNHIN= 0
##$TUNHOUT= 0
##$TUNXOUT= 0
##$USERA1= <user>
##$USERA2= <user>
##$USERA3= <user>
##$USERA4= <user>
##$USERA5= <user>
##$V9= 5
##$VALIST= <valist>
##$VCLIST= <CCCCCCCCCCCCCCC>
##$VD= 0
##$VDLIST= <DDDDDDDDDDDDDDD>
##$VPLIST= <PPPPPPPPPPPPPPP>
##$VTLIST= <TTTTTTTTTTTTTTT>
##$WBST= 1024
##$WBSW= 4
##$XGAIN= (0..3)
0 0 0 0 
##$XL= 0
##$YL= 0
##$YMAX_a= 158270
##$YMIN_a= -105527
##$ZGOPTNS= <>
##$ZL1= 120
##$ZL2= 120
##$ZL3= 120
##$ZL4= 120
##$ABSF1= 15.98128
##$ABSF2= -0.9913816
##$ABSG= 5
##$ABSL= 3
##$ALPHA= 0
##$AQORDER= 0
##$ASSFAC= 0
##$ASSFACI= 0
##$ASSFACX= 0
##$ASSWID= 0
##$AUNMP= <proc_1d>
##$AZFE= 0.1
##$AZFW= 0.1
##$BCFW= 0
##$BC_mod= 2
##$BYTORDP= 0
##$COROFFS= 0
##$CY= -3
##$DATMOD= 1
##$DC= 0
##$DFILT= <>
##$DTYPP= 0
##$F1P= 0
##$F2P= 0
##$FCOR= 1
##$FTSIZE= 16384
##$FT_mod= 6
##$GAMMA= 0
##$GB= 0
##$INTBC= 1
##$INTSCL= 2.992141e-10
##$ISEN= 128
##$LB= 0.24
##$LEV0= 0
##$LPBIN= 0
##$MAXI= 10000
##$MC2= 0
##$MEAN= 0
##$ME_mod= 0
##$MI= 1.114404
##$NCOEF= 0
##$NC_proc= -9
##$NLEV= 6
##$NOISF1= 3.799351
##$NOISF2= 2.8
##$NSP= 0
##$NTH_PI= 0
##$NZP= 0
##$OFFSET= 15.96574
##$PC= 1
##$PHC0= -11121.95
##$PHC1= 15.60092
##$PH_mod= 1
##$PKNL= yes
##$PPARMOD= 0
##$PSCAL= 0
##$PSIGN= 0
##$REVERSE= no
##$SF= 200.130009145742
##$SI= 16384
##$SIGF1= 3
##$SIGF2= 2
##$SINO= 5.538805
##$SIOLD= 16384
##$SREGLST= <1H.CDCl3>
##$SSB= 0
##$STSI= 16384
##$STSR= 0
##$SW_p= 3396.73913043479
##$SYMM= 0
##$S_DEV= 0
##$TDeff= 16384
##$TDoff= 0
##$TI= <>
##$TILT= no
##$TM1= 0
##$TM2= 0
##$TOPLEV= 0
##$USERP1= <user>
##$USERP2= <user>
##$USERP3= <user>
##$USERP4= <user>
##$USERP5= <user>
##$WDW= 1
##$XDIM= 16384
##$YMAX_p= 516437708
##$YMIN_p= -2365044
$$ End of Bruker specific parameters
$$ ---------------------------------
##NTUPLES= NMR SPECTRUM
##VAR_NAME=  FREQUENCY,     SPECTRUM/REAL,   SPECTRUM/IMAG
##SYMBOL=    X,             R,               I
##VAR_TYPE=  INDEPENDENT,   DEPENDENT,       DEPENDENT
##VAR_FORM=  AFFN,          ASDF,            ASDF
##VAR_DIM=   16384,         16384,           16384
##UNITS=     HZ,            ARBITRARY UNITS, ARBITRARY UNITS
##FACTOR=    0.207333158178282, 1,           1
##FIRST=     3195.22373301653, 0,            0
##LAST=      -201.515397418263, 0,           0
##MIN=       -201.515397418263, -2365044,    0
##MAX=       3195.22373301653, 516437708,    0
$$ Real data points
##PAGE= N=1
##DATA TABLE= (X++(R..R)), XYDATA
$$ [...]
5968i34075N87580o42376Q10141M0448N86095m37191k72854k72293K04733J11715
5958b18077l85958l6310J67618m26346L64480M39948r05673r74274L68355M19990
5948a186247K64028j96310M86179N29257n41893N1806r7704P00404j37249m98461
5938f26190k24724K66837J07176P3198k7767L33355J022291n68836j219808K94527
5928e69941k99162m45715Q57151j76451l49906j02120M71773J73207P49380q14870
5918e06654p31409K91483K69492o47906P47462J28700k30665K94048L03681k46122
5908c27890m71239O05654M02767p5708q56781Q7348o9726M9851J19896M53533
5898h2295J33552p8402m9791j98660q7046q22327M35231R38207p22630M05264
$$ y = [-934075, -346495, -988871, -178730, -138282, 447813, 10622, -262232, -534525, -329792, -218077, -604035, -640345, -472727, -899073, -534593, -94645, -1000318, -1974592, -1606237, -1186247, -922219, -1118529, -632350, -103093, -644986, -593180, -690884, 9520, -127729, -626190, -850914, -584077, -476901, -403703, -431470, -98115, 924176, 355340, -864468, -569941, -869103, -1314818, -457667, -634118, -984024, -1086144, -614371, -441164, 308216, -506654, -1238063, -946580, -677088, -1324994, -577532, -448832, -679497, -385449, -81768, -327890, -799129, -193475, 209292, 133584, -723197, -635849, -705575, -655724, -535828, -82295, 51257, -27145, -76936, -275596, -362642, -1184969, -749738, 188469, -534161, -128897]
5888a28897l9115j02289P38870q28121n19784M65955J80116K89549O63315q01153
5878h1554k52301R177l05021m5134O13279j53331o5067J29492L8417Q3365l02268
5867c30946k69983O26624J96608p31918k26727p0290Q5950l85153K92045M86203
5857c27587L91746K16093r45423l80106Q63148o6143L29780l98006M58459j71288
5847b9327o18422N63274J57196k18410L94989l66363p02050O94994l39604N558
5837d58165K4196M27207L45755J64599J3830k99385j11438k55764M54937L56282
5827F62054k96465Q99103n64225o50465l15154M82760P1025k27054L06711k51149
5817A17141L76444R3980m38486J80346P36198k45017m79442q77362J11928N78760
$$ y = [-128897, -168012, -270301, 468569, -359552, -879336, -413381, -233265, 56284, 719599, -81554, -333855, -324678, -629699, -674833, -61554, -214885, -279952, -150460, -112043, -28678, -330946, -600929, 25695, 222303, -509615, -736342, -806632, -720682, -1105835, -813790, -327587, 64159, 280252, -665171, -1045277, -182129, -248272, 81508, -316498, 141961, -29327, -647749, -84475, 72721, -145689, 249300, -117063, -819113, -124119, -463723, -458165, -433969, -6762, 338993, 503592, 517422, 218037, 106599, -149165, 305772, 662054, 365589, 1264692, 700467, 50002, -265152, 217608, 288633, 61579, 368290, 117141, 493585, 587565, 149079, 329425, 1065623, 820606, 341164, -536198, -424270, 154490]
5807A54490j39141K20632k21583m24660r7833K29749J97595m71186L24167M96204
5797B68434K27455l94532j04287p78406N4442J71357P47964n90028n87429k55979
5787a241009O20739J359817k7023q26350j17656L70116o35519O16688j91126P275
5777f4048l6724M97488L57847o55724j81125j18561j37025L90304L77466l11203
5767A18695p07873j32252N10744k16589j69489l88005l46500Q93096L87447j79791
5757b30517N55947j70295q24368q72627J158781r7786J79118k05277l01129L13073
5747d95080M9552N33654J01976m07805R03790m10028n82208M76211n3783l21347
5737b05068N8265k87475l88049Q67013J03123k2413N20821P000K4464M84224l11479
$$ y = [154490, 15349, 235981, 14398, -410262, -508095, -278346, -80751, -551937, -227770, 268434, 495889, 101357, -2930, -781336, -726894, -555537, 192427, -397601, -985030, -1241009, -620270, 739547, 712524, -113826, -231482, 138634, -496885, 119803, -71323, -64048, -100772, 396716, 754563, 98839, -82286, -200847, -337872, 52432, 429898, 118695, -589178, -721430, -210686, -427275, -596764, -984769, -1331269, -438173, -50726, -230517, 325430, 155135, -669233, -1541860, -383079, -480865, -301747, -507024, -808153, -495080, -445528, 88126, 190102, -217703, 686087, 276059, -306149, 170062, 116279, -205068, -146803, -434278, -822327, 44686, 147809, 125396, 646217, 653217, 677681, 1161905, 850426]
5726H50426n03649m87159O50900j76013R60624k46143n10803k22592k58144L19877
5716C77324l49215K30891J220988j10875O41547Q0057r05710K98731j5594K47806
5706A715950J4959j04240O24733m14134j37320J24949M81450j32712K4042j15797
5696B081880M67231P29290n96022j60654Q6253P49081k00700Q51772L31835J32613
5686D472579Q03652N32502j60673q4910p32338R7518M58653Q6033K8418n94889
5676D906545o89501o25670k9516p89721R7745q758q7742p91887M88512N59779
5666C029786k95306J2783m06855l81030N09141N38074l74696M05355L28597J3155
5656C379004p53016J36972l33251K9342M22133J29337K25463j032891l29773o35621
$$ y = [850426, 346777, -140382, 510518, 334505, 1295129, 1048986, 538183, 315591, 57447, 377324, 28109, 259000, 1479988, 1369113, 2010660, 2090717, 1185007, 1483738, 1468144, 1715950, 1730909, 1626669, 2251402, 1837268, 1699948, 1824897, 2306347, 2173635, 2197677, 2081880, 2549111, 3278401, 2682379, 2521725, 2607978, 3357059, 3156359, 4008131, 4339966, 4472579, 5276231, 5808733, 5648060, 5563150, 4830812, 4928330, 5386983, 5473016, 5501434, 4906545, 4217044, 3591374, 3561858, 2772137, 2869882, 2861124, 2773382, 1981495, 2470007, 3029786, 2734480, 2747263, 2340408, 1959378, 2468519, 3006593, 2631897, 3037252, 3365849, 3379004, 2625988, 2762960, 2429709, 2459051, 2881184, 3010521, 3235984, 2203093, 1873320, 1237699]
5646A237699K89185m756k08418J3455L46257p21443k97904L61699J46122Q26475
5636A988371K37893N67815l82641p64348O24218K35994m10053k19519J02575k19167
5626A761138K86162n259L44795r8999p21581j82640r8862J30783N17849j89582
5616A743804k30968k24512p91498M51662L769L47472M74276M34599J46977o94913
5606A660668K48595J82647p20811r2077L12498O2544J36177J63696n15654l20970
5596A117313k35450R20466P84433m25849l45215L18307L31943M9324K93384M51031
5586C259687n61830j248649n9038N15292K95646J99103o24313J018353k77888
5577B516363m68477J08066P04695p32298p63141P40371J38809M17103k2683P4499
$$ y = [1237699, 1526884, 1522128, 1313710, 1327165, 1673422, 951979, 654075, 1015774, 1161896, 1988371, 2226264, 2794079, 2411438, 1647090, 2271308, 2507302, 2097249, 1877730, 1980305, 1761138, 2047300, 2042041, 2386836, 2287837, 1566256, 1383616, 1284754, 1415537, 1933386, 1743804, 1512836, 1288324, 496826, 948488, 952257, 1299729, 1774005, 2208604, 2355581, 1660668, 1909263, 2091910, 1371099, 1279022, 1591520, 1654064, 1790241, 1953937, 1438283, 1117313, 881863, 1802329, 2586762, 2160913, 1815698, 2134005, 2465948, 2515272, 2808656, 3259687, 2697857, 1449208, 1390170, 1905462, 2201108, 2400211, 1775898, 2794251, 2516363, 2047886, 2155952, 2860647, 2128349, 1365208, 2105579, 2244388, 2661491, 2638808, 2713307]
5567B713307J32122K34213L81838N2696J13791K27532K87462M80801n96779L72127
5557D399110K13056j86581N31409l04516j95608L07025m03026K87277N21813L79428
5547E549387m59735m62303P27322K92361J38293k01215P29126N22446L7286K48317
5537G121285K8195R429k19289j19288K81176O15789O24893P7851k74696O68485
5527H813830L17005J08110N94891j52502J20351J20347j45957P72073M24845P9268
5517A1052261J93440O6509J086695P98401N97856N39086j79762j04189R65829
5508A5016126Q29975R94192l999m20634Q05399Q31658R36755J435255J131552
5499B1556279Q1545N52175P99443P05755R72316J555059J184337J011754J490651
$$ y = [2713307, 2845429, 3079642, 3461480, 3514176, 3627967, 3855499, 4142961, 4623762, 4026983, 4399110, 4612166, 4425585, 4956994, 4652478, 4456870, 4763895, 4360869, 4648146, 5169959, 5549387, 5089652, 4627349, 5354671, 5647032, 5785325, 5584110, 6313236, 6835682, 6872968, 7121285, 7149480, 7158909, 6939620, 6820332, 7101508, 7717297, 8342190, 8420041, 8145345, 8813830, 9130835, 9238945, 9833836, 9681334, 9801685, 9922032, 9776075, 10548148, 10972993, 11052261, 11245701, 11312210, 12398905, 13197306, 13795162, 14334248, 14154486, 14050297, 15016126, 15846101, 16840293, 16836294, 16415660, 17221059, 18052717, 18989472, 20424727, 21556279, 21637824, 22189999, 22989442, 23695197, 24667513, 26222572, 27406909, 28418663, 29909314]
5490B9909314P62068K162405J865297J582828K204085J970646K052018L280528
5482D5789189L628650L601569M124533M427752N764743O670834P135517Q315242
5474H9458029J0227191J1193721J0840369J2136831J2785517J0577102R077166
5467A66295926M996463J928997j812750n213827q610282j0400172j2228876j2381735
5459A22573744j2285548j0959755r647433q184348o966624o622922n751097m266388
5451E7889629m195856m268279l326457l365480l034095k426816j898148j665592
5443C3708906j407048k209898j958986l70859j358111j640484r58804o27696j090662
5434B2086358n26961K92360j695566j153073o72734m05724p9755o32021j686800
$$ y = [29909314, 30671382, 32833787, 34699084, 36281912, 38485997, 40456643, 42508661, 45789189, 49417839, 53019408, 57143941, 61571693, 67336436, 74007270, 81142787, 89458029, 99685220, 110878941, 121719310, 133856141, 146641658, 157218760, 166295926, 171292389, 173221386, 171408636, 166194809, 157584527, 147184355, 134955479, 122573744, 110288196, 99328441, 89681008, 81496660, 74530036, 67907114, 62156017, 57889629, 53693773, 49425494, 46099037, 42733557, 39699462, 37272646, 35374498, 33708906, 32301858, 30091960, 28132974, 27762115, 26404004, 24763520, 23804716, 23177020, 22086358, 21559397, 21851757, 20156191, 19003118, 18330384, 17924660, 17844905, 17212884, 15526084]
5425A5526084j65100k62825O40056J37609n62614P7728P6137l49190j026052J08980
5415A4200813k54119p07071j338777J23900k07115j174039n6677j73303o70328
5406I743284J11897j140388l83583k23191n15105R4433L20147n57548N2974j9386
5396G483534m85239o24388j05507L05123k826M6704n59452J60442J6097n93750
5386E640738j25147L66514j29136N0539m86852j67144n92510p992m81849K2947
5376D090108L51490K50266j59830p36503l16160L48164L59689j29819N47659j85352
5366D419712n47053M05707k60656j73962N61400r33644m92477Q00886J70268K50289
5356D200470q6055k45424M80193L97043l21877J9588j11323L14326o69554M26245
$$ y = [15526084, 15360984, 15098159, 15738215, 15875824, 15313210, 15390938, 15467075, 15117885, 14091833, 14200813, 13946694, 13239623, 11900846, 12024746, 11817631, 10643592, 10586915, 10413612, 9743284, 9855181, 8714793, 8331210, 8108019, 7592914, 7687347, 8007494, 7449946, 7502920, 7483534, 6998295, 6373907, 6268400, 6573523, 6570697, 6617401, 6057949, 6218391, 6234488, 5640738, 5515591, 5882105, 5752969, 5803508, 5316656, 5149512, 4557002, 4549010, 4067161, 4090108, 4441598, 4691864, 4532034, 3795531, 3479371, 3827535, 4187224, 4057405, 4605064, 4419712, 3872659, 4278366, 4017710, 3843748, 4405148, 3471504, 2979027, 3779913, 3950181, 4200470, 4114415, 3868991, 4349184, 4746227, 4424350, 4443938, 4332615, 4646941, 3977387, 4403632]
5346D403632K81475p99719K5075l87482l12476l04911m58178M62729L57883j29187
5336C138841O68111M96345J57961k16022o21278j05872L72989k9703J53825r2813
5326C922384k35087n11928l61092N20285N02204J17404o04221N75831K33953n57292
5316C602441r57224K81395j81476j34259L60267L91770o42967k71402N1005J35265
5306B634815L64587J62474K38992K01790k67326L90218J27951j40535O08971p48061
5296C573876N9524O6693j040782l30043O85173R0191o7287M54780j91818p95457
5286B504850J159978M61725J99955J31019L07538O14612q25902j51841L94996
5277D796930K59663O39063K7024k41004m37675J45940k31157n4424O97535K95872
$$ y = [4403632, 4685107, 3885388, 3910463, 3522981, 3210505, 2905594, 2447416, 2910145, 3268028, 3138841, 3806952, 4303297, 4461258, 4245236, 3623958, 3518086, 3891075, 3861372, 4015197, 3922384, 3687297, 3175369, 2814277, 3334562, 3836766, 3954170, 3349949, 3925780, 4159733, 3602441, 2645217, 2926612, 2745136, 2610877, 2971144, 3362914, 2719947, 2448545, 2499550, 2634815, 2999402, 3161876, 3400868, 3602658, 3335332, 3725550, 3853501, 3712966, 4321937, 3573876, 3633400, 3700093, 2659311, 2329268, 3014441, 3104632, 3037345, 3492125, 3300307, 2504850, 3664828, 4126553, 4326508, 4457527, 4765065, 5379677, 4553775, 4401934, 4796930, 5056593, 5695656, 5722680, 5481676, 5044001, 5189941, 4958784, 4904360, 5601895, 5897767]
5267E897767J47271J75361q3405o5551r10463K98194K45006K02o33626Q21569
5257E892325P3231j35999J029287n4451j004782K77507L95164q37756M71276K46379
5247F352181P34626J099256n22435m93161P3159J013724j19244l19500M04599
5238H223205P29406M34128O72702o21302k12312M14903K47967K36392j472721
5229H652368N60655J570005L84586o79223R24355M82606j49412N42190N12054
5220A2800184o78865l1248J235074o2423p66964m0723L65308P47225R37772N49562
5210A5054902O82347k03113n82287R13056N91949K38641N8645L50624Q05036j12365
5200A7797435l99093M38270M52622j58219m92972K60528m3200n94983O36966L82734
$$ y = [5897767, 6045038, 6220399, 6136994, 6071443, 5160980, 5459174, 5704180, 5704382, 5070756, 5892325, 5965556, 5829557, 6858844, 6804393, 5799611, 6077118, 6472282, 5634526, 6105802, 6352181, 7086807, 8186063, 7663628, 7170467, 7243626, 8257350, 8138106, 7818606, 8223205, 8952611, 9386739, 10059441, 9438139, 9225827, 9640730, 9888697, 10125089, 8652368, 9213023, 10783028, 11167614, 10488391, 11412746, 11895352, 11745940, 12288130, 12800184, 12121319, 12090071, 13325145, 13262722, 12495758, 12455035, 12820343, 13567568, 14505340, 15054902, 15737249, 15534136, 14951849, 15864905, 16456854, 16695495, 16754140, 17104764, 17909800, 17797435, 17398342, 17836612, 18289234, 18131015, 17638043, 17898571, 17855371, 17260388, 17897354, 18280088]
5190A8280088K35192Q11295m80968r01169p6526K18135K88130m95130O04959N50344
5180A9034350j322487K95117J42458L52989p6012k01265J050166n61905o43517
5171A8069894J267534L75843M72538P581p9460J36832q06018k64386j018057j45692
5161A8016609j43649k29897p3028n87673J20621K02718l94943k58165n92462J61
5151A6060292j35221o27127L04492l24806P6338m88964o08211M2018O49982o69057
5141A4279736j474825J11454P68666n9278j16023j05442o82282K58776m73034
5132A2507748j69329L03739j94329q05265k81444N43455l60568n43475l47798
5123A0652734O53055M46603l37630n3024p73525o81415r3886K22240m56642k43489
$$ y = [18280088, 18515280, 19326575, 18845607, 17944438, 17867912, 18086047, 18374177, 17879047, 18484006, 19034350, 17711863, 18006980, 18149438, 18502427, 18426415, 18225150, 19275316, 18713411, 18069894, 19337428, 19713271, 20185809, 20193390, 20113930, 20250762, 19444744, 19180358, 18162301, 18016609, 17872960, 17643063, 17570035, 16982362, 17102983, 17305701, 16910758, 16652593, 16060131, 16060292, 15925071, 15297944, 15602436, 15277630, 15353968, 14865004, 14256793, 14298811, 14948793, 14279736, 12804911, 12916365, 13685031, 13625753, 13509730, 13404288, 12722006, 12980782, 12507748, 12338419, 12642158, 12447829, 11642564, 11361120, 11904575, 11544007, 11000532, 10652734, 11305789, 11752392, 11414762, 11361738, 10588213, 9906798, 9812912, 10035152, 9578510, 9335021]
5113I335021m43914J6743J166836j51365p49250k73357K39518p40607M24933k36859
5103H587699R7654K41089o12852L56480o73456n25374L55584l1680k80971k11965
5093G302208L20664M042j62065L50424o40346L02952k8359m66944O80549K49170
5083G912295q00475l16072l05280J29081o25688N22259J45605l9097L71781m13659
5073F580750j95871K21358n01935J64769M45223M3967N32988n8031q64714n84665
5063E783839J027302P74021L00073m69499q51529m88554L36828J50658k27564
5054F335575M43988L86734k75135K64509j20830L98931l8664k12487m60185N28175
5044G250611K2563l70436q27112L2535L21293l9550P4202J052597o05243p58708
$$ y = [9335021, 8891107, 8907850, 10074686, 9923321, 9174071, 8900714, 9140232, 8399625, 8824558, 8587699, 8685353, 8926442, 8313590, 8670070, 7996614, 7471240, 7826824, 7795144, 7514173, 7302208, 7622872, 7626914, 7464849, 7815273, 7174927, 7477879, 7449520, 6982576, 7663125, 7912295, 7111820, 6795748, 6490468, 6619549, 5993861, 6516120, 6661725, 6622628, 6994409, 6580750, 6384879, 6606237, 6104302, 6269071, 6714294, 6758261, 7291249, 7233218, 6368504, 5783839, 6811141, 7585162, 7885235, 7415736, 6564207, 6075653, 6412481, 6563139, 6335575, 6779563, 7166297, 6891162, 7155671, 7034841, 7433772, 7395108, 7182621, 6722436, 7250611, 7273174, 6902738, 6075626, 6108161, 6429454, 6389904, 6464106, 7516703, 6911460, 6152752]
5034F152752R36018K17767l91476o64252K59382n3604J75404k73026M52990o07781
5024F204174O6526M02718J08084K55357J93294m56340n06802M35824n32758l58713
5014E811364J166909K13112k30745L38384j91655m03080l61378n97284N81446
5005F327073Q61962j86947j79462N77709l77122n96483N72102N7647L00046R9346
4995G455871k52324j84612L46270L40190m83594P0041N89342l878J06465k02663
4985G781108L49323l53833l95314j32290l84969j47728l14074Q59349Q9900k82036
4975G069436L6557o19671Q28070R2874l19471L30506k69053N58907Q4735O61337
4965H454227n62697j006604k60088j9530m79876J233910l721o11472J083579k95584
$$ y = [6152752, 7088770, 7306537, 6915061, 6250809, 6510191, 6456587, 6631991, 6358965, 6811955, 6204174, 6270700, 6673418, 6781502, 7036859, 7230153, 6773813, 6267011, 6702835, 6170077, 5811364, 6978273, 7191385, 6960640, 7299024, 7107369, 6704289, 6342911, 5745627, 6327073, 7189035, 7002088, 6822626, 7400335, 7023213, 6426730, 6998832, 7056479, 7356525, 7455871, 7203547, 7018935, 7365205, 7705395, 7221801, 7291842, 7881184, 7877306, 7983771, 7781108, 8130431, 7776598, 7381284, 7248994, 6864025, 6716297, 6402223, 7261572, 7351472, 7069436, 7105993, 6486322, 7314392, 7407266, 7087795, 7418301, 7149248, 7708155, 7792890, 8454227, 7891530, 6884926, 6624838, 6605308, 6125432, 7359342, 7355621, 6744149, 7827728, 7532144]
4955G532144j22447N0036j27061p5162J81779K28240M89048m72647l90208N9153
4945G352875J45603K75871j26944J130714L6588N05837J1388k73684K86584N81294
4935I926126L29517j64275O03409k08459N92194Q12371j90266J69629M93865J57488
4925A2521599P78834Q68289N2496J040313J07129M83216J041106R17733R99257
4916A8809972J325444Q87082R17742Q58763o05770M01010q14084j077386o46096
4907B0056677o68617m3481r55149j596153q94118K54217k99942q2622m00480m21357
4897A4948975J322798l10226p50811L42015J1625R88924j60022j5577k30989K14385
4887A6361097Q53535m30844N22486j59094J02871p10285j26282O30997N10005
$$ y = [7532144, 7409697, 7459733, 7332672, 7257510, 7439289, 7667529, 8156577, 7683930, 7293722, 7352875, 7498478, 7774349, 7647405, 8778119, 8814707, 9320544, 9331932, 9058248, 9344832, 9926126, 10255643, 10091368, 10694777, 10486318, 11078512, 11890883, 11700617, 11870246, 12364111, 12521599, 13300433, 14168722, 14221218, 15261531, 15368660, 15851876, 16892982, 17810715, 18809972, 20135416, 21022498, 21940240, 22799003, 22193233, 22594243, 21780159, 20702773, 20056677, 19388060, 19344579, 18389430, 16793277, 15899159, 16153376, 15853434, 15770812, 15370332, 14948975, 16271773, 15961547, 15210736, 15552751, 15564376, 16553300, 16393278, 16377701, 16146712, 16361097, 17214632, 16783788, 17306274, 17147180, 17250051, 16539766, 16413484, 17044481, 17554486]
4878A7554486r53361Q69802J080533Q77283L58794J81329P59178O53388K67233
4869B1648665L68693P97181N46593N49275J487054N74164l12124J356060P20861
4860B7736422K32554J153823J309358J276554L57103J518683J567434J477455
4852C6629386J976415K312482J782612Q62050J945628K954469J921560K218176
4844E2602778K151572L551498M129353L668275L857927M986209N480428N985575
4836H6413615N127479O587465O683671N847200O400089O867415O511457M196484
4828A34634875K802178R24330p77872k884814m109559o276067o040903o673170
4820A11598998p654005p560668p182962o774053n767190n166071m182888m543517
$$ y = [17554486, 16601125, 17470927, 18551460, 19428743, 19787537, 19968866, 20728044, 21381432, 21648665, 22017358, 22814539, 23361132, 23910407, 25397461, 25971625, 25659501, 27015561, 27736422, 27968976, 29122799, 30432157, 31708711, 32065814, 33584497, 35151931, 36629386, 38605801, 40918283, 42700895, 43562945, 45508573, 48463042, 50384602, 52602778, 54754350, 58305848, 62435201, 66103476, 69961403, 74947612, 80428040, 86413615, 91541094, 98128559, 104812230, 110659430, 117059519, 123926934, 130438391, 134634875, 137437053, 138361383, 137583511, 134698697, 130589138, 124313071, 118272168, 111598998, 103944993, 96384325, 89201363, 82427310, 76660120, 71494049, 67311161, 62767644]
4812F2767644n148352m988346l112796k928941k057285k129075j783621l220836
4804C7398392k136758j272367j410412j116722j735687j421139l72896j588697
4796B6343714j260708j027077j341710j073083j199280o80185o02132j041243
4788A8118296n46591p88569j032335n5496J28118n90962o39720n57460o1174j79313
4778A3794794p2931J70184r39410m05221k48896n17189k69577k42685K49203m11824
4768A1106448l92187K14569L81023r01121J39608J42885j022255J90142j039417
4759H819695L66557j00184K94770N12280J06297M21978j078783p88243K20179
4750H774546J68277M41913K99172n28399p62663j61793R29882N5353r2683j38290
$$ y = [62767644, 57619292, 52630946, 49518150, 46589209, 44531924, 42402849, 40619228, 37398392, 35261634, 33989267, 32578855, 31462133, 29726446, 28305307, 27932411, 26343714, 25083006, 24055929, 22714219, 21641136, 20441856, 19761671, 19159539, 18118296, 17571705, 16783136, 15750801, 15695305, 15823423, 15232461, 14592741, 14035281, 13974107, 13794794, 13721863, 13892047, 12952637, 12547416, 12298520, 11781331, 11511754, 11269069, 11518272, 11106448, 10714261, 10928830, 11309853, 10408732, 10548340, 10691225, 9668970, 9859112, 8819695, 9186252, 9086068, 9380838, 9893118, 9999415, 10421393, 9342610, 8554367, 8774546, 8942823, 9384736, 9683908, 9155509, 8392846, 8231053, 9160935, 9216288, 9123605, 8985315]
4740H985315j9379J17027L06095l15582m07780K91807K0602k23486l95321n15578
4730G843720L23165P29142l47878j482n18291q4950l74946j13684K08842O91863
4720H355501l36262m07096k24084o27487M61394N48900N9862O42906J24125O02795
4710I200554M63902n55991n67480j3684N65406o98680p1648n5215L93023M23080
4700I083267M44942o31472l24551N4187p28471L97090K46234j185m18175J74996
4690H296862j23473J57400k66494l24748j31646K7707K52110k06624P11349j19834
4680H272609j147962l30482j81935J91328K35194M45410o13038l69204Q31255
4671G333175K79472L02694L11625p5347l33980K13140J64553Q8677J66711l57148
$$ y = [8985315, 8965936, 9082963, 9389058, 9073476, 8665696, 8957503, 8978105, 8754619, 8359298, 7843720, 8166885, 8896027, 8548149, 8546667, 8028376, 7943426, 7568480, 7454796, 7663638, 8355501, 8019239, 7612143, 7388059, 6760572, 7221966, 7770866, 7830728, 8473634, 8597759, 9200554, 9664456, 9108465, 8540985, 8527301, 9092707, 8394027, 8322379, 8267164, 8660187, 9083267, 9528209, 8896737, 8572186, 8626373, 7897902, 8294992, 8541226, 8540041, 8121866, 8296862, 8173389, 8330789, 8064295, 7739547, 7607901, 7635608, 7887718, 7681094, 8392443, 8272609, 7124647, 6794165, 6612230, 6803558, 7038752, 7484162, 6871124, 6501920, 7333175, 7612647, 7915341, 8226966, 8151619, 7817639, 8030779, 8195332, 8284009, 8450720, 8093572]
4661H093572m69497m7236K55974n23559m06148l52581J85144j97184K93576p7695
4651F754366r00706M29854o62213n94787l04206q7818L3406l30373L45512M67686
4641E150721j24101m38412M59558o17770r64927J50057N53072J66516k46878L31771
4631D419607l11694n65771J86567Q25792L39780l66394o28431K97276k24241l99864
4621C572627R56350j93047p86317o37210L62051J302870J19693K42562p93617
4612D145962r39235Q3382j42609O1171n42514K92231N73006k739o09082L100K96143
4601C218816N86153K4929k20714l0085N2153k0812l19975l12925J11873L34590
4591C424003L57518N87696k85492m69960P0318k9513l83049j306325L22337R39932
$$ y = [8093572, 7624075, 7576839, 7832813, 7309254, 6903106, 6550525, 6735669, 6538485, 6832061, 6754366, 5853660, 6283514, 5621301, 5026514, 4722308, 4634490, 4667896, 4337523, 4683035, 5150721, 5026620, 4588208, 5047766, 4429996, 3465069, 3615126, 4168198, 4334714, 4087836, 4419607, 4107913, 3542142, 3728709, 4554501, 4894281, 4527887, 3899456, 4196732, 3972491, 3572627, 4528977, 4335930, 3549613, 2912403, 3274454, 4577324, 4697017, 4939579, 4145962, 3206727, 3290109, 3147500, 3208671, 2666157, 2958388, 3531394, 3528655, 2919573, 2922673, 3218816, 3804969, 3829898, 3609184, 3579099, 3631252, 3610440, 3290465, 2977540, 3089413, 3424003, 3781521, 4369217, 4083725, 3613765, 3684083, 3654570, 3271521, 1965196, 2287533, 3227465]
4581C227465k13125K5646M5175l83134O6643k39050m0700J62003Q73988k27566
4571C297345l05567O72492r87583L35076L14304K19014l62391N60309k77959L52793
4561C817833j94678J197K22933J54143J8109j27247j57927M86108k99788q339
4551C912344m72409o04410L82713R24250M38350j54472M6327o4172O87824k35159
4541D861186N5562n4444l68818o7114M36117k79533j56123P74420L50787l97175
4531E154865o87393J15263J52453J048320M2470K90608k7317n14812Q72288j24648
4521F322097l06781M92995P8362m60292k26336K00726N41634J06495r9215j35741
4511F513944K7157J127437p79646N48666O83894o54860N23261m9573m8687j71570
$$ y = [3227465, 3014340, 3039986, 3085161, 2702027, 2768670, 2529620, 2488920, 2650923, 3524911, 3297345, 2991778, 3664270, 2676687, 3011763, 3326067, 3545081, 3182690, 3742999, 3465040, 3817833, 3623155, 3624352, 3847285, 4001428, 4019537, 3892290, 3734363, 4220471, 3920683, 3912344, 3439935, 2835525, 3218238, 4142488, 4580838, 4426366, 4472693, 4408521, 5096345, 4861186, 4916748, 4862304, 4493486, 4426372, 4862489, 4582956, 4426833, 5201253, 5552040, 5154865, 4467472, 4582735, 4735188, 5783508, 5825978, 6116586, 6089269, 5574457, 6446745, 6322097, 6015316, 6508311, 6586673, 6126381, 5900045, 6100771, 6642405, 6748900, 6649685, 6513944, 6541101, 7668538, 6888892, 7437558, 8121452, 7466592, 7989853, 7940280, 7891593, 7720023]
4501G720023P46284M31794L83610K54083J35215p20045J455909M95068n33212
4492A0368729K00023k02702o74640N74707L50908K07491Q64595k84292L84601
4483A1789420q468O69034m27268L45362K75303m89499L72792J68516P23894L30203
4473A3749289k53128P019Q81527N58461N95125j44446P40313J155343J173475
4464A8462978L89203O86347J081027P8479Q87884M76584M14327P99880j27765
4455B3148944j156831n95740j152526q61452k89402j122074M1611j74433o38425
4446A7199672n41897p85911r38699P0584m29110p99546l65640J99754L68171J00302
4436A4077680R3934l23273N75488J594430J5126l02433j90483J88113J090519
$$ y = [7720023, 8466307, 8898101, 9281711, 9535794, 9671009, 8950964, 10406873, 10901941, 10368729, 10568752, 10366050, 9691410, 10266117, 10617025, 10824516, 11689111, 11404819, 11789420, 11780952, 12449986, 12022718, 12368080, 12643383, 12153884, 12526676, 12695192, 13419086, 13749289, 13496161, 13503180, 14384707, 14943168, 15538293, 15393847, 16134160, 17289503, 18462978, 18852181, 19538528, 20619555, 20698034, 21585918, 22062502, 22476829, 23276709, 23148944, 21992113, 21396373, 20243847, 19382395, 19092993, 17970919, 18012530, 17838097, 17199672, 16657775, 15871864, 14933165, 15003749, 14574639, 13775093, 13409453, 13609207, 13977378, 14077680, 14171614, 13848341, 14423829, 16018259, 16033385, 15730952, 15540469, 15728582, 16819101]
4427A6819101O9552n08550p33432m54706O53699l57077o23614K88899J91382m47713
4417A4897541j83508k93990J4423k55929p83380o81775l83887N860k92109j28847
4407A1914399J48431j93855K85266K671L79760K73684j270611l07543L36606k79418
4397A1289390k74087Q68719L78527j711069k88213J25462N75702P9628J46043
4388A1190102j12516m99016p67860k92592r95210l89386k07727j402896J24949
4379F647848L1090Q0665p0289m98895p75461N323K41415J23441P2341M97222j84971
4368F169729m98802o882L55915j133851J80899L37694k49981J92874K50201p04374
4358D893422j57072j81016O85469l04547L62846N67041p59583J48075M97158m99982
$$ y = [16819101, 16888653, 16380103, 15646671, 15191965, 15845664, 15488587, 14864973, 15153872, 15345254, 14897541, 14714033, 14420043, 14434466, 14178537, 13395157, 12713382, 12329495, 12335355, 12043246, 11914399, 12062830, 11868975, 12154241, 12156912, 12536672, 12810356, 11539745, 11232202, 11568808, 11289390, 11015303, 11884022, 12262549, 10551480, 10263267, 10388729, 10964431, 11044059, 11190102, 11077586, 10578570, 9810710, 9518118, 8522908, 8133522, 7925795, 6522899, 6647848, 6678938, 6759603, 6689314, 6190419, 5414958, 5420281, 5661696, 5785137, 5857478, 6354700, 6169729, 5670927, 5664045, 6019960, 4886109, 5067008, 5404702, 5154721, 5347595, 5597796, 4893422, 4736350, 4555334, 5240803, 4936256, 5299102, 5866143, 5106560, 5254635, 5751793, 5251811]
4348E251811o16728K39941O71589m34624k62500m46711j97966L98279K4956m12596
4338D215451J61329J10556l37224k52342m06263M52726M29195O4085R8826n16944
4328D019395m40517k71525M3720l91675J083316N44027k78409j09115q40506q21395
4318B537316J41471N84914m13410O19806K39037n62010k85477O3713K21985m57985
4308B689360Q30396K75579k14199j78501M19833K65189m19290j55091N33813p00086
4298C347003R7598M66239l91920L13887p34159k38908O26289Q46818o87904o96013
4288B948930J69900L31802m96361J056643M16846q54859M59239n55238k64926
4279C211976J57308J60546J11466O5175K95901j032824Q46796n49798N2603Q13723
$$ y = [5251811, 4635083, 4875024, 5546613, 5111989, 4849489, 4402778, 4204812, 4603091, 4628047, 4215451, 4376780, 4487336, 4150112, 3897770, 3491507, 3944233, 4373428, 4437513, 4536339, 4019395, 3578878, 3307353, 3351073, 2959398, 4042714, 4586741, 4308332, 4199217, 3358711, 2537316, 2678787, 3263701, 2850291, 3470097, 3709134, 3147124, 2861647, 2925360, 3147345, 2689360, 3519756, 3795335, 3581136, 3402635, 3822468, 4087657, 3668367, 3513276, 4047089, 3347003, 3444601, 3910840, 3518920, 3832807, 3098648, 2859740, 3486029, 4332847, 3644943, 2948930, 3118830, 3450632, 2954271, 4010914, 4427760, 3572901, 4032140, 3476902, 3211976, 3369284, 3529830, 3641296, 3706471, 4002372, 2969548, 3816344, 3266546, 3319149, 4132872]
4269D132872l94203p95941J191414o01837o96673L48731K77623m43940Q19301
4260C837347P33225r89418k19316Q2642l25613L4266K61025N80956l05911n8146
4250C631057K73799J13061k17049p8368L38289N07439Q0125k89692m75694q04955
4240C078012O23825Q73169O4575J35856j8746n72474K39982m04640l95427K20016
4230C844148P33569n15817m45408L73390K92571n93341m04606K72687N53792j52054
4220C958931n0238l91356j025073O96271Q78404L83059J04881K38525m29052J84194
4210D548546M49210k78340N0634o135p91730j15879M26212l11992p3324j14278
4200C782924n58357O84456M0479k61235m06892J405982p0987k72934k83955m15889
$$ y = [4132872, 3738669, 2942728, 4134142, 3532305, 2835632, 3184363, 3461986, 3018046, 3837347, 4570572, 3581154, 3361838, 3444480, 3118867, 3153133, 3414158, 3995114, 3689203, 3631057, 3904856, 4017917, 3800868, 3722500, 4060789, 4568228, 4648353, 4358661, 3882967, 3078012, 3701837, 4575006, 4639581, 4775437, 4756691, 4184217, 4424199, 4019559, 3624132, 3844148, 4577717, 4061900, 3616492, 3989882, 4282453, 3689112, 3284506, 3557193, 4110985, 3958931, 3908693, 3517337, 2492264, 3188535, 4066939, 4449998, 4554879, 4793404, 4364352, 4548546, 4997756, 4719416, 4770050, 4763915, 3972185, 3856306, 4282518, 3970526, 3897202, 3782924, 3224567, 3909023, 3949502, 3688267, 3281375, 4687357, 4616370, 4343436, 4059481, 3643592]
4190C643592N38847O3708j2532k82475o47499n63191J250573L64521O0586o86646
4180C729484L16206L8500q9274l78223O43346l80378K06409O555L01010M33185
4170D826820P50655q95042K12937p4918l89623n44511Q01913o97327n69539N63095
4160C984460L38130P02578p24609n7518j62103N32463L16489L99379j39216q1415
4150E108638m3720K56872m35528j87228k36599N13022K7763l11116L35338j22941
4140D904501k19607l23994K94393R05338j22340J79855k08594j84717N1939n76089
4130D700685K66381k85306j16358P42343j2577o0706r4696J037563j95054m04696
4120E577579L87028j61775J17872m35263L48027P35769j183584M5244o345K09670
$$ y = [3643592, 4182439, 4246147, 4233615, 3951140, 3303641, 2740450, 3991023, 4355544, 4416130, 3729484, 4045690, 4084190, 3994916, 3616693, 4260039, 3879661, 4086070, 4092625, 4393635, 4826820, 5577475, 4682433, 4895370, 4820452, 4430829, 3886318, 4688231, 3990904, 3421365, 3984460, 4322590, 5025168, 4300559, 4243041, 4080938, 4613401, 4929890, 5329269, 5190053, 5108638, 5064918, 5321790, 4886262, 4699034, 4462435, 4975457, 5003220, 4692104, 5027442, 4904501, 4684894, 4360900, 4655293, 5560631, 5438291, 5618146, 5409552, 5224835, 5276774, 4700685, 4967066, 4681760, 4565402, 5307745, 5295168, 5234462, 5139766, 6177329, 5982275, 5577579, 5964607, 5802832, 5920704, 5485441, 5833468, 6569237, 5385653, 5430897, 5424552, 5634222]
4110E634222J149044o46350K67905m30302m77845N49999n20809M31804k09059
4101E748609k15957J289004J13738l86849q79578j44441J47126Q5523M66025N06845
4091F730045M00201m32344k30866L80041K69539N49280K08085m67132K45619j67000
4081G485468M12224R26908J99928p54051O41466k70073j33619O94820K60366K11430
4071I674867K59289N30872J36528J00033n94438L40675j7632m38376l89952m35727
4061I166139q9682m42620K49310j28100n15029N53424n26273n24932J218204M85888
4051I446329q87492O7480O14103n5684k44036J008216J34173P72730m85864r32725
4041I437230J46172r432O15257P11178q3079p48169N1959n21250L92439N74520
$$ y = [5634222, 6783266, 6136916, 6404821, 5974519, 5496674, 6046673, 5525864, 5957668, 5748609, 5532652, 6821656, 6935394, 6548545, 5668967, 5524526, 5671652, 5757175, 6223200, 6730045, 7130246, 6697902, 6467036, 6847077, 7116616, 7665896, 7873981, 7406849, 7652468, 7485468, 7897692, 8824600, 9024528, 8270477, 8911943, 8641870, 8508251, 9203071, 9463437, 9674867, 9934156, 10465028, 10601556, 10701589, 10107151, 10447826, 10430194, 9991818, 9601866, 9166139, 9076457, 8633837, 8883147, 8755047, 8240018, 8793442, 8267169, 7742237, 8960441, 9446329, 8558837, 8626317, 9240420, 9184736, 8940700, 9948916, 10083089, 10855819, 10369955, 9437230, 9583402, 9573970, 10189227, 10900405, 10817326, 10069157, 10121116, 9599866, 9992305, 10566825]
4031A0566825K62604q0350k61723K40930J72291J12074M4986L33346O81711L1158
4021A2103852j44205n09060l397q7586J76536p80238r105N10293N55481j26628
4011A1685943j68039R25057P4530K83271K82779j12213j87908k90557m15709P77311
4001A2854465R50164j86406l31684R8794l49085J97328O5124O21664J81016n03220
3991A3598160r632J198879J4065L64227K46467n33224M98589N07312l62252Q3093
3981A5605684P52227M46516k51222j12781M27679P13378M4378j91346L11195n07738
3971A7237970l233N95130M39579j65958Q59643R8462J279476l4611K25392N32548
3961B1064398R55868N13379k04064P65674L12299J28794j44485Q00945J639548
$$ y = [10566825, 10829429, 10749079, 10487356, 10728286, 10900577, 11012651, 11057637, 11390983, 12072694, 12103852, 11959647, 11450587, 11447190, 11359604, 11536140, 10755902, 10746797, 11257090, 11812571, 11685943, 11517904, 12442961, 12517491, 12800762, 13083541, 12971328, 12783420, 12492863, 12077154, 12854465, 13804629, 13618223, 13286539, 13385333, 13036248, 13233576, 13298700, 13920364, 14101380, 13598160, 13588528, 14787407, 14801472, 15165699, 15412166, 14878942, 15377531, 15884843, 15522591, 15605684, 16357911, 16804427, 16553205, 16440424, 16868103, 17581481, 17625859, 17434513, 17745708, 17237970, 17234737, 17829867, 18269446, 18103488, 18963131, 19061593, 20341069, 20306458, 20531850, 21064398, 22020266, 22533645, 22329581, 23095255, 23407554, 23536348, 23391863, 24192808, 25832356]
3952B5832356J76786k1048Q11216J299803J725104Q1903M42558R37554J361481
3943C2647713q412m94836L86476J36260N6351N08762K11575l97934N67085K7883
3933C3640923O37846J48656o46092K03158l43577k66400m11626n25059L87776
3924C2825605l15664m25036l26354j42151J53837r70528L59983q42627p32186
3915B9584879n24519o9950J159522J26167k55731k21300J21513l8893n42297m78201
3905B8861190K70350J90672J070501O77343R4136O88233l38335J07678J108460
3896C2730228O40618P14838Q2931J107255J833153Q35348O18838k05481J206413
3887C9564141Q92761J068895K81873J013388L31883J011233O00468O58971M86959
$$ y = [25832356, 26009142, 25988094, 26799310, 28099113, 29824217, 29906120, 30348678, 31286232, 32647713, 32639301, 32144465, 32530941, 32667201, 32723552, 33232314, 33443889, 33045955, 33613040, 33640923, 34278769, 34427425, 33781333, 33984491, 33640914, 33374514, 32962888, 32437829, 32825605, 32509941, 32084905, 31758551, 31616400, 31770237, 30799709, 31159692, 30317065, 29584879, 29060360, 28990410, 30149932, 30276099, 30020368, 29799068, 29920581, 29881688, 29339391, 28861190, 29131540, 29322212, 30392713, 31070056, 31164192, 31852425, 31514090, 31621768, 32730228, 33370846, 34085684, 34168615, 35275870, 37109023, 37944371, 38563209, 38357728, 39564141, 40456902, 41525797, 41807670, 42821058, 43152941, 44164174, 44764642, 45423613, 45910572]
3878D5910572m46462O9797l34971n42804m21809J33916L14291L31759p92569p84796
3868D3436924k11925p78128r78126r07465k92056n50505j106034r08711n43193
3859C7160781k33329p29097K13038K38326n37401n24331J90155n60791r44950
3850C4272401m06008M72834k68843o90743N6318m4071L16191M20996q6425n3447
3840C3989203L97722J159569n6393M70006K13536M92077M01624L1360J448627
3831C8547331J118205l34043k37917N32423L94362K79600M21321P31267P05363
3822D2157912J123708J166793N32586J181333P18147J067597J371748M84494Q39394
3813E0643712L86711M93892N49823N16379J893553N70194J107933J152106Q20002
$$ y = [45910572, 45464110, 45533907, 45198936, 44656132, 44234323, 44368239, 44682530, 45014289, 44221720, 43436924, 43224999, 42446871, 41468745, 40561280, 40269224, 39718719, 38612685, 37703974, 37160781, 36927452, 36198355, 36411393, 36649719, 36112318, 35587987, 35778142, 35217351, 34272401, 33866393, 34339227, 34070384, 33379641, 33435959, 33391888, 33708079, 34129075, 34042650, 33989203, 34386925, 35546494, 35490101, 35960107, 36173643, 36665720, 37067344, 37098704, 38547331, 39665536, 39331493, 39093576, 39625999, 40020361, 40299961, 40721282, 41452549, 42157912, 43281620, 44448413, 44980999, 46162332, 46880479, 47948076, 49319824, 49804318, 50643712, 51030423, 51524315, 52074138, 52590517, 54484070, 55054264, 56162197, 57314303, 58134305]
3804E8134305R32609O55189J556027R16125M07149J412301J515342R54302Q75839
3795F7359188J191834N88787N77461J139495J907018Q40142Q72911J719483J305561
3786G7501880J050292J814810K411012K122892J610829L235556L380394K813962
3778I5941627M085397L681572L786255L553381L827159M423934M901412N276782
3770A29477519M363291L809777K953764K542047K996530J679030N78594N51068
3762A48951620J457385J631029J376745J975509L348405M058112N514205N261752
3754A73574762N084627N558284N802049N675287M709640L309359J192235L92003
3746B05298246K36547j472295l398473m001253l106828m256892l629752l286437
$$ y = [58134305, 59066914, 59722103, 61278130, 62194255, 62601404, 64013705, 65529047, 66483349, 67359188, 68551022, 69139809, 69717270, 70856765, 72763783, 73603925, 74476836, 76196319, 77501880, 78552172, 80366982, 82777994, 84900886, 86511715, 89747271, 93127665, 95941627, 100027024, 103708596, 107494851, 111048232, 114875391, 119299325, 124200737, 129477519, 133840810, 137650587, 140604351, 143146398, 146142928, 147821958, 148400552, 148951620, 150409005, 152040034, 153416779, 155392288, 158740693, 162798805, 168313010, 173574762, 178659389, 184217673, 190019722, 195695009, 200404649, 203714008, 204906243, 205298246, 205534793, 204062498, 200664025, 196662772, 193555944, 189299052, 185669300, 182382863]
3738A82382863k968603k446335j023868j074641j238326j812718r71734j514162
3730A69332476k592883k969466j975440j866797k341264k850912k281387k195481
3722A50258846j950843j49690K69013Q4762R35943J541771J186994K216871K239499
3713A56633166K879006J569525J204329J272484J80660j309842j540905k293283
3705A58595140j587279k187146k577102k739452l147150k588704k349497j383683
3697A40035127j380784k830990j203367o72157p64062l58651p56309k09564l83457
3688A31475786j168268k097269j540574j176675l074099k032798k532514k456344
3680A15397245k242271k514237l653578j819236k189256l317135j731419j828507
$$ y = [182382863, 179414260, 176967925, 175944057, 174869416, 173631090, 171818372, 170846638, 169332476, 166739593, 163770127, 161794687, 159927890, 157586626, 154735714, 152454327, 150258846, 148308003, 148158313, 148427326, 148512088, 149448031, 150989802, 152176796, 154393667, 156633166, 159512172, 161081697, 162286026, 163558510, 163739170, 162429328, 160888423, 158595140, 157007861, 154820715, 152243613, 149504161, 146357011, 143768307, 141418810, 140035127, 138654343, 135823353, 134619986, 133947829, 133183767, 132825116, 132068807, 131859243, 131475786, 130307518, 128210249, 126669675, 125493000, 122418901, 120386103, 117853589, 115397245, 113154974, 110640737, 106987159, 105167923, 102978667, 99661532, 97930113, 96101606]
3672I6101606k337258j684075k21890j464936j657460k204020q47014o35918n91771
3663H4457264p49626r48097j432443o48788k51520j099559J58100r30859o01574
3654G7952898r57071p63064k52427n25616j52875p3411j97122r22220O41090m02646
3644G4347536k41417j266641j611680o66261q69630p53100n97509n73673j024059
3635F6743566j214926r97043m96574j82219n62271j391795n95464M56579l36523
3626F1423330k48975j38558o84042k59601k1640n90810p71726j154508q28755
3617E6724715q74303q22699j041451r83770o71127l72067l34465j463294k9122
3608E0132417K13756j043364l12222k06918j201760j15483j79306k37170m84739
$$ y = [96101606, 93764348, 92080273, 91858383, 90393447, 88735987, 86531967, 85684953, 85049035, 84457264, 83707638, 82759541, 81327098, 80678310, 80426790, 79327231, 79485331, 78554472, 77952898, 76995827, 76232763, 75980336, 75454720, 75301845, 75228434, 75031312, 74109092, 74750182, 74347536, 74106119, 72839478, 71227798, 70561537, 69691907, 68938807, 68341298, 67767625, 66743566, 65528640, 64531597, 64035023, 63852804, 63290533, 61898738, 61303274, 61759853, 61423330, 61174355, 61035797, 60351755, 60092154, 60070514, 59479704, 58707978, 57553470, 56724715, 55850412, 55027713, 53986262, 53002492, 52331365, 51959298, 51624833, 50161539, 50132417, 50346173, 49302809, 48990587, 48783669, 47581909, 47466426, 47287120, 47049950, 46565211]
3599D6565211P1220o72428n47676l38207M28854O57374o7608j34857L26672L07587
3589D6596142m78749J09151M29725K91438L11180K6488m45195l79617K46060o17150
3579D6089473p99701o27342q66706q14445o55578n2336n93055l94913r02261k45667
3569D0137469m6905m44344l51948k32573p65305m66995k58552j97440R4777p21074
3559C6747110k14386O70233j014864K9751L44117L38371k65351J56142J04371
3550C6895494q730O37168M08972j006750q67076j05206J04988m71403n42054l3942
3540C5011461q86993q65989j112437r9340j77410m01522p3757K43287r60398n3045
3530C0623857K67599M24026K52996J47113o30813j63536K5662M55169K01314P5115
$$ y = [46565211, 46636431, 45964003, 45416327, 45078120, 45506974, 46164348, 46096740, 45961883, 46288555, 46596142, 46117393, 46226544, 46656269, 46947707, 47258887, 47285375, 46840180, 46460563, 46706623, 46089473, 45289772, 44662430, 43795724, 42981279, 42325701, 42273365, 41680310, 41285397, 40383136, 40137469, 40090564, 39646220, 39294272, 39061699, 38296394, 37829399, 37570847, 37373407, 37468184, 36747110, 36532724, 37202957, 36188093, 36217844, 36561961, 36900332, 36634981, 36791123, 36895494, 36886764, 37523932, 37932904, 36926154, 36059078, 35953872, 36058860, 35587457, 35045403, 35011461, 34124468, 33258479, 32146042, 32046702, 31869292, 31467770, 31394013, 31637300, 30676902, 30623857, 30891456, 31315482, 31568478, 31715591, 31084778, 30921242, 30946904, 31402073, 31603387, 31678502]
3520C1678502K85830K04550R59154L57472m61579m41575O69186q37509q3772M25581
3510C2755840M09936M77779J03201Q65728K23238m91094k80092k75949Q99583
3501C4688170O2435l88252k5494j2131K09914O46147L25077J033553J145438m64372
3491C7220485K6502m67339M03232O43833K01052K48412N36097j27646J076509
3482C9761137N70176M46500N04892N38757J483726Q68955M04345J08239J66517
3473D4853244P60020R55607K68113J189448P03400m05886L97992P29574M01911
3464D9853423J65630L61719J463256M65142R29916J378140M42607J347680O38790
3455E7046303J653239J761247J624355K729978K271652Q46301J765536K405542
$$ y = [31678502, 31964332, 32168882, 33128036, 33485508, 33023929, 32582354, 33251540, 32414031, 32330259, 32755840, 33165776, 33643555, 33746756, 34612484, 34835722, 34344628, 34064536, 33788587, 34688170, 34750605, 34362353, 34336859, 34324728, 34534642, 35180789, 35505866, 36539419, 37684857, 37220485, 37246987, 36779648, 37182880, 37826713, 38027765, 38276177, 38812274, 38684628, 39761137, 40331313, 40777813, 41282705, 41821462, 43305188, 44174143, 44578488, 44686727, 44853244, 45613264, 46568871, 46836984, 48026432, 48729832, 48323946, 48721938, 49451512, 49853423, 50019053, 50380772, 51844028, 52309170, 53239086, 54617226, 55059833, 56407513, 57046303, 58699542, 60460789, 62085144, 64815122, 67086774, 67933075, 69698611, 72104153]
3447G2104153K509478K284719J572629L002588M073131L356644K773744M489292
3439I6166378L478568M672738O235669O492945O448056P560981R720404J0191680
3431A50967419R725205J0478082J2201866J2755870J5106152J6917125J7327727
3424B45479446J7964310J7685179J5525362J0877947L470360k970657q378472
3417B99653475j3697103j7676690j8782855j7602748j6941631j6327955j4397659
3410A84226834j3231648j1733146j0297779j0198752p963213o991399o790557
3403A17020340n992953n429917n231528l541754l581376l413426l237742k745729
3395H3845915j770169k010028k280782k455488o68557j333158r45091n45939j402064
$$ y = [72104153, 74613631, 76898350, 78470979, 81473567, 85546698, 88903342, 91677086, 96166378, 99644946, 104317684, 110553353, 117046298, 123494354, 131055335, 140775739, 150967419, 160692624, 171170706, 183372572, 196128442, 211234594, 228151719, 245479446, 263443756, 281128935, 296654297, 307532244, 311002604, 308031947, 299653475, 285956372, 268279682, 249496827, 231894079, 214952448, 198624493, 184226834, 170995186, 159262040, 148964261, 138765509, 130802296, 123810897, 117020340, 111027387, 105597470, 100365942, 96824188, 93242812, 89829386, 86591644, 83845915, 82075746, 80065718, 77784936, 75329448, 74660891, 73327733, 72382642, 71836703, 70434639]
3386G0434639q14626n71762r66063j047170j363007j294955r98284j744350n71817
3377F1062605o46893r69456q64386n08398q38308j453469p57759n99057j237043
3368E3187836j76015m30349m70590p33725o56057l6324l57888m97796q81002k68863
3358D8679227m48005j56815n80765N897J44113j62389k47579k03025p63198r7651
3348D6169810K44633M88363k83222O42062M60673j20312N12751n14720P42269
3339D8342307M38281J192715R22445P78603Q18421L08718Q73361J173957m8662
3330E4800146N64952k0073N48678J349151l3709J1014J8498j491304n85632M53235
3320E5614956j274663k27608M43795M69819q35432n57203j57215O42748P94362
$$ y = [70434639, 69620013, 69048251, 68082188, 67035018, 65672011, 64377056, 63378772, 61634422, 61062605, 60415712, 59446256, 58581870, 58073472, 57235164, 55781695, 55023936, 54424879, 53187836, 53011821, 52581472, 52110882, 51377157, 50721100, 50684776, 50326888, 49829092, 48948090, 48679227, 48231222, 48074407, 47493642, 47499539, 47643652, 47481263, 47233684, 47030659, 46267461, 46169810, 46414443, 46902806, 46619584, 47261646, 47722319, 47602007, 48114758, 47600038, 48342307, 48780588, 49973303, 50895748, 51674351, 52492772, 52801490, 53674851, 54848808, 54800146, 55365098, 55345025, 55893703, 57242854, 57209145, 57220159, 57238657, 55747353, 55161721, 55614956, 54340293, 54112685, 54556480, 55026299, 54190867, 53633664, 53476449, 54119197, 54913559]
3311E4913559P87523K4890L73621P96244Q51988N76455P29029J49990J264196
3302F0467495J447905L17767M02316Q42244L44832K58672J339568N96019J445468
3293F7462286J042952M87101O62179J025223N10470N13156K60858L74285O96053
3284G3034563N01373O95201J684228P51027K250914J843264J448023K770662J711841
3275H6691096J165150J216366J463386J280940Q97487J589581K204005K211450
3267I8719461K440449K557445K706248M395533L783378M689373N331825O158188
3259A30781900Q454036R616419J0788055J1669600J5250355J9060880K4357478
3252B29978723L0649310L6995039M2724423M7371238M5922110M1662516K9665460
$$ y = [54913559, 55701082, 55725972, 56099593, 56895837, 57747825, 58324280, 59053309, 59203299, 60467495, 61915400, 62233167, 62635483, 63477727, 63822559, 64081231, 65420799, 66016818, 67462286, 68505238, 68992339, 69654518, 70679741, 71190211, 71703367, 71964225, 72338510, 73034563, 73535936, 74231137, 75915365, 76666392, 78917306, 80760570, 82208593, 84979255, 86691096, 87856246, 89072612, 90535998, 91816938, 92714425, 94304006, 96508011, 98719461, 101159910, 103717355, 106423603, 110819136, 114602514, 119291887, 124623712, 130781900, 139235936, 148852355, 159640410, 171310010, 186560365, 205621245, 229978723, 260628033, 297623072, 340347495, 387718733, 433640843, 475303359, 504968819]
3245E04968819J1468889n507312k2766310l8178261m7813751m9243912m7651579
3238C05276583m3038357l3636627k6090834j9989267j4712125j1403860r281148
3231A47124365p256280o505555n489820n287002m837290m490607m180366m109085
3223A04968360l913565l070789k971180l374063k838766k023863j729315k329164
3215H2717655j899579j551673o99079J9643m60601j561888j942673j118491l74108
3206G3129206r70859j167692j002713r50196n45857j330046j311690n63507n25337
3197F4761309j733183r77313j42848j003458j459747o43146q45462q45027j622000
3188E5489125o74140r6706j734399r83361k58193o04090k76240r72276j041055
$$ y = [504968819, 516437708, 510930396, 488164086, 449985825, 402172074, 352928162, 305276583, 262238226, 228601599, 202510765, 182521498, 167809373, 156405513, 147124365, 139868085, 133362530, 127872710, 122585708, 117748418, 113257811, 109077445, 104968360, 101054795, 97984006, 95012826, 91638763, 88799997, 86776134, 85046819, 82717655, 80818076, 79266403, 78567324, 78586967, 78126366, 76564478, 74621805, 73503314, 73129206, 72158347, 70990655, 69987942, 69037746, 68491889, 67161843, 65850153, 65286646, 64761309, 63028126, 62050813, 61907965, 60904507, 59444760, 58801614, 57956152, 57111125, 55489125, 54814985, 54718279, 52983880, 52000519, 51742326, 51138236, 50861996, 49889720, 48848665]
3179D8848665q08722j40113j107385O8648o24176j62146K59149P44639J83416
3170D7261975j35414k43156J84419L24973m75756j422650j623103l84269j277793
3161D2209226p79063j046144J88650k00222k59018J36694j53161k93295j9873
3152C9783794L34835M61976L96086J092992J149274P07872J614719q02637j415553
3143D3323358r51956j519458j460172q53444o09027l41768O8150N1329p26271
3134C6980741j9356k14050l31590K90525K12242K69601k93232l53310Q99964Q51778
3124C8293313J75273O63416o58555L07794k29121n58215O90344K08077K49183
3115C9141509k83702n16383J89824J25266j35026j53318l52083j64716K36827
$$ y = [48848665, 48039943, 47899830, 46792445, 46861093, 46236917, 46074771, 46333920, 47078559, 47261975, 47126561, 46883405, 47067824, 47392797, 46917041, 45494391, 43871288, 43487019, 42209226, 41430163, 40384019, 40572669, 40372447, 40113429, 40250123, 40096962, 39803667, 39783794, 40118629, 40580605, 40976691, 42069683, 43218957, 43926829, 45541548, 44738911, 43323358, 42371402, 40851944, 39391772, 38538328, 37929301, 37587533, 37655683, 37707012, 36980741, 36961385, 36747335, 36415745, 36706270, 36918512, 37188113, 36894881, 36541571, 37441535, 38293313, 38468586, 39132002, 38473447, 38781241, 38552120, 37993905, 38684249, 38892326, 39141509, 38857807, 38341424, 38531248, 38656514, 38521488, 38368170, 38016087, 37851371, 38088198]
3106C8088198q85551P14908Q57917J64021k58058L27500J013911J193200m28814
3097D0787232Q47J98111N58734P86355R5596Q58537J20582J174401J289773J85864
3087D6056032J231713K106003M13300N76390J592608J557604Q44544R67558J653520
3078E6999272K032850J828866K503690K019201K606825K551088K743614L510235
3070G6795641M995178M627771N132836O808434N548131N549581L878489n34726
3062A12801335j564032j339973j855922m13642K378019L013938L488625M879360
3054A21387708N416513O471255O838425Q232772R065880R542087J0727454J1023759
3046A88705853R694727R848986P279485M146881M736m046083p416434r274493
$$ y = [38088198, 37202647, 37917555, 38775472, 38939493, 38681435, 39008935, 40022846, 41216046, 40787232, 40788079, 40986190, 41544924, 42331279, 42426875, 43285412, 43405994, 44580395, 45870168, 46056032, 47287745, 49393748, 49807048, 50383438, 51976046, 53533650, 54378194, 55345752, 56999272, 59032122, 60860988, 63364678, 65383879, 67990704, 70541792, 73285406, 76795641, 81790819, 86418590, 91551426, 98359860, 103907991, 109457572, 113336061, 112801335, 111237303, 109897330, 108041408, 107627766, 110005785, 113019723, 116508348, 121387708, 126804221, 133275476, 140113901, 148346673, 157412553, 166954640, 177682094, 188705853, 198400580, 208249566, 215529051, 219675932, 219680668, 215634585, 208218151, 198943658]
3038A98943658j0806409j1794305j1238066r388813p781115o456348o003661n645371
3030A29829570m547078l519968k982084k583247j364351j366806j812058j995313
3022A09658665j628031j439323o22998l31446M78752r7173j905117k37691O08813
3013A04484451j26941j87697j80734l89984K88861M98168p5207M81381N69573
3004A05361871J04361Q5211N01116M07874K534N6460K5935Q20455J61638j76727
2994A07350728l2927m89n73907o62448J051501m79010k78816L39482Q95160k85815
2984A07323459o07300l04071o42820m47004J48582j85318q27663p72639k88456
2975A03396770J86415p78791p16583m30590p76440j131590j545542M072N579m71369
$$ y = [198943658, 188137249, 176342944, 165104878, 155716065, 147934950, 141478602, 135474941, 129829570, 125282492, 121762524, 118780440, 116197193, 114832842, 113466036, 111653978, 109658665, 108030634, 106591311, 105968313, 105636867, 106115619, 106018446, 104113329, 103875638, 104484451, 104357510, 104169813, 103989079, 103599095, 103887956, 104386124, 104310917, 104792298, 105361871, 105466232, 105551443, 106052559, 106460433, 106462967, 106519427, 106545362, 107365817, 107527455, 107350728, 107317801, 107317312, 106743405, 106080957, 107132458, 106653448, 106374632, 106714114, 107609274, 107323459, 106716159, 106412088, 105769268, 105322264, 105470846, 105285528, 104457865, 103685226, 103396770, 103583185, 102804394, 102087811, 101657221, 100880781, 99749191, 98203649, 98207721, 98213300, 97741931]
2965I7741931m73996j063319o68500l78279q22492j062357p30071p56114j072316
2956I0714487j190138r58716j006248j137248j7334q12726k29351j109794j366752
2947H2886180r8436k68607P23955q46795L63330m90643q84862k47182P7757k41009
2937H0973688L1715o15436o60451j85846J65780l84307k98595M2719R4263R41280
2927H0104810O40121N04849k63670Q31268O64173J749977J206676J355487J812507
2918H8606198J319913J020430Q30562J228925J478552J728302P39781P36829J861588
2909I9551080J231371Q48446J493312J653352J422569J608850J843558J242639
2901A10895177Q17658J297103J087963J854356J104989j15640M21406J183671
$$ y = [97741931, 97267935, 96204616, 95536116, 95157837, 94335345, 93272988, 92542917, 91786803, 90714487, 89524349, 88565633, 87559385, 86422137, 86404803, 85592077, 85362726, 84252932, 82886180, 82787744, 82519137, 83243092, 82396297, 82759627, 82268984, 81384122, 81136940, 81214697, 80973688, 81005403, 80389967, 79729516, 79543670, 79709450, 79325143, 79026548, 79069267, 79163530, 80104810, 80744931, 81249780, 80986110, 81817378, 82481551, 84231528, 85438204, 86793691, 88606198, 89926111, 90946541, 91777103, 93006028, 94484580, 96212882, 96952663, 97689492, 99551080, 100782451, 101630897, 103124209, 104777561, 106200130, 107808980, 109652538, 110895177, 111712835, 113009938, 114097901, 115952257, 117057246, 116941606, 117363012, 118546683]
2893A18546683R16083Q14273O29780L15054R23979J41695r59314m41094J54362
2884A21041501M97463m84552j080466p19276m57893j209550m91244r46529K0415
2875A16169869j130363p72135q41771j222445n84316j453593j451155j647199
2867A07066892j509230j445241j007383j526132j634698j417557q20892l323123
2859I4382636k085981j019375k146836j210399j481855j766213o55622j979697
2851H2036658j750968j705382k237942j023541j117896j429672j271887m45519
2843G1053851j89667k199850j427825j175171r49600p50223o59069k14595p37809
2834F2750042j610573l05171j5021n1483o67932j043535j29296K66405p34551
$$ y = [118546683, 119462766, 120277039, 120906819, 121221873, 122145852, 122287547, 121328233, 120887139, 121041501, 121538964, 121054412, 119973946, 119254670, 118796777, 117587227, 117095983, 116149454, 116169869, 115039506, 114267371, 113425600, 112203155, 111618839, 110165246, 108714091, 107066892, 105557662, 104112421, 103105038, 101578906, 99944208, 98526651, 97705759, 94382636, 92296655, 91277280, 89130444, 87920045, 86438190, 84671977, 84016355, 82036658, 80285690, 78580308, 76342366, 75318825, 74200929, 72771257, 71499370, 71053851, 70864184, 68664334, 67236509, 66061338, 65111738, 64361515, 63702446, 63487851, 62750042, 61139469, 60834298, 60819277, 60767794, 60099862, 59056327, 58927031, 59193436, 58458885]
2825E8458885m68697j45967m62667k28087n55738q40227L7558O05213K92831j83750
2815E6509354r23779j222024N40810k22373Q9611m53451M42834L90684o63281
2806E4488385q21958P6262J74887O03419m9306l22917M41168k68586k04329L59912
2796E4476937k53450o50958J042265n07019j51184j80303J69178N2828j83343
2787E3814951L68790O67176k85638O97816o391L75606j43820j39621M53679R97225
2777E6799773K98460m1389L34267K39268M94876J210468M7321K11037M86932K99222
2767F0380235P52040N73340M98866R55750N07891J35988N65518O36283K65144
2758F5271055N50104Q77513M97357Q75549P08913J021909P64749M03949J51154
$$ y = [58458885, 57990188, 57844221, 57381554, 57153467, 56597729, 55757502, 55795060, 56400273, 56693104, 56509354, 55585575, 54363551, 54904361, 54681988, 54771599, 54318148, 54760982, 55151666, 54488385, 53666427, 53742689, 53917576, 54520995, 54471689, 54148772, 54589940, 54321354, 54117025, 54476937, 54223487, 53572529, 54614794, 54107775, 53956591, 53776288, 53945466, 53998294, 53814951, 54183741, 54850917, 54565279, 55263095, 55256704, 55632310, 55488490, 55348869, 55802548, 56799773, 57098233, 57056844, 57391111, 57630379, 58125255, 59335723, 59383044, 59594081, 60081013, 60380235, 61132275, 61705615, 62204481, 63160231, 63668122, 63804110, 64369628, 65005911, 65271055, 65821159, 66698672, 67196029, 68071578, 68780491, 69802400, 70567149, 70971098, 71122252]
2749G1122252J497371J201440R46618P97983L40952O97254P93429J931221J386874
2740H0715394N57019P34608J260343J403707K41000J824750J521948J176656K235943
2731I1671368K11965M91114J169980R28861J164534R87533O47404L14148J11511
2722I7698418J288355L38391k86022O37469O11870J018693P02504m20841j98200
2713A01390637J81034K53494n83255O23445m92059n8516R4396l56763K20246o20899
2703A00651760P69627J112082O60857M54035J80301J50820J230092J059131J373427
2694A07642132J391346J707484J640824K186244L446237K709679L082629L625885
2686A27432460L429059L922273M330222L429357M398864N332031M095879M948377
$$ y = [71122252, 72619623, 73821063, 74767681, 75565664, 75906616, 76603870, 77397299, 79328520, 80715394, 81272413, 82007021, 83267364, 84671071, 84912071, 86736821, 88258769, 89435425, 91671368, 91883333, 92374447, 93544427, 94473288, 95637822, 96625355, 97272759, 97586907, 97698418, 98986773, 99325164, 99039142, 99676611, 100288481, 101307174, 102009678, 101588837, 101390637, 101571671, 101825165, 101241910, 101865355, 101373296, 101314780, 101409176, 101052413, 101272659, 100651760, 101421387, 102533469, 103194326, 103648361, 103828662, 103979482, 105209574, 106268705, 107642132, 109033478, 110740962, 112381786, 114568030, 118014267, 120723946, 123806575, 127432460, 130861519, 134783792, 139114014, 142543371, 146942235, 152274266, 156370145, 161318522]
2678A61318522M760911M366743M377456M479735M407631L545812L259105M192754
2670A94708669M011125L323754L850141L662871K482592K147562J207571J946510
2662B17340795J285809L06455R16662L96823k64382p79893j679658j627524m46232
2653B15448855j865742k118260j961560k571238k337627k452028l497695l232485
2645A95412220j889077k562884k755579k528304k631204l831852k974903k962050
2637A73276367l390720k751267k097509k283203l063648k272289j914065j505069
2629A53998597k737964k382499j699204j525937j115560o63187o93464j282742
2621A41898040p91007o74525o63040k3302Q38194L87915L10637Q10676R44350
$$ y = [161318522, 166079433, 170446176, 174823632, 179303367, 183710998, 187256810, 190515915, 194708669, 198719794, 202043548, 205893689, 209556560, 212039152, 214186714, 215394285, 217340795, 218626604, 218933059, 219849721, 220246544, 219982162, 219202269, 217522611, 215895087, 215448855, 213583113, 211464853, 209503293, 206932055, 204594428, 202142400, 198644705, 195412220, 193523143, 190960259, 188204680, 185676376, 183045172, 179213320, 176238417, 173276367, 169885647, 167134380, 165036871, 162753668, 159690020, 157417731, 155503666, 153998597, 151260633, 148878134, 147178930, 145652993, 144537433, 143874246, 143180782, 141898040, 141107033, 140432508, 139769468, 139746166, 140584360, 140972275, 141282912, 142093588, 143037938]
2612A43037938J206076J679402J010760J484593J453823J376321J822003K697657
2604A55768573J460608J480229J807117J954389K498634K541551K517657K281419
2596A72310177K730905J840639J506428K082643J078214J548770J893446J396234
2588A86387456J060534M03930J242314Q67773J428076M59375J457651J522133
2580A94829242R53020J083094J33818O61403L7413J377407R00267M46090O92520
2571B01114274L71517J248674O62418J301966J614908M77560n3010J052272R44554
2562B08735133J062081R92192J386438J295535O69971J983716J636986J570357
2554B19332409M55017k77788J871275M87502P64105K95336O4754N69110K98249
$$ y = [143037938, 144244014, 145923416, 146934176, 148418769, 149872592, 151248913, 153070916, 155768573, 157229181, 158709410, 160516527, 162470916, 164969550, 167511101, 170028758, 172310177, 175041082, 176881721, 178388149, 180470792, 181549006, 183097776, 184991222, 186387456, 187447990, 187851920, 189094234, 189962007, 191390083, 191849458, 193307109, 194829242, 195782262, 196865356, 196999174, 197660577, 197697990, 199075397, 199975664, 200421754, 201114274, 201485791, 202734465, 203396883, 204698849, 206313757, 206791317, 206738307, 207790579, 208735133, 209797214, 210789406, 212175844, 213471379, 214141350, 216125066, 217762052, 219332409, 219787426, 219509638, 221380913, 221868415, 222632520, 222927856, 222992610, 223561720, 223859969]
2545B23859969K24817J89902J121473j60890m73236m08222p27935o11936r29657
2536B22084285j066346q52314r48639k341568j703761j537565j850256j313128
2528B10470708j230118k116014k206492j949467k246628k978553k436837j889654
2520A93416945k257223k199345j687371j293579k619340k469764k304810k579221
2512A76006292k420029j919913k165780k126943j732183j595432j501652j166658
2504A61377702j687196r16373j033342j044178k38179r63685o06811K49209k86113
2495A54851034q50672l38736J039258m48228j37254K78782M10701M16328O62838
2486A55884051J40513o67426O9340K93560K16168j9490o93732j23114n84118j547085
$$ y = [223859969, 224084786, 224274688, 225396161, 225235271, 224762035, 224353813, 223625878, 223013942, 222084285, 221017939, 220165625, 219216986, 216875418, 215171657, 213634092, 211783836, 210470708, 209240590, 207124576, 204918084, 202968617, 200721989, 197743436, 195306599, 193416945, 191159722, 188960377, 187273006, 185979427, 183360087, 180890323, 178585513, 176006292, 173586263, 171666350, 169500570, 167373627, 165641444, 164046012, 162544360, 161377702, 159690506, 158774133, 157740791, 156696613, 156458434, 155494749, 154887938, 155137147, 154851034, 154000362, 153661626, 154700884, 154252656, 154115402, 154394184, 154804885, 155221213, 155884051, 156024564, 155357138, 155426478, 155720038, 155936206, 155916716, 155222984, 155099870, 154515752, 152968667]
2476A52968667j187224j854915m42372j781993j514239j469253k044163k243819
2468A40430689j922685k511041j765523k005774l033446k691729l488868k392264
2460A20619359j793454k637132k279648l085344k914790j663122j740169k150381
2452A02355319k150888k644083j842363j070837j383485j639990j098806j297907
2444H9226960p16276n40305j018050m89232j143018k00688N21602M94564M33331
2435H6568888M3701j13029L79272K76131J118404J151063R10247J254177J219153
2426I2808007Q25961J452268M39409K16521J199015K28453O62305Q55741L95982
2417I9083662J232N61363N21312j7430n94601m86987j2056j027673r76525p76200
$$ y = [152968667, 151781443, 149926528, 149484156, 147702163, 146187924, 144718671, 142674508, 140430689, 138508004, 135996963, 134231440, 132225666, 129192220, 126500491, 123011623, 120619359, 118825905, 116188773, 113909125, 110823781, 107908991, 106245869, 104505700, 102355319, 100204431, 97560348, 95717985, 94647148, 93263663, 91623673, 90524867, 89226960, 88510684, 87970379, 86952329, 86463097, 85320079, 85119391, 85640993, 86135557, 86568888, 86612589, 86499560, 86878832, 87154963, 88273367, 89424430, 90334677, 91588854, 92808007, 93633968, 95086236, 95525645, 95742166, 96941181, 97169634, 97831939, 98687680, 99083662, 99084894, 99646257, 100167569, 100150139, 99555538, 99068551, 99056495, 98028822, 97052297, 96276097]
2407I6276097j102061j613319j026931r80636k054831k201347j627984k259433
2399H3409555j841366k279340j870096k213815j946218k290809k173392j879307
2391F6915212l023468k372066k094052j459665j200158j681298j063622j396219
2383E2624664j718499p42913j886708j454056j118667j016204P43547k54785l05352
2374D4871027J54095r20868l53211O08322K05184j45852P6581l67869N53016N99446
2364D5279871J71844r7035m35119P12618J71074n60379K54304J73429n1854K31801
2354D5850554l9379n23569m94233O44184M06736o92670n72811p55382n23898q47905
2344D2451627j198398j065103r19390o43880r16017n84609r2939q44214j495614
$$ y = [96276097, 95174036, 93560717, 92533786, 91553150, 89498319, 87296972, 85668988, 83409555, 81568189, 79288849, 77418753, 75204938, 73258720, 70967911, 68794519, 66915212, 63891744, 61519678, 59425626, 57965961, 56765803, 55084505, 54020883, 52624664, 50906165, 50163252, 48276544, 46822488, 45703821, 44687617, 45431164, 45176379, 44871027, 45025122, 44104254, 43751043, 44359365, 44564549, 44418697, 44495278, 44127409, 44680425, 45279871, 45451715, 45354680, 44919561, 45632179, 45803253, 45242874, 45497178, 45670607, 45618753, 45850554, 45811175, 45287606, 44793373, 45437557, 45844293, 45151623, 44578812, 43823430, 43299532, 42451627, 41253229, 40188126, 39268736, 38624856, 37708839, 37124230, 37031291, 36187077, 34691463]
2335C4691463j236771j021777j343470m42238j289640p61910m30058j204946p83635
2326B6177018n06980j179595j505428J36427k62547k71115j56613p42534l99613
2317B1289020q31863o56090m6092j046853p03938k86951L78283o57819p37953
2308A6699744Q0371L99768p45754o13983o06812l64132N57142j050712q80928
2299A3474704L5319m23034p2167J00245p36562K285k26943J33907J45575q0551
2289A2352778N3478l85319n61026n35447l22280j00190N48633n16084n98737L91464
2279A0327270m02998P7700L62266J056205p82809n21741O58927K35022j010873
2270I998969J93022J59588q5249N73563n23878n373k59791l64801l66415n03471
$$ y = [34691463, 33454692, 32432915, 31089445, 30647207, 29357567, 28595657, 28165599, 26960653, 26177018, 25670038, 24490443, 22985015, 23121442, 22858895, 22587780, 22431167, 21688633, 21289020, 20457157, 19801067, 19754975, 18708122, 18004184, 17717233, 18095516, 17437697, 16699744, 16780115, 17179883, 16434129, 15820146, 15213334, 14849202, 15406344, 14355632, 13474704, 13510023, 13086989, 13014822, 13115067, 12378505, 12380790, 12153847, 12287754, 12433329, 12352778, 12406256, 12020937, 11459911, 10924464, 10602184, 10501994, 11050627, 10534543, 9935806, 10327270, 9924272, 10001972, 10364238, 11420443, 10637634, 10115893, 10774820, 11009842, 9998969, 10191991, 10351579, 10266330, 10839893, 10316015, 10310642, 10050851, 9686050, 9319635, 8816164]
2260H816164O74586p8781P4245O96850l95283j04261p48795m57247j38457L159
2250H342180K95544k6506J25888n46056n33853L22081j31239r2871N0126J010
2240G806304r81989k08244R07446Q6567O70237j69892k70457j86040J51510J8521
2230G823963j41842J95746n37709m63663L87145R57228p85884j21894M51185l61974
2220G402301K44247j58778O04671j24892n31817K8137k48124J33063N04961k26506
2210G627263l9680m82364o07230K43980L46371L25265o21681k15794N49032O931
2200G132093k29471m5983j34911M61013k32912P58932j54978l49728n1018K14136
2190G367173N17318O66962o93876k92182M25915q8526n5420J05015J68080o75775
$$ y = [8816164, 9490750, 9411969, 9486214, 10183064, 9787781, 9683520, 8934725, 8477478, 8339021, 8342180, 8637724, 8611218, 8737106, 8191050, 7657197, 7979278, 7848039, 7755168, 7805294, 7806304, 6824315, 6616071, 7523517, 7610084, 8280321, 8110429, 7839972, 7653932, 7805442, 7823963, 7682121, 7877867, 7340158, 6876495, 7263640, 8220868, 7434984, 7313090, 7764275, 7402301, 7646548, 7487770, 8092441, 7967549, 7435732, 7463869, 7215745, 7348808, 7853769, 7627263, 7587583, 7105219, 6497989, 6741969, 7088340, 7413605, 6791924, 6576130, 7125162, 7132093, 6902622, 6856639, 6721728, 7182741, 6949829, 7708761, 7553783, 7204055, 7153037, 7367173, 7884491, 8551453, 7857577, 7565395, 7991310, 7902784, 7847364, 7952379, 8120459, 7444684]
2180G444684j97951N625l18243l42692Q26921m41840j28424j09442o2233n3113
2170F623292p47821l91729p17342M31204J67506K4937K26370L79417k57077L91733
2160F130490r40494o43227J52364p86937J196981K27630p24614K90748m11561
2151D491380l07779J215569m83867j060396J53180M79340p44112k34816P61457
2142D269956L37958O7688q92077j69958L95076N06789k52224j199559m11326J010223
2132C662546j51552M5285q48455p30557R22964J13464j15761N21209k02523l70448
2122B846172L73784m24646Q997O74322L1696l1746l68k90713l34782q4721O70369
2111C438364J79951J0279p02187O00585j601p2698J29230p50819m03452j19214
$$ y = [7444684, 7246733, 7252358, 6934115, 6591423, 7418344, 6976504, 6848080, 6738638, 6676405, 6623292, 5875471, 5483742, 4766400, 5197604, 5365110, 5390047, 5616417, 5995834, 5738757, 6130490, 5189996, 4546769, 4699133, 3912196, 5109177, 5336807, 4612193, 4902941, 4491380, 4183601, 5399170, 4915303, 3854907, 4008087, 4487427, 3743315, 3508499, 4269956, 4607914, 4675602, 3783525, 3613567, 4008643, 4515432, 4263208, 3063649, 2652323, 3662546, 3510994, 3556279, 2707824, 1977267, 2900231, 3013695, 2897934, 3419143, 3216620, 2846172, 3219956, 2795310, 2804307, 3478629, 3510325, 3478579, 3478211, 3187498, 2852716, 2767995, 3438364, 3618315, 3628594, 2926407, 3526992, 3525391, 3452693, 3581923, 2831104, 2427652, 2308438]
2101B308438L4294P05969m73645q82834R78712J1402J9843k67575n06117K14911
2091B143398j71540M38186O47372n35105l24885P99529M20359J74815p04903m60121
2081B427105M6849P2289q0155m61222j55745j2180m40176p5360K33851Q5954L20631
2070A961841N98166m30338q6090J38053J2646L75112j14557J73426r20363k8730
2060A679166J88027r02442o64909Q37020K51333p76729M59794K55730P45214O69120
2050B741324j263758K27048O87603o60921q98303R03947L50654k13965K05203
2041B078832L98698l32017m68365J03999K32402k31602m57589O72285J94605k59853
2031A931395p1887j54327l75296O4317n28073j25917M74843R72055P1431l35219
$$ y = [2308438, 2342732, 3048701, 2575056, 1692222, 2670934, 2682336, 2702179, 2434604, 1928487, 2143398, 1971858, 2410044, 3057416, 2522311, 2197426, 2996955, 3417314, 3592129, 2887226, 2427105, 2473954, 2546243, 2466088, 2004866, 1849121, 1836941, 1396765, 1321405, 1555256, 1641210, 1961841, 2560007, 2129669, 2043579, 2181632, 2194278, 2569390, 2454833, 2628259, 1707896, 1679166, 1867193, 964751, 299842, 1136862, 1388195, 611466, 1071260, 1326990, 2072204, 2741324, 1477566, 1704614, 2392217, 1731296, 832993, 1736940, 2087594, 1873629, 2078832, 2477530, 2145513, 1677148, 1781147, 2013549, 1781947, 1324358, 1996643, 2191248, 1931395, 1859508, 1705181, 1329885, 1394202, 866129, 740212, 1215055, 2187110, 2258541, 1923322]
2021A923322m98152M98351Q71215p24382o52614l97570Q48465K9619p51594j04137
2011A042523M47824p8091M50927P43171o42929l23015m29104L00183k3346L04567
2001A792710p59931m23691M14508J89231j28869P09903n94720L42279J27600K47602
1991A916622k63588o0998k84225k10036N31948o3244n59374P23948M77501j445578
1981G62976k83857m10789O88647q70981J91615N61472P66245p47883Q17590j81891
1971A293144L06990k73580q10600J098205k93158n72077J86255k18600o10729
1962A05850K71387L01065m35599M98564R37178j62289L9909k94771J50325n39857
1952H71762l61061j65154L39493n53466J60227J112425k00949l42313L96929m28960
$$ y = [1923322, 1425170, 1923521, 2794736, 2070354, 1417740, 1020170, 1868635, 1898254, 1146660, 1042523, 1490347, 1412256, 1863183, 2606354, 1963425, 1640410, 1211306, 1511489, 1488143, 1792710, 1032779, 609088, 1023596, 1212827, 1083958, 1793861, 1199141, 1541420, 1669020, 1916622, 1653034, 1592036, 1307811, 1097775, 1629723, 1566479, 1007105, 1731053, 2208554, 762976, 479119, 68330, 756977, -114004, 77611, 639083, 1405328, 657445, 1475035, 1293144, 1600134, 1326554, 515954, 1614159, 1321001, 748924, 935179, 716579, 105850, 377237, 678302, 242703, 741267, 1678445, 1516156, 1556065, 1261294, 1411619, 871762, 510701, 345547, 685040, 131574, 291801, 1404226, 1203277, 860964, 1257893, 828933]
1942H28933k96695N74617M56019J24191r25651q4878J24023J19584p07493l99678
1932a87028J106184K82818L04350k67445j63261K90492r90512M88414O7247j9685
1922I11574N84108q21205l36219L91159k87998K36714j32137j67566P28912Q1764
1912A189106l95423P27284k46340q25099n68760K46771L31518r1840l31789N88456
1902F23884N93099n96872L96836K28655N7760n86961k12290K08307K69644m88067
1892D93995L81909l11851L11425l23671J52789L11677p82008L35496k30656N45909
1882H85014P9304l03181J0563k08643R671m65961n59228Q49672N10563J56412
1872I64186K63584j78572l84428O4782K53191o02912J27011L69580m89763o3155
$$ y = [828933, 532238, 1106855, 1562874, 1687065, 761414, 676536, 800559, 920143, 212650, -187028, 919156, 1201974, 1506324, 1238879, 1075618, 1366110, 375598, 864012, 931259, 911574, 1495682, 674477, 338258, 729417, 441419, 678133, 545996, 378430, 1107342, 1189106, 793683, 1520967, 1274627, 449528, -119232, 127539, 459057, 367217, 35428, 623884, 1216983, 620111, 1016947, 1245602, 1303362, 716401, 504111, 712418, 982062, 493995, 875904, 564053, 875478, 551807, 704596, 1016273, 234265, 569761, 339105, 885014, 964318, 661137, 671700, 463057, 472728, 6767, -552461, 297211, 807774, 964186, 1227770, 1049198, 664770, 729552, 982743, 379831, 506842, 876422, 386659, 323504]
1862C23504N78044K61273J34743k88573n31856p4990j80858Q76655l7413k91517
1852G69012M99156p47577k27723K94164n52830j53769N27003j58554M28090N36582
1842A213554N23876j26105n08147m93557n93414R11489j51420R6050L86663m07380
1832H51609k92158J34564J67471j91418L47447j25351L48346k70783N50408J51678
1822A671813o27322J269665K32943j76563n35912n50908k25435q1729k03362N54384
1812A327574J16275q57544K83292m88565N4677Q18760m89183k09932m2893K79811
1802G92272K49485Q64072j04914m14210n4987k18688j6771j90916J18251P78875
1792A802469K18548l83635J43896m14642P2483K31873j26541o65304k99458o18328
$$ y = [323504, 901548, 1162821, 1297564, 1008991, 477135, 402145, 221287, 1097942, 1060529, 769012, 1268168, 520591, 292868, 587032, 34202, -119567, 407436, 248882, 676972, 1213554, 1737430, 1611325, 1103178, 609621, 16207, 927696, 776276, 872326, 1258989, 851609, 559451, 694015, 861486, 670068, 1017515, 892164, 1240510, 969727, 1520135, 1671813, 1044491, 2314156, 2547099, 2370536, 1834624, 1283716, 1058281, 976552, 773190, 1327574, 1443849, 586305, 869597, 381032, 435709, 1254469, 765286, 555354, 512461, 792272, 1041757, 1905829, 1800915, 1386705, 1331718, 1113030, 1096259, 905343, 1023594, 1802469, 2021017, 1637382, 1781278, 1366636, 1439119, 1670992, 1544451, 879147, 579689, -38639]
1782c8639j47240J007077N45498M47202K03138q54864m03259j73709J81531J45283
1772I12018j28467k56171L33585K77608m56967o21895Q03463m43585o23843K60921
1762E6667o6118o79681K63051M81589K89711k69259m3087L23706L63125K36646
1752I56350O0442o38251o70909P29172k07700O8802r8449n43436M47515O66794
1742G70330j89408l68940j39553N31938J96155p7046r5770K33360n67185j29382
1732A64499k6466j68723q023M14735k51968j36323K22896k3580j13098j88281
1722a14332j6811k9158j0436k75140M09343O69589K67571p90002N662L292R9803
1711B19381m7837k33882j17018r4495P98477r25932Q30442J63913m4088J79509
$$ y = [-38639, -185879, 821198, 1366696, 1813898, 2017036, 1162172, 758913, 585204, 766735, 912018, 783551, 527380, 860965, 1138573, 681606, 59711, 863174, 419589, -204254, 56667, -9451, -689132, -426081, 55508, 345219, 75960, 32873, 356579, 719704, 956350, 1016792, 378541, -292368, 436804, 229104, 297906, 199457, -343979, 103536, 770330, 580922, 211982, 72429, 604367, 800522, 723476, 627706, 861066, 293881, 164499, 138033, -30690, -38713, 376022, 124054, -12269, 210627, 187047, 73949, -114332, -131143, -160301, -170737, -445877, -36534, 633055, 900626, 110624, 116286, 119578, 219381, 171544, -62338, -179356, -273851, 524626, -401306, 429136, 593049, 548961, 728470]
1701G28470m74274p6383m02762N1419p76883l73512O65407M12642l61171j33384
1691g40431m3785O5021L70610J80760q2829P11869P7810p78062k87629J15655
1681d11011O25416l34824k61190O12221K36748p28166Q3746J08402K68210q1767
1671A17785K54120r508l74823n239J51708m70138l03936j06589L58830L82988
1661d802n75204O55706n97970J034459r3058j41335k51693m72687N08690m04208
1651c42102N56053l78229K4251M47173r90642p9392K54629K11714R13277N00477
1641A117209m76342p87639N87724J57061k77093m11214L15267J42921l71694k52718
1631b56518N66073l01291P7846k07142k16234L33565J86140J17979n02258l28668
$$ y = [728470, 254196, 177813, -224949, -173530, -950413, -1323925, -658518, -245876, -607047, -740431, -784216, -719195, -348585, -167825, -250654, 461215, 539025, -239037, -526666, -411011, 214405, -120419, -381609, 230612, 467360, -260806, -177060, -68658, 199552, 117785, 371905, 362397, -12426, -17665, 134043, -336095, -640031, -746620, -387790, -4802, -580006, 75700, -522270, 512189, 419131, 277796, 26103, -446584, 62106, -342102, 213951, -164278, -140027, 307146, -683496, -762888, -508259, -296545, 616732, 1117209, 640867, -146772, 440952, 598013, 320920, -90294, 224973, 367894, -3800, -256518, 309555, 8264, 86110, -121032, -337266, -3701, 182439, 300418, -201840, -530508]
1621e30508q09473M27121K15368k04121M21475j53449k66242m2502L89178N06246
1611d6907K96448m72443k08691N35692O35679n33506o97185L17059l86875Q79813
1601C19084O29652o27600k67247m53064j8476Q48045Q8425m81426k17772O5936
1591a14443m79088j67638n35945o9664N6385q5187N39049N33142Q6004l68632
1581f06017m54178J34426P26922K63619q46097j22929L69537M79543N38889q40864
1571c57149o80349Q2887p0733J99466j62949J179687k37024k19132K06262j65455
1561b24489o83049j59634Q76515o98474J42613j52721l78928M56020p4082k87285
1551a183514n35616N35946K16358M00942q9051J30842K79492l58502N32573J72651
$$ y = [-530508, -1339981, -912860, -697492, -901613, -480138, -633587, -899829, -942331, -553153, -46907, 249541, -222902, -431593, 104099, 739778, 206272, -490913, -173854, -560729, 319084, 948736, 321136, 53889, -399175, -417651, 430394, 518819, 37393, -180379, -114443, -593531, -761169, -1297114, -1366778, -1310393, -1395580, -856531, -323389, -237385, -606017, -1060195, -925769, -198847, 64772, -781325, -904254, -534717, -55174, 483715, -357149, -1037498, -954611, -1025344, -825878, -988827, 190860, -46164, -265296, -59034, -224489, -907538, -1067172, -190657, -889131, -746518, -899239, -1278167, -822147, -896229, -1183514, -1719130, -1183184, -966826, -565884, -654935, -524093, -244601, -603103, -70530, 102121]
1541A02121K07638n95016m74707K50628J37145k46651L19110k68370k1294O07118
1531A7722j12622l37019K13432j49550j132R75158n20262l33910J77932O08750
1521E38499m86932k89445O43506n70985n17856j42882n4572N25772M23377r28971
1511h60489l19099p5507L46385N49939m23328m40582m5565P81807L71565q32042
1501i46916M35483j54923m16412p2261N14185K08388O93710K20382j116533q61336
1491a496233L44832K17997j47896K97757Q65997M11803j466682L7454j11867M17972
1481f28866N58487J94148M15131n85833l3924m08466k18303J89166Q96613l12081
1471F6072n07208j32985m80693J58040R08492m25725k64976M68679M51001m51208
$$ y = [102121, 309759, -285257, -759964, -509336, -372191, -618842, -299732, -568102, -589396, 17722, -94900, -431919, -218487, -368037, -369169, 605989, 85727, -248183, -70251, 538499, 51567, -237878, 405628, -165357, -683213, -826095, -880667, -354895, 68482, -860489, -1179588, -1255095, -908710, -358771, -782099, -1222681, -1268246, -486439, -114874, -946916, -511433, -666356, -1082768, -1155029, -640844, -432456, 261254, 481636, -634897, -1496233, -1151401, -933404, -1081300, -783543, 82454, 494257, -972425, -934971, -1046838, -628866, -70379, 123769, 538900, -46933, -80857, -489323, -707626, -518460, 378153, 66072, -441136, -574121, -1054814, -896774, 11718, -414007, -678983, -210304, 240697, -210511]
1461b10511L47372L10974l68645l26198k65436L36013K76052j7217p04351M19702
1451b02245l9940n46793L39329k43353l16251L47112N15487j6985L4569l0164
1441a59234k20715L66674P91604j94565p07533J62912K23824l05730p57043K45220
1431e54586K76888K50307P38501n45426o87727J44373M92j28424K21254l89613
1421f73961n36749O96335M00972K75378L0674l66200k13170o14844O74827P4003
1411b52735J75012O04745J17340k8185M7230k81184j28646l23129o86340K69127
1401d86765J64198J37563j79396K895N67099L43322l18074n02465j010744Q80493
1391d01874m4547J22600J83502M06241J71277K31668n98981p69530j59306J47535
$$ y = [-210511, 136861, 447835, 79190, -247008, -512444, -176431, 99621, 82404, -621947, -202245, -242185, -788978, -449649, -693002, -1009253, -662141, -146654, -163639, -129070, -159234, -379949, -13275, 778329, 583764, -123769, 39143, 262967, -42763, -799806, -554586, -277698, -27391, 711110, 165684, -522043, -377670, -377178, -505602, -284348, -673961, -1210710, -514375, -113403, 161975, 192649, -173551, -386721, -1001565, -326738, -252735, -77723, 527022, 644362, 616177, 663407, 382223, 253577, -69552, -755892, -486765, -322567, -185004, -364400, -361505, 205594, 548916, 230842, -271623, -1282367, -401874, -446421, -323821, -140319, 265922, 437199, 668867, 69886, -699644, -858950, -711415]
1381g11415K65308L05680j83789k4982L40753p99296J36897Q9402p57757L86643
1371i52556N67016L60716K71284p69963j22850k89208n8846M05813P6905l34131
1361h45820j98130M204k86537M73447l1599j23666j45009k23579P34971M91254
1351a50464k65223L13251P4076j09856M472m1480n86866j81975N91236J16045
1341b36784L67789M27795j24748o70778O37173j50818o68701L23199K67019l58597
1331a87451N3688p36930m65080Q50769O25405l68099n16430j21253j90603Q83230
1321a72754J68109J4657n96873n36535L57785P53776m42483n36754N49572o328
1311d47828J81647j00836K51191M98951n94206m88859j33483m4292K83139M72287
$$ y = [-711415, -446107, -140427, -324216, -349198, -8445, -807741, -670844, -581442, -1339199, -952556, -385540, -24824, 246460, -523503, -646353, -935561, -994407, -588594, -511689, -845820, -1043950, -1039746, -1326283, -852836, -884435, -1008101, -1153110, -1376689, -641718, -150464, -415687, -102436, -28360, -138216, -133744, -175224, -762090, -944065, -352829, -236784, 131005, 558800, 434052, -236726, 400447, 249629, -419072, -95873, 171146, -187451, -133763, -870693, -1335773, -485004, 140401, -227698, -744128, -865381, -1055984, -172754, -4645, 10012, -586861, -1123396, -765611, -11835, -454318, -991072, -441500, -447828, -266181, -367017, -115826, 383125, -211081, -699940, -833423, -877715, -594576, -122289]
1301a22289R1844K99709k09384l70258R2378l87448N349L29540o63109r2310k06783
1290a232761K88576l942J9047Q2509k95530n02051J42493J154169L20798o5926
1280i2618k24877r6794j39963R83675k30573j00290l22697N91594K90879n33580
1270A24756m77466J32826q0779j11416L10646K96688L26674k49077o8993M399
1260B08258l59309J3599L99653Q05728n47350q14789L69979L28458o97351o36795
1250i29919L96329R14290l34230j91846M06817J85612k89187l26612k01940J21827
1240b48859P65348M15753q07360P17818j3488j212537J61267J52632j9337J8570
1230g0193M86322K34347l79126j35376l97186l91634N06430l93171J7136M09882
$$ y = [-122289, -30445, 269264, 59880, -310378, -218000, -605448, -600099, -270559, -933668, -1025978, -1232761, -944185, -948127, -929080, -846571, -1142101, -1644152, -1501659, -347490, -26692, -92618, -317495, -414289, -554252, 429423, 198850, 98560, -224137, 367457, 658336, 124756, -352710, -219884, -300663, -412079, -101433, 195255, 521929, 272852, 203859, 208258, -151051, -137452, 262201, 1067929, 520579, -294210, 75769, 404227, -293124, -929919, -533590, 380700, 46470, -145376, 261441, 447053, 157866, -168746, -370686, -248859, 516489, 932242, 124882, 842700, 829212, -383325, -222058, -69426, -88763, -70193, 416129, 650476, 271350, 135974, -261212, -652846, -146416, -539587, -522451, -112569]
1220a12569j53193N78966m35226o93477N6508O7719P59216O15704j072541n15004
1210i03897O89823M58782R2310K79547k46240l79092M70314r62954l38052M75005
1200c64454P4253l14271M48250K63959Q2183l41976J59894K22059P24344j34901
1190H19340p78063M50422o14114l49772O02766J2231m85880N06665K09915l87295
1180a3785M13196O48568N874l76344K04678P6925K51521o29292l05638J9114L33807
1169F28624m09461m33160P33445N15692L98643m27033j160180r0976j5799O58841
1159C98636j271105R30108P90006J59451m98430q86448L14602L0668m2662o9562
1149a44736M17532k82431P1846K95080J49661K47338N32761J35847o72889J9024
$$ y = [-112569, -265762, 313204, -122022, -815499, -758991, -691272, 67944, 683648, -388893, -903897, -214074, 244708, 337018, 616565, 370325, -8767, 461547, -501407, -839459, -364454, -290201, -604472, -156222, 107737, 189920, -152056, 7838, 229897, 954241, 819340, 41277, 491699, -122415, -472187, 130579, 142810, -343070, 163595, 373510, -13785, 399411, 1047979, 1053853, 677509, 882187, 959112, 1210633, 581341, 275703, 294817, 628624, 219163, -213997, 519448, 1035140, 1433783, 1006750, -153430, -244406, -260205, 398636, -872469, 57639, 847645, 1007096, 508666, -377782, -63180, -32512, -75174, -144736, 272796, -9635, 62211, 357291, 506952, 754290, 1287051, 1422898, 750009, 769033]
1139G69033M85353n57981k46141k76241L3502l54403L55873L06322m54783k09931
1129a49397J178990p13777K95427M87343l87159M030n61313k56982J076141J71638
1119A144941O06607j19492K00500L56083j51902m51467m45249k54151j02035J155017
1109A938852l76612n92234m83119L21810n2101J83454N62098l77598q4823O85591
1099A725318j54320K7511l90604m888P68536l6084j222362N54830L39690l086
1089A604541r4819k25063j81519l45508Q54520o59978L04594n2066n19136J74819
1079H60385L98390q3913n7240k72494k87270M75394K19701j48166K7679K77893
1069A410359J77175O11421K84946o40602N1348O79811q1194m52382n1345j21466
$$ y = [769033, 1254386, 696405, 450264, 174023, 207525, -146878, 208995, 515317, 60534, -149397, 1029593, 315816, 611243, 1098586, 711427, 715457, 154144, -102838, 973303, 1144941, 1751548, 1632056, 1832556, 2188639, 2036737, 1585270, 1140021, 885870, 783835, 1938852, 1562240, 970006, 486887, 808697, 756596, 940050, 1502148, 1124550, 1039727, 1725318, 1570998, 1598509, 1207905, 1203017, 1971553, 1935469, 713107, 1267937, 1607627, 1604541, 1509722, 1284659, 1103140, 757632, 1612152, 952174, 1256768, 1204702, 685566, 860385, 1258775, 1174862, 1117622, 845128, 557858, 1033252, 1252953, 1104787, 1132466, 1410359, 1587534, 2198955, 2483901, 1843299, 1894647, 2574458, 2493264, 2040882, 1989537, 1868071]
1059A868071j81312J002732L00872m79717K63829k69531m54263Q24637o9899l40611
1049B464808M56210l59389J06783K83963l56327K98802M30878N17972O39999n60715
1039C922984l70868O71200Q2578K13089M04558n10540L47751J236561o97187k54533
1029E045593L11973l97849p33713P72520Q62215M38063j83505k65441R69631L22046
1019G141533O7781R8295j1974p5721Q61461M05307O65183o62027k22260J033138
1009I300716N18517N04289L06716J158405Q12389N29299M64017R57951P97330
1000A5349629L30557J376683J458146J358301J214103L54697K440700K251970
992B6134786K930275K135652K515312K614017J688952K160340K691909M412152
$$ y = [1868071, 1686759, 2689491, 2990363, 2510646, 2774475, 2504944, 2050681, 2875318, 2805419, 2464808, 2921018, 2561629, 2668412, 2952375, 2596048, 2894850, 3325728, 3843700, 4483699, 3922984, 3552116, 4223316, 4305894, 4518983, 4923541, 4413001, 4760752, 5997313, 5300126, 5045593, 5357566, 4959717, 4226004, 4998524, 5860739, 6298802, 6115297, 5849856, 6819487, 7141533, 7209314, 7307609, 7295635, 7219914, 8081375, 8486682, 9151865, 8489838, 8267578, 9300716, 9819233, 10323522, 10630238, 11788643, 12601032, 13130331, 13594348, 14552299, 15349629, 15680186, 17056869, 18515015, 19873316, 21087419, 21442116, 23882816, 26134786, 29065061, 31200713, 33716025, 36330042, 38018994, 40179334, 42871243, 47283395]
984D7283395N651620O292480Q910735J1483726J2913451J7931900K4683610L1638154
976A66789071L1609081L0227014L1803031J5760977k5994443n0669457n2353029
969A47172245l4398413k0255961j4253324j1206003r569970o966929n016323l118324
961D2386998k700805k408739j046752j111420j877809k384571k948593k533629
953B5374680j776789j352282j465073j189144q94737j207670j003404p43063j474328
944A4268190m02216r54235m82765r3499k47209j348886j96839j183046l38647
935I020848q07552o6055k59445L61039p11022o95334P3415m95189k17745L61752
925F564712l22014m85245J47458P7499l42306j122386J24960P74161J40164m47514
$$ y = [47283395, 52935015, 59227495, 68138230, 79621956, 92535407, 110467307, 135150917, 166789071, 198398152, 228625166, 260428197, 276189174, 250194731, 199525274, 147172245, 112773832, 92517871, 78264547, 67058544, 57488574, 50521645, 45505322, 42386998, 39686193, 37277454, 36230702, 35119282, 33241473, 30856902, 27908309, 25374680, 23597891, 22245609, 20780536, 19591392, 18696655, 17488985, 16485581, 15742518, 14268190, 13865974, 12911739, 12428974, 12335475, 12088266, 10739380, 10542541, 9359495, 9020848, 8213296, 8147241, 7887796, 8248835, 7537813, 6842479, 6915894, 6420705, 6202960, 6564712, 6242698, 5757453, 5904911, 5982410, 5640104, 4517718, 4642678, 5416839, 5557003, 5109489]
915E109489j6561J396819n29787p44002q5400m59819J35223K06562p83739n41572
905C687213n70089J472044J88921q46403L1946q7958r2256N25097j08742j34969
895D064804p23548L93132k47946p50331m71934m38348j79357O30794k5493m02859
885A848914L10951k89759K01926o84928o47751j5364Q60304O626Q8592L73294
875B052805j91476j24598j04777k80575Q95592O12631k84984m7914N10395m75022
865B562077l18666q37148j44057K74740m19883J8398N79643j91444J16859M62962
855B103481j19385p15806N5432k96111k25374q4167l72263Q1533N69513r2857
845I03996j92495J61222l11453j15663l54753J55156O40777K5152K64121m07189
$$ y = [5109489, 5092928, 6489747, 5959960, 5215958, 5130558, 4670739, 4805962, 5012524, 4228785, 3687213, 3117124, 4589168, 4778089, 3931686, 3963632, 3875674, 3783418, 4308515, 4199773, 4064804, 3341256, 3734388, 3486442, 2736111, 2264177, 1825829, 1646472, 2277266, 2251773, 1848914, 2159865, 1870106, 2072032, 1387104, 739353, 723989, 1584293, 1590919, 1679511, 2052805, 1861329, 1736731, 1631954, 1351379, 2246971, 2859602, 2574618, 2526704, 3037099, 2562077, 2243411, 1406263, 1262206, 1536946, 1117063, 1135461, 1715104, 1523660, 1640519, 2103481, 1984096, 1268290, 1323722, 1027611, 802237, 718070, 345807, 427340, 996853, 903996, 711501, 872723, 561270, 445607, 90854, 246010, 886787, 911939, 1176060, 768871]
835G68871m41696o34679M90537P94087K17223o45526k65281m13279M73879L17045
825F61181K95645L80768k09638L82335l14709l36747l87875N6898o22236J31342
815C6964J52675j92887M59336j43683l59024q2973N786m85322R16111o2047J31832
804C76768j90532l21520N60285L41605k16626m32821N9250M92137l52444l82314
794f6212K2476n76804R55890M60675n50760R28362q0478p48047K55919L50522
784I51543n50201o45144O39933N62457l54246p02054m7228l09055l45485j05745
774i05225K76712J29431o4966K20356J132980k67406m11521L93566k50330l42777
764h9180k36907O88288L54635o6321j72227j71548n30835K47637J26701K02709
$$ y = [768871, 327175, -307504, 183033, 977120, 1194343, 548817, 283536, -129743, 344136, 661181, 956826, 1337594, 1127956, 1510291, 1195582, 858835, 470960, 527858, -94378, 36964, 189639, -3248, 456088, 312405, -46619, -129592, -123806, -609128, 306983, 244936, 376768, 186236, -135284, 425001, 766606, 549980, 117159, 176409, 668546, 316102, -66212, -43736, -620540, 335350, 796025, 245265, 1173627, 1093149, 345102, 601021, 951543, 401342, -243802, 396131, 958588, 604342, -97712, -144940, -453995, -799480, -905225, -628513, -499082, -564048, -343692, 789288, 521882, 110361, 503927, 253597, -89180, -326087, 362201, 716836, 650515, 478288, 306740, -224095, 23542, 150243, 352952]
754C52952M45381j48115k0682q23874j88518l11970N52608j95927J154743q3300
744G33298p12316j41066P1076n39709N4674N53489p0643j66971J93482K42070
734B17384n95695L69909j21755J08745r465m39145M74428P05451l05019o1301
724C43537j48890k43320l3259L61829k97796j63369K56185M46567l5123m68955
714A7406K55112j49854m1353l04014J73193N64199p48881o6945l43305P01141
704E6699N41880J1787N3628n10470p64355k50146P66316M46905L26309k05685
694D72868O8587l18775P5779k9253L12632k8251K32777L98729L76236j88930o14243
683G58156j004656k05514k22099O07569P67117L52592o78619l38645m3611k12174
$$ y = [352952, 798333, 650218, 629536, -194338, -382856, -694826, -142218, -338145, 816598, 733298, 20982, -120084, -49008, -588717, -534043, 19446, -51197, -218168, -24686, 217384, -378311, -8402, -130157, -21412, -30877, -470022, 4406, 709857, 404838, 343537, 194647, -48673, -81932, 279897, -17899, -181268, 74917, 521484, 486361, 17406, 272518, 122664, 81311, -222703, -49510, 514689, -234192, -301137, -644442, 56699, 598579, 610366, 663994, 153524, -610831, -860977, -94661, 352244, 678553, 472868, 541455, 222680, 298459, 269206, 581838, 553587, 786364, 1185093, 1561329, 1372399, 758156, -246500, -452014, -674113, -66544, 700573, 1053165, 374546, 35901, -7710, -219884]
673b19884L29710J38448l54370n04595M49036j0211k21096Q16382M87777j53330
663G57867n87961J23373L03491o39312m2795J05886K10565m32815K00437L32615
653C31351p25146K08869K87474J71412k5254R063j90532M80126n57928J28665
643A18100K46915q35513K13947l80377k85143M64633l3280j26799j17617o90041
633a425175Q17292M83515m77887M39831k47336M5272M55633j18976K50336q6634
623A35871M2115m44645K9963j78445L67766k43936J25040l57329K34728j68538
613d57410N56349K6571k45917k12069j22076o8312J659502p46738o81476l72334
603f63910K90958K44383n32617k47067L02220L65936k75786L21255k8692k24751
$$ y = [-219884, 109826, 248274, -106096, -610691, -161655, -171866, -392962, 423420, 911197, 757867, 169906, 293279, 596770, -42542, -85337, 20549, 231114, -201701, -1264, 331351, -393795, -184926, 102548, 273960, 248706, 257769, 67237, 547363, -10565, 118100, 365015, -470498, -256551, -636928, -922071, -457438, -490718, -617517, -735134, -1425175, -607883, -124368, -602255, -162424, -409760, -364488, 91145, -27831, 222505, 135871, 177986, -266659, -236696, -415141, -47375, -291311, -166271, -523600, -288872, -457410, 98939, 125510, -120407, -332476, -454552, -522864, 1136638, 389900, -291576, -663910, -372952, -128569, -661186, -908253, -606033, -240097, -515883, -194628, -223320, -448071]
593d48071Q49516k35249l93620J28635k97908r5680m12881L64890O6393m30711
583i04686j43632J235264M09318q4680m24410m12803m15963j0088L42063J91799
573b17818O3063J77857j43995K76779l61353l48877N69269P24224m33012m93850
563a87713k57945L55502N680p3162M73833J73282q43802p7529M13635N04144n70855
552h4930J60633n085n76847Q40442N16595l03178n28346p74779Q401L49545m3951
541d41500j01755m41936j57514L4000L60372L18471q5953k32296O03467j21720
531b66364o63140L39902j71161M5854L93107K95505J72300M2292l83848j84873
521c80426M96956m17295p63678j68447P51307k12473l29559K59847J93021P42438
$$ y = [-448071, 401445, 166196, -227424, -98789, -396697, -492377, -905258, -540368, -473975, -904686, -1048318, 186946, 596264, 511584, 87174, -325629, -741592, -751680, -409617, -217818, -154755, 23102, -120893, 155886, -205467, -554344, 14925, 739149, 306137, -187713, -445658, -90156, -84476, -157638, 316195, 489477, -354325, -431854, -18219, 485925, -84930, 75703, 70618, -506229, 334213, 850808, 547630, 19284, -755495, -747094, -397549, -441500, -543255, -985191, -1142705, -1108705, -748333, -429862, -515815, -748111, -144644, -266364, -929504, -589602, -760763, -714909, -321802, -26297, 146003, 188295, -195553, -380426, 116530, -300765, -1064443, -1232890, -481583, -694056, -1023615, -763768, -570747, 171691]
511A71691k15841m98660n61516N68352J99620q9411j69906K25668J36542K35464
501B003J0317L13648K46936K89405j442925r2955Q60971k1825l20647K37544n44420
$$ y = [171691, -44150, -542810, -1104326, -535974, -336354, -425765, -595671, -370003, -233461, 2003, 12320, 325968, 572904, 862309, -580616, -673571, 187400, 165575, -155072, 82472, -461948]
$$ [...]
##END NTUPLES=NMR SPECTRUM
##END=
