##TITLE=1H_TG-2326-x
 DMSO,8 sc, 
 7.04.2021
##JCAMPDX= 6.0         $$ Bruker NMR JCAMP-DX V2.0
##DATA TYPE= NMR SPECTRUM
##DATA CLASS= NTUPLES
##ORIGIN= UXNMR, Bruker Analytische Messtechnik GmbH
##OWNER= root
$$ XWIN-NMR		Version 3.5
$$ Wed Apr  7 10:49:55 2021 Russian Standard Time (UT+4h)  she@DPX200
##.OBSERVE FREQUENCY= 200.131506
##.OBSERVE NUCLEUS= ^1H
##.ACQUISITION MODE= SIMULTANEOUS
##.ACQUISITION SCHEME= undefined
##.AVERAGES= 8
##.DIGITISER RES= 18
##SPECTROMETER/DATA SYSTEM= spect
##.PULSE SEQUENCE= zg30
##.SOLVENT NAME= DMSO
##.SHIFT REFERENCE= (INTERNAL, DMSO, 0, 15.9989)
##AUDIT TRAIL= $$ (NUMBER, WHEN, WHO, WHERE, WHAT)
$$ ##TITLE= Audit trail, XWIN-NMR		Version 3.5
$$ ##JCAMPDX= 5.01
$$ ##ORIGIN= Bruker BioSpin GmbH
$$ ##OWNER= she
$$ F:/spectra/data/she/nmr/H-F/1/pdata/1/auditp.txt
$$ ##AUDIT TRAIL=  $$ (NUMBER, WHEN, WHO, WHERE, WHAT)
(   1,<2021-04-07 10:48:37.92 +0400>,<she>,<DPX200>,
      <created by zg, POWCHK disabled, PULCHK disabled
       configuration hash MD5:
       00 E9 B6 7A A2 85 ED C7 34 08 36 98 17 FE 4E 26
       data hash MD5: 16K
       4F B9 AC E3 65 94 06 31 AA 58 24 80 50 94 BF 47>)
(   2,<2021-04-07 10:48:40.31 +0400>,<she>,<DPX200>,
      <Start of raw data processing
       efp BC_mod = 2 LB = 0.24 FT_mod = 6 PKNL = 1 PHC0 = -11125.44 PHC1 = 23.60092 SI = 16K 
       data hash MD5: 16K
       B3 27 4F 2E 70 AC 87 FF 0A F8 77 2C 2D 61 49 A8>)
(   3,<2021-04-07 10:49:01.17 +0400>,<she>,<DPX200>,
      <pk PHC0 = -6.254802 PHC1 = -1.2 
       data hash MD5: 16K
       8B F4 8C 73 72 8E 1D 38 B2 F1 3C 45 FC AF 31 33>)
(   4,<2021-04-07 10:49:04.32 +0400>,<she>,<DPX200>,
      <abs ABSG = 5 
       data hash MD5: 16K
       AF 41 8C FF C7 5A 83 85 59 0D 1B C1 AA 35 4D 66>)
$$ ##END=
$$ 
$$ hash MD5
$$ 04 3A 4B CF 8E AD 71 BD 8D 6D 01 03 80 DD B3 79
##$RELAX= 
##$RELAX= 
##$RELAX= 
##$RELAX= 
##$RELAX= 
##$RELAX= 
$$ Bruker specific parameters
$$ --------------------------
##$DU= <F:/spectra>
##$EXPNO= 1
##$NAME= <H-F>
##$PROCNO= 1
##$TYPE= <nmr>
##$USER= <she>
##$AMP= (0..31)
100 100 100 100 100 100 100 100 100 100 100 100 100 100 100 100 100 100 
100 100 100 100 100 100 100 100 100 100 100 100 100 100 
##$AQSEQ= 0
##$AQ_mod= 1
##$AUNM= <au_zg>
##$AUTOPOS= <>
##$BF1= 200.13
##$BF2= 200.13
##$BF3= 200.13
##$BF4= 200.13
##$BF5= 200.13
##$BF6= 200.13
##$BF7= 200.13
##$BF8= 200.13
##$BYTORDA= 1
##$CFDGTYP= 0
##$CFRGTYP= 5
##$CHEMSTR= <none>
##$CNST= (0..31)
1 1 145 1 1 1 1 1 1 1 1 1 1 1 1 1 1 1 1 1 1 1 1 1 1 1 1 1 1 1 1 1 
##$CPDPRG= <>
##$CPDPRG1= <>
##$CPDPRG2= <>
##$CPDPRG3= <>
##$CPDPRG4= <mlev>
##$CPDPRG5= <mlev>
##$CPDPRG6= <mlev>
##$CPDPRG7= <mlev>
##$CPDPRG8= <mlev>
##$CPDPRGB= <>
##$CPDPRGT= <>
##$D= (0..31)
0 1.2 0 0 0 0 0 0 0 0.06 0 0.03 0 0 0 0 0.0002 0 0 0 0 0 0 0 0 0 0 0 0 
0 0 0 
##$DATE= 1617778117
##$DBL= (0..7)
120 120 120 120 120 120 120 120 
##$DBP= (0..7)
150 150 150 150 150 150 150 150 
##$DBP07= 0
##$DBPNAM0= <>
##$DBPNAM1= <>
##$DBPNAM2= <>
##$DBPNAM3= <>
##$DBPNAM4= <>
$$ [...]
##$SUBNAM3= <"">
##$SUBNAM4= <"">
##$SUBNAM5= <"">
##$SUBNAM6= <"">
##$SUBNAM7= <"">
##$SUBNAM8= <"">
##$SUBNAM9= <"">
##$SW= 16.9725357007746
##$SWIBOX= (0..15)
0 0 2 0 0 0 0 0 0 0 0 0 0 0 0 0 
##$SW_h= 3396.73913043478
##$TD= 16384
##$TD0= 1
##$TE= 0
##$TE2= 300
##$TE3= 300
##$TEG= 300
##$TL= (0..7)
0 120 120 120 120 120 120 120 
##$TP= (0..7)
150 150 150 150 150 150 150 150 
##$TP07= 0
##$TPNAME0= <>
##$TPNAME1= <>
##$TPNAME2= <>
##$TPNAME3= <>
##$TPNAME4= <>
##$TPNAME5= <>
##$TPNAME6= <>
##$TPNAME7= <>
##$TPOAL= (0..7)
0.5 0.5 0.5 0.5 0.5 0.5 0.5 0.5 
##$TPOFFS= (0..7)
0 0 0 0 0 0 0 0 
##$TUNHIN= 0
##$TUNHOUT= 0
##$TUNXOUT= 0
##$USERA1= <user>
##$USERA2= <user>
##$USERA3= <user>
##$USERA4= <user>
##$USERA5= <user>
##$V9= 5
##$VALIST= <valist>
##$VCLIST= <CCCCCCCCCCCCCCC>
##$VD= 0
##$VDLIST= <DDDDDDDDDDDDDDD>
##$VPLIST= <PPPPPPPPPPPPPPP>
##$VTLIST= <TTTTTTTTTTTTTTT>
##$WBST= 1024
##$WBSW= 4
##$XGAIN= (0..3)
0 0 0 0 
##$XL= 0
##$YL= 0
##$YMAX_a= 218543
##$YMIN_a= -242139
##$ZGOPTNS= <>
##$ZL1= 120
##$ZL2= 120
##$ZL3= 120
##$ZL4= 120
##$ABSF1= 15.97402
##$ABSF2= -0.998642
##$ABSG= 5
##$ABSL= 3
##$ALPHA= 0
##$AQORDER= 0
##$ASSFAC= 0
##$ASSFACI= 0
##$ASSFACX= 0
##$ASSWID= 0
##$AUNMP= <proc_1d>
##$AZFE= 0.1
##$AZFW= 0.1
##$BCFW= 0
##$BC_mod= 2
##$BYTORDP= 0
##$COROFFS= 0
##$CY= -3
##$DATMOD= 1
##$DC= 0
##$DFILT= <>
##$DTYPP= 0
##$F1P= 0
##$F2P= 0
##$FCOR= 1
##$FTSIZE= 16384
##$FT_mod= 6
##$GAMMA= 0
##$GB= 0
##$INTBC= 1
##$INTSCL= 2.992141e-10
##$ISEN= 128
##$LB= 0.24
##$LEV0= 0
##$LPBIN= 0
##$MAXI= 10000
##$MC2= 0
##$MEAN= 0
##$ME_mod= 0
##$MI= 1.114404
##$NCOEF= 0
##$NC_proc= -8
##$NLEV= 6
##$NOISF1= 3.799351
##$NOISF2= 2.8
##$NSP= 0
##$NTH_PI= 0
##$NZP= 0
##$OFFSET= 15.99889
##$PC= 1
##$PHC0= -11131.7
##$PHC1= 22.40092
##$PH_mod= 1
##$PKNL= yes
##$PPARMOD= 0
##$PSCAL= 0
##$PSIGN= 0
##$REVERSE= no
##$SF= 200.130002511223
##$SI= 16384
##$SIGF1= 3
##$SIGF2= 2
##$SINO= 5.538805
##$SIOLD= 16384
##$SREGLST= <1H.CDCl3>
##$SSB= 0
##$STSI= 16384
##$STSR= 0
##$SW_p= 3396.73913043479
##$SYMM= 0
##$S_DEV= 0
##$TDeff= 16384
##$TDoff= 0
##$TI= <>
##$TILT= no
##$TM1= 0
##$TM2= 0
##$TOPLEV= 0
##$USERP1= <user>
##$USERP2= <user>
##$USERP3= <user>
##$USERP4= <user>
##$USERP5= <user>
##$WDW= 1
##$XDIM= 16384
##$YMAX_p= 512525588
##$YMIN_p= -2491416
$$ End of Bruker specific parameters
$$ ---------------------------------
##NTUPLES= NMR SPECTRUM
##VAR_NAME=  FREQUENCY,     SPECTRUM/REAL,   SPECTRUM/IMAG
##SYMBOL=    X,             R,               I
##VAR_TYPE=  INDEPENDENT,   DEPENDENT,       DEPENDENT
##VAR_FORM=  AFFN,          ASDF,            ASDF
##VAR_DIM=   16384,         16384,           16384
##UNITS=     HZ,            ARBITRARY UNITS, ARBITRARY UNITS
##FACTOR=    0.207333158178282, 1,           1
##FIRST=     3201.85788048592, 0,            0
##LAST=      -194.881249948866, 0,           0
##MIN=       -194.881249948866, -2491416,    0
##MAX=       3201.85788048592, 512525588,    0
$$ Real data points
##PAGE= N=1
##DATA TABLE= (X++(R..R)), XYDATA
$$ [...]
5695A063316M42613n75497j05891J46047P9686K56599l96157m42829J3060J6336
$$ 1063316 1505929 930432 824541 970588 1050274 1306873 910716 467887 480947 497283
5685D97283p1750L05664K53455J47733n94836N19374J39538k63771k96930K55522
$$ 497283 425533 731197 984652 1132385 537549 1056923 1196461 932690 635760 891282
5675H91282L89271q57124M15447n9574p3467L1604j03409L92293L7636N2165m80202
$$ 891282 1280553 423429 838876 779302 705835 737439 634030 1026323 1063959 1116124 635922
5664F35922l63665L58249k51590N55246m14619m0698l02442q2779P5304L84372
$$ 635922 272257 630506 378916 934162 519543 478845 176403 93624 168928 553300
5654E53300O32827N17689q12613k37318O10288j8585o74526L2436N13700M25765
$$ 553300 1186127 1703816 891203 653885 1264173 1245588 571062 603498 1117198 1542963
5644A542963J26715l43832Q7132l69951l40752j07966O65235J72297n47532n82564
$$ 1542963 1669678 1325846 1412978 1043027 702275 594309 1259544 1431841 884309 301745
5634C01745N75791L47435l52742o38173J95958K07407L76063N41572j25567P171
$$ 301745 877536 1224971 872229 234056 430014 637421 1013484 1555056 1429489 1436660
5624A436660M3368P9671J60225k37583J92609l85461J68124N8293L69155N683
$$ 1436660 1480028 1559699 1719924 1482341 1674950 1289489 1457613 1515906 1885061 1890744
5614A890744p9833K65368l4055q1507J06046j5295K36159k05675n4260Q97964
$$ 1890744 1810911 2076279 2042224 1960717 2066763 2051468 2287627 2081952 2027692 2925656
5604B925656Q2283l49526p19324L36846R51224M14744o28716q0659K52102J60044
$$ 2925656 3007939 2658413 1939089 2275935 3227159 3641903 3013187 2932528 3184630 3344674
5594C344674J74930j97708K23126K42647l45805M9746L06270k24307K49791m14142
$$ 3344674 3519604 3321896 3545022 3787669 3441864 3491610 3797880 3573573 3823364 3409222
5584C409222j98212J55471O14998o8128J12879k87801J97327n19227R3393P2827
$$ 3409222 3211010 3366481 3981479 3913351 4026230 3738429 3935756 3416529 3509922 3582749
5574C582749m13649j04146J03437J02551k58145n3492j28613P03582P6928J28487
$$ 3582749 3169100 3064954 3168391 3270942 3012797 2959305 2830692 3534274 3611202 3739689
5564C739689M34831k51485K98012O9521m65248O6191j28045J47199p02156k13894
$$ 3739689 4174520 3923035 4221047 4290568 3825320 3891511 3763466 3910665 3208509 2994615
5554B994615L44788M91641P3476k56847j57254N14618k49675o57397M09146L12292
$$ 2994615 3339403 3831044 3904520 3647673 3490419 4005037 3755362 3097965 3507111 3819403
5544C819403Q5439l29555N5642P8830K93820r4294J29199N06119Q011J39500j62152
$$ 3819403 3904842 3575287 3630929 3709759 4003579 3909285 4038484 4544603 4552614 4692114 4529962
5533D529962J51070l78616k80691M34755j4702l28971K88444l5460L5102L26898
$$ 4529962 4681032 4302416 4021725 4456480 4441778 4112807 4401251 4365791 4400893 4727791
5523D727791M80911L1804p13659q7301K69121j34163M37540L16271l67929m20678
$$ 4727791 5208702 5240506 4526847 4439546 4708667 4574504 5012044 5328315 4960386 4539708
5513D539708j33514J89159L77384j91758O023L45701J26741j73232m02357o2015
$$ 4539708 4406194 4595353 4972737 4780979 4787002 5132703 5259444 5086212 4683855 4621840
5503D621840K05353O07549l71846L42385K95679m61962M37340K50498o15090l24668
$$ 4621840 4827193 5434742 5062896 5405281 5700960 5238998 5676338 5926836 5311746 4987078
5493D987078J89612J04230O3692j13787l53630l1881J30400J05304M42450M22063
$$ 4987078 5176690 5280920 5344612 5230825 4877195 4845314 4975714 5081018 5523468 5945531
5483E945531o21502o61911M66182l33925M09997j63019M00064L68329k08051q9179
$$ 5945531 5324029 4662118 5128300 4794375 5204372 5041353 5441417 5809746 5601695 5512516
5473E512516j79846N95038O00803q0493J03251r54725q9226J94967J78626O2768
$$ 5512516 5332670 5927708 6528511 6448018 6551269 5596544 5507318 5702285 5880911 5943679
5463E943679k71614n5821k0458M13331o92472m73425P85185K18745k32780L97273
$$ 5943679 5672065 5616244 5595786 6009117 5316645 4843220 5628405 5847150 5614370 6011643
5453F011643m0685K02735N448r5185M18431k34051l18899n02325m26480J90429
$$ 6011643 5970958 6173693 6179141 6083956 6502387 6268336 5949437 5447112 5020632 5211061
5443E211061M27850o490K81290K25366n62607k64689j40599N08406Q93131J36371
$$ 5211061 5638911 5632421 5913711 6139077 5576470 5311781 5171182 5679588 6572719 6709090
5433F709090l02385j048168k37531M21110R1217k73647M00487L24925k6707j99193
$$ 6709090 6406705 5358537 5121006 5542116 5633333 5359686 5760173 6085098 6058391 5859198
5423E859198Q3921n5489n46471J19378r5864K49062l7895J9312j83086q3305k89181
$$ 5859198 5943119 5887630 5341159 5460537 5364673 5613735 5575840 5595152 5412066 5328761 5039580
5412E039580O72466N5594K90602j33599l20845l19011L26578k60145K46255O54508
$$ 5039580 5712046 5767640 6058242 5924643 5603798 5284787 5611365 5351220 5597475 6251983
5402F251983k77790N4478J1793j51849J57896M52574l91868k55232L24506L0907
$$ 6251983 5974193 6028671 6040464 5888615 6046511 6499085 6107217 5851985 6176491 6207398
5392F207398J60461k20827M43393J09352J95933m91095k86880j4088j12253J54612
$$ 6207398 6367859 6147032 6590425 6699777 6895710 6404615 6117735 6103647 5991394 6146006
5382F146006j08253K05921N9908o08900K15124J47466M64197k94103L07289M62012
$$ 6146006 6037753 6243674 6303582 5694682 5909806 6057272 6521469 6227366 6534655 6996667
5372F996667j69328J19310K10182M46785j82553j52451J40023R0597n3713Q6614
$$ 6996667 6827339 6946649 7156831 7603616 7421063 7268612 7408635 7499232 7445519 7532133
5362G532133R6469L57634j38875K44014k70262l67524j14604L93170L53945J48548
$$ 7532133 7628602 7986236 7847361 8091375 7821113 7453589 7338985 7732155 8086100 8234648
5352H234648J60674O51697N70039j58500P32700K11834n25295P85274M5779k19538
$$ 8234648 8395322 9047019 9617058 9458558 10191258 10403092 9877797 10663071 10708850 10489312
5342A0489312K03561j18745O2754M55266N5755L95598j70477k82883O87501P7559
$$ 10489312 10692873 10574128 10636882 11092148 11147903 11543501 11373024 11090141 11777642 11855201
5332A1855201R4153o8708L81880K12637n43768R1301l86765O97462J57614m37737
$$ 11855201 11949354 11880646 12262526 12475163 11931395 12022696 11635931 12333393 12491007 12053270
5322A2053270n60391R2787l00285n8271p0778j46947l04315K991N16946L64877
$$ 12053270 11492879 11585666 11285381 11227110 11156332 11009385 10705070 10708061 11225007 11589884
5312A1589884k15564J58842q9332l11263J8677J59135J35759K57245Q67329k00644
$$ 11589884 11374320 11533162 11443830 11132567 11151244 11310379 11446138 11703383 12570712 12370068
5302A2370068q43512l23628L18179P36248L62599J56365l39829K4030L94207m114
$$ 12370068 11526556 11202928 11521107 12257355 12619954 12776319 12436490 12460520 12854727 12850613
5292A2850613J17952K30952K41921L75752O19441M48387J33083N04745P53168
$$ 12850613 12968565 13199517 13441438 13817190 14436631 14885018 15018101 15522846 16276014
5283A6276014n41277M02938Q14487m93122J45862K91244J11893J58243L58792
$$ 16276014 15734737 16137675 16952162 16459040 16604902 16896146 17008039 17166282 17525074
5274A7525074J32434K24470O85170N6885j02495l94403k6094N25694j36026M00098
$$ 17525074 17657508 17881978 18567148 18624033 18521538 18127135 18101041 18626735 18490709 18890807
5264A8890807N4123J21304J76780m81196L37608k86637l83350J28097O17664m20413
$$ 18890807 18944930 19066234 19243014 18761818 19099426 18812789 18429439 18557536 19175200 18754787
5254A8754787k28076k36615O49380n86081o83687L56338K14465n68351m8886j34701
$$ 18754787 18526711 18290096 18939476 18353395 17669708 18026046 18240511 17672160 17623274 17488573
5244A7488573o24891J80262k53728j25496m09289K89322K55800L38270j03955
$$ 17488573 16863682 17043944 16790216 16664720 16255431 16544753 16800553 17138823 17034868
5235A7034868m35440j41977J57355P2814l17298o88656J13292O81195n82498p25125
$$ 17034868 16599428 16457451 16614806 16687620 16370322 15681666 15794958 16476153 15893655 15168530
5225A5168530l28167Q6715L16347k81582R4157j3227l37032l49526J53295K06034
$$ 15168530 14840363 14927078 15243425 14961843 15056000 15042773 14705741 14356215 14509510 14715544
5215A4715544o70438M22326M70921l49403j58220Q3157k40902k22614L21928O78294
$$ 14715544 14045106 14467432 14938353 14588950 14430730 14513887 14272985 14050371 14372299 15050593
5205A5050593n05268j67037K38659n62852p10124l56610j68074M20922L77496
$$ 15050593 14545325 14378288 14616947 14054095 13343971 12987361 12819287 13240209 13617705
5196A3617705L24352L72971n56077r60831K27048N695n39776m04298p2909j02907
$$ 13617705 13942057 14315028 13758951 12798120 13025168 13030863 12491087 12086789 12013880 11910973
5186A1910973p0461Q2636n07440n7137M40106N0216j52838l0888n39705J45702
$$ 11910973 11840512 11923148 11415708 11358571 11798677 11848893 11696055 11665167 11125462 11271164
5176A1271164k15607P8155K57238J81740J95357K7651k52519R1125q164k22678
$$ 11271164 11055557 11133712 11390950 11572690 11768047 11795698 11543179 11634304 11626140 11403462
5166A1403462N9599M48936l96077K3855q8718l39639j35720l16581m92680l2853
$$ 11403462 11463061 11911997 11515920 11539775 11451057 11111418 10975698 10659117 10166437 10133584
5156A0133584M96429o35090k66671O7372n32257j26704K55305n24861k83161J43715
$$ 10133584 10630013 9994923 9728252 9795624 9263367 9136663 9391968 8867107 8583946 8727661
5146H727661M36352j3755k47811j40685n04723N9545K05919l53591m44141j73499
$$ 8727661 9164013 9150258 8902447 8761762 8257039 8316584 8522503 8168912 7724771 7551272
5136G551272M9156j63297r4404K4583M72136j13245j2949O3170l24943l21130
$$ 7551272 7600428 7437131 7342727 7367310 7839446 7726201 7713252 7776422 7451479 7130349
5126G130349l97895r3041O63031M63607L87680n37147m99784k9340Q5123j66681
$$ 7130349 6732454 6639413 7302444 7766051 8153731 7616584 7116800 7087460 7172583 7005902
5116G005902P07176L59090l67434j6047K54160m59640Q0553j94943n99187K7843
$$ 7005902 7713078 8072168 7704734 7688687 7942847 7483207 7563760 7368817 6769630 6797473
5106F797473L01715r1803p0532J22099Q8081j04039k56745J77299M33229n83791
$$ 6797473 7099188 7007385 6936853 7058952 7147033 7042994 6786249 6963548 7396777 6812986
5096F812986q10150K07492J13144O5752j95418O3676q2937P24959k66978k74026
$$ 6812986 6002836 6210328 6323472 6389224 6193806 6257482 6174545 6899504 6632526 6358500
5086F358500J16336R1411k23644K89941L75974L91602L55716K32352l67107j59599
$$ 6358500 6474836 6566247 6342603 6632544 7008518 7400120 7755836 7988188 7621081 7461482
5076G461482l39719q8079R30541N58931j80388N12370k33325l67974L84152M14291
$$ 7461482 7121763 7033684 7964225 8523156 8342768 8855138 8621813 8253839 8637991 9052282
5066I052282j64547K64698O5479N09606j47656J81513O08922K64120M59477K66945
$$ 9052282 8887735 9152433 9217912 9727518 9579862 9761375 10370297 10634417 11093894 11360839
5056A1360839O5365k47653k70937R1436j54543J13740l5582k46472o2242J76246
$$ 11360839 11426204 11178551 10907614 10999050 10844507 10958247 10922665 10676193 10613951 10790197
5046A0790197J92008n31151M28993K99135m45299l93364j73240k41196K67546
$$ 10790197 10982205 10451054 10880047 11179182 10733883 10340519 10167279 9926083 10193629
5037A0193629J44827J46220J50846k548N73572M19102m03732K55400L05344j84918
$$ 10193629 10338456 10484676 10635522 10632974 11206546 11625648 11221916 11477316 11782660 11597742
5027A1597742l94382m13139J87514k31519L19927K23405L67459n3252j21187P7158
$$ 11597742 11203360 10790221 10977735 10746216 11066143 11289548 11657007 11603755 11482568 11559726
5017A1559726K24488J45003N749N2885k52113j08017j98321J38229L98697J51002
$$ 11559726 11784214 11929217 11934966 11987851 11735738 11627721 11429400 11567629 11966326 12117328
5007A2117328p01963m7915j3991Q6391n4710q9149m6999j27272p82896O55915
$$ 12117328 11415365 11367450 11353459 11439850 11385140 11295991 11248992 11121720 10338824 10994739
4997A0994739K84411K46273k4335L02139J08499j92612J28688j80017L58520Q38012
$$ 10994739 11279150 11525423 11501088 11803227 11911726 11719114 11847802 11667785 12026305 12864317
4987A2864317M63700J06238p31250J50054l396P5324J44924j5418J59030K56300
$$ 12864317 13328017 13434255 12703005 12853059 12849663 12924987 13069911 13054493 13213523 13469823
4977A3469823o00417l69697O28769R99817q9131J3165L09775O5084J61262m7329
$$ 13469823 12869406 12499709 13128478 14128295 14039164 14052329 14362104 14427188 14588450 14541121
4967A4541121k82514L05746J49197O70172J94897l26708N67490L9432k79383L0453
$$ 14541121 14258607 14564353 14713550 15383722 15578619 15251911 15819401 15858833 15579450 15609903
4957A5609903R74959O0069N5764K70418P35224O10028j69634j77182P8667M53670
$$ 15609903 16584862 16644931 16700695 16971113 17706337 18316365 18146731 17969549 18048216 18501886
4947A8501886K33587n81400P6348L70335P91158j35812k34178j94797o700l17973
$$ 18501886 18735473 18154073 18230421 18600756 19391914 19256102 19021924 18827127 18820427 18502454
4937A8502454K31801M81241l50559k26154N1120n39588j81601K67737J27928k00638
$$ 18502454 18734255 19215496 18864937 18638783 18689903 18150315 17968714 18236451 18364379 18163741
4927A8163741j20115m51997m49930M72452K22974J34940J92791m96471R4518l2437
$$ 18163741 18043626 17591629 17141699 17614151 17837125 17972065 18164856 17668385 17762903 17730466
4917A7730466k7696K57375J0276J27887l46247P9383P40908M11646j02656k83020
$$ 17730466 17702770 17960145 17970421 18098308 17752061 17831444 18572352 18983998 18881342 18598322
4907A8598322m27848K7260J16247p28599j38116k22110J9508m00158n23078N52736
$$ 18598322 18170474 18197734 18313981 17585382 17447266 17225156 17244664 16844506 16321428 16874164
4897A6874164O48873K43498o17302k76905m3412N21997L76982n31992J21209k44359
$$ 16874164 17523037 17766535 17149233 16872328 16828916 17350913 17727895 17195903 17317112 17072753
4887A7072753j73571k02562j62336m69094l35461J22458K08987n64450K92976
$$ 17072753 16899182 16696620 16534284 16065190 15729729 15852187 16061174 15496724 15789700
4878A5789700J042892O4510Q8916l5408k68108m66492m01235l52284M78742N24167
$$ 15789700 16832592 16897102 16986018 16950610 16682502 16216010 15814775 15462491 15941233 16465400
4868A6465400q51823k51788K42998m02100O0680N50405j44153j066930o04745
$$ 16465400 15613577 15361789 15604787 15202687 15263367 15813772 15669619 14602689 13997944
4859A3997944N56938k69694k05316j50446O85401P020m36346l34956l3233l96072
$$ 13997944 14554882 14285188 14079872 13929426 14614827 14621847 14185501 13850545 13817312 13421240
4849A3421240L73102L33935k52477k11418m41388K35226k26949K32306n52601
$$ 13421240 13794342 14128277 13875800 13664382 13222994 13458220 13231271 13463577 12910976
4840A2910976k3607j02380J41621j48773K27922k93363j20775j88671K70690L26897
$$ 12910976 12887369 12784989 12926610 12777837 13005759 12712396 12591621 12402950 12673640 13000537
4830A3000537n90113m78798R89753n43869j4933j10843m67907R1435K17011K80648
$$ 13000537 12410424 11931626 12921379 12377510 12362577 12251734 11783827 11875262 12092273 12372921
4820A2372921R176J21389j38458J5968M44379m01425k55649K73076m48262K27275
$$ 12372921 12382097 12503486 12365028 12380996 12825375 12423950 12168301 12441377 11993115 12220390
4810A2220390l47259k46481j43637K81302K09156N87073k24237l62856M2508R7575
$$ 12220390 11873131 11626650 11483013 11764315 11973471 12560544 12336307 11973451 12015959 12113534
4800A2113534J15285m59587M16599O02434P327o47446k8143m13850L62457N68438
$$ 12113534 12228819 11769232 12185831 12788265 12795592 12148146 12120003 11706153 12068610 12637048
4790A2637048j35549j02629L26015j81043p10018K58570N42211K02755J98446
$$ 12637048 12501499 12398870 12724885 12543842 11833824 12092394 12634605 12837360 13035806
4781A3035806M8155n20496k98093L50161k71478j25178J13623K78225j32692p4245
$$ 13035806 13083961 12563465 12265372 12615533 12344055 12218877 12332500 12610725 12478033 12403788
4771A2403788O667j26746J11887L41327M77134L26910j66587l25767m7871L68629
$$ 12403788 12410455 12283709 12395596 12736923 13214057 13540967 13374380 13048613 13000742 13369371
4761A3369371l27967L04498m28222l8788M98215K76135P14340J4764J35353n77709
$$ 13369371 13041404 13345902 12917680 12878892 13377107 13653242 14367582 14382346 14517699 13939990
4751A3939990K73295m19119j23339k11077J19593J33499J33385K0679N865m60302
$$ 13939990 14213285 13794166 13670827 13459750 13579343 13712842 13846227 13866906 13872771 13412469
4741A3412469M13639J5344K74981j62884j4036L70004K11796j6009J81420K41440
$$ 13412469 13826108 13841452 14116433 13953549 13939513 14309517 14521313 14505304 14686724 14928164
4731A4928164N382J52899m8018N53919q0657o15059M69542K13545L5321j31779
$$ 14928164 14933546 15086445 15038427 15592346 15511689 14896630 15366172 15579717 15615038 15483259
4721A5483259O83794J25180M46583L02843K42988K75416J80361J42273l03044
$$ 15483259 16167053 16292233 16738816 17041659 17284647 17560063 17740424 17882697 17579653
4712A7579653M78974N23841l4403M85690J06062n58890J020386l1693O92733O59718
$$ 17579653 18058627 18582468 18548065 19033755 19139817 18580927 19601313 19569620 20262353 20922071
4702B0922071n47191L51711O43921m6236L8263q40778j35556M19265p88241k22798
$$ 20922071 20374880 20726591 21370512 21324276 21362539 20521761 20386205 20805470 20017229 19794431
4692A9794431O1920l16464L51955O81616q3355o8125M66490J03252o0117q0978
$$ 19794431 19856351 19539887 19891842 20573458 20490103 20421978 20888468 20991720 20931603 20850625
4682B0850625J37972k14231J407225Q28025k39289N13699k2862l45633P27325
$$ 20850625 20988597 20774366 22181591 23009616 22770327 23284026 23261164 22915531 23642856
4673B3642856Q84694M38074N44162N72317M17235q68826q12320m863r6285J70917
$$ 23642856 24527550 24965624 25509786 26082103 26499338 25630512 24818192 24813329 24717044 24887961
4663B4887961n82715p48894j23051n69594Q5127q6058l18107m00273o34661M46623
$$ 24887961 24305246 23556352 23433301 22863707 22948834 22862776 22544669 22144396 21509735 21956358
4653B1956358k05305j37842K10025P6818Q08287l726n53481L10883k43069M86782
$$ 21956358 21751053 21613211 21823236 21900054 22708341 22704615 22151134 22462017 22218948 22705730
4643B2705730J03288J90967L92932J7177k77457N52591J72803j9792L14148k34980
$$ 22705730 22809018 22999985 23392917 23410094 23132637 23685228 23858031 23838239 24152387 23917407
4633B3917407n57911j58519K6728m18572J06142o2853j68365j86188L20586j70749
$$ 23917407 23359496 23200977 23227705 22809133 22915275 22852422 22684057 22497869 22818455 22647706
4623B2647706j137J07993k79249k64119M3195L59138K14408K79140K33454l04135
$$ 22647706 22646569 22754562 22475313 22211194 22254389 22613527 22827935 23107075 23340529 23036394
4613B3036394J53325l7498l91403L67889O34245r2470J06561j12023n576O88642
$$ 23036394 23189719 23152221 22760818 23128707 23762952 23670482 23777043 23665020 23659444 24348086
4603B4348086O74311j44007j99608k79412k17690N2827N39494L78533j56726q1646
$$ 24348086 25022397 24878390 24678782 24399370 24181680 24234507 24774001 25152534 24995808 24914162
4593B4914162Q1557N96294L4074J34630N77323L42011K31200Q3882M04261M9211
$$ 24914162 24995719 25592013 25626087 25760717 26338040 26680051 26911251 26995133 27399394 27448605
4583B7448605L34130m74697l11450K46177P3301J111216n1140L98296J17937p1262
$$ 27448605 27782735 27308038 26996588 27242765 27316066 28427282 28376142 28774438 28892375 28821113
4573B8821113M01911l982L1235k31901r0861R09443N98373R72717K90557R9996
$$ 28821113 29223024 29219042 29250277 29018376 28927515 29836958 30435331 31408048 31698605 31798601
4563C1798601M01989J234366o2302q00649J25564J26210Q78994Q9502Q32227L51426
$$ 31798601 32200590 33434956 33372654 32572005 32697569 32823779 33702773 33792275 34624502 34975928
4553C4975928K48050P26465M29391J75905J84321N56824Q96542M07625N81086
$$ 34975928 35223978 35950443 36379834 36555739 36740060 37296884 38193426 38601051 39182137
4544C9182137N03281R87841L82023J035671J335650M59496M24339J315974J246536
$$ 39182137 39685418 40673259 41055282 42090953 43426603 43886099 44310438 45626412 46872948
4535D6872948k8813O38639J274583J139090P56746k39101K86528M61609O02163
$$ 46872948 46844135 47482774 48757357 49896447 50653193 50414092 50700620 51162229 51764392
4526E1764392Q08713P05992M6796M48179P87424O11267P81352J14451k19392K99773
$$ 51764392 52573105 53279097 53325893 53774072 54561496 55172763 55954115 56068566 55849174 56148947
4516E6148947M49894k89901J84193O65340P99032M43066O6977J48068Q39742l83757
$$ 56148947 56598841 56308940 56493133 57158473 57957505 58400571 58467548 58615616 59455358 59071601
4506E9071601j98638o5516O21219J13744j18364N56065P35714P12267K47470K83539
$$ 59071601 58872963 58807447 59428666 59542410 59424046 59980111 60715825 61428092 61675562 61959101
4496F1959101L72127K11808J03386l78670O59211L7915m42223q89298O4461Q14972
$$ 61959101 62331228 62543036 62646422 62267752 62926963 62964878 62522655 61633357 61697818 62512790
4486F2512790j67614P88387M48607k7020m2273P88358P90087L94512j41788j04487
$$ 62512790 62345176 63133563 63582170 63555150 63512877 64301235 65091322 65485834 65344046 65239559
4476F5239559J25665N11689k66665O74286L74217M96994R61380M57982J01103
$$ 65239559 65365224 65876913 65610248 66284534 66658751 67155745 68117125 68575107 68676210
4467F8676210J39686N91793L56729R14527j60014n18416O73069O73267j3193R3194
$$ 68676210 68815896 69407689 69764418 70678945 70518931 70000515 70673584 71346851 71333658 71426852
4457G1426852P75676j39577J30223L98318j03844R1421k90964J16710L29928Q7384
$$ 71426852 72202528 72062951 72193174 72591492 72487648 72579069 72288105 72404815 72734743 72822127
4447G2822127P79739J121139j94833m57985n65468J72027j91099m8735M6250p9886
$$ 72822127 73601866 74723005 74528172 74070187 73504719 73676746 73485647 73436912 73483162 73403276
4437G3403276J7577q65830N9974l73871J08923M51422M28232r74978K83896K25891
$$ 73403276 73420853 72555023 72614997 72241126 72350049 72801471 73229703 72254725 72538621 72764512
4427G2764512j503538j74639j79506n7955K0420o14697k93900q144l28148j06586
$$ 72764512 71260974 71086335 70906829 70848874 70869294 70254597 69960697 69952553 69624405 69517819
4417F9517819R9199j40986o6737m0747l01862m21411m54182m15954j27377j62856
$$ 69517819 69617018 69476032 69409295 69368548 69066686 68645275 68191093 67775139 67647762 67484906
4407F7484906j58427m03013l97248k66667m23906q3865n41772l29527j95086r37666
$$ 67484906 67326479 66923466 66526218 66259551 65835645 65751780 65210008 64880481 64685395 63747729
4397F3747729m01035o3032P8066m93049m67642l28311r05293m18944k26802j17769
$$ 63747729 63346694 63283662 63361728 62868679 62401037 62072726 61167433 60748489 60521687 60403918
4387F0403918o61122k16975m0732j44123m50859k83212n05897j58944m10259l23226
$$ 60403918 59742796 59525821 59485089 59340966 58890107 58606895 58100998 57942054 57531795 57208569
4377E7208569j473529m34530N28268P2696m94319n74222p59871K38604n21059
$$ 57208569 55735040 55300510 55828778 55901474 55407155 54832933 54073062 54311666 53790607
4368E3790607j80741k63012l01698K21498J82076n06253R474j02162p43911k6159
$$ 53790607 53609866 53346854 53045156 53266654 53448730 52942477 52951951 52849789 52105878 52079719
4358E2079719l03507n35911n75775m9788J25906k31408n96502l60139J79959L67597
$$ 52079719 51776212 51240301 50664526 50614738 50740644 50509236 49912734 49552595 49732554 50100151
4348E0100151l771o69380o53432l20775r18O6154o53097n56277o09903J40338
$$ 50100151 50096380 49427000 48773568 48452793 48451875 48518029 47864932 47308655 46698752 46839090
4338D6839090j62528L87412J01869M01871o84246j113147l45535J98037p0186
$$ 46839090 46676562 47063974 47165843 47567714 46883468 45770321 45424786 45622823 45552637
4329D5552637l88540m2393L38197l75655k08075k88022K61005K55855Q1182l59521
$$ 45552637 45164097 45121704 45459901 45084246 44876171 44588149 44849154 45105009 45186191 44826670
4319D4826670j13038l23420o48597K20242K74412p5312J66447q0977Q5386r16222
$$ 44826670 44713632 44390212 43741615 43961857 44236269 44160957 44327404 44246427 44331813 43415591
4309D3415591M46122k44197k78310j41904j007388Q64157K81726k59211J03844
$$ 43415591 43861713 43617516 43339206 43197302 42189914 43054071 43335797 43076586 43180430
4300D3180430K69585L27088j80576k51941o21244P8828M41696m20838m23948N15324
$$ 43180430 43450015 43777103 43596527 43344586 42723342 42802170 43243866 42823028 42399080 42914404
4290D2914404m82098J64199l3209k10345q7748J21013J188985l29837n34833k74315
$$ 42914404 42432306 42596505 42563296 42352951 42265203 42386216 43575201 43245364 42710531 42436216
4280D2436216L03267k52781m38380K94997J4776n20269M17742P5633J02774j37516
$$ 42436216 42739483 42486702 42048322 42343319 42358095 41837826 42255568 42331201 42433975 42296459
4270D2296459l37762J70833J19920j28399l30923o16829P44814J54187J99211
$$ 42296459 41958697 42129530 42249450 42121051 41790128 41173299 41918113 42072300 42271511
4261D2271511j13578j0514j65180M89501O13698j054147k67770p17104Q6134O66847
$$ 42271511 42157933 42147419 41982239 42471740 43085438 42031291 41763521 41046417 41132551 41799398
4251D1799398M12678j12489L39909m54112j76667M32221M43264N96808l97842
$$ 41799398 42212076 42099587 42439496 41985384 41808717 42240938 42684202 43281010 42883168
4242D2883168O13565l04264l17818M47194N6384j56914K68809K82933O50133n12668
$$ 42883168 43496733 43192469 42874651 43321845 43378229 43221315 43490124 43773057 44423190 43910522
4232D3910522q61838J46554R14333L7561m9260K7434K31488J09231j55871k51739
$$ 43910522 43048684 43195238 44109571 44147132 44097872 44125306 44356794 44466025 44310154 44058415
4222D4058415j57520N66805k32304o91236J73206o8010K45852J164630R9856n77014
$$ 44058415 43900895 44467700 44235396 43544160 43717366 43649356 43895208 45059838 45159694 44582680
4212D4582680j83885m08884j97889j63531j32719j87588J44665p0871l18191L12320
$$ 44582680 44398795 43989911 43792022 43628491 43495772 43308184 43452849 43381978 43063787 43376107
4202D3376107j98367j3607j26697n0169o069J91741L12910n18294l37068j8396
$$ 43376107 43177740 43164133 43037436 42987267 42981198 43172939 43485849 42967555 42630487 42612091
4192D2612091L90645j28813N96195n06407j37642k69263o2131Q64647l39175l80003
$$ 42612091 43002736 42873923 43470118 42963711 42826069 42556806 42494675 43359322 43020147 42640144
4182D2640144M0121O87993M22102N3374Q9875m84789k47233k15930n6571L99980
$$ 42640144 42680265 43368258 43790360 43843734 43933609 43448820 43201587 42985657 42929086 43329066
4172D3329066n6219M32643k89569P15118N65244P636J52339l45390K92400J99187
$$ 43329066 43272847 43705490 43415921 44131039 44696283 44703919 44856258 44510868 44803268 45002455
4162D5002455K53110n642M54704Q17700k36284J28178K21059k30980L39299J026664
$$ 45002455 45255565 45249923 45704627 46522327 46286043 46414221 46635280 46404300 46743599 47770263
4152D7770263L4442K21184k43524j20777O79339J64334J99769M36993r36230J00615
$$ 47770263 47804705 48025889 47782365 47661588 48340927 48505261 48705030 49142023 48205793 48306408
4142D8306408Q0825l23640N40913L9633j63547K45625m68621k16972q6555L97208
$$ 48306408 48387233 48063593 48604506 48644139 48480592 48726217 48257596 48040624 47954069 48351277
4132D8351277n37064Q8136J26745J24012k26165L36448L19125K2680m36441m31091
$$ 48351277 47814213 47902349 48029094 48153106 47926941 48263389 48582514 48605194 48168753 47737662
4122D7737662M04919O42629l3976k47633m1473K57404k01388m65211M93644k9066
$$ 47737662 48142581 48785210 48751234 48503601 48462128 48719532 48518144 48052933 48546577 48517511
4112D8517511J93936L96767n5231O16046L28627j53048l78869l46875J22071m64730
$$ 48517511 48711447 49108214 49052983 49669029 49997656 49844608 49465739 49118864 49240935 48776205
4102D8776205P47155J1138m29516p224j2248m25564n457m65202n32045K7969k21555
$$ 48776205 49523360 49534498 49104982 49097758 49085510 48659946 48654489 48189287 47657242 47685211 47463656
4091D7463656O602j56494P1520J91123j72562k95690m66286m7664l47197N91107
$$ 47463656 47470258 47313764 47385284 47576407 47403845 47108155 46641869 46594205 46247008 46838115
4081D6838115J05320n73557K4892K12773K01153J12617l72760m6390K92796L79099
$$ 46838115 46943435 46369878 46394770 46607543 46808696 46921313 46548553 46502163 46794959 47174058
4071D7174058K40646K9269n34638K4457J85485O7164J87358j0364L11901O16354
$$ 47174058 47414704 47443973 46909335 46933792 47119277 47186441 47373799 47363435 47675336 48291690
4061D8291690o08158k9234L54143L97826j64431j23192P6178L10367L44162K22726
$$ 48291690 47683532 47654298 48008441 48406267 48241836 48118644 48194822 48505189 48849351 49072077
4051D9072077L59198o2932O60903K49107J88429L93116M99779l46570k60324M52946
$$ 49072077 49431275 49368343 50029246 50278353 50466782 50859898 51359677 51013107 50752783 51205729
4041E1205729p08826o97950r23046o73799k10125M1535m57933M72924k59045m52596
$$ 51205729 50496903 49798953 48875907 48202108 47991983 48033518 47575585 48048509 47789464 47336868
4031D7336868k99108l57748j00375J40187k28483m41749j81839k67071k83346
$$ 47336868 47037760 46680012 46579637 46719824 46491341 46049592 45867753 45600682 45317336
4022D5317336L06706M1452j243613j65290L08278O19814J33710l07478J59103
$$ 45317336 45624042 45665494 44421881 44256591 44564869 45184683 45318393 45010915 45170018
4013D5170018L49193q18196j70892m88792l68410L10541k97345K5974j15439j90343
$$ 45170018 45519211 44701015 44530123 44041331 43672921 43983462 43686117 43712091 43596652 43406309
4003D3406309m28625k15328J53458n34331n220J1257N13878j17115l84162l21311
$$ 43406309 42977684 42762356 42915814 42381483 42376263 42387520 42901398 42784283 42400121 42078810
3993D2078810j8469o09161l69347j04488K72593j95297k18027M55705k53116l09327
$$ 42078810 42060341 41451180 41081833 40977345 41249938 41054641 40836614 41292319 41039203 40729876
3983D0729876o0364k56919K43222K90851k28906J54126l45097o93019l0644n69714
$$ 40729876 40669512 40412593 40655815 40946666 40717760 40871886 40526789 39833770 39803126 39233412
3973C9233412n5637k61865j62456o04450l99152m05062m3363l72146K7507n1012
$$ 39233412 39177775 38915910 38753454 38149004 37749852 37344790 37301427 36929281 36956788 36905776
3963C6905776l78379k47498l00422J35343N72969O97r5792J49324p83145l57795
$$ 36905776 36527397 36279899 35979477 36114820 36687789 36688486 36592694 36742018 35958873 35601078
3953C5601078j21361j8446j794J71467J42766K16451k06529k56152j52831L04019
$$ 35601078 35479717 35461271 35459477 35630944 35773710 35990161 35783632 35527480 35374649 35678668
3943C5678668l98374k83989J14276n6374J66968M00315o95525K11634K49405j65204
$$ 35678668 35280294 34996305 35110581 35054207 35221175 35621490 34925965 35137599 35387004 35221800
3933C5221800j26699J24541n38727j11496L83556O07352N9779p01498J78089j50148
$$ 35221800 35095101 35219642 34680915 34569419 34952975 35560327 35620106 34918608 35096697 34946549
3923C4946549P984k90988K10063m78460L33654R28074n90918l59644K771k68829
$$ 34946549 34954533 34663545 34873608 34395148 34728802 35656876 35065958 34706314 34709085 34440256
3913C4440256k74987K28368j94017l5062n74825j05634N85078N56885l16522K45733
$$ 34440256 34165269 34393637 34199620 34164558 33589733 33484099 34069177 34626062 34309540 34555273
3903C4555273j72787m73063p29547J71195M49361o5023M42253m38559m89408L41748
$$ 34555273 34382486 33909423 33179876 33351071 33800432 33735409 34177662 33739103 33249695 33591443
3893C3591443k72599O96581N29691o6897K65683n5501j81123N22812O85533P43187
$$ 33591443 33318844 34015425 34545116 34478219 34743902 34688401 34507278 35030090 35715623 36458810
3883C6458810J521233N75762P89290Q71938K57609P30315M63113m57677j418446
$$ 36458810 37980043 38555805 39345095 40217033 40474642 41204957 41668070 41210393 39791947
3874C9791947j588527p10528l86091j176399j809934j182234l86807j97356k53505
$$ 39791947 38203420 37492892 37106801 35930402 34120468 32938234 32551427 32354071 32100566
3865C2100566J30337l31442o48299m04327k68230r59551k44310P57367k51957
$$ 32100566 32230903 31899461 31251162 30846835 30578605 29619054 29374744 30132111 29880154
3856B9880154l23124L6314O7171K65646J70825Q08405P1681K13458M00546N51058
$$ 29880154 29557030 29593344 29660515 29926161 30096986 30905391 30977072 31190530 31591076 32142134
3846C2142134J13710m56533J76365M3030L9822J63567J87795L12226l99481l47370
$$ 32142134 32255844 31799311 31975676 32018706 32058528 32222095 32409890 32722116 32322635 31975265
3836C1975265L99158O09117m6980N35407O41314k63976M79476J15958J44477O33547
$$ 31975265 32374423 32983540 32936560 33471967 34113281 33849305 34328781 34444739 34589216 35222763
3826C5222763m89486M81803O93746Q45119j77046P1424J73444L1137k45638P14393
$$ 35222763 34733277 35215080 35908826 36753945 36576899 36648323 36821767 36852904 36607266 37321659
3816C7321659M30390P83M76296N42557m429n3819M33132K33580N60474R0416Q75733
$$ 37321659 37752049 37752832 38229128 38771685 38767256 38713437 39146569 39380149 39940623 40031039 40906772
3805D0906772R52671j4619M68440O88086N11829O36357P85354k3168P99736O21671
$$ 40906772 41859443 41844824 42313264 43001350 43513179 44149536 44934890 44911722 45711458 46333129
3795D6333129N13602Q21175R80987Q11657J045714J504430Q23153J093487J498174
$$ 46333129 46846731 47667906 48648893 49460550 50506264 52010694 52833847 53927334 55425508
3786E5425508J991556J409319J729287K001710J280658L24680J047657O32510
$$ 55425508 57417064 58826383 60555670 62557380 63838038 64162718 65210375 65842885
3778F5842885K67788o25902o24721n82614r7890o05397r8804j86990j228732m53337
$$ 65842885 66110673 65484771 64860050 64277436 64179546 63574149 63475345 63288355 62059623 61606286
3768F1606286N03744M81867L28865L56770R49307L68418J212868J002285J33520
$$ 61606286 62110030 62591897 62920762 63277532 64226839 64595257 65808125 66810410 66943930
3759F6943930j23506m62157P01937L08208j499697j715827j286221j183020o19737
$$ 66943930 66820424 66358267 67060204 67368412 65868715 64152888 62866667 61683647 61063910
3750F1063910j314941j758870j370082j037892p54720q47016j112816j570422
$$ 61063910 59748969 57990099 56620017 55582125 54827405 53980389 52867573 51297151
3742E1297151q89128n32961n16313p98113o46460o72763j3970l91993p52382r31763
$$ 51297151 50408023 49875062 49358749 48560636 47914176 47241413 47227443 46835450 46083068 45151305
3732D5151305o13545n51950r28679M24514l50069k06214O1130p77463j132482
$$ 45151305 44537760 43985810 43057131 43481645 43131576 42925362 42986492 42209029 41076547
3723D1076547K30632l52062o61180j43352o19865j86997k18167K33914j227761
$$ 41076547 41307179 40955117 40293937 40150585 39530720 39343723 39125556 39359470 38131709
3714C8131709n85759o6629L12082j52297l91434m38265O6331N40696n29180l97967
$$ 38131709 37545950 37479321 37791403 37639106 37247672 36809407 36875738 37416434 36887254 36489287
3704C6489287k35046K41089l53904l38555R5761p0573l82878L53162k63935l56989
$$ 36489287 36254241 36495330 36141426 35802871 35898632 35828059 35445181 35798343 35534408 35177419
3694C5177419J45518O8127J18098J90505j63907o2157j045848L0908L38922l8020
$$ 35177419 35322937 35391064 35509162 35699667 35535760 35473603 34427755 34458663 34797585 34759565
3684C4759565M81903n22339m77631O72552k04243j20790L09566M9336j97987M64306
$$ 34759565 35241468 34719129 34241498 34914050 34709807 34589017 34898583 34947919 34749932 35214238
3674C5214238K79708j09426j89380N09037K73277k24162L00338L85734l57504
$$ 35214238 35493946 35384520 35195140 35704177 35977454 35753292 36053630 36439364 36081860
3665C6081860L20182K20459J78861k70665l41713q2228L923L35910n71674o6229
$$ 36081860 36402042 36622501 36801362 36530697 36188984 36106756 36110679 36446589 35874915 35808686
3655C5808686M4471O59945j07364k00249n7488j68003m33311j37630l16665j03103
$$ 35808686 35853157 36513102 36405738 36205489 36148001 35979998 35546687 35409057 35092392 34989289
3645C4989289j07758r46293j82000l80346o97531K75174n08829n57325L44703
$$ 34989289 34881531 33935238 33753238 33372892 32675361 32950535 32441706 31884381 32229084
3636C2229084l13630p70805l82002j23401k82872m53620m04049p36381L29715
$$ 32229084 31915454 31144649 30762647 30639246 30356374 29902754 29498705 28762324 29092039
3627B9092039k7329o30317n94922k76797k51699k34829j81445m45032J45081j01463
$$ 29092039 29064710 28434393 27839471 27562674 27310975 27076146 26894701 26449669 26594750 26493287
3617B6493287m08796o25856k41779m71433m05930l93212j04375j55488q60918
$$ 26493287 26084491 25458635 25216856 24745423 24339493 23946281 23841906 23686418 22825500
3608B2825500l21762J55810O3880j66317j165389Q7441L21222p29126n94045j50385
$$ 22825500 22503738 22659548 22723428 22557111 21391722 21479163 21800385 21071259 20477214 20326829
3598B0326829k55481k34335m42197j28957p4049o89517Q6693o5999m29525o71091
$$ 20326829 20071348 19837013 19394816 19265859 19191810 18502293 18588986 18522987 18093462 17422371
3588A7422371n04686l04720L27627K52021j69198J01359l05747m53013m19834
$$ 17422371 16917685 16612965 16940592 17192613 17023415 17124774 16819027 16366014 15946180
3579A5946180k89855l84622j16198L76616j61023L9168J6296j01153J61133l54752
$$ 15946180 15656325 15271703 15155505 15532121 15371098 15410266 15426562 15325409 15486542 15131790
3569A5131790p42455k57430K0392k9858j11324K29557J24162m94420m33469j49963
$$ 15131790 14389335 14131905 14152297 14122439 14011115 14240672 14364834 13870414 13436945 13286982
3559A3286982j02040K54678j12681M11935j04801r7984K4050l72249L12948r20945
$$ 13286982 13184942 13439620 13326939 13738874 13634073 13536089 13560139 13187890 13500838 12579893
3549A2579893O77277J81349m42033K53529k26384l12188l47464M51158M4999l45478
$$ 12579893 13257170 13438519 12996486 13250015 13023631 12711443 12363979 12815137 12860136 12514658
3539A2514658p9878j81306m72966R4551o887k60732J49191o13688J82511M30426
$$ 12514658 12434780 12253474 11780508 11875059 11868172 11607440 11756631 11142943 11325454 11755880
3529A1755880m99791M21536J94056Q4856j76231n2467m92320k15521M29999j92453
$$ 11755880 11256089 11677625 11871681 11956537 11780306 11727839 11235519 11019998 11449997 11257544
3519A1257544p5532k03131k44099L44759K60524j119740l3109P16817N637L15572
$$ 11257544 11182012 10978881 10734782 11079541 11340065 10220325 10187216 10904033 10909670 11225242
3509A1225242o68944J11643k00810j99994N71609l42811L78122N84967j79504
$$ 11225242 10556298 10667941 10467131 10267137 10838746 10495935 10874057 11459024 11279520
3500A1279520K68718J01459J56858o26766j38550K51874j35588J014M40832p345
$$ 11279520 11548238 11649697 11806555 11179789 11041239 11293113 11157525 11158539 11599371 11592026
3490A1592026J3755N9821J89142K08101q03874n10259M76932J071456K13726P0205
$$ 11592026 11605781 11665602 11854744 12062845 11258971 10748712 11225644 12297100 12510826 12581031
3480A2581031p52768Q1566O69783K29761j42720J31639J45751j98336M73788L58517
$$ 12581031 11828263 11909829 12579612 12809373 12666653 12798292 12944043 12745707 13219495 13578012
3470A3578012M7900j32673m94592j54714J075132M24936j93289N00235L88252
$$ 13578012 13625912 13493239 12998647 12843933 13919065 14344001 14150712 14650947 15039199
3461A5039199j16907L79843N17152j52029k75387M93159O61919J4882O75230j38157
$$ 15039199 14922292 15302135 15819287 15667258 15391871 15885030 16546949 16561831 17237061 17098904
3451A7098904O949K71952j61912L7246J88200O05031M97979L57906j69166J41695
$$ 17098904 17105853 17377805 17215893 17253139 17441339 18046370 18544349 18902255 18733089 18874784
3441A8874784O79198L50494O86219K76815k48650N05293O40682M53816L68677
$$ 18874784 19553982 19904476 20590695 20867510 20618860 21124153 21764835 22218651 22587328
3432B2587328L7098M39273O52307O59830j78149k78358M82147Q25353P62640M388
$$ 22587328 22624426 23063699 23716006 24375836 24197687 23919329 24401476 25226829 25989469 25993857
3422B5993857J82423J1052P00657R67664N4757N19787O97456O75582J306112J416993
$$ 25993857 26176280 26187332 26887989 27855653 27910410 28430197 29127653 29803235 31109347 32526340
3412C2526340K68248J080519J49009J048811J660940J051781R98388J964318J279603
$$ 32526340 32794588 33875107 34024116 35072927 36733867 37785648 38784036 40748354 42027957
3403D2027957J370069J023610R63789K198589K916299K836683J462363K695685
$$ 42027957 43398026 44421636 45385425 47584014 50500313 53336996 54799359 57495044
3395E7495044K404330K833370L598736L695372L953810M385303N409987N978036
$$ 57495044 59899374 62732744 66331480 70026852 73980662 78365965 83775952 89753988
3387H9753988O693496Q243623Q016892Q636864Q880451R306452J0228532J0311390
$$ 89753988 96447484 104691107 112707999 121344863 130225314 139531766 149760298 160071688
3379A60071688R602389Q969974R171096R610540J0882330J0807637J1084465J0098554
$$ 160071688 169674077 178644051 187815147 197425687 208308017 219115654 230200119 240298673
3371B40298673R474453P559358O001474N991595N514242N797279N333111M929909
$$ 240298673 249773126 257332484 263333958 269325553 274839795 280637074 285970185 290900094
3363B90900094L853510J793023j222862l691803n516159o765052p467440p284945
$$ 290900094 294753604 296546627 295323765 291631962 286115803 279350751 271883311 264598366
3355B64598366o361578n665898p398477q782297j0545164j1422049j1557402j0371876
$$ 264598366 258236788 252570890 245172413 236390116 225844952 214422903 202865501 192493625
3347A92493625j0258653j0220266q876381q721684r217089q720189r447214r047312
$$ 192493625 182234972 172014706 163138325 154416641 145199552 136479363 127032149 117984837
3339A17984837q705939q143118p378063o634177n628954m969616m419274l857467
$$ 117984837 109278898 101135780 93757717 87123540 81494586 76524970 72105696 68248229
3331F8248229m126206l321692k171703k984233k689857k501728j780029j794519
$$ 68248229 64122023 60800331 58628628 55644395 52954538 50452810 48672781 46878262
3323D6878262j549618j612004o83829k086342j776247n02899j023630n69679r21426
$$ 46878262 45328644 43716640 43032811 40946469 39170222 38667323 37643693 37074014 36152588
3314C6152588j257673j130115l42149r04380j038254r45006p99882p12149m71042
$$ 36152588 34894915 33764800 33422651 32518271 31480017 30535011 29735129 29022980 28551938
3305B8551938o54318r89510m99911m85608n74407k0836o71741m95066j94437m66787
$$ 28551938 27897620 26908110 26408199 25922591 25348184 25327348 24655607 24160541 23966104 23499317
3295B3499317q31904q52645J83166o51193j8801k76579l62114p15493q44422L9310
$$ 23499317 22667413 21814768 21997934 21346741 21327940 21051361 20689247 19973754 19129332 19168642
3285A9168642k52798P71951n58689j056896l46953r198l62665j93366L27020k15858
$$ 19168642 18915844 19687795 19129106 18072210 17725257 17716059 17353394 17160028 17487048 17271190
3275A7271190m76301k72139J75440M44862k9826m44274k08804o27855M9604M58434
$$ 17271190 16794889 16522750 16698190 17143052 17113226 16668952 16460148 15832293 15881897 16340331
3265A6340331j82985o37095J90325p932N0158K7753j14693p61165l53685K70757
$$ 16340331 16157346 15520251 15710576 15702644 15752802 15780555 15665862 14904697 14551012 14821769
3255A4821769j023638o73575J7464K74356N69188m99338R8181m36171k45021J53300
$$ 14821769 13798131 13124556 13142020 13416376 13985564 13486226 13584407 13148236 12903215 13056515
3245A3056515M41461N3603k17246l13021m71105l45518K5669p00463N676m86093
$$ 13056515 13497976 13551579 13334333 13021312 12550207 12204689 12230358 11529895 11535571 11049478
3235A1049478M0080O04855P9506J47695k18533O65160k78069n53337n63644l34533
$$ 11049478 11089558 11694413 11773919 11921614 11703081 12368241 12090172 11536835 10973191 10638658
3225A0638658M64904j5785j78333M38711j42822N211k67265k08233Q1082j20045
$$ 10638658 11103562 11087777 10909444 11348155 11205333 11210544 10943279 10735046 10816128 10696083
3215A0696083o85410J63805K00482k32569k53514O4548k42237P5616M657K79349
$$ 10696083 10010673 10174478 10374960 10142391 9888877 9953425 9711188 9786804 9791461 10070810
3205A0070810j4039m33497J47270K18966j71057J98509q3784k48386l23662j30340
$$ 10070810 10056771 9623274 9770544 9989510 9818453 10016962 9933178 9684792 9361130 9230790
3195I230790J46597n26667n2134M76338J88386J5727k23335j53406O53969L24539
$$ 9230790 9377387 8850720 8798586 9274924 9463310 9479037 9255702 9102296 9756265 10080804
3185A0080804n47402l8413r137j28873M15954L0297n38793j92441P56107n4648
$$ 10080804 9533402 9494989 9485852 9356979 9772933 9803230 9264437 9071996 9828103 9773455
3175I773455q34417M9065L9388N70812P4454R0760n6861M57181J12839J98593
$$ 9773455 8939038 8988103 9027491 9598303 9672757 9763517 9706656 10163837 10276676 10475269
3165A0475269k06037j0757J87094J20984J03267m10932j65092k2710P61094j4964
$$ 10475269 10269232 10258475 10445569 10566553 10669820 10258888 10093796 10071086 10832180 10817216
3155A0817216J24077N184M99320q7260R0128k74097J44974j77995L07137P489
$$ 10817216 10941293 10946477 11445797 11358537 11448665 11174568 11319542 11141547 11448684 11456173
3145A1456173m95614k3813m9774K21361o5208q0650M74289M28188j5786K33625
$$ 11456173 10960559 10936746 10886972 11108333 11043125 10962475 11436764 11864952 11849166 12082791
3135A2082791O37116p62742J59284K79607O00843K52440k46133J10433k27451
$$ 12082791 12719907 11957165 12116449 12396056 12996899 13249339 13003206 13113639 12886188
3126A2886188M50806M41840O4825j01214J51520K73233L26942j97810M49261j77971
$$ 12886188 13336994 13778834 13843659 13742445 13893965 14167198 14494140 14296330 14745591 14567620
3116A4567620M17L69325L35776J70188R4039P07127J06070J42809K67087J89844
$$ 14567620 14568037 14937362 15273138 15443326 15537365 16244492 16350562 16493371 16760458 16950302
3106A6950302l7260q4135M99043J37959M67494M16331l54619K70524N96006K36958
$$ 16950302 16913042 16828907 17327950 17465909 17933403 18349734 17995115 18265639 18861645 19098603
3096A9098603J70963M13163L05886q94N17011j02450P40225k21828R68146M88296
$$ 19098603 19269566 19682729 19988615 19987721 20504732 20402282 21142507 20920679 21888825 22377121
3086B2377121L4504O54209k34614Q27428K23391M35943K4575L69037M80749O15397
$$ 22377121 22411625 23065834 22831220 23658648 23882039 24317982 24342557 24711594 25192343 25807740
3076B5807740K42548L34082R37959M47482N74860P48348K77286N32432O96950
$$ 25807740 26050288 26384370 27322329 27769811 28344671 29093019 29370305 29902737 30599687
3067C0599687L81274O93299N42567L23370J04687J109685R00659L02965K18792
$$ 30599687 30980961 31674260 32216827 32540197 32644884 33754569 34655228 34958193 35176985
3058C5176985J084848Q03969L18969J010979J387710P82777J231815J197496P63834
$$ 35176985 36261833 37065802 37384771 38395750 39783460 40566237 41798052 42995548 43759382
3049D3759382J262480M70950Q00929J388528P15746Q36970Q06712J761756Q80362
$$ 43759382 45021862 45492812 46293741 47682269 48398015 49234985 50041697 51803453 52683815
3040E2683815N32573R93529J094376J638644J369751Q27441J302282J206803J827442
$$ 52683815 53216388 54209917 55304293 56942937 58312688 59140129 60442411 61649214 63476656
3031F3476656J542929J168251J586799J243888J559622K202085J618629J263925
$$ 63476656 65019585 66187836 67774635 69018523 70578145 72780230 74398859 75662784
3023G5662784K448754K540289J396364K015657K440842K031553K195428K216670
$$ 75662784 78111538 80651827 82048191 84063848 86504690 88536243 90731671 92948341
3015I2948341K905088K252552K596654L244774K779775L037870L639907K547066
$$ 92948341 95853429 98105981 100702635 103947409 106727184 109765054 113404961 115952027
3007A15952027L972283L781211L472750L942433M307307M322967N060055N139261
$$ 115952027 119924310 123705521 127178271 131120704 135428011 139750978 144811033 149950294
2999A49950294M653274M545150M063041L125747K849069J296882J579941J254766
$$ 149950294 154603568 159148718 163211759 166337506 169186575 170483457 172063398 173318164
2991A73318164J548005J828503K191262K396080K436459J924538K049120K052342
$$ 173318164 174866169 176694672 178885934 181282014 183718473 185643011 187692131 189744473
2983A89744473J485812J783268J994302K653188K462822K707104L380714L964247
$$ 189744473 191230285 193013553 195007855 197661043 200123865 202830969 206211683 210175930
2975B10175930N064765N941090P077665P998022Q467847R208498R628990Q703531
$$ 210175930 215240695 221181785 228259450 236257472 244725319 253933817 263562807 272266338
2967B72266338P489993O364646P553656J0225397J5406119K1779563L0430311
$$ 272266338 279756331 286120977 293674633 303900030 319306149 341085712 371516023
2960C71516023L2868979L4367624L5749821L1051841O971300k7477425l3564176
$$ 371516023 404385002 438752626 474502447 505554288 512525588 485048163 451483987
2953D51483987l8149114m7788947m7529538l7456430k8170337k0601767j6176180
$$ 451483987 413334873 365545926 318016388 280559958 252389621 231787854 215611674
2946B15611674j3942597j1466299j0338747r844795q033769o499193o444571o015212
$$ 215611674 201669077 190202778 179864031 170019236 161985467 155486274 149041703 143026491
2938A43026491n336521m633144m134910l460771l607784k882745k221382k401947
$$ 143026491 137689970 133056826 128921916 125461145 121853361 118970616 116749234 114347287
2930A14347287j700567j382110n86028j118387K27396K40135R31025J178959R61160
$$ 114347287 112646720 111264610 110678582 109560195 109787591 110027726 110958751 112137710 113098870
2921A13098870K031172J110326m32174l17401j112432j246161j593493k635948
$$ 113098870 115130042 116240368 115808194 115490793 114378361 113132200 111538707 108902759
2913A08902759k642606k738447l485528l948527l219528l668803l560308k203817
$$ 108902759 106260153 103521706 100036178 96087651 92868123 89199320 85639012 83435195
2905H3435195k127200k156377j161886q31126j079534j137716q19257j329099
$$ 83435195 81307995 79151618 77989732 77158606 76079072 74941356 74122099 72793000
2897G2793000q01736k57213p60065n88660j55267n11874j72717n16829P681k77391
$$ 72793000 71991264 71734051 70973986 70385326 70230059 69718185 69545468 69028639 69036320 68758929
2887F8758929K18117j15104K83896k01473j36661l3454J66386Q35517L77271l89290
$$ 68758929 68977046 68861942 69145838 68944365 68807704 68774250 68940636 69776153 70153424 69764134
2877F9764134m10144L70984L93845L05113j81863L33488O86341J302247O04012
$$ 69764134 69353990 69724974 70118819 70423932 70242069 70575557 71261898 72564145 73168157
2868G3168157Q74163O61055K04888L56280R59907R99603J293937Q55900P4101
$$ 73168157 74042320 74703375 74908263 75264543 76224450 77224053 78517990 79373890 79447991
2859G9447991J682327J011563P21313P44803Q93815J080169J481462J480940J295501
$$ 79447991 81130318 82141881 82863194 83607997 84501812 85581981 87063443 88544383 89839884
2850H9839884J763777J834278O31487J430985R41815J489288J453948J717705
$$ 89839884 91603661 93437939 94069426 95500411 96442226 97931514 99385462 101103167
2842A01103167K500730J686003J720963K472871K345194K298051K191513K639084
$$ 101103167 103603897 105289900 107010863 109483734 111828928 114126979 116318492 118957576
2834A18957576J836876J804267K250380K449221K103507K464292K419770K382939
$$ 118957576 120794452 122598719 124849099 127298320 129401827 131866119 134285889 136668828
2826A36668828K378249K151624K269046K416290L006382K387439K337385J965192
$$ 136668828 139047077 141198701 143467747 145884037 148890419 151277858 153615243 155580435
2818A55580435J534699K263179K791127K255498K137851J765294J702663J869250
$$ 155580435 157115134 159378313 162169440 164424938 166562789 168328083 170030746 171899996
2810A71899996J781659P27630J257004P19069J012298R61984N94876J64064J40690
$$ 171899996 173681655 174409285 175666289 176385358 177397656 178359640 178954516 179118580 179259270
2801A79259270L09625Q3185K30970j34883O7074J44195k718m79328q69155q65146
$$ 179259270 179568895 179652080 179883050 179748167 179815241 179959436 179956718 179477390 178608235 177743089
2791A77743089k78628n45691j032766j196308j743980j168963j158067j193407
$$ 177743089 177464461 176918770 175886004 174689696 172945716 171776753 170618686 169425279
2783A69425279j220510j283186j995174j631295j771524k084226k448207k517157
$$ 169425279 168204769 166921583 164926409 163295114 161523590 159439364 156991157 154474000
2775A54474000k106855j968258k771814k730923k282417k274534l155259l345235
$$ 154474000 152367145 150398887 147627073 144896150 142613733 140339199 137183940 133838705
2767A33838705k967762k864353l328396k370229k271474k591181l224275k533376
$$ 133838705 130870943 128006590 124678194 122307965 120036491 117445310 114221035 111687659
2759A11687659k512354k928913k464868k468538k001586k094455j820828j972130
$$ 111687659 109175305 106246392 103781524 101312986 99311400 97216945 95396117 93423987
2751I3423987k396711j698005j991194j244546r46646j067026q07989j510634
$$ 93423987 91027276 89329271 87338077 86093531 85146885 84079859 83271870 81761236
2743H1761236j939731j027953j21005k18002K06836k90705m47604N56068P82548
$$ 81761236 79821505 78793552 78672547 78454545 78661381 78370676 77923072 78479140 79261688
2734G9261688R02248K024186K364501J976510R18274R84531N32032J87408l73780
$$ 79261688 80163936 82188122 84552623 86529133 87447407 88431938 88963970 89151378 88777598
2725H8777598q18855j249198j094633j810823k911986l361566l105346l416750
$$ 88777598 87958743 86709545 85614912 83804089 80892103 77530537 74425191 71008441
2717G1008441l234094k585874l124876k441748j351229j786393j285778j007126
$$ 71008441 67774347 65188473 62063597 59621849 58270620 56484227 55198449 54191323
2709E4191323p88401m34844j010342p95578o17180j010300o10062q04725m86371
$$ 54191323 53402922 52968078 51957736 51162158 50544978 49534678 48924616 48119891 47633520
2700D7633520o42610m23991K24151K6242o72170p29384l91306n97877l81689k47877
$$ 47633520 46990910 46566919 46791070 46817312 46145142 45415758 45024452 44426575 44044886 43797009
2690D3797009O3548J91643l16543M03594j70436p21035l66991J9109k44782o26746
$$ 43797009 43860557 44052200 43735657 44139251 43968815 43247780 42880789 42899898 42655116 42028370
2680D2028370K726J09719L70756K77608K94872K64526l49036J34515l21920N56295
$$ 42028370 42031096 42140815 42511571 42789179 43084051 43348577 42999541 43134056 42812136 43368431
2670D3368431P43744K20014J57899J082308L02341Q55041O88523N06998J415984
$$ 43368431 44112175 44332189 44490088 45572396 45874737 46729778 47418301 47925299 49341283
2661D9341283O59097M53136R34019O94408O91576J408967Q42378J152865J051847
$$ 49341283 50000380 50453516 51387535 52081943 52773519 54182486 55024864 56177729 57229576
2652E7229576M55931J06936L1867K09918J00350l09227l57300k62205p4372n15189
$$ 57229576 57685507 57792443 57824310 58034228 58134578 57825351 57468051 57205846 57131474 56616285
2642E6616285o90371m4722l99595p41620r36801j365467p73663q35448q10899
$$ 56616285 55925914 55881192 55481597 54739977 53803176 52437709 51664046 50828598 50017699
2633E0017699q49526j226856j313500p36559k93684j024482o33677n52950o10535
$$ 50017699 49168173 47941317 46627817 45891258 45597574 44573092 43939415 43386465 42775930
2624D2775930m18747q35251J67434k78070L93412n98931K04921L55424J95245
$$ 42775930 42357183 41521932 41689366 41411296 41804708 41205777 41410698 41766122 41961367
2615D1961367k0157j6073L44175M64132K03161J067464N38580k4536J81146P66288
$$ 41961367 41941210 41925137 42269312 42733444 42936605 44004069 44542649 44518113 44699259 45465547
2605D5465547J099988O85438N14139O40423J108986L87882Q03365O96143O55755
$$ 45465547 46565535 47250973 47765112 48405535 49514521 49902403 50705768 51401911 52057666
2596E2057666O75223J006784P16302N64344M15757J016829R63217Q50351O14723
$$ 52057666 52732889 53739673 54455975 55020319 55436076 56452905 57416122 58266473 58881196
2587E8881196K05266R18070J069787N04495O02912O72949Q65135N93238Q35324
$$ 58881196 59086462 60004532 61074319 61578814 62181726 62854675 63719810 64313048 65148372
2578F5148372J153321K31573O44343M52205J018840N39065P6776R71823M32427
$$ 65148372 66301693 66533266 67177609 67629814 68648654 69187719 69264495 70236318 70668745
2569G0668745P34159Q81391O96707N41206J78050Q63792J174410Q10703J011555
$$ 70668745 71402904 72284295 72981002 73522208 73700258 74564050 75738460 76549163 77560718
2560G7560718J743278J350160J605900J114654J389217K401078J664391J964874
$$ 77560718 79303996 80654156 82260056 83374710 84763927 87165005 88829396 90794270
2552I0794270J690680J908120K294903K826489K050000K266719L656469L186709
$$ 90794270 92484950 94393070 96687973 99514462 101564462 103831181 107487650 110674359
2544A10674359L782026L483150L836236L873530L743133M841951M499618M140689
$$ 110674359 114456385 117939535 121775771 125649301 129392434 134234385 138734003 142874692
2536A42874692N395210N497154N375085N838077O375205P146226P379658O858147
$$ 142874692 148269902 153767056 159142141 164980218 171355423 178501649 185881307 192739454
2528A92739454O333005M928980K055173K52201m10543q43379j661349j812565
$$ 192739454 199072459 204001439 206056612 206308813 205898270 205054891 203393542 201580977
2520B01580977k76551j41606l87743K46089M18616Q41091L48517K2238P25177
$$ 201580977 201304426 201162820 200775077 201021166 201439782 202280873 202629390 202651628 203376805
2511B03376805K21823j98735M04386j70952K65157l8757J02315l04609n74453
$$ 203376805 203598628 203399893 203804279 203633327 203898484 203859727 203962042 203657433 203082980
2502B03082980n07541o45092o50529q35009r28109j507163r53560j117296j809240
$$ 203082980 202575439 201930347 201279818 200444809 199516700 198009537 197055977 195938681 194129441
2493A94129441j649713j355373j372604k194417k043544k116719k372649k343999
$$ 194129441 192479728 191124355 189751751 187557334 185513790 183397071 181024422 178680423
2485A78680423k265280k502550l446349l236960k771366k631707k584587l178129
$$ 178680423 176415143 173912593 170466244 167229284 164457918 161826211 159241624 156063495
2477A56063495l650998l763855l386695k800018k994515l259095l065227l685380
$$ 156063495 152412497 148648642 145261947 142461929 139467414 136208319 133143092 129457712
2469A29457712l112450l214621k443340k985721k919356l102092k765675k017465
$$ 129457712 126345262 123130641 120687301 117701580 114782224 111680132 108914457 106896992
2461A06896992k146105k401654k310123k504057j672571j414214k168109k085717
$$ 106896992 104750887 102349233 100039110 97535053 95862482 94448268 92280159 90194442
2453I0194442j676790o53044j591345j468782r31186j564530p73257j190639j649805
$$ 90194442 88517652 87864608 86273263 84804481 83873295 82308765 81535508 80344869 78695064
2444G8695064q73344p31266o12744o87520j213777j038736p24451p43170k65459
$$ 78695064 77821720 77090454 76477710 75790190 74576413 73537677 72813226 72070056 71804597
2435G1804597r94908o99628k46968n70206j59348j036384j370176n97282r60737
$$ 71804597 70809689 70110061 69863093 69292887 69133539 68097155 66726979 66129697 65168960
2426F5168960q93955p60487r64682j120194j144180j319331k50765j763433q04083
$$ 65168960 64275005 63514518 62549836 61429642 60285462 58966131 58715366 56951933 56147850
2417E6147850m47793j049297j001011j496356q88335j186622j042562j164368
$$ 56147850 55700057 54650760 53649749 52153393 51265058 50078436 49035874 47871506
2409D7871506r79020o95650q29601m64982j526531j116173r76129j187375n40112
$$ 47871506 46892486 46196836 45367235 44902253 43375722 42259549 41283420 40096045 39555933
2400C9555933q99254p39080l57120m71775q71189q66409p80991p84610m64025
$$ 39555933 38656679 37917599 37560479 37088704 36217515 35351106 34570115 33785505 33321480
2391C3321480p65601k52080o29274o79953n76183n51429n25800o31485m05787
$$ 33321480 32555879 32303799 31674525 30994572 30418389 29866960 29341160 28709675 28303888
2382B8303888n68704m80860n7567q50702q68195P76601j52731q68336q70828q41388
$$ 28303888 27735184 27254324 27196757 26346055 25477860 26254461 26101730 25233394 24362566 23521178
2372B3521178L23249n24333j88132l18649j202302K18123j13509r43345l42760
$$ 23521178 23844427 23320094 23131962 22813313 21611011 21829134 21715625 20772280 20429520
2363B0429520k81535o4484l49167K45514M20058l52670q10525n3083J2801p07002
$$ 20429520 20147985 20083501 19734334 19979848 20399906 20047236 19236711 19183628 19196429 18489427
2353A8489427m94665m92326j37422K51421L6830l78077o9883J9446n52387l48623
$$ 18489427 17994762 17502436 17365014 17616435 17653265 17275188 17205305 17224751 16672364 16323741
2343A6323741k30643j08871m3214Q2836l07586o71376P0026K91920j47739k56809
$$ 16323741 16093098 15984227 15941013 16023849 15716263 15044887 15114913 15406833 15259094 15002285
2333A5002285q3230q5040k83393L0903L81569o53033o1056m08218l18752k74694
$$ 15002285 14919055 14834015 14550622 14581525 14963094 14310061 14249005 13840787 13522035 13247341
2323A3247341n39533o5589J1722L42915K93805k48631j56105k17495O0341m30022
$$ 13247341 12707808 12642219 12653941 12996856 13290661 13042030 12885925 12668430 12728771 12298749
2313A2298749m38643M84771l59963n93920P3196M27606J40487o24145j20029o66448
$$ 12298749 11860106 12344877 11984914 11390994 11464190 11891796 12032283 11408138 11288109 10621661
2303A0621661k11045J002114m24105l46343L66770J55477K3467p24577j90215
$$ 10621661 10410616 11412730 10988625 10642282 11009052 11164529 11187996 10463419 10273204
2294A0273204M82399K9518K98602o0876l18717j44452L2543k78226k08889N23491
$$ 10273204 10755603 10785121 11083723 11022847 10704130 10559678 10592221 10313995 10105106 10628597
2284A0628597n00110o8437l70266J94452J22412k00544q294k7942k22069l12403
$$ 10628597 10128487 10060050 9689784 9884236 10006648 9806104 9797810 9769868 9547799 9235396
2274I235396n2777K12649n50647j17646L50460O0353J6539k15143o18486m12608
$$ 9235396 9182619 9395268 8844621 8726975 9077435 9137788 9154327 8939184 8320698 7908090
2264G908090M91604K87656J94570N55732M4868o03981J67687j0450p3775J14072
$$ 7908090 8399694 8687350 8881920 9437652 9482520 8878539 9046226 9035776 8962001 9076073
2254I076073m02348n03244J91550M42290q67183J29543O70640M5336l18329O06754
$$ 9076073 8673725 8170481 8362031 8804321 7937138 8066681 8737321 8782657 8464328 9071082
2244I071082n13777J05633M97791k11885M4735m62042k56753J73222J06443K65726
$$ 9071082 8557305 8662938 9160729 8948844 8993579 8531537 8274784 8448006 8554449 8820175
2234H820175j65149K59268j35187k45991O43676L45956l44012k36839L89836j16064
$$ 8820175 8655026 8914294 8779107 8533116 9176792 9522748 9178736 8941897 9331733 9215669
2224I215669L92138n65679K58855l99087L28631P9861L00207M10517j67550J8257
$$ 9215669 9607807 9042128 9300983 8901896 9230527 9310388 9610595 10021112 9853562 9871819
2214I871819k76264K07569M12282p3419n4653k70626K00393k4975Q2546O3151
$$ 9871819 9595555 9803124 10215406 10141987 10087334 9816708 10017101 9992126 10074672 10137823
2204A0137823J70061j01723L19751j49785k02136K77944k12123J37007N38992
$$ 10137823 10307884 10206161 10525912 10376127 10173991 10451935 10239812 10376819 10915811
2195A0915811m51108n35971L39045O1240K72825k86417m66298J97547L77388J57637
$$ 10915811 10464703 9928732 10267777 10329017 10601842 10315425 9849127 10046674 10424062 10581699
2185A0581699j68477O57357J67644n99811n38569J64909M78039j88229L2422L96317
$$ 10581699 10413222 11070579 11238223 10638412 10099843 10264752 10742791 10554562 10586984 10983301
2175A0983301M4669N86530k40659R1050n12472m35656J23553J76971N40880P94994
$$ 10983301 11027970 11614500 11373841 11464891 10952419 10516763 10640316 10817287 11358167 12153161
2165A2153161K06371n61121J10175N18082K56164m2900j80075k92453M63734J75166
$$ 12153161 12359532 11798411 11908586 12426668 12682832 12639932 12459857 12167404 12631138 12806304
2155A2806304m29394J42929N91289K86646L50600m66722Q26091P87134L85640
$$ 12806304 12376910 12519839 13111128 13397774 13748374 13281652 14107743 14894877 15280517
2146A5280517M42146O12552P44044J119971N61021L03268L76007J124995J075243
$$ 15280517 15722663 16335215 17079259 18199230 18760251 19063519 19439526 20564521 21639764
2137B1639764J123923L00747R3876J12454J59599o38733m04792q24265j72438
$$ 21639764 22763687 23064434 23158310 23270764 23430363 22791630 22386838 21562573 21390135
2128B1390135p83792j393998r78560j034692r92671o14796k3452p39441n49775
$$ 21390135 20606343 19212345 18233785 17199093 16206422 15591626 15568174 14828733 14278958
2119A4278958p89673q20764l54258M58787o26696q80294M9114m2801J21071K8045
$$ 14278958 13489285 12668521 12314263 12773050 12146354 11266060 11315174 11272373 11393444 11421489
2109A1421489l76091k37314n48975L05588k98475m77212J9352J78808l00494k28080
$$ 11421489 11045398 10808084 10259109 10564697 10266222 9789010 9808362 9987170 9686676 9458596
2099I458596J76842J76793J80666n34577n09839J59349M03922l10919j90189N1406
$$ 9458596 9635438 9812231 9992897 9458320 8948481 9107830 9511752 9200833 9010644 9062050
2089I062050n32793m92308j00304k8500L41976R39756j50067m68370l00274j13681
$$ 9062050 8529257 8036949 7936645 7908145 8250121 9189877 9039810 8571440 8271166 8157485
2079H157485K15433k40179j19841K15845K70082j74250m05492R8276M15679N30998
$$ 8157485 8372918 8132739 8012898 8228743 8498825 8324575 7919083 8017359 8433038 8964036
2069H964036J819l43104k86940O73653L32267k28508k87721J48889R9314N26213
$$ 8964036 8965855 8622751 8335811 9009464 9341731 9113223 8825502 8974391 9073705 9599918
2059I599918J2499J65592L29419m62811L78207N89084N29953L57505N02480L46706
$$ 9599918 9612417 9778009 10107428 9644617 10022824 10611908 11141861 11499366 12001846 12348552
2049A2348552R28243J727875J164526J202347K033344N87116K89450K79998k31140
$$ 12348552 13276795 15004670 16169196 17371543 19404887 19992003 20281453 20561451 20330311
2040B0330311j578369j759869j930723j211579q99788q47862r44573j354894o40407
$$ 20330311 18751942 16992073 15061350 13849771 12949983 12102121 11157548 9802654 9162247
2031I162247k86467j025097k12062N88154m08069m97994k66266j39144j28249
$$ 9162247 8875780 7850683 7638621 8226775 7818706 7320712 7054446 6915302 6787053
2022F787053m75834L56088j86766r65480k53799L35116R842K19024J30502m69971
$$ 6787053 6311219 6667307 6480541 5515061 5261262 5596378 5606220 5825244 5955746 5485775
2012E485775j56359L62451N25183j244960L63518Q84168r70769m56683J4741r0233
$$ 5485775 5329416 5691867 6217050 4972090 5335608 6219776 5249007 4792324 4807065 4716832
2002D716832K98207j05995m95680J26072J01098l04943J09747l5237J67921l69863
$$ 4716832 5015039 4909044 4413364 4539436 4640534 4335591 4445338 4410101 4578022 4208159
1992D208159n69193q0284J79917L63516p3130k86475K37457o59105M68253J02400
$$ 4208159 3638966 3558682 3738599 4102115 4028985 3742510 3979967 3320862 3789115 3891515
1982C891515n69030j18828R35562k40915m50020R0941K21396M32088j04365l51940
$$ 3891515 3322485 3203657 4139219 3898304 3448284 3539225 3760621 4192709 4088344 3736404
1972C736404m50490L48144J58865L32365m41585J57177j59938n15723M88250m70110
$$ 3736404 3285914 3634058 3792923 4125288 3683703 3840880 3680942 3165219 3653469 3183359
1962C183359l92138o5529P6685L38947J06411J29296o7349k4265K7211L09379
$$ 3183359 2791221 2725692 2802377 3141324 3247735 3377031 3309682 3285417 3312628 3622007
1952C622007k73616l2227l1109J86795j90758j56074o91691L32419L02097l10924
$$ 3622007 3348391 3316164 3285055 3471850 3281092 3125018 2433327 2765746 3067843 2756919
1942B756919O4649K99984J69529m32491J16701L00123K03164l4038p44325L2327
$$ 2756919 2821568 3121552 3291081 2858590 2975291 3275414 3478578 3444540 2700215 2732542
1932B732542k0874N0751k16240k88953m36606k8036j4485M26730K24985K36997
$$ 2732542 2711668 2762419 2546179 2257226 1820620 1792584 1778099 2204829 2429814 2666811
1922B666811o61346m66999O92406j55384L58110Q822J65733q692j7885m74311
$$ 2666811 2005465 1538466 2230872 2075488 2433598 2442420 2608153 2599461 2581576 2107265
1912B107265J5335J74504N2897L7148m16687j84584O81993k74066m07475O7273
$$ 2107265 2122600 2297104 2350001 2387149 1970462 1785878 2467871 2193805 1786330 1853603
1902A853603K6043Q1840L68203q1357n89092J7994n50217J88427N0014N2045K56884
$$ 1853603 1879646 1961486 2329689 2248332 1659240 1677234 1127017 1315444 1365458 1417503 1674387
1891A674387k73742P05494l20743O07787M59598n5161k47946k38537N4801O33379
$$ 1674387 1400645 2106139 1785396 2393183 2852781 2797620 2549674 2311137 2365938 2999317
1881B999317k58582j74536l13084j03706m88473J75546l55012R5839N57724j89343
$$ 2999317 2740735 2566199 2253115 2149409 1660936 1836482 1481470 1577309 2135033 1945690
1871A945690L08925L46226M4768p1570l81818k0697j10059j60544n7474j77900
$$ 1945690 2254615 2600841 2645609 2574039 2192221 2171524 2061465 1900921 1843447 1665547
1861A665547N75558q7751Q7975j5126l51533k09156j25269N16770P28852q52887
$$ 1665547 2241105 2153354 2241329 2226203 1874670 1665514 1540245 2057015 2785867 1932980
1851A932980j47630k36374k96176M69982K99515J54025K09369l23792j35090j56447
$$ 1932980 1785350 1548976 1252800 1722782 2022297 2176322 2385691 2061899 1926809 1770362
1841A770362J3238l00779k53213L63357M37812j49102M13971J59171l6626m61479
$$ 1770362 1783600 1482821 1229608 1592965 2030777 1881675 2295646 2454817 2418191 1956712
1831A956712l06307j6994O76706p78364J30777M20999j7674K21440j26258k7111
$$ 1956712 1650405 1633411 2310117 1531753 1662530 2083529 2065855 2287295 2161037 2133926
1821B133926j14526L33383K17537L97179K45183q38893o92450O70984L65714k462
$$ 2133926 2019400 2352783 2570320 2967499 3212682 2373789 1681339 2352323 2718037 2715575
1811B715575j13951J28859J02102K56283o6798k41816n0163l28446L82340j8821
$$ 2715575 2601624 2730483 2832585 3088868 3022070 2780254 2730091 2401645 2783985 2765164
1801B765164k85393J72885q3961K86332M7502k37348Q57869l39835j12317k6069
$$ 2765164 2479771 2652656 2568695 2855027 2902529 2665181 3523050 3183215 3070898 3044829
1791C044829M23245n00771K26090N58535o4452k36726k59257N48277M3823k60187
$$ 3044829 3468074 2967303 3193393 3751928 3687476 3450750 3191493 3739770 3783593 3523406
1781C523406p26567M89277j86967J5040K99011J04762j93080N41605J30724l66810
$$ 3523406 2796839 3286116 3099149 3114189 3413200 3517962 3324882 3866487 3997211 3630401
1771C630401J46002L48295k40645M37637N5442k9289l25136J6334K70856k9172
$$ 3630401 3776403 4124698 3884053 4321690 4377132 4347843 4022707 4039041 4309897 4280725
1761D280725l69435N04442J5160p00263k5573j00849J58884m22146O71182L44872
$$ 4280725 3911290 4415732 4430892 3730629 3705056 3604207 3763091 3340945 4012127 4356999
1751D356999k02854j59860M6481O57113J45611m85958n52286K57415O11117j98912
$$ 4356999 4154145 3994285 4040766 4697879 4843490 4357532 3805246 4062661 4673778 4474866
1741D474866n84894K7299M21290l14580P0935M93300L80691K6482l21385J58292
$$ 4474866 3889972 3917271 4338561 4023981 4094916 4588216 4968907 4995389 4674004 4832296
1731D832296j92110K46442P33617o63959o01960J80895O88692J63314q53658k66872
$$ 4832296 4640186 4886628 5620245 4956286 4354326 4535221 5223913 5387227 4533569 4266697
1721D266697l3393n81571m53429L62655j90558l0268j1887L43511K35816m28725
$$ 4266697 4233304 3651733 3198304 3560959 3370401 3340133 3328246 3671757 3907573 3478848
1711C478848j30674j60288k56727k55429M08389l5039o23641L80922l88379k04442
$$ 3478848 3348174 3187886 2931159 2675730 3084119 3049080 2425439 2806361 2417982 2213540
1701B213540Q9215N017K38895M83762K54523m4797r1413o82524m35709K60299
$$ 2213540 2302755 2307772 2546667 3030429 3284952 3240155 3148742 2466218 2030509 2290808
1691B290808K41367l60706k77387O48R3457L5239j98702L95053k59499o50150
$$ 2290808 2532175 2171469 1894082 1894730 1988187 2023426 1824724 2219777 1960278 1310128
1681A310128r3939K04909m34460L75057N02375l5900M8877l39954j12045L89330
$$ 1310128 1216189 1421098 986638 1361695 1864070 1828170 1877047 1537093 1425048 1814378
1671A814378n29978J48761j24687J80900k68221M3777P19271o82605M8200j56550
$$ 1814378 1284400 1433161 1308474 1489374 1221153 1264930 1984201 1301596 1349796 1193246
1661A193246M82440P3250K49465n30329k85440J00876j95460K99531j90275j17407
$$ 1193246 1675686 1748936 1998401 1468072 1182632 1283508 1088048 1387579 1197304 1079897
1651A079897M76443p64190J72087K70485j45840j23149N4753J56770M53686l45053
$$ 1079897 1556340 792150 964237 1234722 1088882 965733 1020486 1177256 1630942 1285889
1641A285889l87036K08260m51797K38758N72989m22198j24059p3660k29458P8229
$$ 1285889 898853 1107113 655316 894074 1467063 1044865 920806 847146 617688 695917
1631F95917L40569K02653J34980l47655n67500m04419L80036Q53045j50856o75657
$$ 695917 1036486 1239139 1374119 1026464 458964 54545 434581 1287626 1136770 461113
1621D61113L84516M33124k47590m57067l16819p1137l9176N20567r90539K04580
$$ 461113 845629 1278753 1031163 574096 257277 186140 146964 667531 -323008 -118428
1611a18428L61697J06964k81862k75200K66689Q7311L4273J52126m09993j60134
$$ -118428 243269 350233 68371 -206829 59860 147171 181444 333570 -76423 -236557
1601b36557M67494K54087p3562j85096k08920J43862N43593j75552p58224m07072
$$ -236557 230937 485024 411462 226366 17446 161308 704901 529349 -228875 -635947
1591f35947K68020O01468K27016l75826j98434j72809K94065M06772L02126o30072
$$ -635947 -367927 233541 460557 84731 -113703 -286512 7553 414325 716451 86379
1581H6379l29680j29120K42425N42666K56411l53934L74534o36102J49315j45934
$$ 86379 -243301 -372421 -129996 412670 669081 315147 689681 53579 202894 56960
1571E6960l43382K08742K41538K75748l8996j20881J31175l8443o37106j7844
$$ 56960 -286422 -77680 163858 439606 400610 279729 410904 372461 -264645 -282489
1561b82489n7318J77877J28472L64931K19593n43320k6622K9177k28789l1464
$$ -282489 -339807 -161930 -33458 331473 551066 7746 -18876 10301 -218488 -249952
1551b49952K9697J68462K0936j52626l31184O52144j76396k9846K77630M85293
$$ -249952 -220255 -51793 -30857 -183483 -514667 137477 -38919 -68765 208865 694158
1541F94158k08964j38681Q1758J8330K30089M6033l97863m56083Q7583l29920
$$ 694158 485194 346513 428271 446601 676690 722723 324860 -131223 -43640 -373560
1531c73560J20357Q5813M62854K05809l78247m9894K54879M9083j60720K35311
$$ -373560 -253203 -167390 295464 501273 123026 73132 328011 377094 216374 451685
1521D51685j77249n27988k82900M92K03395m731K66181j25059L1073k45683K66797
$$ 451685 274436 -253552 -536452 -535960 -332565 -337296 -71115 -196174 -165101 -410784 -143987
1510a43987K51445n40930J99479q0111J87900l42555N05982o9464n49672K64188
$$ -143987 107458 -433472 -233993 -314104 -126204 -468759 37223 -32241 -581913 -317725
1500c17725P31750J26109l92606j00956l30353j66493M20504J17819J77900k76102
$$ -317725 414025 540134 147528 46572 -283781 -450274 -29770 88049 265949 -10153
1490a0153o3145m98601O39486J1858m72860j12648J67263L91020o3695p16736
$$ -10153 -73298 -571899 67587 79445 -393415 -506063 -338800 52220 -11475 -728211
1480g28211K03330l18799N09439J11254n5445j73907L0423M47727k06221K94237
$$ -728211 -524881 -843680 -334241 -222987 -278432 -452339 -421916 25811 -180410 113827
1470A13827l68326L11635j59108K58918J14177o4697o49818J76168K74758j85161
$$ 113827 -254499 57136 -101972 156946 271123 206426 -443392 -267224 7534 -177627
1460a77627k29234K84915j13584l35094K88887K6681L96370k5137k02397J82110
$$ -177627 -406861 -121946 -235530 -570624 -281737 -255056 141314 116177 -86220 95890
1450I5890P4331J1761k5917o64671J16054M30683l62868J38819K6651j70662m81130
$$ 95890 170221 181982 156065 -508606 -392552 38131 -324737 -185918 -159267 -329929 -811059
1439h11059N23005n1815o47744N47194L75811l88270o5291l65645O15252j89726
$$ -811059 -288054 -339869 -987613 -440419 -64608 -452878 -518169 -883814 -268562 -458288
1429d58288L12904Q575p39018j87221L22067l15140J93487L34454K91n4850J93390
$$ -458288 -145384 -136809 -875827 -1063048 -740981 -1056121 -862634 -528180 -527889 -582739 -389349
1418c89349J95308J21531J29854n41521n3915M14551K73726J76150o82423q5163
$$ -389349 -194041 -72510 57344 -484177 -538092 -123541 150185 326335 -356088 -441251
1408d41251L84306J71744o04104J64648Q55939l05107n55485m3721j44037L2205
$$ -441251 -56945 114799 -489305 -324657 531282 226175 -329310 -373031 -517068 -484863
1398d84863j47945J12226n676k853P39364m34536j2748j3722j77429K3558K13491
$$ -484863 -632808 -520582 -526258 -529111 210253 -224283 -237031 -250753 -428182 -404624 -191133
1387a91133P7368r62164l9329L44979K82773O59301j08544J43502j16830J88539
$$ -191133 -113765 -1075929 -1115258 -770279 -487506 171795 63251 206753 89923 278462
1377B78462o25232j24621m10107j38305K16709K94304J26859L92120k80562m06242
$$ 278462 -346770 -471391 -881498 -1019803 -803094 -508790 -381931 10189 -270373 -676615
1367f76615l69611j46822J69040K51288M58352n27953k48437O02314K31137l78568
$$ -676615 -1046226 -1193048 -1024008 -772720 -314368 -842321 -1090758 -488444 -257307 -635875
1357f35875K36570k07770m63231R8651K06634L04376j11735J66035m63655P4190
$$ -635875 -399305 -607075 -1070306 -971655 -765021 -460645 -572380 -406345 -870000 -795810
1347g95810K30184J89806L86761L2015r2853j79953l13262k68092M44168p4216
$$ -795810 -565626 -375820 10941 42956 -49897 -229850 -543112 -811204 -367036 -441252
1337d41252l37130l07607L19093L35152K60666L27940l79622l98724L06326L49102
$$ -441252 -778382 -1085989 -766896 -431744 -171078 156862 -222760 -621484 -315158 33944
1327C3944l15849k40734L00606J12090l22081l9908Q02215p79112j60416L64368
$$ 33944 -281905 -522639 -222033 -109943 -432024 -471932 330283 -448829 -609245 -244877
1317b44877K6050m26409Q457N50382L29632m87271n92978O59112k50882k4212
$$ -244877 -218827 -645236 -636779 -86397 243235 -244036 -837014 -177902 -428784 -452996
1307d52996M22436L11008p33588m27340k0573m50694M14000L49018O28524R8047
$$ -452996 -30560 280448 -453140 -880480 -901053 -1351747 -937747 -588729 39795 137842
1297A37842k71615n25062j70692M39665j37246N17290q5421q5196J03421j97395
$$ 137842 -133773 -658835 -829527 -389862 -527108 -9818 -95239 -180435 -77014 -274409
1287b74409L43982j57178n99532r2302J35332O23071L68275m78894k18063n42189
$$ -274409 69573 -87605 -687137 -779439 -644107 -21036 347239 -131655 -349718 -891907
1277h91907j83993O32213r6590J42719l6226k15120K30023J1599K76741l69320
$$ -891907 -1075900 -443687 -540277 -397558 -433784 -648904 -418881 -407282 -130541 -499861
1267d99861o05212N37434J40033J83282M19470K07097k45236n95268J73747K08409
$$ -499861 -1105073 -567639 -427606 -244324 175146 382243 137007 -458261 -284514 -76105
1257g6105j51346k96449j85977Q11547r9575q43765N46025k03870p652M50936
$$ -76105 -227451 -523900 -709877 101670 2095 -841670 -295645 -499515 -507167 -56231
1247e6231J32684m76343j74156L02442L46650M01026l26406L44376o61955k03340
$$ -56231 76453 -399890 -574046 -271604 75046 476072 149666 494042 -167913 -371253
1237c71253L94616m81853j49704L78405l13752M13420K30651j98761N4853J24806
$$ -371253 23363 -458490 -608194 -229789 -543541 -130121 100530 -98231 -43378 81428
1227H1428l30848K19770K35893L4969L1414R6658k51633n68919K11321l72504
$$ 81428 -249420 -29650 206243 241212 272626 369284 117651 -451268 -239947 -612451
1217f12451j28002Q7695J16608o32820O7888O61180M480j72863K85426j91779
$$ -612451 -740453 -652758 -536150 -1168970 -1101082 -439902 -435422 -608285 -322859 -514638
1207e14638J4794Q91331M64412q30787m24616N6133R7854J0721N981J20752l09506
$$ -514638 -499844 391487 855899 25112 -399504 -343371 -245517 -234796 -228815 -108063 -417569
1196d17569J18186j53600p66933L2822J32890M39634K49641j57734l05280l7580
$$ -417569 -299383 -452983 -1219916 -1187094 -1054204 -614570 -364929 -522663 -827943 -865523
1186h65523O63969M3344j28253O5600J40242M66599k64834k8736m70089l99074
$$ -865523 -201554 -158210 -286463 -220863 -80621 385978 121144 92408 -377681 -776755
1176g76755p8827p2594K14290L40088p6902k04211j77170K37512r0537M91908
$$ -776755 -855582 -928176 -713886 -373798 -450700 -654911 -832081 -594569 -685106 -193198
1166a93198P95906j8304j062771j66779N57143l18532q0664k34823K72076P97862
$$ -193198 602708 584404 -478367 -645146 -88003 -406535 -487199 -722022 -449946 347916
1156C47916M33085n71115p64929l88049R6630P28609N4047q64396l45967M42783
$$ 347916 781001 209886 -555043 -943092 -846462 -117853 -63806 -928202 -1274169 -831386
1146h31386K03323m94434J25509n9901L65912n062L65006L5878j05958r0721M9830
$$ -831386 -628063 -1122497 -996988 -1056889 -690977 -696039 -331033 -295155 -401113 -491834 -442004
1135d42004J36753J00175j80241l05459o3838P4372K55111J77066n03001l54212
$$ -442004 -305251 -205076 -385317 -690776 -754614 -680242 -425131 -248065 -751066 -1105278
1125a105278L71345M64282p9007k75671j49399L64029j30181m76897L93641K44929
$$ -1105278 -733933 -269651 -348658 -624329 -773728 -409699 -539880 -1016777 -623136 -378207
1115c78207j78197l96014Q28157L11503k17151J25204l07405k30099j95536J84315
$$ -378207 -556404 -952418 -124261 187242 -29909 95295 -212110 -442209 -637745 -453430
1105d53430O1540k64081J21644J62168P5675m9258m09524j2187K25228J27501
$$ -453430 -391890 -655971 -534327 -372159 -296484 -345742 -755266 -767453 -542225 -414724
1095d14724m16954m89614M29104M61181J81677q6489j53873m04077L82725J91753
$$ -414724 -831678 -1321292 -892188 -431007 -249330 -335819 -489692 -893769 -511044 -319291
1085c19291J83897M17574K1706m13240P5650J99153M25n50159M55428j50643j50707
$$ -319291 -135394 282180 303886 -109354 -33704 165449 165874 -384285 71143 -79500 -230207
1074b30207k22556N4695M0694J34420J9901K00530k48745p46815Q47270p87650
$$ -230207 -452763 -398068 -357374 -222954 -203053 -2523 -251268 -998083 -150813 -938463
1064i38463J23596P35335J15107m56049L93201l5256J63048L9344o27341l61945
$$ -938463 -814867 -79532 35575 -420474 -27273 -62529 100519 139863 -487478 -849423
1054h49423k8252j16559j35866L66530L43245L1217k5197o6737n91218L89335
$$ -849423 -877675 -994234 -1130100 -763570 -420325 -389108 -414305 -481042 -1072260 -682925
1044f82925K50519k55065J59051O4787J86610K12309O56699j8794m95911l75014
$$ -682925 -432406 -687471 -528420 -463633 -277023 -64714 591985 573191 77280 -297734
1034b97734P91460j09426p57638L25181K98467j3006J39615l94238k90445N10962
$$ -297734 493726 384300 -373338 -48157 250310 237304 376919 -17319 -307764 203198
1024B03198M7561j60785J10635K96385j89676n34889J88508J31047p77164j5533
$$ 203198 250759 89974 200609 496994 307318 -227571 -39063 91984 -685180 -700713
1014g00713N07710L75229L09836J08772j9241l88558K1616M98123K27104J76980
$$ -700713 -193003 182226 492062 600834 581593 193035 214651 712774 939878 1116858
1004A116858N3837j35417l68445K49060K69216j29932R4649j55578r85815L85509
$$ 1116858 1170695 1035278 666833 915893 1185109 1055177 1149826 994248 8433 393942
994C93942J87425J59978P2469K80668J19580l18451k14823l26980J37129K49114
$$ 393942 581367 741345 813814 1094482 1214062 895611 680788 353808 490937 740051
984G40051J7352M5208N00685j85757M50754o4608O6225J56889n06680l17495L84182
$$ 740051 757403 802611 1303296 1117539 1568293 1503685 1569910 1726799 1220119 902624 1286806
973A286806K86061O84760N82726k26860k50084L6885L87150J03473q9763L59554
$$ 1286806 1572867 2257627 2840353 2613493 2363409 2400294 2787444 2890917 2801154 3160708
963C160708L61881P35608P12670P51853O04997L5373O40511L70104J68560K78189
$$ 3160708 3522589 4258197 4970867 5722720 6327717 6363090 7003601 7373705 7542265 7820454
953G820454J129394P51967J185024J016249J182392J833685K185170L194865M087056
$$ 7820454 8949848 9701815 10886839 11903088 13085480 14919165 17104335 20299200 24386256
944B4386256L931879L870079L549290J587749j354213k772166l348492m021668
$$ 24386256 28318135 32188214 35737504 37325253 35971040 33198874 29850382 25828714
936B5828714l855871l390095k614526j618357j880516j638119p65867m58504o62034
$$ 25828714 21972843 18582748 15968222 14349865 12469349 10831230 10065363 9606859 8944825
927H944825m09993l93915r19267j081489j442661Q57334m78547p56223j31757
$$ 8944825 8534832 8140917 7221650 6140161 4697500 5554834 5076287 4320064 4188307
918D188307j27905P3617N4832l38895o20383k30694l57490k82345j36685j16785
$$ 4188307 4060402 4134019 4188851 3849956 3229573 2998879 2641389 2359044 2222359 2105574
908B105574q8555J20432J45901l55667M1752L53022m80566r7102p7041J36413
$$ 2105574 2017019 2137451 2283352 1927685 1969437 2322459 1841893 1744791 1667750 1804163
898A804163K09438l64547o55298L03574J18572J78715K60646o75454l59412L7342
$$ 1804163 2013601 1649054 993756 1297330 1415902 1594617 1855263 1179809 820397 857739
888H57739L20886J52004l41200J81175o23297r4184J56013k20486m65932K55136
$$ 857739 1178625 1330629 989429 1170604 547307 453123 609136 388650 -77282 177854
878A77854P9185M43673J09401K6847K08582J02133J51655j08087m04687L12514
$$ 177854 257039 700712 810113 836960 1045542 1147675 1299330 1191243 786556 1099070
868A099070m69082J504l81004q11355P44153m16645j700M28468J55849k03311
$$ 1099070 629988 631492 250488 -560867 183286 -233359 -235059 193409 349258 145947
858A45947J61217K02653n42005J58090K93524m48707M8620J42345M20078p39837
$$ 145947 307164 509817 -32188 125902 419426 -29281 19339 161684 581762 -158075
848a58075n2941N53386j57579m25455p432O83556j25838Q9223k35323j81858M10257
$$ -158075 -211016 342370 184791 -240664 -248096 435460 309622 398845 163522 -18336 391921
837C91921n73145k72252K23744k04109k57276K54488J37433k12682N73485K78632
$$ 391921 -181224 -453476 -229732 -433841 -691117 -436629 -299196 -511878 61607 340239
827C40239j2666N2050k12281l9451l98535L91528l96544N51372J4478J5769l11432
$$ 340239 327573 379623 167342 127891 -270644 120884 -275660 275712 290190 305959 -5473
816e473O3579j66897j13396J07445K43133J02720j53011o22587M78156J48251
$$ -5473 58106 -108791 -222187 -114742 128391 231111 78100 -544487 -66331 81920
806H1920j22898K50401o9116l66487K44183K7764j84738j18128J41940l1154P9128
$$ 81920 -40978 209423 140307 -226180 18003 45767 -138971 -257099 -115159 -146313 -67185
795f7185M83619j119205P41664R2641j91218l80308L40409K44324j59724j18630
$$ -67185 416434 -702771 38893 131534 -59684 -439992 -99583 144741 -14983 -133613
785a33613j7693J55300j78442n4429k21952l58105K53788L18895j7158m8659j31139
$$ -133613 -151306 3994 -174448 -228877 -450829 -808934 -555146 -236251 -253409 -302068 -433207
774d33207M20537L97848n57105m26451N95291R3622l53311J00681l36591K81486
$$ -433207 -12670 385178 -171927 -598378 -3087 90535 -262776 -162095 -498686 -217200
764b17200N8787j97030M99737p54657o87079J25128l48521L28473M85088q9233
$$ -217200 -158413 -355443 144294 -610363 -1297442 -1172314 -1520835 -1192362 -707274 -796507
754g96507k74632M71038N71088L05781k05637Q6882K8081l81405j48494L00844
$$ -796507 -1071139 -600101 -29013 276768 71131 158013 186094 -195311 -343805 -42961
744d2961L5670l7176k5883l87446l05120L18331l39606j80043r5891O08610N76522
$$ -42961 -7291 -44467 -70350 -457796 -762916 -444585 -784191 -964234 -1060125 -451515 125007
733A25007K29131m02812J27610K654m5210l0915j57027n8331J77588K66795K36315
$$ 125007 354138 -48674 78936 81590 36380 5465 -151562 -209893 -32305 234490 470805
722D70805o10460j84825j05399n07598J90585m883J61555L28788O2834n14451
$$ 470805 -139655 -324480 -429879 -937477 -746892 -751775 -590220 -261432 -198598 -713049
712g13049M6214R8505J60213q2558n15541J75784L33352J36676J71325r0153K14131
$$ -713049 -666835 -568330 -408117 -490675 -1006216 -830432 -497080 -360404 -189079 -279232 -65101
701f5101j96985k8958K3423N31009K03361k83950k50983k08608j4341R8007M87009
$$ -65101 -262086 -291044 -267621 263388 466749 182799 -68184 -276792 -291133 -193126 293883
690B93883K46914n74830j4965j93902o2675K83831k04371J38131R2981k06132
$$ 293883 540797 -34033 -48998 -242900 -305575 -21744 -226115 -87984 4997 -201135
680b01135j40696j26651L70406l08475L78278k97041m55251j83703o3700N59873
$$ -201135 -341831 -468482 -98076 -406551 -28273 -325314 -780565 -964268 -1027968 -468095
670d68095j57895k97365K61178N86149l45125M26605m4634J28830M50888m36181
$$ -468095 -625990 -923355 -662177 -76028 -421153 5452 -39182 89648 540536 104355
660A04355k6536K37512j96382N1575r802o0603l06602k10219J91853j12739J33233
$$ 104355 77819 315331 118949 170524 160722 100119 -206483 -416702 -224849 -337588 -204355
649b04355q6055m46560l86111J126947N76772l22082m86757j29036m12928M30519
$$ -204355 -290410 -736970 -1123081 3866 580638 258556 -228201 -357237 -770165 -339646
639c39646j03302J61055J07758O6726k20863J8891M9549k03148j4251o0666J23719
$$ -339646 -442948 -281893 -174135 -107409 -328272 -309381 -259832 -462980 -477231 -537897 -414178
628d14178L05961j27264J92320J54299o74392k15993J41504M78937q47566k38447
$$ -414178 -108217 -235481 -43161 111138 -563254 -779247 -637743 -158806 -1006372 -1244819
618a244819N02055k80114K11265J36408J28512m97140j19395R53028p4440L14767
$$ -1244819 -742764 -1022878 -811613 -675205 -546693 -1043833 -1163228 -210200 -284640 30127
608C0127k9724p6399K93553m71563J15107J48508m54125N21932l53729o95690
$$ 30127 403 -75996 217557 -254006 -138899 9609 -444516 77416 -276313 -972003
598i72003p3807N27190L04417n08484r2621P03450l3616n34404M77816o52699
$$ -972003 -1045810 -518620 -214203 -722687 -815308 -111858 -145474 -679878 -202062 -854761
588h54761R7596L84194j18708O33319L12456j95346l92868P7556o4017J30947
$$ -854761 -757165 -372971 -491679 141640 454096 258750 -134118 -56562 -120579 10368
578A0368j56209L06874m55807n62257O74597k06518q11443N42520j78415M14800
$$ 10368 -145841 161033 -294774 -857031 -182434 -388952 -1200395 -657875 -836290 -421490
568d21490k12943K24015m81967M8968P87399n01278m35060M35678M52N25765O86130
$$ -421490 -634433 -410418 -892385 -843417 -56018 -557296 -992356 -556678 -556226 -30461 655669
557F55669m00889l2699K9141l12558k58545L1887Q3049J95904K74138k66423q15779
$$ 655669 254780 222081 251222 -61336 -319881 -287994 -204945 -9041 265097 -1326 -817105
546h17105R92365j27422n38858k78536M84679M74019m28361m86767L85350K80686
$$ -817105 175260 47838 -491020 -769556 -284877 189142 -239219 -725986 -340636 -59950
536e9950P6447k9932k81967L58566j17307l37760p4306q4674O7938J71694J2165
$$ -59950 16497 -13435 -295402 63164 -54143 -391903 -466209 -550883 -482945 -311251 -299086
525b99086Q9747J48892m05825J56737L02284j04347j03553l46415j84221K41042
$$ -299086 -209339 -60447 -466272 -309535 -7251 -111598 -215151 -561566 -745787 -504745
515e04745M33182o41338P7954O74642N69564r3914j30193O5224j77481l5053m82330
$$ -504745 -71563 -712901 -634947 39695 609259 515345 385152 450376 272895 237842 -244488
504b44488K82030k72171O3359r9070J5622o5742K05414P1980k9550J29334j83706
$$ -244488 37542 -234629 -171270 -270340 -254718 -320460 -115046 -43066 -72616 56718 -126988
493a26988M0620p0373M74665l33012J26973M1088n2663M21423j52847j13852M52360
$$ -126988 -86368 -156741 317924 -15088 111885 152973 100310 521733 368886 255034 707394
482G07394l60337M92234j56913o14165o90255K5378O6434J89414J07591Q0057
$$ 707394 347057 839291 682378 68213 -622042 -596664 -530230 -340816 -233225 -153168
472a53168k27821k30508J31710K60945P73864k56967j92042k44946J66904n40860
$$ -153168 -380989 -611497 -479787 -218842 555022 298055 106013 -138933 27971 -512889
462e12889j62884K7393M85285J29852P43181l23075J63657k76071o51871k46136
$$ -512889 -675773 -648380 -163095 -33243 709938 386863 550520 274449 -377422 -623558
452f23558j02718M37511p7175R4719l12896L20908m56467J92717M23524N06486
$$ -623558 -726276 -288765 -365940 -271221 -584117 -263209 -719676 -526959 -103435 403051
442D03051J94253n58294R9985p90742l76517Q1590K21301q6808Q816p707R41764
$$ 403051 597304 39010 138995 -651747 -1028264 -946674 -725373 -812181 -803365 -811072 130692
431A30692J23389j71903l3551k60868K7588j5981J85876L8084L88434J02958m76691
$$ 130692 254081 82178 48627 -212241 -184653 -200634 -14758 23326 411760 514718 38027
420C8027j22427j92330J96729j02999p66581M35716L30066M38765m62417m79633
$$ 38027 -84400 -276730 -80001 -183000 -949581 -513865 -183799 254966 -207451 -687084
410f87084P0665K74057M00440L20470R7845n32315P8884K2704l08770n68723L74609
$$ -687084 -616419 -342362 58078 378548 476393 -55922 22962 45666 -263104 -831827 -457218
399d57218j16540k6674p6342l33018O15146o1914R7424k53062K19018N05753k52378
$$ -457218 -573758 -600432 -676774 -1009792 -394646 -456560 -359136 -612198 -393180 112573 -139805
388a39805l46103k81574N8959O52171N77503j12617m10662k32570k39948R38746
$$ -139805 -485908 -767482 -708523 -56352 521151 408534 -2128 -234698 -474646 464100
378D64100j44958q59835p99794j21714K88564M12449J20571L14441M72334k65295
$$ 464100 319142 -540693 -1340487 -1462201 -1173637 -761188 -640617 -326176 146158 -119137
368a19137p48431K50517R8752K09168j80169K03025J01536M93334j76155J08386
$$ -119137 -867568 -617051 -518299 -309131 -489300 -286275 -184739 308595 132440 240826
358B40826o14410j30434J49338l57295K88406j22155J81220l2576K44221j75831
$$ 240826 -373584 -504018 -354680 -711975 -423569 -545724 -364504 -397080 -152859 -328690
348c28690J3789j10528o7820j23257J08752m77422R0410m6303M37772l4678K57591
$$ -328690 -314901 -425429 -493249 -616506 -507754 -985176 -894766 -941069 -503297 -537975 -280384
337b80384O17247J79035k78732k9315m44462K93141r393k52671O1000j56623j36040
$$ -280384 336863 515898 237166 207851 -236611 56530 47137 -205534 -144534 -301157 -437197
326d37197K08451M43947k60003l4430p2737M1221P6544k75180j46757J33160P35947
$$ -437197 -228746 215201 -44802 -79232 -151969 -110748 -34204 -309384 -456141 -322981 412966
315D12966L00975m69866K10480J30306l94110J0991m778n89424L90134J71913
$$ 412966 713941 244075 454555 584861 190751 201742 196964 -392460 -2326 169587
305A69587j33347j27250j47930k05526j41774M45489Q0596K793J47729l49842
$$ 169587 36240 -91010 -238940 -444466 -586240 -140751 -60155 -57362 90367 -259475
295b59475J19011l28831K324L31756n87346L03063k03870N6661K95612L15406
$$ -259475 -140464 -469295 -466971 -135215 -722561 -419498 -623368 -566707 -271095 44311
285D4311P6059k23790q96283J78174J089057K54235q88502j47354N1999R50L50308
$$ 44311 120370 -103420 -999703 -821529 267528 521763 -366739 -514093 -462094 -461144 -110836
274a10836j8288p1205r0634Q0413L98154l83662q14174k69933N30108J43130Q1480
$$ -110836 -129124 -200329 -290963 -210550 187604 -196058 -1010232 -1280165 -750057 -606927 -525447
263e25447J25009l57780Q93476p04793P1923n6603l92588J43408L38284k65752
$$ -525447 -400438 -758218 135258 -569535 -497612 -554215 -946803 -803395 -465111 -730863
253g30863M83153Q1840j55630n6475k11616O25758l39282l36266k28632j45798
$$ -730863 -247710 -165870 -321500 -377975 -589591 36167 -303115 -639381 -868013 -1013811
243a013811O37992L48449j1781J59722K74327n64961k63251j86342N63699K81438
$$ -1013811 -375819 -27370 -39151 120571 394898 -170063 -433314 -619656 -55957 225481
233B25481n98592O11132l69349l40364M01813k17749Q707k05733k44954L2072
$$ 225481 -373111 238021 -131328 -471692 -69879 -287628 -278921 -484654 -729608 -697536
223f97536M19906L39385q9681J74824l01372j66654l3942K71888o02906m95892
$$ -697536 -277630 61755 -27926 146898 -154474 -321128 -355070 -83182 -686088 -1181980
213a181980O59411J11832M03349L20798k07313K92507L6764m72768m12327J38659
$$ -1181980 -522569 -410737 -7388 313410 106097 398604 435368 -37400 -449727 -311068
203c11068l88678k79909J45826J77170R1419k2056K38707N94938m45569l89875
$$ -311068 -699746 -979655 -833829 -656659 -565240 -587296 -348589 246349 -199220 -589095
193e89095N8893J53304r1284m71627J71052L41458m33787L70438O74465l84037
$$ -589095 -530202 -376898 -468182 -939809 -768757 -427299 -861086 -490648 183817 -200220
$$ [...]
##END NTUPLES=NMR SPECTRUM
##END=
