##TITLE=1H_TG-2326-2 
 CDCl3, 8 sc, 
 8.04.2021
##JCAMPDX= 6.0         $$ Bruker NMR JCAMP-DX V2.0
##DATA TYPE= NMR SPECTRUM
##DATA CLASS= NTUPLES
##ORIGIN= UXNMR, Bruker Analytische Messtechnik GmbH
##OWNER= root
$$ XWIN-NMR		Version 3.5
$$ Thu Apr  8 11:39:25 2021 Russian Standard Time (UT+4h)  she@DPX200
##.OBSERVE FREQUENCY= 200.131506
##.OBSERVE NUCLEUS= ^1H
##.ACQUISITION MODE= SIMULTANEOUS
##.ACQUISITION SCHEME= undefined
##.AVERAGES= 8
##.DIGITISER RES= 18
##SPECTROMETER/DATA SYSTEM= spect
##.PULSE SEQUENCE= zg30
##.SOLVENT NAME= DMSO
##.SHIFT REFERENCE= (INTERNAL, DMSO, 0, 15.9761)
##AUDIT TRAIL= $$ (NUMBER, WHEN, WHO, WHERE, WHAT)
$$ ##TITLE= Audit trail, XWIN-NMR		Version 3.5
$$ ##JCAMPDX= 5.01
$$ ##ORIGIN= Bruker BioSpin GmbH
$$ ##OWNER= she
$$ F:/spectra/data/she/nmr/H-F/1/pdata/1/auditp.txt
$$ ##AUDIT TRAIL=  $$ (NUMBER, WHEN, WHO, WHERE, WHAT)
(   1,<2021-04-08 11:38:14.29 +0400>,<she>,<DPX200>,
      <created by zg, POWCHK disabled, PULCHK disabled
       configuration hash MD5:
       00 E9 B6 7A A2 85 ED C7 34 08 36 98 17 FE 4E 26
       data hash MD5: 16K
       F6 8D 45 A4 67 86 CA 6A E0 FD 55 F2 D7 D1 C6 14>)
(   2,<2021-04-08 11:38:16.73 +0400>,<she>,<DPX200>,
      <Start of raw data processing
       efp BC_mod = 2 LB = 0.24 FT_mod = 6 PKNL = 1 PHC0 = -11123.13 PHC1 = 15.00092 SI = 16K 
       data hash MD5: 16K
       4F 56 4A 2E 1F 94 F5 9F D9 5D 55 E9 00 C9 EC 7D>)
(   3,<2021-04-08 11:38:32.75 +0400>,<she>,<DPX200>,
      <pk PHC0 = -5.230968 PHC1 = 6.4 
       data hash MD5: 16K
       22 AD 75 33 04 F6 29 DF 0E 75 EC 22 3B 4C 70 F4>)
(   4,<2021-04-08 11:38:35.64 +0400>,<she>,<DPX200>,
      <abs ABSG = 5 
       data hash MD5: 16K
       8C 1C 73 EA 4B 39 A7 D7 05 C5 F7 33 94 3A 2F 89>)
$$ ##END=
$$ 
$$ hash MD5
$$ 80 01 A0 2B A3 CD B2 74 17 BA 30 88 14 BB B5 0F
##$RELAX= 
##$RELAX= 
##$RELAX= 
##$RELAX= 
##$RELAX= 
##$RELAX= 
$$ Bruker specific parameters
$$ --------------------------
##$DU= <F:/spectra>
##$EXPNO= 1
##$NAME= <H-F>
##$PROCNO= 1
##$TYPE= <nmr>
##$USER= <she>
##$AMP= (0..31)
100 100 100 100 100 100 100 100 100 100 100 100 100 100 100 100 100 100 
100 100 100 100 100 100 100 100 100 100 100 100 100 100 
##$AQSEQ= 0
##$AQ_mod= 1
##$AUNM= <au_zg>
##$AUTOPOS= <>
##$BF1= 200.13
##$BF2= 200.13
##$BF3= 200.13
##$BF4= 200.13
##$BF5= 200.13
##$BF6= 200.13
##$BF7= 200.13
##$BF8= 200.13
##$BYTORDA= 1
##$CFDGTYP= 0
##$CFRGTYP= 5
##$CHEMSTR= <none>
##$CNST= (0..31)
1 1 145 1 1 1 1 1 1 1 1 1 1 1 1 1 1 1 1 1 1 1 1 1 1 1 1 1 1 1 1 1 
##$CPDPRG= <>
##$CPDPRG1= <>
##$CPDPRG2= <>
##$CPDPRG3= <>
##$CPDPRG4= <mlev>
##$CPDPRG5= <mlev>
##$CPDPRG6= <mlev>
##$CPDPRG7= <mlev>
##$CPDPRG8= <mlev>
##$CPDPRGB= <>
##$CPDPRGT= <>
##$D= (0..31)
0 1.2 0 0 0 0 0 0 0 0.06 0 0.03 0 0 0 0 0.0002 0 0 0 0 0 0 0 0 0 0 0 0 
0 0 0 
##$DATE= 1617867493
##$DBL= (0..7)
120 120 120 120 120 120 120 120 
##$DBP= (0..7)
150 150 150 150 150 150 150 150 
##$DBP07= 0
##$DBPNAM0= <>
##$DBPNAM1= <>
##$DBPNAM2= <>
##$DBPNAM3= <>
##$DBPNAM4= <>
$$ [...]
##$SUBNAM3= <"">
##$SUBNAM4= <"">
##$SUBNAM5= <"">
##$SUBNAM6= <"">
##$SUBNAM7= <"">
##$SUBNAM8= <"">
##$SUBNAM9= <"">
##$SW= 16.9725357007746
##$SWIBOX= (0..15)
0 0 2 0 0 0 0 0 0 0 0 0 0 0 0 0 
##$SW_h= 3396.73913043478
##$TD= 16384
##$TD0= 1
##$TE= 0
##$TE2= 300
##$TE3= 300
##$TEG= 300
##$TL= (0..7)
0 120 120 120 120 120 120 120 
##$TP= (0..7)
150 150 150 150 150 150 150 150 
##$TP07= 0
##$TPNAME0= <>
##$TPNAME1= <>
##$TPNAME2= <>
##$TPNAME3= <>
##$TPNAME4= <>
##$TPNAME5= <>
##$TPNAME6= <>
##$TPNAME7= <>
##$TPOAL= (0..7)
0.5 0.5 0.5 0.5 0.5 0.5 0.5 0.5 
##$TPOFFS= (0..7)
0 0 0 0 0 0 0 0 
##$TUNHIN= 0
##$TUNHOUT= 0
##$TUNXOUT= 0
##$USERA1= <user>
##$USERA2= <user>
##$USERA3= <user>
##$USERA4= <user>
##$USERA5= <user>
##$V9= 5
##$VALIST= <valist>
##$VCLIST= <CCCCCCCCCCCCCCC>
##$VD= 0
##$VDLIST= <DDDDDDDDDDDDDDD>
##$VPLIST= <PPPPPPPPPPPPPPP>
##$VTLIST= <TTTTTTTTTTTTTTT>
##$WBST= 1024
##$WBSW= 4
##$XGAIN= (0..3)
0 0 0 0 
##$XL= 0
##$YL= 0
##$YMAX_a= 163265
##$YMIN_a= -175878
##$ZGOPTNS= <>
##$ZL1= 120
##$ZL2= 120
##$ZL3= 120
##$ZL4= 120
##$ABSF1= 15.99268
##$ABSF2= -0.9799843
##$ABSG= 5
##$ABSL= 3
##$ALPHA= 0
##$AQORDER= 0
##$ASSFAC= 0
##$ASSFACI= 0
##$ASSFACX= 0
##$ASSWID= 0
##$AUNMP= <proc_1d>
##$AZFE= 0.1
##$AZFW= 0.1
##$BCFW= 0
##$BC_mod= 2
##$BYTORDP= 0
##$COROFFS= 0
##$CY= -3
##$DATMOD= 1
##$DC= 0
##$DFILT= <>
##$DTYPP= 0
##$F1P= 0
##$F2P= 0
##$FCOR= 1
##$FTSIZE= 16384
##$FT_mod= 6
##$GAMMA= 0
##$GB= 0
##$INTBC= 1
##$INTSCL= 2.992141e-10
##$ISEN= 128
##$LB= 0.24
##$LEV0= 0
##$LPBIN= 0
##$MAXI= 10000
##$MC2= 0
##$MEAN= 0
##$ME_mod= 0
##$MI= 1.114404
##$NCOEF= 0
##$NC_proc= -8
##$NLEV= 6
##$NOISF1= 3.799351
##$NOISF2= 2.8
##$NSP= 0
##$NTH_PI= 0
##$NZP= 0
##$OFFSET= 15.9761
##$PC= 1
##$PHC0= -11128.36
##$PHC1= 21.40092
##$PH_mod= 1
##$PKNL= yes
##$PPARMOD= 0
##$PSCAL= 0
##$PSIGN= 0
##$REVERSE= no
##$SF= 200.130007072893
##$SI= 16384
##$SIGF1= 3
##$SIGF2= 2
##$SINO= 5.538805
##$SIOLD= 16384
##$SREGLST= <1H.CDCl3>
##$SSB= 0
##$STSI= 16384
##$STSR= 0
##$SW_p= 3396.73913043479
##$SYMM= 0
##$S_DEV= 0
##$TDeff= 16384
##$TDoff= 0
##$TI= <>
##$TILT= no
##$TM1= 0
##$TM2= 0
##$TOPLEV= 0
##$USERP1= <user>
##$USERP2= <user>
##$USERP3= <user>
##$USERP4= <user>
##$USERP5= <user>
##$WDW= 1
##$XDIM= 16384
##$YMAX_p= 309442214
##$YMIN_p= -1213939
$$ End of Bruker specific parameters
$$ ---------------------------------
##NTUPLES= NMR SPECTRUM
##VAR_NAME=  FREQUENCY,     SPECTRUM/REAL,   SPECTRUM/IMAG
##SYMBOL=    X,             R,               I
##VAR_TYPE=  INDEPENDENT,   DEPENDENT,       DEPENDENT
##VAR_FORM=  AFFN,          ASDF,            ASDF
##VAR_DIM=   16384,         16384,           16384
##UNITS=     HZ,            ARBITRARY UNITS, ARBITRARY UNITS
##FACTOR=    0.207333158178282, 1,           1
##FIRST=     3197.29699958439, 0,            0
##LAST=      -199.442130850401, 0,           0
##MIN=       -199.442130850401, -1213939,    0
##MAX=       3197.29699958439, 309442214,    0
$$ Real data points
##PAGE= N=1
##DATA TABLE= (X++(R..R)), XYDATA
$$ [...]
5290D502068M038k77328m65553L54355K88472J83067K134j35787J17649k0522
5280D552593K09086m319J27307K96590L10215K90603n30571l66428k53375J01849
5270D733550L28483j31961M5028j7099K65233N8876l66641L04345L4076p5544
5260E178346M05143J44744j74708l45713K50046j37906j65482L48903K70863k48154
5250E526082K2880O854R0310K07076k29893j31729R4503j83841m7686N769j74222
5239E186103j97775J53021m2647L591n0612O8741q3067j79942K10718J3696k83847
5228D797980k38291K60709M8210k36152J41490j74628L3740J21748J14706L52116
5218E221628L14366n45859n61173M3284N1254J89084k8768m86544M43207o8154
$$ plain form
5290 4502068 4506106 4228778 3763225 4117580 4406052 4589119 4591253 4455466 4573115 4552593
5280 4552593 4761679 4757360 4884667 5181257 5491472 5782075 5251504 4885076 4631701 4733550
5270 4733550 5062033 4930072 4975100 4958001 5223234 5282110 4915469 5219814 5253890 5178346
5260 5178346 5583489 5728233 5553525 5207812 5457858 5319952 5154470 5503373 5774236 5526082
5250 5526082 5548962 5555816 5646126 5853202 5623309 5491580 5586083 5402242 5354556 5360325 5186103
5239 5186103 4988328 5141349 5098702 5102293 5051681 5120422 5037355 4857413 5068131 5081827 4797980
5228 4797980 4559689 4820398 4868608 4632456 4773946 4599318 4633058 4754806 4869512 5221628
5218 5221628 5535994 4990135 4428962 4472246 4523500 4712584 4683816 4197272 4640479 4572325
5208D572325k76387R6223L94602J35811n76562j73804J29109K8232K4592R7309
5198D451450k1705m65702J60088J0699j73679k0779j82038Q2950k63758r4634
5188C482892M0122N49118K67833l48522l4558J48298K71765K6706m62664k35961
5178C705029K5909k56714k23350L81203L8544j6741K21177l89270m070m6068n0538
5167C385111J42131m2270J62933L28875k93764j95049j20620L66608M02408j7461
5157D118902j62448k48968K73956k02528m6607O3771J51743Q4604j29551q5690
5147C817184m06041K08278J53339k99671J83487L35834q4021K07965k72143k18635
5137C625576O3832n769K2107N13431r7360p0015K60310O5905K30070n4413N6500
$$ plain form
5208 4572325 4295938 4392161 4786763 4922574 4346012 4172208 4301317 4329549 4354141 4451450
5198 4451450 4429745 3964043 4124131 4134830 3961151 3940372 3758334 3841284 3577526 3482892
5188 3482892 3523014 4072132 4339965 3991443 3956885 4105183 4376948 4403654 3940990 3705029
5178 3705029 3730938 3474224 3250874 3632077 3670621 3653880 3875057 3485787 3481717 3435649 3385111
5167 3385111 3527242 3484972 3647905 3976780 3683016 3487967 3367347 3733955 4136363 4118902
5157 4118902 3956454 3707486 3981442 3778914 3732307 3796078 3947821 4032425 3902874 3817184
5147 3817184 3411143 3619421 3772760 3473089 3656576 3992410 3908389 4116354 3844211 3625576
5137 3625576 3689408 3683639 3705746 4219177 4121817 4051802 4312112 4378017 4608087 4553674 4610174
5126D610174n58019L7391K52031J40301k20757K01986j61900K4184J03707o2822
5116D366276l17790J13969L66358k12067k19012J83595o2619n19669J10800j7492
5106C792349n6688K7890k43654K0669K55477L9460J24444r793k14945O07538L80056
5095D722803j84756j08538R2357m72769K09651J95432l12351J022j67953l56754
5085C618144O41406R3188l61668m5979J29685K78479j73594l0126N4022p9893
5075D123664J41655J19057j02686q5299p336K30277N1874o9178k70259m3307K30816
5064D319278L56455m5063r360k33366Q2359J88545j49569L15340L10619j23482
5054E011756m87430P7072j27225p0001o544J49762k309k14070J58616q7368J85212
$$ plain form
5126 4610174 4052155 4089546 4341577 4481878 4261121 4463107 4301207 4325391 4429098 4366276
5116 4366276 4048486 4162455 4528813 4316746 4097734 4281329 4218710 3699041 3809841 3792349
5106 3792349 3735661 3763551 3519897 3540566 3796043 3835503 3959947 3950154 3735209 4342747 4722803
5095 4722803 4538047 4429509 4521866 4049097 4258748 4454180 4141829 4142851 3974898 3618144
5085 3618144 4259550 4352738 3991070 3945091 4074776 4353255 4179661 4149535 4203557 4123664
5075 4123664 4265319 4384376 4281690 4196391 4189055 4419332 4471206 4402028 4131769 4088462 4319278
5064 4319278 4675733 4630670 4621310 4387944 4470303 4658848 4509279 4824619 5135238 5011756
5054 5011756 4524326 4601398 4474173 4404172 4397628 4547390 4545081 4331011 4489627 4402259 4587471
5043D587471J95455j8798k55978K16187K5150j71248P7782N41630K63334k55229
5033E205756j07165K73163K40133j34121K53457j26894k28911l00483n8694L11647
5023E327888j06154K7424J52487M9160p3914K55337j18642p3359J85340N1834
5013E677401m6536P5573k19140M4502K68636k23642k83236J03745M78381L62734
5003F238418k42355J34129o4178j08108j37355M7691J66391J53556l22251k41743
4993E624195J17406m56070N03321M9140M76630M09733m3030j14418k42811j04452
4983F219644K01626L27601k12038K5002l60797J28701K29687J75103J14016J1841
4973F860386o5641Q581J10665L6116J20080k29002J9909J61701k16721N5610J95514
$$ plain form
5043 4587471 4782926 4764128 4508150 4724337 4749487 4578239 4656021 5197651 5460985 5205756
5033 5205756 5098591 5371754 5611887 5477766 5731223 5604329 5375418 5074935 5016241 5327888
5023 5327888 5221734 5249158 5401645 5450805 5376891 5632228 5513586 5440227 5625567 5677401
5013 5677401 5630865 5706438 5487298 5531800 5800436 5576794 5293558 5397303 5875684 6238418
5003 6238418 5996063 6130192 6066014 5957906 5820551 5868242 6034633 6188189 5865938 5624195
4993 5624195 5741601 5285531 5788852 5837992 6314622 6724355 6681325 6566907 6324096 6219644
4983 6219644 6421270 6748871 6536833 6561835 6201038 6329739 6559426 6734529 6848545 6860386
4973 6860386 6794745 6803326 6913991 6950107 7070187 6841185 6861094 7022795 6806074 6861684 7057198
4962G057198Q4962q4728K20196K85956j32895n1735j86931L02191R8772l7133
4952G555853K67653K5659K95011n35274K13908L88615j43643J56422K53141k91475
4942H185870L25150J03466j49876K96623L5960l92817o7873K63624J7954K43633
4932H861714J01732l1847k20957l9389N07528K51658j01862R027K07724Q6083
4922I631411p5597K55115N26416P6412j29220J20358J61070j60635l08731M56457
4912A0553056K24577j27374j41146Q3097j53321J90902J56223N6416n45854K88022
4902A0584598N6816K14095J23993Q8582j35508M82188K56066k32871M2454k14514
4892A1265899J63034K19306O7352l3220m09353J78654P85273o068k4330P0842
$$ plain form
4962 7057198 7142160 7057432 7277628 7563584 7430689 7378954 7192023 7494214 7592986 7555853
4952 7555853 7823506 7849165 8144176 7608902 7822810 8211425 8067782 8224204 8477345 8185870
4942 8185870 8511020 8614486 8464610 8761233 8797193 8404376 8336503 8600127 8618081 8861714
4932 8861714 8963446 8931599 8710642 8671253 9178781 9430439 9328577 9337604 9545328 9631411
4922 9631411 9555814 9810929 10337345 10413757 10284537 10404895 10565965 10405330 10096599 10553056
4912 10553056 10777633 10650259 10509113 10592210 10438889 10629791 10786014 10842430 10296576 10584598
4902 10584598 10641414 10855509 10979502 11068084 10932576 11414764 11670830 11437959 11480413 11265899
4892 11265899 11428933 11648239 11715591 11682371 11273018 11451672 12236945 12230877 12206547 12277389
4882A2277389j35528j45957M26j3595j28032L86574K04880K16384J1770k92820
4872A2381491N72281L86111j26290N5789L9029j50633j69608M41028M57607K31168
4862A4117973J20062k07927o2741K73136J6674J37483J25048J35321k27480P300
4852A4434849K96358J98908M94512M72873k7117r5579L23543K56259J91240n3531
4842A6492315K06362K77923J28795l22606M24458r022L9736Q3733k15884l34174
4832A6771636M6346N8890n14684o2850o0963j57598n64822l10554m06361J21204
4822A4920244P8329l39911m4382j04676k90513m19352K30684M1558j7039J83638
4812A4238580j40717p7956p9383n71746o8841L57029K379k86499k69116k70163
$$ plain form
4882 12277389 12141861 11995904 11996330 11982735 11854703 12241277 12446157 12662541 12674311 12381491
4872 12381491 12953772 13339883 13213593 13269382 13308411 13157778 12988170 13429198 13886805 14117973
4862 14117973 14238035 14030108 13967367 14240503 14257177 14394660 14519708 14655029 14427549 14434849
4852 14434849 14731207 14930115 15424627 15897500 15870383 15774804 16098347 16354606 16545846 16492315
4842 16492315 16698677 16976600 17105395 16782789 17207247 17198225 17237961 17321694 17105810 16771636
4832 16771636 16817982 16876872 16362188 16299338 16238375 16080777 15515955 15205401 14799040 14920244
4822 14920244 14998573 14658662 14614280 14509604 14219091 13799739 14030423 14071981 14054942 14238580
4812 14238580 14097863 14019907 13940524 13368778 13299937 13656966 13659345 13372846 13103730 12833567
4802A2833567J19829L15080J47118l40864q0664j53771p1050n6252J23584k34398
4792A2602179j6033J8176R7929j19187K09331n26252k28971k22533J80803N55541
4782A2550983r5279o40j33494k65465M85121N3086j50857k8199O3000M803k28667
4771A2254392j02165J58879J75737J58354J30115k03034J98240l26340L38232
4762A2782410J74708j82357L118j92851o6218L0703L4058j56511o9463Q8323M7884
4751A2493804J81247J20064n404p00048L13559J12953j7237J95558M7933l18092
4741A2424337N43799K51836N8672m9617m84733m6521M49900J93553r1174J46592
4731A3396644o9525j13314K89410k92645j36140P7383K24304J0107j47321K90686
$$ plain form
4802 12833567 12953396 13268476 13415594 13074730 12994066 12840295 12769245 12712993 12836577 12602179
4792 12602179 12586146 12604322 12702251 12583064 12792395 12266143 12037172 11814639 11995442 12550983
4782 12550983 12455704 12455064 12321570 12056105 12541226 12594312 12443455 12415256 12478256 12483059 12254392
4771 12254392 12152227 12311106 12486843 12645197 12775312 12572278 12770518 12444178 12782410
4762 12782410 12957118 12774761 12777879 12585028 12518810 12549513 12583571 12427060 12357597 12445920 12493804
4751 12493804 12675051 12795115 12789711 12089663 12403222 12516175 12498938 12694496 12742429 12424337
4741 12424337 12968136 13219972 13278644 13229027 12744294 12697773 13147673 13341226 13250052 13396644
4731 13396644 13327119 13213805 13503215 13210570 13074430 13151813 13376117 13386224 13238903 13529589
4721A3529589M33293J64205o20100k06633m6914j738K11491J32381K54362P9389
4711A3929325k25364k21987j25606L39429k77746K44208L84181n8223j16808o5718
4701A3805691J60061L78364k79895l8721p3889K25988J81217j45502P7182j08760
4691A4181736L48187k07101K35701j94067L19817R0793l25144J90288K47654l01448
4681A4586416K41783L9047j77921M7789l11705J01724N25012j02869j59274P8346
4671A4868348L19202r526J99129J70386l69295L19040K95046J36730Q8110k21123
4661A5796047N8884M61376J01412J9729n5442k12083J02975q7453j7285J14441
4651A6282601M26113J16776k3772J29775l78457N2018l72785J68990L53977L16522
$$ plain form
4721 13529589 13962882 14127087 13506987 13300354 13253440 13251702 13463193 13595574 13849936 13929325
4711 13929325 13703961 13481974 13356368 13695797 13418051 13662259 14046440 13988217 13871409 13805691
4701 13805691 13965752 14344116 14064221 14025500 13951611 14177599 14358816 14213314 14290496 14181736
4691 14181736 14529923 14322822 14558523 14364456 14684273 14775066 14449922 14640210 14887864 14586416
4681 14586416 14828199 14867246 14689325 14737114 14425409 14527133 15052145 14949276 14790002 14868348
4671 14868348 15187550 15178024 15377153 15547539 15178244 15497284 15792330 15929060 16017170 15796047
4661 15796047 15854931 16316307 16417719 16437448 16382006 16169923 16272898 16185445 16168160 16282601
4651 16282601 16708714 16825490 16801718 16931493 16553036 16605054 16232269 16401259 16755236 17071758
4641A7071758K82607q6606q6253j9414N1029J61873L40353N86882k02457m0p9058
4630A8020674K85736j4735J32347M29957M76255j40227P6178K18475r7427R6910
4620A9484143J33412L73078L21770K02768o1321K04084M29745L40866j17681L411
4610B1314275L12716N12116J72942L87733O1354K67773J22030J33646J63600j86102
4600B3262083P14233K65644m0519M62202j56709j26869M02052k32132J99184j11799
4590B4637370j08714K72720k51438l16018J65034l4563m80934l14358K59883J5473
4580B3844455J17094l07708l93361Q0702K1081n9991k67455L4664L6515n50221
4570B2555775O0970n2192n51331k79926m8173j43368K09660m08821j90986l1009
$$ plain form
4641 17071758 17354365 17267759 17181506 17162092 17213121 17374994 17715347 18302229 18099772 18099732 18020674
4630 18020674 18306410 18291675 18424022 18853979 19330234 19190007 19266185 19484660 19387233 19484143
4620 19484143 19617555 19990633 20312403 20515171 20453850 20657934 21087679 21428545 21310864 21314275
4610 21314275 21626991 22139107 22312049 22699782 22761136 23028909 23150939 23284585 23448185 23262083
4600 23262083 23976316 24241960 24201441 24663643 24506934 24380065 24782117 24549985 24749169 24637370
4590 24637370 24528656 24801376 24549938 24233920 24398954 24364391 23883457 23569099 23828982 23844455
4580 23844455 23961549 23653841 23260480 23341182 23362263 23302272 23034817 23069481 23105996 22555775
4570 22555775 22616745 22564553 22013222 21733296 21685123 21541755 21751415 21342594 21151608 21120599
4560B1120599k98122K47700j3729K4680k0414j77249m10073n7850j28638j55309
4550B0131595L9792J52162l36178o283j16176L03226j66683J40877l18624n01796
4540A9321912K22649m8953K71635K1359j67115k7133l20924Q4848k12347p1404
4530A9074527j9583k41842k48661o1254L6683K17850Q8830m73354J74514M05591
4520A8953301n107K97403k29346k42611L51952L89457j27560M215Q2319J03488
4510A9577511J70934j40256m42966p8624j10329L04670j44184k83265J95545J14871
4500A9163907J92581l02732n90424K56646K67731J758Q2300J77720N9668j67573
4490A9141582n7835l46421L74267K15513K80395K15121k41641N2262L67017M51710
$$ plain form
4560 21120599 20822477 21070177 21056448 21081128 21060714 20883465 20473392 20415542 20286904 20131595
4550 20131595 20171387 20323549 19987371 19981088 19864912 20168138 20001455 20142332 19823708 19321912
4540 19321912 19544561 19495608 19767243 19788602 19621487 19594354 19273430 19358278 19145931 19074527
4530 19074527 19054944 18813102 18564441 18503187 18539870 18757720 18846550 18373196 18547710 18953301
4520 18953301 18948194 19245597 19016251 18773640 19125592 19515049 19387489 19391704 19474023 19577511
4510 19577511 19748445 19608189 19165223 19086599 18976270 19280940 19136756 18853491 19049036 19163907
4500 19163907 19356488 19053756 18463332 18719978 18987709 18989467 19071767 19249487 19309155 19141582
4490 19141582 19083747 18737326 19111593 19327106 19607501 19822622 19580981 19633243 20000260 20451970
4480B0451970m4005J80005N63500K717K91191L61530P18541K52898J15810K35721
4470B3129878O38797P09277L90680M19490M06566P50360J033634J164828Q56850
4461B9500360Q08520J415319J180210J155044J198173J713775J863939J600088
4453D0435428J546034J874011J492309J117084J155178M83617L936R4538p21531
4444D7480604j267437j611003j267601j271840k456665j898959j777174k171419
4436C3758506j597401j374078j449140j115999j129132r64304p59573j226105
4428B4142774m00816k58959l76133n36118l01216p05277n20374J78418j0117k17461
4418B0994721k16363m5747Q51654k48775m1603M76184j5285K34595O05558N86171
$$ plain form
4480 20451970 20407965 20587970 21151470 21154187 21445378 21806908 22525449 22778347 22894157 23129878
4470 23129878 23768675 24477952 24868632 25288122 25694688 26445048 27478682 28643510 29500360
4461 29500360 30308880 31724199 32904409 34059453 35257626 36971401 38835340 40435428
4453 40435428 41981462 43855473 45347782 46464866 47620044 48103661 48107597 48202135 47480604
4444 47480604 46213167 44602164 43334563 42062723 39606058 37707099 35929925 33758506
4436 33758506 32161105 30787027 29337887 28221888 27092756 26128452 25368879 24142774
4428 24142774 23741958 23482999 23106866 22570748 22269532 21564255 21043881 21222299 21212182 20994721
4418 20994721 20778358 20732611 21584265 21335490 21293887 21770071 21754786 21989381 22594939 23181110
4408B3181110M48664L32729L22220M78954Q28575K70650N04443J07219l12438
4399B6162126j24391l80461l21807q96118k90507n58115q05687n13081j24998
4390B2146961m91003l83527j28891p5422j96640N38275m3097k22889k47412O35217
4380B1531572M47093K99987K09372k2899j01287j46922j62806j46225m47787m05661
4370B1054437k74686o77713o61550l66007p38697m13673m45425q9495J01061l74439
4360A7113813k51911k48186l99410p8177k67466Q8305J42172P06687j46004j17667
4350A6542156j23971j6706O9442j1941k50282Q4723k0621l51206L49249K00149
4340A6470992J16289J21501j27143j36570p6318K47132J84818o1712r3455j28257
$$ plain form
4408 23181110 23629774 23962503 24284723 24763677 25592252 25862902 26367345 26474564 26162126
4399 26162126 26037735 25657274 25335467 24439349 24148842 23590727 22785040 22271959 22146961
4390 22146961 21655958 21272431 21143540 21068118 20871478 21409753 21366656 21143767 20896355 21531572
4380 21531572 21978665 22278652 22488024 22465125 22363838 22216916 22054110 21907885 21460098 21054437
4370 21054437 20779751 20102038 19440488 19074481 18335784 17922111 17476686 17387191 17488252 17113813
4360 17113813 16861902 16613716 16214306 16136129 15868663 15956968 16099140 16805827 16659823 16542156
4350 16542156 16418185 16401479 16470921 16458980 16208698 16293421 16272800 15921594 16270843 16470992
4340 16470992 16587281 16708782 16581639 16445069 16368751 16615883 16800701 16738989 16645534 16517277
4330A6517277P90027K83197r0063m17111m143j57974P1251j66368J0053L65947
4320A7202093L12855J93826J2673k62322j11477l90626l25339K49784M62986l51499
4310A6992954n2843k39292J93080k18828n19522j46699K13993l1430k08358J8778
4300A6001833l07257j13110k47557k39888K16794p2243K65181j71411K94168k77515
4290A5348995m41544N8317n41582m56942j3095K271l22620L62306j9163m22303
4280A3554640o3198l75956O971p5699j87258Q8878K6753j50107l50986m65078
4270A2008960Q855l22252j80496l239K3709j04327j04547L7750k62120J98390
4260A1300683j96174k90816j66163n88r9501m57667Q340J37804J46469j7071k02219
$$ plain form
4330 16517277 17307304 17590501 17500438 17083327 17079184 16921210 16992461 16826093 16836146 17202093
4320 17202093 17514948 17708774 17721447 17459125 17347648 16957022 16631683 16881467 17344453 16992954
4310 16992954 16940111 16700819 16893899 16675071 16155549 16008850 16222843 16191413 15983055 16001833
4300 16001833 15694576 15581466 15333909 15094021 15310815 15238572 15503753 15332342 15626510 15348995
4290 15348995 14907451 14965768 14424186 13967244 13954149 13956420 13633800 13996106 13976943 13554640
4280 13554640 13491442 13115486 13122457 13046758 12859500 12948378 12975131 12825024 12474038 12008960
4270 12008960 12017815 11695563 11515067 11511828 11535537 11431210 11326663 11364413 11102293 11300683
4260 11300683 11104509 10813693 10647530 10646942 10547441 10089774 10098114 10235918 10382387 10365316 10163097
4249A0163097J31455l0394k22688O086r5583j25373N6432J91681R8154k52481
4239I920386J24771l96861L1182o891j16299J59408r3306j39353k62523n2490
4229I168024L05250j84232L24359l61830K21999l74276N255K35061j21943L02495
4219I520162R6302j93946N7732j47572j54086Q0115O5879l1014n9416R1825J73618
4208I499599k95115N2112J03698l21817j17945L23276R6158l00945l14013J87618
4198H912626K35644m24935j40619N6354J71925J41131p3572K11637M17481O2351
4188I570023l76134k27242j37486n7597L72969j1997l95225M2836R3975K00668
4178I074790K93786k3156r2220k55217N0716j867K82124n15834j98322K49951
$$ plain form
4249 10163097 10294552 10264158 10041470 10047556 9951973 9826600 9883032 10074713 10172867 9920386
4239 9920386 10045157 9648296 9679478 9672587 9556288 9715696 9622390 9483037 9220514 9168024
4229 9168024 9473274 9289042 9613401 9251571 9473570 9099294 9104549 9339610 9217667 9520162
4219 9520162 9616464 9422518 9480250 9332678 9178592 9258707 9324586 9293572 9234156 9325981 9499599
4208 9499599 9204484 9256596 9360294 9038477 8920532 9243808 9339966 9039021 8725008 8912626
4198 8912626 9148270 8723335 8582716 8639070 8810995 8952126 8878554 9090191 9507672 9570023
4188 9570023 9193889 8966647 8829161 8771564 9144533 9132536 8737311 8780147 8874122 9074790
4178 9074790 9368576 9345420 9253200 8997983 9048699 9046832 9328956 8813122 8614800 8864751
4168H864751K10931m88587Q7123k02712N70466L50887q7885k22175j5440m28421
4158H638938J3767L0242K24672O9783j75392J15781J31276N06449l22528l4856
4148I198132l2421k91769L3679K00700J95918m77548r6966j37834L39922M20125
4138I351938P1278R1635l64759K67285j81487q6212N7459J65568M7518K45575
4128I665798m3330K7097K17895m7058j77564K75761K8805j42582P0863K42228
4118A0117913k87671K26142o9891j77530J55660L51548l07122R4815J93690m9923
4108A0247631L6831R6199J22972J17710l63162l23979K1570R1649J07073J10864
4098A0265358K76213K16852J40289n59728J03305J88752m03870j02554K49499
$$ plain form
4168 8864751 9075682 8587095 8674218 8471506 9041972 9392859 9304974 9082799 9067359 8638938
4158 8638938 8652705 8682947 8907619 8977402 8802010 8917791 9049067 9555516 9232988 9198132
4148 9198132 9165711 8873942 8907621 9108321 9304239 8826691 8729725 8591891 8931813 9351938
4138 9351938 9423216 9514851 9150092 9417377 9235890 9149678 9207137 9372705 9420223 9665798
4128 9665798 9622468 9649565 9867460 9820402 9642838 9918599 9947404 9804822 9875685 10117913
4118 10117913 9830242 10056384 9986493 9808963 9964623 10316171 10009049 10103864 10297554 10247631
4108 10247631 10284462 10380661 10503633 10621343 10258181 9934202 9955772 10047421 10154494 10265358
4098 10265358 10541571 10758423 10898712 10338984 10442289 10631041 10227171 10124617 10374116
4089A0374116J34801j41391k65795K76758K56836j33399K91755l49053M2388M03534
4079A0890550q7517K14316j16395J69546O59625l93493o9526q9706K501L32384
4069A1512285R0476K31285K03487k4884J99678k49281k36281N84183N0999O0757
4059A2422704K978M78974n3778R4480J66157K54832K13983J54223J26401P5238
4049A3936192k58525K731M7664L74207J08331J06664p9386N24772K57401P0078
4039A5090129m1284L74231L73381k04847l95253K90370J52485J62578L15200L9240
4029A6156230j82303J59660j7785k12524J26570L06879o7073M8189M34860k35214
4019A6517489l9595p7449P6024j12230m88151K51405K4088J16291M02328P3565
$$ plain form
4089 10374116 10508917 10367526 10101731 10378489 10635325 10501926 10793681 10444628 10487016 10890550
4079 10890550 10803033 11017349 10900954 11070500 11730125 11336632 11267106 11177400 11179901 11512285
4069 11512285 11602761 11834046 12037533 12012649 12212327 11963046 11726765 12310948 12361947 12422704
4059 12422704 12425682 12904656 12850878 12945358 13111515 13366347 13580330 13734553 13860954 13936192
4049 13936192 13677667 13680398 13728062 14102269 14210600 14317264 14237878 14762650 15020051 15090129
4039 15090129 15048845 15423076 15796457 15591610 15196357 15486727 15639212 15801790 16116990 16156230
4029 16156230 15973927 16133587 16115802 15903278 16029848 16336727 16269654 16317843 16752703 16517489
4019 16517489 16477894 16400445 16476469 16364239 15876088 16127493 16151581 16267872 16670200 16743765
4009A6743765l1591l84886l65200O5029J40699k23037K19531k56102m31591j00641
3999A5375976P3652l70012K28485p7320M6416N6648J48816l54708m1843k84219
3989A4801891j14929j00286j16948M2705k03586j86069P976j47169j63975j70864
3979A3648746l62841j35693J94742L3004m1711l96491k67424o0453K7398N0222
3969A2689499l92647m21084J49071j75189L47044R7442j49853M0491J98201l07446
3959A2075529j77981m00060J30902O6031O2700j66235K69386J09411m04421j032
3949A1564230q7492P6214K87022j66611J45248k20198l44859J43440R833k53540
3939A1153287K25348K02570K0899k69526k22419N56491k89300L50457k42311j49672
$$ plain form
4009 16743765 16712174 16327288 15962088 16027117 16167816 15944779 16164310 15908208 15476617 15375976
3999 15375976 15449628 15079616 15308101 15230781 15277197 15333845 15482661 15127953 15086110 14801891
3989 14801891 14686962 14586676 14469728 14512433 14308847 14122778 14130754 13983585 13819610 13648746
3979 13648746 13285905 13150212 13344954 13377958 13336247 12939756 12672332 12611879 12639277 12689499
3969 12689499 12296852 11875768 12024839 11849650 12196694 12294136 12144283 12184774 12382975 12075529
3959 12075529 11897548 11497488 11628390 11694421 11757121 11590886 11860272 11969683 11565262 11564230
3949 11564230 11476738 11552952 11839974 11673363 11818611 11598413 11253554 11396994 11406827 11153287
3939 11153287 11378635 11581205 11602104 11332578 11110159 11666650 11377350 11727807 11485496 11335824
3929A1335824K50808m3698k22766N39670k20680k29301j80353L4699M48004J86489
3919A1898696k09037K88436K433r030k51854L72325O6681L08208j43009Q8781
3909A2412630n60356j76959J08750L01248M09804K23469j53018k70752j99984
3900A2094832L21543J22405K2653j91730J88320j93699O5749M40755J17583j34799
3890A2853612q5399J2822N3353k23241m07861N87678P2738O5330J5007n5440K73778
3879A3162377p3436L93326r6183k41277O0518K26546O06379K46464k32351n17063
3869A3535300K24574L20277J68206j82873L36380K73911J09070o4602J3907k87666
3859A4446484Q9360J54790K85917j1432M1391K51800k05277k52280K96820M93864
$$ plain form
3929 11335824 11586632 11542934 11320168 11859838 11639158 11409857 11229504 11264203 11712207 11898696
3919 11898696 11689659 11978095 11980528 11971498 11719644 12091969 12158650 12466858 12323849 12412630
3909 12412630 11852274 11675315 11784065 12085313 12495117 12718586 12565568 12294816 12094832
3900 12094832 12416375 12538780 12561433 12369703 12558023 12364324 12430073 12870828 12988411 12853612
3890 12853612 12768213 12781035 12834388 12611147 12203286 12790964 12863702 12929032 12944039 12888599 13162377
3879 13162377 13088941 13482267 13386084 13144807 13205325 13431871 14038250 14284714 14052363 13535300
3869 13535300 13759874 14080151 14248357 14065484 14401864 14675775 14784845 14720243 14734150 14446484
3859 14446484 14535844 14690634 14976551 14965119 15006510 15258310 15053033 14800753 15097573 15591437
3849A5591437L08651M4352J30803k19852Q5859J45197j5721k17497L83836K69142
3839A6506207P4517n4991J31776o4741j76335J40216N97555K11655J3140j1994
3829A7367005N13444j55988j77165J95380K29864j23285M0843Q270K37809J38989
3819A8275166J08408j70858N57545J71492m60770J65738K23927R3641o2779J16680
3809A9018190M03192r6925J66565k83521L75983O01681j40114j45744J59771K91021
3799B0350099n6633J8208K69542l29430M69570N23413l15530J92302L12753K31978
3789B1666272o1995N8034j1937M90220O21741J67237K07542K96637O6714R8838
3779B3599303J26653L61009N9908M56517K87679K86469N9218N17818J31940K6792
$$ plain form
3849 15591437 15900088 15944440 16075243 15855391 15941250 16086447 16070726 15853229 16237065 16506207
3839 16506207 16580724 16525733 16657509 16592768 16416433 16556649 17154204 17365859 17378999 17367005
3829 17367005 17880449 17724461 17547296 17742676 17972540 17849255 17890098 17898368 18136177 18275166
3819 18275166 18383574 18212716 18770261 18941753 18480983 18646721 18870648 18964289 18901510 19018190
3809 19018190 19421382 19324457 19491022 19207501 19583484 20185165 20045051 19899307 20059078 20350099
3799 20350099 20293466 20311674 20581216 20251786 20721356 21244769 20929239 21121541 21434294 21666272
3789 21666272 21604277 21662311 21650374 22140594 22762335 22929572 23137114 23433751 23500465 23599303
3779 23599303 23725956 24086965 24146873 24603390 24891069 25177538 25236756 25754574 25886514 25913306
3769B5913306J34260O72690K07597J23494K53236L39476j74789N40499K49788
3760B8259557O13957J28682O38735K77774J54902L92234L45453L25157O71332
3751C1807783L43989K32810O23971O61863P07928O97111J56643N45443M45517
3742C6223058M38870P11023J45730M74983O92073J5511N06531K67294K16083M43546
3732D0134702M05418L90966N02510R4393N90862P19566O90091O28174M07145O87319
3722D5251146R53965P35394L76600O14212J15511M85373P44626L69353K53151
3713D9899331M60560M71786J182363Q26855O64484K15660M37678O68730P95124
3704E5622571M87902N69312L72219R29579P42716N14446M96222M60549L85544
$$ plain form
3769 25913306 26047566 26720256 26927853 27051347 27304583 27644059 27469270 28009769 28259557
3760 28259557 28873514 29002196 29640931 29918705 30073607 30465841 30811294 31136451 31807783
3751 31807783 32151772 32384582 33008553 33670416 34378344 35075455 35232098 35777541 36223058
3742 36223058 36661928 37372951 37518681 37993664 38685737 38701248 39207779 39475073 39691156 40134702
3732 40134702 40540120 40931086 41433596 41527989 42118851 42838417 43528508 44156682 44563827 45251146
3722 45251146 46205111 46940505 47317105 47931317 48046828 48532201 49276827 49646180 49899331
3713 49899331 50359891 50831677 52014040 52840895 53505379 53721039 54158717 54827447 55622571
3704 55622571 56110473 56679785 57052004 57981583 58724299 59238745 59734967 60195516 60581060
3695F0581060L63966K11377L82330m0943j6728M9601J21095L5988Q8880k22145
3685F1554481r26903m88772K17310n67551l81456k36768j75586p15945n21585
3676E7757225l27641m42411n96172m51064p22205p70326r62596l99730n56099
3667E2528981p28835q97246p45163o78477m75748p45772r01662n50393m29112
3658D6376573m26095n89256p83749n63960l56560m32428n79926l31186n3759l22508
3648D1937146j2972k25904j85346J08865k71725l05969l11126m70521p4098l20554
3638C9867796q7124j25870k82736m9149k87699m26596k36273j99526J59471m66573
3628C7865721l00979J82140m07560p8701j02510j53549k65388k38001k21353N6403
$$ plain form
3695 60581060 60945026 61156403 61538733 61497790 61481062 61530663 61651758 61687746 61776626 61554481
3685 61554481 60627578 60138806 60356116 59788565 59407109 59170341 58994755 58278810 57757225
3676 57757225 57429584 56987173 56391001 55939937 55217732 54447406 53484810 53085080 52528981
3667 52528981 51800146 50902900 50157737 49479260 49003512 48257740 47356078 46805685 46376573
3658 46376573 45950478 45361222 44577473 44013513 43656953 43224525 42644599 42313413 42259654 41937146
3648 41937146 41924174 41698270 41512924 41621789 41350064 41044095 40732969 40262448 40188350 39867796
3638 39867796 39780672 39654802 39372066 39322917 39035218 38608622 38372349 38172823 38332294 37865721
3628 37865721 37564742 37746882 37339322 37260621 37158111 37004562 36739174 36501173 36279820 36336223
3618C6336223k14022m6064K51468j01434M02041J3818j76631o54272k15513M26318
3608C6021932o6396j82289L65549n28335k14151r0931K90780l97260K05331R5304
3598C5499534o53p8197k46725j87772K0448K9631K05380L22755k73652J39805
3588C5430554k59841m8371R3804J17517l61607l80969L11787J86188J99456J38116
3578C5426634q4621l3100J86704j53973j77400M6846K80560j44973o4413m2495
3568C5239769j59643R9711N1767j27614J11646k94538L8207K22688K56427O8635
3558C5507055J59759K60532J28437K08827N50642J35908K80361K52132K98567
3549C7782220M82403M76192L35001L633N38128K65236M34240M08033m4587j8604
$$ plain form
3618 36336223 36122201 36076137 36327605 36226171 36628212 36642030 36465399 35811127 35595614 36021932
3608 36021932 35955536 35773247 36138796 35610461 35396310 35305379 35596159 35198899 35404230 35499534
3598 35499534 35498881 35420684 35173959 34986187 35006635 35036266 35241646 35564401 35290749 35430554
3588 35430554 35170713 35122342 35216146 35333663 34972056 34591087 34902874 35089062 35288518 35426634
3578 35426634 35342013 35308913 35495617 35341644 35164244 35211090 35491650 35346677 35282264 35239769
3568 35239769 35080126 35179837 35231604 35103990 35215636 34921098 34959305 35181993 35438420 35507055
3558 35507055 35666814 35927346 36055783 36264610 36815252 36951160 37231521 37483653 37782220
3549 37782220 38264623 38740815 39075816 39079449 39617577 39882813 40317053 40725086 40680499 40661895
3539D0661895j90001M2775J14785k29468n58107m15129k72128l18659j30880q0093
3529C8624990k46707l81379j49645R4604L9997K30783J25893m4358P9667R8969
3519C8472814M4256k89179j8610n3438K75095N48831J50996J53724M95768J66089
3509C9946346M88660m6952j78236Q8913k40279L1419J10254p28758o48109m62449
3499C8360809m78172p60157n0515l9454j84843k57371L33K989K39734l6546k19108
3488C6577699j37325K54687j53132L19467M19197K60786l9761j64163O7464j65410
3478C7239509J5987J1139l74896L07293J16374Q9543n02431k67659R2078J53650
3468C6880587M54414o8174J04459L56616R840M13307P41718L16594j49876L68035
$$ plain form
3539 40661895 40471894 40514669 40629454 40399986 39841879 39426750 39154622 38835963 38705083 38624990
3529 38624990 38378283 37996904 37847259 37941863 37981860 38212643 38338536 38294178 38373845 38472814
3519 38472814 38517070 38227891 38209281 38155843 38430938 38979769 39130765 39284489 39780257 39946346
3509 39946346 40435006 40388054 40209818 40298731 40058452 40089871 40200125 39471367 38823258 38360809
3499 38360809 37882637 37122480 37071965 37032511 36847668 36590297 36590630 36593619 36833353 36796807 36577699
3488 36577699 36440374 36695061 36541929 36861396 37280593 37541379 37501618 37337455 37404919 37239509
3478 37239509 37255496 37266635 36891739 37199032 37315406 37404949 36902518 36634859 36726937 36880587
3468 36880587 37335001 37266827 37371286 37727902 37737742 38151049 38892767 39209361 39059485 39427520
3458C9427520J21575K71265P68374N17954R07086J63527M60823Q23250N91875
3449D4053249P35530J219410N75421N64144Q99648Q46632P57559K67588P72740
3440E0691921J179908J118618J376676J607534J374908J726187K583377K348429
3432F4007558K323304K789792L326297L506722L745166L917310L688109L770863
3424I1075121L239392K038177K27260k325644m014013n060450n943651n678054
3416G3558138n144315m519913l448229k936018k452597k128134j516661j270821
3408E0141450j075941j015251q70041o19632n73543p43691k49073r56177m36389
3399D3601712m60316j9265m28391o96639j63243M3862m47610j31648l4388k31454
$$ plain form
3458 39427520 39549095 39820360 40588734 41106688 42013774 42177301 42638124 43461374 44053249
3449 44053249 44788779 46008189 46583610 47147754 48047402 48894034 49651593 49919181 50691921
3440 50691921 51871829 52990447 54367123 55974657 57349565 59075752 61659129 64007558
3432 64007558 66330862 69120654 72446951 75953673 79698839 83616149 87304258 91075121
3424 91075121 94314513 96352690 96579950 94254306 90240293 85179843 79236192 73558138
3416 73558138 68413823 63893910 60445681 57509663 55057066 52928932 51412271 50141450
3408 50141450 49065509 48050258 47180217 46560585 45987042 45243351 44994278 44038101 43601712
3399 43601712 43141396 43122131 42693740 41997101 41833858 41877720 41430110 41298462 41264074 41032620
3389D1032620p18604n5477r3230O8971j38964k33261j90567q8287k21728m29491
3379C8931982n16026j01576n3565p4954j47289l52841k74520k883r9231k21915
3369C7087182j09011M62688J39754m0082l19416l21960l8100l94364O0983r1201
3359C6436473L95927L27315R2434k14698k09571l16142l03724m03542k10416M43641
3349C6037697L26547k03266j90027l97077j17373K66422L09583m68857k41406
3340C5322243L54006M7092k41924k04445j95777M0757m51932J76950N7304O3769
3330C4968043L9490j30725r4582q1447R488K74887K26882P5261P045j86352l35946
3319C4772044N87164o0203K0046k60655k29896K79297j65855l00353q6495j90468
$$ plain form
3389 41032620 40314016 40258539 40165309 40234280 40095316 39862055 39671488 39583201 39361473 38931982
3379 38931982 38415956 38314380 38260815 38185861 38038572 37685731 37411211 37408328 37309097 37087182
3369 37087182 36978171 37440859 37580613 37540531 37221115 36899155 36861055 36466691 36527674 36436473
3359 36436473 36832400 37159715 37252149 37037451 36827880 36511738 36208014 35804472 35594056 36037697
3349 36037697 36364244 36160978 35970951 35573874 35456501 35722923 36032506 35563649 35322243
3340 35322243 35676249 35723341 35481417 35276972 35081195 35121952 34670020 34846970 34904274 34968043
3330 34968043 35007533 34876808 34782226 34700779 34710267 34985154 35212036 35287297 35294342 35107990 34772044
3319 34772044 35359208 35299005 35319051 35058396 34828500 35107797 34941942 34641589 34555094 34364626
3309C4364626o946J72270p3873k29549M93300j26796j20034k89681L5217R4849
3299C4313383R8607j92760m6770j96239K78256O20268l94342l66198L54292n6685
3289C4411812J35875K5876k32476M04343q0231N28825j6503n3366k59070l72825
3279C4492260O718L44539J67372k82420j74437L00203j91010J44181l7540k14114
3269C4555752j71j17053j40491n6758L61193R8089R1180O6452L4455l88775m0593
3258C4463280L42056o2189K29323o7205N1424J76650M0498N73582J89963L25632
3248C6263014K47072L27869j97591n01252l1834l36963k87849L5254O9192j95825
3238C5391087o8742P1665k55265j32758P20661k13237L06144J75253K51739j475
$$ plain form
3309 34364626 34357680 34529950 34456077 34226528 34719828 34593032 34472998 34183317 34218534 34313383
3299 34313383 34411990 34219230 34172460 33976221 34254477 34874745 34480403 34114205 34468497 34411812
3289 34411812 34547687 34573563 34341087 34745430 34665199 35194024 35177521 35124155 34865085 34492260
3279 34492260 34498978 34843517 35010889 34728469 34554032 34854235 34663225 34807406 34769866 34555752
3269 34555752 34555581 34438528 34298037 34241279 34602472 34700561 34791741 34858193 34892648 34503873 34463280
3258 34463280 34805336 34743147 34972470 34905265 34956689 35133339 35173837 35747419 35937382 36263014
3248 36263014 36510086 36837955 36640364 36139112 36107278 35770315 35482466 35517720 35586912 35391087
3238 35391087 35322345 35394010 35138745 35005987 35726648 35513411 35819555 35994808 36246547 36245072
3228C6245072j50741n8670N68308N30572N80557k00319L98818L26447j40664O32628
3218C8732008L51094k24814M03256L25933J31997K30966N01661L18727J01299
3209D0872127k1214O3607n4578k01294l48664m04229k36995J81252M35811j84536
3199D0101287K16284j5241j32449j86662J30605O8443M59320m8874Q3293O86805
3189D1362811J98287j03642l41800k71643k30487o14657o96419J87843m08388
3180C9081905o41917j22581l78095j68795j09717k02916j13798J12444M5556j54280
3170C7347806p9235Q8095N44754O07024M35452O35429K84915L19731M15120M64652
3160D1063743L39828J41868o35599n87287k56391m04724l85051o19138q13425
$$ plain form
3228 36245072 36094331 36035661 36603969 37134541 37715098 37514779 37913597 38240044 38099380 38732008
3218 38732008 39083102 38858288 39261544 39587477 39719474 39950440 40452101 40770828 40872127
3209 40872127 40850913 40914520 40859942 40658648 40309984 39905755 39668760 39850012 40285823 40101287
3199 40101287 40317571 40302330 40169881 39983219 40113824 40182267 40641587 40592713 40676006 41362811
3189 41362811 41561098 41457456 41115656 40844013 40613526 39998869 39302450 39490293 39081905
3180 39081905 38439988 38317407 37939312 37770517 37660800 37457884 37344086 37456530 37502086 37347806
3170 37347806 37268571 37356666 37901420 38508444 38943896 39579325 39864240 40183971 40599091 41063743
3160 41063743 41403571 41545439 40909840 40322553 40066162 39661438 39276387 38657249 37843824
3151C7843824n72833m41148J04006j83059l76477k91764p47104l08475L30184
3142C5357154j02731j70292O35k28396j23832K84895j43111o83312m4196m03673
3132C3743141k95000l67365l71737K0668K41530L40195j02799J98381j31330K86441
3122C3562125K01625j92708K41162k91865l78764M43269L82398P5819l09056L18275
3112C4052280J13682K89840L53847N0349L92868K51994p3687K28615L34228J91694
3102C6185710L01450J34621K0720L60555M19411M78396J9380K17826J27866J75952
3092C8441887j15642L37458r0698P654o4883N8792J67996n5296m29145m0029Q67169
3081C9085263J59846K06202M15444K38473K86578L68997Q43809N56195P00531
$$ plain form
3151 37843824 37270991 36829843 36933849 36750790 36374313 36082549 35335445 35026970 35357154
3142 35357154 35254423 35084131 35084766 34856370 34732538 35017433 34874322 34191010 34146814 33743141
3132 33743141 33448141 33080776 32709039 32729707 32971237 33311432 33208633 33407014 33275684 33562125
3122 33562125 33763750 33571042 33812204 33520339 33141575 33584844 33967242 34043061 33734005 34052280
3112 34052280 34165962 34455802 34809649 34859998 35252866 35504860 35431173 35659788 35994016 36185710
3102 36185710 36487160 36621781 36642501 37003056 37422467 37900863 37920243 38138069 38265935 38441887
3092 38441887 38326245 38663703 38573005 38580659 38515776 38574568 38742564 38687268 38258123 38218094 39085263
3081 39085263 39245109 39451311 39866755 40105228 40391806 40760803 41604612 42160807 42861338
3072D2861338O62585O94731R50476L34500M18947M59657M46234K25730k39305
3063D6814893n5457L11762L01680j04445L17178M15904R72907J377385O52643
3054E1004450J165204P77803M58442j063867j603536j801843j783582j458345
3046D5694726j146532j022802l31054k19935N49306k14360L59161J1144O94366
3037D4374020L66980J95392Q82264J086746J164749J336980Q58658J136687L64473
3028E1766949L09875J51854q9825N7515j1861k77177l63338n86500p72035m25383
3018D9760074n62920l38529N7672J75777M44019N9626K95353N75955Q07155N38437
3008E1812619P90390P81767O20717R25593P44013J200126J182896J021523J446513
$$ plain form
3072 42861338 43523923 44218654 45169130 45503630 45922577 46382234 46828468 47054198 46814893
3063 46814893 46759436 47071198 47372878 47268433 47585611 48001515 48974422 50351807 51004450
3054 51004450 52169654 52947457 53405899 52342032 50738496 48936653 47153071 45694726
3046 45694726 44548194 43525392 43194338 42974403 43523709 43309349 43668510 43679654 44374020
3037 44374020 44741000 44936392 45818656 46905402 48070151 49407131 50265789 51402476 51766949
3028 51766949 52076824 52228678 52138853 52196368 52184507 51907330 51543992 50957492 50185457 49760074
3018 49760074 49197154 48858625 48916297 49092074 49536093 49595719 49891072 50467027 51274182 51812619
3008 51812619 52603009 53384776 54005493 54931086 55675099 56875225 58058121 59079644 60526157
2999F0526157R33528J011857J739848J423867J176122J494764J938072J981747
2991G2225962J817156J370405J656507J468428J947843J614693J922711J881699
2983H5905404J960424K027892J885404J589893J843626J337544K246270J854549
2975A00651006J437058J383106J730734J539285J421906J040149J872549J508297
2967A12584090J407745R65710J241699O30248P57637Q22737P34250M68349M73969
2958A20086434M62422L57075k22517k39383r8385n04321j83523m64868j113227
2949A18079707r54721r35961j102896j412091r29832p02341j259697j863430j865355
2940A07053383j895903j295680j582746j626185j886086j904200j389219k005170
$$ plain form
2999 60526157 61459685 62471542 64211390 65635257 66811379 68306143 70244215 72225962
2991 72225962 74043118 75413523 77070030 78538458 80486301 82100994 84023705 85905404
2983 85905404 87865828 89893720 91779124 93369017 95212643 96550187 98796457 100651006
2975 100651006 102088064 103471170 105201904 106741189 108163095 109203244 111075793 112584090
2967 112584090 113991835 114957545 116199244 116829492 117587129 118409866 119144116 119612465 120086434
2958 120086434 120548856 120905931 120683414 120444031 120345646 119841325 119657802 119192934 118079707
2949 118079707 117124986 116189025 115086129 113674038 112744206 112041865 110782168 108918738 107053383
2940 107053383 105157480 103861800 102279054 100652869 98766783 96862583 95473364 93468194
2932I3468194k187667j923310j665513j969332k044194k079424j878365k093487
2924G7626902j643054j655994j772826j875725j599567j620005j672922j634678
2916F4152131j467324j161130j265655j741602p95902j502093j391196j033522
2908E3793707j438226j415762n82005j115049r77430j239942o73874q88220j091770
2899D4371429j093732o11797j015156n76026n43069n87109p55197q71392o41978
2890C7675973l78958k23701l04866n04980m92680r20716o41111p63381o48424
2881C2797156L2654j55688n46376p07197k82261j83369k58909m07428J15191o9203
2871C0334570n05195m90910m15214K3828J4312n62828o8339l26817l49650k75919
$$ plain form
2932 93468194 91280527 89357217 87691704 85722372 83678178 81598754 79720389 77626902
2924 77626902 75983848 74327854 72555028 70679303 69079736 67459731 65786809 64152131
2916 64152131 62684807 61523677 60258022 58516420 57720518 56218425 54827229 53793707
2908 53793707 52355481 50939719 50357714 49242665 48265235 47025293 46351419 45463199 44371429
2899 44371429 43277697 42665900 41650744 41074718 40531649 39944540 39189343 38317951 37675973
2890 37675973 37297015 37073314 36768448 36263468 35770788 34850072 34208961 33445580 32797156
2881 32797156 32829810 32674122 32127746 31420549 31138288 30954919 30696010 30288582 30403773 30334570
2871 30334570 29829375 29338465 28923251 28947079 28961391 28398563 28330224 28003407 27653757 27377838
2861B7377838l62669J51025k64422m3556m9946r1758K53283k1814j69604p04574
2851B6073803m24710j07706l17126J29133r9937q4287K52947K4830k95553j47583
2841B5003811J72458j98466j80799K22576j88026k71519r0792j848k2333K6646
2831B4471708K01694k1628J17083k11969j02883J33994k79485J91681J47889j61960
2821B4486124k19056J5891J0677J01606K12739k14587M72271k90078r8649n7133
2811B4419805J41549M369J80321M26559J7441k98168r1875J23935J93057J03416
2801B5220409J01572K4523K82848O7728Q8785L32447P01513O2371O59952O89035
2791B8231183N59403Q35977O43404Q00052J107103Q30131N63693N38576K94816
$$ plain form
2861 27377838 27015169 27166194 26901772 26858216 26808270 26716512 26969795 26947981 26778377 26073803
2851 26073803 25649093 25541387 25224261 25353394 25253457 25169170 25422117 25446947 25151394 25003811
2841 25003811 25176269 24977803 24797004 25019580 24831554 24560035 24469243 24467395 24445062 24471708
2831 24471708 24673402 24651774 24768857 24556888 24454005 24587999 24308514 24500195 24648084 24486124
2821 24486124 24267068 24282959 24293636 24395242 24607981 24393394 24865665 24575587 24476938 24419805
2811 24419805 24561354 24565723 24746044 25172603 25190044 24891876 24800001 24923936 25116993 25220409
2801 25220409 25321981 25346504 25629352 25697080 25785865 26118312 26819825 26882196 27542148 28231183
2791 28231183 28790586 29626563 30269967 31070019 32177122 33007253 33570946 34109522 34404338
2782C4404338j06432J23562l25370o04448o39314o44365j129376j104115p42385
2773B9232095j134003r79474p49291m80068m87273j03450j87834q23709l31340
2764B3955653K33427l71706k74194p0198j50237n1074J29678J94565k74882j98413
2754B3122619j07434n3045J32804r1825J39642j8465K07099L66909J42731k62692
2744B3578343k31904m1886o9817J50440K52864j70227l0274j4118L29797m0186
2734B3713032M13419N256l74286K85374J56801J61881R3744K94249O5233l60476
2724B4454227J04158N25971J78483M5086j16129K58268N75331r554K90253j56385
2714B6149709L340O45815K19301r2400N07583l0470J46908j08179o5037K75717
$$ plain form
2782 34404338 34297906 34421468 34096098 33491650 32852336 32207971 31078595 29974480 29232095
2773 29232095 28098092 27118618 26369327 25889259 25401986 25298536 25110702 24286993 23955653
2764 23955653 24189080 23817374 23543180 23472982 23322745 23271671 23401349 23595914 23321032 23122619
2754 23122619 23015185 22962140 23094944 23003119 23142761 23124296 23331395 23698304 23841035 23578343
2744 23578343 23346439 23304553 23234736 23385176 23638040 23467813 23437539 23423421 23753218 23713032
2734 23713032 24126451 24131707 23757421 24042795 24199596 24361477 24455221 24749470 24814703 24454227
2724 24454227 24558385 25084356 25262839 25307925 25191796 25450064 26025395 26015841 26306094 26149709
2714 26149709 26153049 26798864 27018165 26925765 27433348 27402878 27549786 27441607 27376570 27652287
2704B7652287J90173j79121L17091J26009l4019l7207L39861K47278o9804M33172
2694B8985720j7223O80367M38010Q4223l4753K51154K90040K21472K18540J52999
2684C1270549O40258J95595m522L40138L48416O16437M80125L84415J65151L92294
2674C4828856N06458O0311N62460M59797M7273O18813N41398k2520L73872L54161
2664C8330879P32807R69946M3195L59680P25820M69358P85614M37886M45770N12976
2654D3813931O54731N19222O33901P96312M20358M09275P52174O26274N11567
2645D9137745Q72131N87773Q72728P91111Q69490J149174O85191J377806J148057
2636E7491206P66558J284282J120037J161719J058704J569655J445380J159986
$$ plain form
2704 27652287 27842460 27663339 27980430 28106439 28072420 28035213 28375074 28622352 28552548 28985720
2694 28985720 28968497 29648864 30086874 30171097 30136344 30387498 30677538 30899010 31117550 31270549
2684 31270549 31910807 32106402 32101880 32442018 32790434 33406871 33886996 34271411 34436562 34828856
2674 34828856 35335314 35395625 35958085 36417882 36465155 37083968 37625366 37602846 37976718 38330879
2664 38330879 39063686 40033632 40076827 40436507 41162327 41631685 42417299 42855185 43300955 43813931
2654 43813931 44468662 44987884 45621785 46418097 46838455 47247730 47999904 48626178 49137745
2645 49137745 50009876 50597649 51470377 52261488 53130978 54280152 54965343 56343149 57491206
2636 57491206 58257764 59542046 60662083 61823802 62882506 64452161 65897541 67057527
2628F7057527J127059J348054J197696J732815J601791J470068J784503J518799
2620G8838312J479421J504822J720482J611427J605794J749595J453961J469312
2612I1433126J581345J410235J682482J480036J411406J190363J582406J243612
2604A03015011Q93171J308747J241608J206256J158121J389524J078388J527328
2596A12818154J356075J187469R94393J441651J032762J266892R36177J256876
2588A22290449J468504J395753J261253J658243J767472J696318J886578J748530
2580A35173100K378639K765327K317989K226308K937327L190029L028407L647850
2572A57664976L654686L429086M164225L874206L880116M509110M972189N284302
$$ plain form
2628 67057527 68184586 69532640 70730336 72463151 74064942 75535010 77319513 78838312
2620 78838312 80317733 81822555 83543037 85154464 86760258 88509853 89963814 91433126
2612 91433126 93014471 94424706 96107188 97587224 98998630 100188993 101771399 103015011
2604 103015011 103908182 105216929 106458537 107664793 108822914 110212438 111290826 112818154
2596 112818154 114174229 115361698 116356091 117797742 118830504 120097396 121033573 122290449
2588 122290449 123758953 125154706 126415959 128074202 129841674 131537992 133424570 135173100
2580 135173100 137551739 140317066 142635055 144861363 147798690 150988719 154017126 157664976
2572 157664976 161319662 164748748 168912973 172787179 176667295 181176405 186148594 191432896
2564A91432896M833722N038901N658553N321189N572938N522355N396252O038843
2556B34815649N568702M939700N148165N360698N062901M936838M996995M880248
2548B75709896M388227M274906M072413L389987L309388K857979K624566K233241
2540C02860603J904680J579713J377906O81706O06619L45658Q5329q4078m91973
2531C08866163o45564k42729o28838o79496j005816q20051j129876j544793j392051
2522C00776949q27928j368229j399865j575951j737904j967018k404069k689907
2514B86806078k516203k340078l154009l346926k820656l390871l687944l276708
2506B62272683l595672l796930l884445m283931m077015m021770m393098m413243
$$ plain form
2564 191432896 196266618 201305519 206964072 212285261 217858199 223380554 228776806 234815649
2556 234815649 240384351 245324051 250472216 255832914 260895815 265832653 270829648 275709896
2548 275709896 280098123 284373029 288445442 291835429 295144817 298002796 300627362 302860603
2540 302860603 304765283 306344996 307722902 308404608 309011227 309356885 309442214 309358136 308866163
2531 308866163 308220599 307977870 307349032 306669536 305663720 304843669 303713793 302169000 300776949
2522 300776949 299949021 298580792 297180927 295604976 293867072 291900054 289495985 286806078
2514 286806078 284289875 281949797 278795788 275448862 272628206 269237335 265549391 262272683
2506 262272683 258677011 254880081 250995636 246711705 242634690 238612920 234219822 229806579
2498B29806579m124251m923866m691907m501232m740216m605024m357077m523976
2490A93339030m525421m016128m246657l388792k940169l605847l231905l110483
2482A64273628k958548k446463k337545k674467k616995k161834k274415j852563
2474A44950798k251478k187332j781789j457959j608121j212391j348049j133272
2466A31970407j046104j273716j020241o47141l88298o33539m90142q18385l44182
2457A25308659J92380k48877m53350j74317O05009M44920R280P9739L68316K15991
2447A26347750M30182J08612K92562k06391n08089n47880p72935j252826p36730
2438A23154255j128500j543204j501010j406950j745586j936125j565215j458904
$$ plain form
2498 229806579 225682328 220758462 216066555 211565323 206825107 202220083 197863006 193339030
2490 193339030 188813609 184797481 180550824 177162032 174221863 170616016 167384111 164273628
2482 164273628 161315080 158868617 156531072 153856605 151239610 149077776 146803361 144950798
2474 144950798 142699320 140511988 138730199 137272240 135664119 134451728 133103679 131970407
2466 131970407 130924303 129650587 128630346 127983205 127594907 126961368 126471226 125652841 125308659
2457 125308659 125501039 125252162 124798812 124624495 125229504 125674424 125683704 125763443 126131759 126347750
2447 126347750 126777932 126886544 127179106 126972715 126464626 125916746 125143811 123890985 123154255
2438 123154255 122025755 120482551 118981541 117574591 115829005 113892880 112327665 110868761
2430A10868761k507230k602086k210679k238766k589828k484395k072840k664004
2422I1498933k884856k749044k645289k864174k421162k090609k020184k315115
2414G1508500j954664j782514j528158j488910j431324j261144j531945j408401
2406E9121440r84679j082887j346008r03368q33848q64931j020567q40566j076489
2397E0168097p47076j013766p66450l59659l71183n28437o42913o43395o41340
2388D4453878m22406p20178o65043p39891o75872m74651l55998p16290n29148
2379C9154401l423Q2485r01544n69456p5476m58400m28416l57188p34240m79442
2369C5229301p07589k41896l68158l13559k86769l7564n15256n52635l33576q91688
$$ plain form
2430 110868761 108361531 105759445 103548766 101310000 98720172 96235777 94162937 91498933
2422 91498933 88614077 85865033 83219744 80355570 77934408 75843799 73823615 71508500
2414 71508500 69553836 67771322 66243164 64754254 63322930 62061786 60529841 59121440
2406 59121440 58136761 57053874 55707866 54804498 53970650 53105719 52085152 51244586 50168097
2397 50168097 49421021 48407255 47640805 47281146 46909963 46381526 45738613 45095218 44453878
2388 44453878 44031472 43311294 42646251 41906360 41230488 40755837 40399839 39683549 39154401
2379 39154401 39150978 39233463 38331919 37762463 37686987 37228587 36800171 36442983 35708743 35229301
2369 35229301 34521712 34279816 33911658 33598099 33311330 33273766 32758510 32205875 31872299 30980611
2359C0980611Q3652j4337o77496J11308j96743R200l26467p54551l67894m72347
2349B8374936Q930j70277k09236j40524m67159j86897k12629j28692l13821k81426
2339B6273205j25444j47883k97451j08653k54758m7109k42479n44746m7361J16014
2329B4573335j48003m54000k00937Q5621n07738k76953K21339j95844o79501j95076
2319B2222243j77938j21474k55053o00077k08438M44337M1165k87869k46402n7980
2309B0752514l51622n40315L94090p0947j99474P6415R9363l80813K60301m26834
2299A9612678l79804k10883M9546L21755J57013O1624k26539k22466K08181K91529
2289A9662634J38047k86051J1193J14584M8290l40659J5727O4323m93035m7066
$$ plain form
2359 30980611 31064263 31049926 30372430 30483738 30286995 30296195 29969728 29215177 28847283 28374936
2349 28374936 28383866 28213589 28004353 27863829 27396670 27209773 26997144 26868452 26554631 26273205
2339 26273205 26147761 25999878 25702427 25593774 25339016 25291907 25049428 24504682 24457321 24573335
2329 24573335 24425332 23971332 23770395 23856016 23348278 23071325 23292664 23096820 22417319 22222243
2319 22222243 22044305 21922831 21667778 21067701 20859263 21303600 21344765 21056896 20810494 20752514
2309 20752514 20400892 19860577 20254667 20183720 19984246 20060661 20160024 19779211 20039512 19612678
2299 19612678 19232874 19021991 19071537 19393292 19550305 19611929 19385390 19162924 19371105 19662634
2289 19662634 19800681 19514630 19525823 19640407 19688697 19348038 19363765 19428088 18935053 18887987
2279A8887987m28835k15060J94232m03142R1405J38271k2267n79730m208k10402
2269A7448251k85067l47389j32309j55827k47599K73913k73904J16853l87978
2260A6008944j93364J58513l38348q8509N5044R4551J55533j0566L83224k606
2250A6222416K70869j23676M025J16396m81352j93658N3913J78238P3036K43569
2240A6363776j42213K79735K19463k04533j37953j76286p2340J16742K8504K71838
2230A6546733j17673J07867J61344L1383J91109m47445K89540J97781k63731j25122
2220A6571786N60674L18189j39680n1561j3977l11271n9891P04632J1369Q1294
2210A7671564J33089Q8092L75431J18715j11157L73922K99307J05206L07026J76140
$$ plain form
2279 18887987 18459152 18244092 18438324 18035182 18126587 18264858 18242591 17662861 17658653 17448251
2269 17448251 17163184 16815795 16683486 16527659 16280060 16553973 16280069 16396922 16008944
2260 16008944 15815580 15974093 15635745 15547236 15602280 15696831 15852364 15841798 16225022 16222416
2250 16222416 16493285 16369609 16373634 16490030 16008678 15815020 15868933 16047171 16120207 16363776
2240 16363776 16221563 16501298 16720761 16516228 16378275 16201989 16129649 16246391 16274895 16546733
2230 16546733 16429060 16536927 16698271 16729654 16920763 16473318 16762858 16960639 16696908 16571786
2220 16571786 17132460 17450649 17310969 17259408 17245431 16934160 16874269 17578901 17590270 17671564
2210 17671564 17804653 17892745 18268176 18386891 18275734 18649656 18948963 19054169 19361195 19537335
2200A9537335l962M13228J07255L06806M07836O29283M74897M88728O36700J23534
2190B3121640Q26608N36052O49973N66121R15497J213344R70932J339744J227912
2181C1367823P29455J506247J306114J363156O26130J02268r2525m82014j791658
2172C4634996j980417k179884j727008j770411j411290j564091j168796r83819
2164B1849280l87567n48440q69917p34059m47400k57144m72666m11705m21381
2155A7299001p10112n01263j24438q51107k49891l51202P8365j03066p55182j24915
2145A3606190l58337k97642j97707m83014J1899j2392J1494p28766l9588r9662
2135A1412475n1208j3037P0057l69717j92980L39585k91685n78020M5951L7585
$$ plain form
2200 19537335 19533373 19946601 20053856 20360662 20768498 21397781 21872678 22361406 22998106 23121640
2190 23121640 23948248 24484300 25134273 25700394 26615891 27829235 28800167 30139911 31367823
2181 31367823 32097278 33603525 34909639 36272795 36898925 37001193 36908668 36426654 34634996
2172 34634996 32654579 30474695 28747687 26977276 25565986 24001895 22833099 21849280
2164 21849280 21461713 20913273 20043356 19309297 18861897 18604753 18132087 17720382 17299001
2155 17299001 16588889 16087626 15963188 15112081 14862190 14510988 14589353 14486287 13731105 13606190
2145 13606190 13247853 12950211 12752504 12269490 12281389 12268997 12280491 11551725 11512137 11412475
2135 11412475 11361267 11348230 11418287 11048570 10855590 11195175 10903490 10325470 10371421 10409006
2125A0409006o8486J27767k96450m95644J52688l8526j46875l83781Q2839l7543
2115I304995k52939j81221J77986J7890q814o28244j58336J03927l17434l71268
2105G686542l17824P52727K26780l44388k64619J17046M8048j51990j94378J61306
2095G719250P3412n10603P4476k12929K08567Q063k14373K22766m58607l22859
2085F587163m8244L1306o3150P2690l29148J22334J87475O4388j82017r6925L06010
2074F651882k27230j43601q5550n9890k39199q0538n3756K04106N7080m28851
2064E594453Q7190j64853K47035J83840o4904l4213k67972p6673j88476k18250
2054E097177j24953l09250J83307N11950q1138m16678M3555n1716L78305L19985
$$ plain form
2125 10409006 10340520 10468287 10171837 9676193 9828881 9790355 9643480 9259699 9342538 9304995
2115 9304995 9052056 8870835 9048821 9066711 9057897 8429653 8271317 8375244 8057810 7686542
2105 7686542 7368718 8121445 8348225 8003837 7739218 7856264 7904312 7752322 7557944 7719250
2095 7719250 7792662 7282059 7356535 7143606 7352173 7360236 7145863 7368629 6910022 6587163
2085 6587163 6538919 6570225 6507075 6579765 6250617 6372951 6560426 6624814 6442797 6345872 6651882
2074 6651882 6424652 6281051 6195501 6135611 5896412 5815874 5762118 5966224 6023304 5594453
2064 5594453 5681643 5516790 5763825 5947665 5882761 5848548 5580576 5503903 5315427 5097177
2054 5097177 4972224 4662974 4846281 5358231 5277093 4860415 4903970 4852254 5230559 5550544
2044E550544j79661j19335L5088k3697j40005p403m343l8052l61518L79020p6426
2033E014212k22990j85109l65607J99807j07229L3026K09713J96158M1033m2130
2023D770884r2695j07354j73110n4550j47551l3402l16411N5390R3906K57393
2013D252500J90607m52345r512L45050K84113j75048l50588k99531J2688M4703
2003C842637J05540l72299o4194J82560J11415J13407q7082N2519j09844j21874
1993C652785J31739l6376K9435K74651l07588Q8647J95392k52157k37942l87285
1983C151301j00210N45367K69443j81933j9233J8772j65891J57634l55890l01947
1973C017413L24364L59813M03471n39705J89627L76346m63451j8284k87298N68222
$$ plain form
2044 5550544 5370883 5251548 5286636 5262939 5122934 5115531 5111188 5073136 4711618 5090638 5014212
2033 5014212 4791222 4606113 4240506 4440313 4333084 4366110 4575823 4771981 4813014 4770884
2023 4770884 4678189 4570835 4397725 4343175 4195624 4162222 3845811 3901201 3995107 4252500
2013 4252500 4443107 3990762 3981250 4326300 4610413 4435365 4084777 3785246 3797934 3842637
2003 3842637 3948177 3575878 3511684 3694244 3805659 3919066 3831984 3884503 3774659 3652785
1993 3652785 3784524 3748148 3777583 4052234 3744646 3833293 4028685 3776528 3538586 3151301
1983 3151301 3051091 3596458 3865901 3683968 3664735 3683507 3517616 3675250 3319360 3017413
1973 3017413 3341777 3701590 4105061 3565356 3754983 4131329 3667878 3649594 3362296 3930518
1963C930518j75382l47322J23286k29839K81899r9694n2559j64955R6396o60678
1953B701670J19074M45145J55183J59670m1003k31183j92938O7214K71917k62363
1943C192386j81716J73940N3284k22712Q6849J23009j83213M39300K19763k61276
1933C439614J59801j76030j29593J58069m58480R4386N10667J06169k65715K6853
1923C465741j53163M11918q1158M8661J94204P3683o34987K37037M6965R2954
1913C701855N5468k06902l35841J88689K06110q2110L76662m0941j67856L41126
1903D036260j04988n1883j0467K77377o00413j67145J98593J3608K14249k3056
1893C782135l9851j78883J55506P0218P5314k24197J50525J02261L0926n6242
$$ plain form
1963 3930518 3755136 3407814 3531100 3301261 3583160 3483466 3430907 3265952 3362348 2701670
1953 2701670 2820744 3265889 3421072 3580742 3539739 3308556 3115618 3182832 3454749 3192386
1943 3192386 3010670 3184610 3237894 3015182 3102031 3225040 3041827 3481127 3700890 3439614
1933 3439614 3599415 3423385 3293792 3451861 2993381 3087767 3598434 3704603 3438888 3465741
1923 3465741 3312578 3724496 3643338 3691999 3886203 3959886 3324899 3561936 3608901 3701855
1913 3701855 3757323 3550421 3214580 3403269 3609379 3527269 3903931 3862990 3695134 4036260
1903 4036260 3931272 3879389 3868922 4146299 3545886 3378741 3577334 3590942 3805191 3782135
1893 3782135 3742284 3563401 3718907 3789125 3864439 3640242 3790767 3893028 3923954 3867712
1883C867712p1727J8881l26398J4285M19772m953J11522l27179M05435L49531
1873D456881k22914m00404l7824k65608M38195M9556M3315M9206K02532j02769
1863D210166j57479J71117K19759r3386K45470j16054K0043l57367j63150L42119
1853D321238M13824j57775j16165J43524J64050j74038j32150K53615L77476l6128
1843E057471j22935j99982L71377K60954j83756n7705L40017m43694m3393j02812
1833D875542M19949J13240K55930J3198j40174K16220p63201J72081J30705K28894
1823E522384j11813L46905J71602K49651M63321J68987j4769L095J87004M71983
1813G458350m952k04545m05078L11778m28763l56319n6135k2583l3803J20582
$$ plain form
1883 3867712 3795985 3814866 3488468 3502753 3922525 3917572 4029094 3701915 4107350 4456881
1873 4456881 4233967 3833563 3795739 3530131 3968326 4017882 4061197 4110403 4312935 4210166
1863 4210166 4052687 4223804 4443563 4350177 4595647 4479593 4499636 4142269 3979119 4321238
1853 4321238 4735062 4577287 4461122 4604646 4768696 4594658 4462508 4716123 5093599 5057471
1843 5057471 4934536 4734554 5105931 5366885 5183129 5125424 5465441 5021747 4978354 4875542
1833 4875542 5295491 5408731 5664661 5677859 5537685 5753905 4990704 5162785 5293490 5522384
1823 5522384 5410571 5757476 5929078 6178729 6642050 6811037 6796268 6799363 6986367 7458350
1813 7458350 7453398 7248853 6843775 7155553 6726790 6370471 6314336 6291753 6257950 6378532
1803F378532o05648K94814L76980N2264K27742j87121k9133N81662K06788M55761
1793G752641P8865L49418j57438K49380P81022J31794q8314J64596l98712Q0673
1783H943925n159l46488j47234o48545o27741j90955K26356j87069m38911j51829
1773F426350k61451p2994j43873k62854L24152J0353m76122R496p964n5619j77165
1762E312309N8343j61129m75541q8852j65903L4447m9436k1742j29334k99061
1752D014101p8333l64093j92453R4813R4495J99688j64661m03209m8616l03163
1742B848569j31192K73927j20060l15084M0660K46146j98854J9040l09416j10461
1732B243275M89783l49314j32465p369m3655j17988p9594L0763J19510L3006m92909
$$ plain form
1803 6378532 5772884 6067698 6444678 6496942 6724684 6537563 6508430 7090092 7296880 7752641
1793 7752641 7831506 8180924 8023486 8272866 9053888 9185682 9097368 9261964 8863252 8943925
1783 8943925 8938766 8592278 8445044 7796499 7168758 6977803 7204159 7017090 6578179 6426350
1773 6426350 6164899 6091905 5948032 5685178 6009330 6019683 5543561 5553057 5545093 5489474 5312309
1762 5312309 5370652 5209523 4733982 4645130 4479227 4513674 4464238 4442496 4313162 4014101
1752 4014101 3935768 3571675 3379222 3474035 3568530 3768218 3603557 3200348 3151732 2848569
1742 2848569 2717377 2991304 2871244 2556160 2596820 2842966 2644112 2663152 2353736 2243275
1732 2243275 2733058 2383744 2251279 2243910 2200255 2082267 2002673 2033436 2152946 2185952 1693043
1721A693043K53621j84978o582K34761N31291m45379l73995k41275J42886L8758
1711A642151J06677K12288L10764n27916J86404J71232m91736k63108L81834Q6896
1701A815486q9665j34868J58734j67663k5867k4675L23924j1724l39864n8285
1691A445533k10246J29485M12553J00003J00877j63561l50890l74412N6614k66157
1681H79799k02712n1981K91412K66731N5671N1887j92701K25653j34004j33185
1671A056570K53963Q3316j65087R3743m5338N433K1977j06188j81885j10137n620
1660I00747L9790j965m6454l05674K11138O7696J00925k857l0610l00410L78558
1649A010884K07031j92047M55031j29041j56976j0632l13066J6301L2765l41064
$$ plain form
1721 1693043 1946664 1761686 1755104 1989865 2521156 2075777 1701782 1460507 1603393 1642151
1711 1642151 1748828 1961116 2271880 1743964 1930368 2101600 1609864 1346756 1728590 1815486
1701 1815486 1725821 1590953 1749687 1582024 1556157 1531482 1855406 1843682 1503818 1445533
1691 1445533 1235287 1364772 1777325 1877328 1978205 1814644 1463754 1089342 1145956 879799
1681 879799 677087 625106 916518 1183249 1238920 1290807 1098106 1323759 1189755 1056570
1671 1056570 1310533 1393849 1228762 1322505 1277167 1282600 1304577 1198389 1016504 906367 900747
1660 900747 940537 938572 892118 586444 797582 865278 966203 963346 932736 632326 1010884
1649 1010884 1217915 1025868 1480899 1351858 1194882 1184250 871184 887485 920250 579186
1639E79186K42638M07822l99383m9635J54543L20405j30218j21008l73917P0795
1629G01228r7975K96798M95460m0869q1834j62109n70985P9796j17425j98091
1619C03994K58465J60794q6633J36552j37138n9796l25993M43230L55360M421
1609A053256j07005M1055p8370L00441l47498j38467m95098L07856o017j98486
1599C31667J45647M71672K5748K05650l48744l80778J32636l87426J77019J42207
1589E15298k42N6992o7842q5930j60732k65092L14509J8534J98308J11044R8070
1578G32917p8825n8484K53757l92623K28968O02287p17434n0986j9967K01912
1568G01522l30116L48521j7470k1677J73859l730n96916N5176K06158O2147k8757
$$ plain form
1639 579186 821824 1229646 830263 780628 935171 1255576 1125358 1004350 630433 701228
1629 701228 603253 900051 1395511 1354642 1272808 1110699 539714 619510 502085 303994
1619 303994 562459 723253 636620 773172 636034 576238 250245 693475 1048835 1053256
1609 1053256 946251 987306 908936 1209377 861879 723412 228314 536170 530153 331667
1599 331667 477314 948986 974734 1180384 831640 450862 583498 196072 373091 515298
1589 515298 515056 572048 504206 418276 257544 -7548 306961 325495 523803 634847 732917
1578 732917 654092 595608 849365 456742 685710 1287997 570563 519577 499610 701522
1568 701522 371406 719927 702457 680780 854639 850909 253993 309169 515327 577474 548717
1557E48717P4917J34897q9620j76606o018k90303K08542l26823L4279M86554L09958
1546I08494p9335n3872j40763L70250k41497J4025K4605j57838J93373K19130
1536A056572j23843q2455l22014L03613J4938k5084J05451l16336p4328l0804
1526E05710l21007q8890M28701j81021j25174Q00367O6981k87747k92428J3609
1516E19101l6465Q8176j16366L90134o8640k92416j48215k57543L83019J63820
1506F24605j72893J06291N7273j15356L5458r6024J24479k9105j22947j92022
1496B19759J09690q1861K09006M21856L143l10266M4195Q1982l8050J98691j50840
1485G07305l00420N94692l34517k94262O0744r5321j69466M86224q0333j6467
$$ plain form
1557 548717 623634 758531 668911 492305 486287 195984 404526 77703 111982 598536 908494
1546 908494 829159 775287 634524 1004774 763277 777302 801907 644069 837442 1056572
1536 1056572 932729 850274 528260 831873 846811 821727 927178 610842 536514 505710
1526 505710 184703 95813 524514 343493 218319 1018686 1085667 797920 505492 519101
1516 519101 482636 570812 454446 844580 775940 483524 335309 77766 460785 624605
1506 624605 451712 558003 615276 499920 535378 439354 563833 534728 411781 219759
1496 219759 329449 247588 456594 878450 881593 571327 615522 697504 659454 858145 707305
1485 707305 406885 1001577 667060 372798 433542 338221 168755 654979 574646 558179
1475E58179l48174Q1462k3346K58266J43478k13209j70205Q9064l14842J00708
1465A61381j06554k99273j54831L93344K77961j51146J70474J67353l56124J23846
1455B26431j69777L19162j14977r0223m48847M27252J86125P6857l23459J26289
1445B14833j63352p4770J88422J61600M6398j82807j05982r753O35922K18906
1435I29417o12414J17389K74799j50972k3914j43451j99056Q3441L18074j11554
1425D81759K2257o2995K05573l33666l34990J757J30112n9899J71839r6731N3233
1414A78249L5921J51917R16p8636n0461L87747j63960j24417K02075j57559o84132
1403c02340K01699L12277k14041Q2032M6650k36913L21391l33875P4980K47855
$$ plain form
1475 558179 210005 291467 268121 526387 669865 456656 286451 375515 60673 161381
1465 161381 54827 -244446 -399277 -5933 272028 120882 291356 458709 102585 226431
1455 226431 56654 375816 260839 170616 -278231 149021 335146 412003 88544 214833
1445 214833 51481 -23289 165133 326733 373131 190324 84342 74589 710511 929417
1435 929417 317003 434392 709191 558219 534305 390854 191798 275239 593313 481759
1425 481759 504016 441021 646594 312928 -22062 -20305 109807 49908 221747 125016 178249
1414 178249 214170 366087 367003 288367 237906 625653 461693 337276 539351 381792 -302340
1403 -302340 -100641 211636 -2405 79627 126277 -110636 210755 -123120 -48140 199715
1393A99715K09920r5149l59343J21835M36090j15444J82445j52102r9189j46336
1383A82442p7879l78223j17150l1508j8636J54317M35685j47162P7516K74170
1373C53572J29505j52190K1011j339J62820l90987J38992j42576R494M11622j87415
1362C52509n21420N45997k0197l46925K10601K26409r4976k82586L73462M1309
1352D84183p3664m93133j37847K27510K18839L9373j11259j6191R5114j51909
1342H1016q2842j06052L86748L55618j74252p2196Q8074k36545m20154q7577R9534
1331a68628K8242L81924k28431P5491q778k01215N0169M898L48164J0080k24464
1320F7452k85323j0416J32877K53375J12576j39771M6026J65426L75013k49252
$$ plain form
1393 199715 409635 314486 -44857 76978 513068 397624 580069 427967 328778 182442
1383 182442 104563 -273660 -390810 -422318 -440954 -286637 149048 1886 79402 353572
1373 353572 483077 330887 351898 350559 513379 122392 261384 118808 128302 539924 352509
1362 352509 -168911 377086 356889 9964 220565 446974 351998 69412 442874 484183
1352 484183 410519 -82614 -220461 7049 225888 265261 154002 137811 232925 81016
1342 81016 -1826 -107878 278870 634488 460236 388040 476114 239569 -180585 -268162 -168628
1331 -168628 -140386 241538 13107 88598 79820 -121395 -71226 -66328 281836 291916 67452
1320 67452 -217871 -228287 -95410 157965 270541 130770 176796 342222 717235 467983
1310D67983l10380l63890r0196J49494M0238k3622K73350p0121J36957k82929
1300g3116l2675J76949J00819q7216j19781j85767m0199J59051l697l02180M06063
1289a749L15764o1125J27262j45901N6246j15783n56001L35612j14522K68883
1279A08686L63581k46837J3441J09584r6080K48115j56612O25378o60409n22704
1269b13857L33226K89409L64801j51349n31179M9210L3746j46827K93853j66243
1259A54790k6380l8008m29491M70284N02357J43036J68250J72148J69675m9533
1249A237128k83999K45300j19395k76936j13465k85415J25921J23186k26115k56141
1239A70069M78214M87802l28196n10863n4369J52273j55813k85578L67691P0659
$$ plain form
1310 467983 157603 -206287 -296483 -146989 -106751 -130373 142977 72856 209813 -73116
1300 -73116 -105791 71158 171977 84761 -35020 -220787 -260986 -101935 -105632 -407812 -1749
1289 -1749 314015 252890 380152 234251 290497 174714 -381287 -45675 -160197 108686
1279 108686 472267 225430 238871 348455 252375 500490 343878 969256 308847 -213857
1269 -213857 119369 408778 773579 622230 91051 140261 174007 27180 321033 154790
1259 154790 128410 90402 -339089 131195 633552 776588 944838 1116986 1286661 1237128
1249 1237128 953129 1198429 1079034 802098 688633 403218 529139 652325 426210 170069
1239 170069 648283 1136085 807889 297026 242657 394930 239117 -46461 321230 391889
1229C91889L01344n18863o03473L70764K69913J65674O0999o53378J36708O863
1219g1560k7364K30807M99471k96782J64022k30930l500J85521K63546n04158
1209B09073K31486J96591l39042K29040j51226m528K58498J41459o32401J46460
1199B85410K82478j69556k78261J88785M02502k62150O163j66898J8843K85626
1189E92942l49699L3957K30195o856N22681n40419l95412j68992J69476Q15399
1179I03272q0089m74887N7366j1768k08897J0290K97499n8665p4061M0689K38155
1168F38904O0410O0878j1671l4906l47241K75295L20089k74547k66053L73044
1158G94202k18208k26194j9618l72407M3338J50994J20721M7173L34131l18940
$$ plain form
1229 391889 693233 174370 -429103 -58339 211574 377248 438247 -215131 -78423 -71560
1219 -71560 -98924 131883 631354 334572 498594 267664 264164 449685 713231 209073
1209 209073 440559 637150 298108 527148 375922 371394 629892 771351 138950 285410
1199 285410 567888 398332 120071 308856 711358 449208 455371 288473 307316 592942
1189 592942 243243 277200 507395 500539 1023220 482801 87389 -81603 87873 903272
1179 903272 823183 348296 405662 393894 184997 195287 492786 434121 360060 400749 638904
1168 638904 699314 760192 748521 713615 366374 641669 961758 687211 421158 794202
1158 794202 575994 349800 330182 -42225 1113 152107 272828 320001 654132 335192
1148C35192J60648p8130Q2390K00807m58841J48790L53359j96240k3254l22527
1138B02194L25925R6870n40459M37436k252k18077R3522j05227o2485K85783L85015
1127H98245k73512l67035K40530K85346j266j51083K84854K17170j0207r6734
1117A026308j76392K64922j8803q7033P8642J58729O1583J75424Q1594j89030
1107A375944m3701L20489k15835J03454L17551J56991K09207J56327m44826L7327
1097A972928J28122J03050l24811j84747R4041q5416J39677n4796k93307M87365
1087A982106j18690K5140j89585L18249k63048j40097Q4466k89541L90460K32552
1077B032012M1705J48388k62652k15675J17147K53141J73659J37885k81680n5892
$$ plain form
1148 335192 495840 417710 500100 700907 242066 390856 744215 547975 524721 202194
1138 202194 528119 624989 84530 521966 519714 301637 395159 289932 227447 513230 898245
1127 898245 624733 257698 498228 783574 782308 631225 916079 1133249 1123042 1026308
1117 1026308 849916 1114838 1096035 1009002 1087644 1246373 1307956 1483380 1564974 1375944
1107 1375944 1332243 1652732 1436897 1540351 1857902 2014893 2224100 2380427 1935601 1972928
1097 1972928 2101050 2204100 1879289 1694542 1788583 1703167 1842844 1788048 1494741 1982106
1087 1982106 1863416 1888556 1698971 2017220 1754172 1614075 1698541 1409000 1799460 2032012
1077 2032012 2073717 2222105 1959453 1743778 1860925 2114066 2287725 2425610 2143930 2088038
1067B088038L83390K01953L6344l9265J03441p0739k18261l4890K80579L07967
1057C038557k14113l94928j74109M98440L71399j29512J2353L9120J89669j5193
1047C221683K69214L07107K37414j78100k38846q3777k23925K18374L01972n9426
1037C771690K41634n2804L53178k71066M1749j4931L05941j6414l4956O8800J69033
1026D561854K12919M50437r6904l3595R8913J2529K0605K57471M47137L34011
1016F265377K47923k74330J13493O44193K74813M73450L47244L3606L60508K28840
1006H715117R49343O43356J42407M85032P02114O19219q0112N62921O86139N66171
996A3991707M31557O43679N87606O69853O56631N58836Q50710Q21730Q42004J193859
$$ plain form
1067 2088038 2471428 2673381 2709725 2670460 2773901 2703162 2484901 2450011 2730590 3038557
1057 3038557 2824444 2429516 2255407 2753847 3125246 2995734 3008087 3047207 3236876 3221683
1047 3221683 3490897 3798004 4035418 3857318 3618472 3534695 3310770 3529144 3831116 3771690
1037 3771690 4013324 3960520 4313698 4042632 4084381 4069450 4375391 4358977 4324021 4392821 4561854
1026 4561854 4774773 5225210 5128306 5094711 5193624 5206153 5226758 5484229 5931366 6265377
1016 6265377 6513300 6238970 6352463 6996656 7271469 7744919 8092163 8125769 8486277 8715117
1006 8715117 9664460 10307816 10450223 10935255 11637369 12256588 12176476 12739397 13425536 13991707
996 13991707 14423264 15066943 15654549 16324402 16981033 17539869 18390579 19212309 20054313 21248172
986B1248172J282635P82390J326169J393011J634922J870636K036441K550674
978C4125050K405632K764750L038049L248225M385032M923869O478097Q457050
970F9825754Q827580Q223286J0416806J3004615J5115934J2891088J0466427J678056
962A50449546j1463925j6709766k3924851k2528859j5482913j0110014o728591
955D3500627n786596l353565k867394l026517k667573j848087j048906p66373
947B2135616j682589j559644j378993j202947j383575j183477q02294j002998
939A1939099n31485j085249n07187j77210p41069k57934k84336j42998o27899
930G583732L695l93694k00428l02543l83586M1769k74742l86868l47043L8365
$$ plain form
986 21248172 22530807 23313197 24639366 26032377 27667299 29537935 31574376 34125050
978 34125050 36530682 39295432 42333481 45581706 49966738 54890607 61368704 69825754
970 69825754 78653334 86876620 97293426 110298041 125413975 138305063 148771490 150449546
962 150449546 138985621 122275855 98351004 75822145 60339232 50229218 43500627
955 43500627 37714031 34360466 31493072 28466555 25798982 23950895 22901989 22135616
947 22135616 20453027 18893383 17514390 16311443 14927868 13744391 12942097 11939099
939 11939099 11407614 10322365 9815178 9637968 8896899 8638965 8354629 8211631 7583732
930 7583732 7587427 7193733 6993305 6690762 6307176 6348945 6074203 5687335 5340292 5378657
920E378657K33387k67547k00322n45017j22745K40660j42663k6711l95017m04344
910C748338k54346j78190J62997J47510J05003j34221m12337J59877j02515j47005
900C095111P5996k81225j19780J71251K74889J29656l48524p2670k36182o185
890B682337p3904j63648J87087q6807n92656K75519L60568l75718l78184K67667
880B102261j30139k73355j951K136j04565J5734p6276k91052j91882O05452q7085
869A569278J36456j73454R666j73794l55086k2567Q5493J65962O8710J92K30059
858A540915k90608N0524j84408j97792N5271L42230r184k58428J80574K0702k70533
847I79263j97605K5063J0531J24726l77580J15914m21938O46379J46662l1253
$$ plain form
920 5378657 5612044 5344497 5144175 4599158 4476413 4717073 4574410 4547699 4152682 3748338
910 3748338 3493992 3315802 3478799 3626309 3731312 3597091 3184754 3344631 3242116 3095111
900 3095111 3171107 2889882 2770102 2941353 3216242 3345898 2997374 2924704 2688522 2682337
890 2682337 2608433 2444785 2631872 2545065 1952409 2227928 2588496 2212778 1834594 2102261
880 2102261 1972122 1698767 1696816 1698952 1594387 1610121 1533845 1242793 1050911 1656363 1569278
869 1569278 1705734 1532280 1541946 1368152 1013066 990499 1075992 1241954 1310664 1310856 1540915
858 1540915 1250307 1300831 1116423 918631 973902 1316132 1306948 1048520 1229094 1249796 979263
847 979263 781658 806721 817252 941978 564398 680312 258374 904753 1051415 1020162
837A020162j6864j00418m8733J05123r4649l43781R6697m3549l75861M99513j05290
826E92350l73969K44113P44320l98240n76362k2804M8458O30639k19334j39444
816E29727N9805q9935q5347k43112L1259k8766J08783j38683j7522n6884k36135
805a66810R0315M40591L72704k39488l60938J52478M06098l34374o4013J96660
795D93223l41014O74068j20751j67213m14970L81152l68684m78457O3344J39442
785a39860R2541K18339K13394m05148K28465J66749k95883K39716j21105j50930
775D6278K09211O50J37891k65976j55765p6004l4047L41537M94398l27186n7383
764C13604p6163l58737K89128l91389k13489N8769K30649N95327k38994k07091
$$ plain form
837 1020162 1003298 902880 854147 959270 864621 520840 617537 573988 198127 697640 592350
826 592350 218381 462494 1206814 808574 232212 209408 257866 888505 669171 529727
816 529727 589532 499597 414250 171138 202397 173631 282414 143731 126209 69325 -166810
805 -166810 -76495 364096 736800 497312 136374 288852 694950 360576 296563 493223
795 493223 152209 826277 705526 538313 123343 504495 135811 -342646 -279302 -139860
785 -139860 -47319 171020 384414 -20734 207731 374480 78597 318313 197208 46278
775 46278 255489 256139 394030 128054 -27711 -103715 -137762 203775 698173 370987 313604
764 313604 237441 -121296 167832 -223557 -437046 -378277 -147628 447699 208705 1614
754A614p9465j7837K88382J85088l20666p3358j29510L43395k5561O4202j05545
743A30739k4968k65600j67952J01116N00019j55280r6074o5861l6687l88882j83127
732f52557P8539L49127o9465k13317J14234J92684M0337J49850j59204Q9780L8311
721d1681j29581j08690K45082J07281O2273j51675J3729J88944k06880l65104
711c86302L71522M6640k047M8142j899K5114q3530o4404m0390j6877p6785O659
699a74157J23372K11820L39426K24920l20487K66465M7065l3835n77659j72182
689f5252J92711l75517p440j66265L28532Q12765J8616l49812r1398N810q7278
678B15472Q6778J59930l45214J53196q2922j94286K77391n3662l6692m62864j7628
$$ plain form
754 1614 -77851 -95688 192694 377782 57116 -16242 -145752 197643 172082 236284 130739
743 130739 105771 -159829 -327781 -226665 273354 118074 22000 -43861 -80548 -469430 -652557
732 -652557 -574018 -224891 -294356 -507673 -393439 -200755 -160418 -10568 -169772 -79992 -41681
721 -41681 -171262 -279952 -34870 72411 134684 -16991 -3262 185682 -21198 -386302
711 -386302 -14780 31860 29813 77955 76056 101170 17640 -46764 -87154 -104031 -180816 -174157
699 -174157 -50785 161035 500461 725381 404894 671359 718424 684589 106930 -65252
689 -65252 127459 -248058 -255498 -421763 -93231 719534 738150 388338 296940 302750 215472
678 215472 302250 462180 116966 270162 187240 -7046 270345 216683 179991 -282873 -300501
667c00501O8570K87579l48049R709J45713J02143o4829J52340k65395k96219l5437
656e44376L5292J12168J65464m62987M31281j18980j55357m0342l26166J73021
646g30982K19849P0665Q6377j70539J18369K12944j69205L76050l6868P1709K37705
635B86074j10354l38575m60048J82597K58283N8737p2778L9700K48042j57287
625f5609l84342K75089K26436k97511O1211m0764J12645o2649n45654J03494M90845
614a26809m58297Q0696L47301l10797K38396j74030k03180N61690J76677r3624
604C8023j44759o6286K92106O4206m68237k49090K25353k43286k07650O681M44333
593c08606J22799R5180q3135k9953K93141j25436k36295m31518M19772Q5852l37267
$$ plain form
667 -300501 -231931 55648 -292401 -282692 -136979 -34836 -99665 52675 -212720 -508939 -544376
656 -544376 -509084 -396916 -231452 -694439 -263158 -382138 -537495 -577837 -904003 -730982
646 -730982 -511133 -440468 -354091 -524630 -406261 -193317 -362522 13528 -23340 48369 286074
635 286074 175720 -162855 -622903 -440306 -182023 -123286 -196064 -156364 91678 -65609
625 -65609 -449951 -174862 51574 -245937 -184726 -225490 -112845 -175494 -721148 -617654 -126809
614 -126809 -585106 -504410 -157109 -467906 -229510 -403540 -606720 -45030 131647 38023
604 38023 -106736 -173022 119084 183290 -284947 -534037 -308684 -551970 -759620 -752939 -308606
593 -308606 -185807 -90627 -173762 -203715 89426 -36010 -272305 -703823 -284051 -198199 -535466
582e35466J19655K09636J5798R9600K70380k56744j33934R3231k91607q608j60081
571e78140L02938J81904o36905K30534Q6787J86683R9510k49041k139j24722K6860
560d75731K24561q6086J08882J25480n85165K45551K30762k68891p4673k10138
550g65448J11490J10986N3020p4431l6340L8044J31647j04293J01624J9995j23802
539e37508o1571j90409N55011J09202p2774K36524o5683j98019j57197L35647
529d6777o8408j47084M35626j08125j98496l88442Q0835l13135Q3636M5485K5408
518e99477J73577J92482K5194j05783k12128j7036m03310K38434L11072J95360
508b01615j64833j84964K46997r6410J74599r6453k02070Q6331j35850n0566l13662
$$ plain form
582 -535466 -415811 -206175 -190377 -90777 179603 -77141 -211075 -117844 -409451 -418059 -578140
571 -578140 -275202 -93298 -730203 -499669 -412882 -226199 -126689 -375730 -377869 -502591 -475731
560 -475731 -251170 -337256 -228374 -102894 -688059 -442508 -211746 -480637 -555310 -765448
550 -765448 -653958 -542972 -489952 -564383 -600723 -562679 -431032 -535325 -433701 -413706 -537508
539 -537508 -599079 -789488 -234477 -125275 -198049 38475 -27208 -225227 -382424 -46777
529 -46777 -115185 -262269 173357 65232 -133264 -521706 -440871 -754006 -670370 -624885 -599477
518 -599477 -425900 -233418 -208224 -314007 -526135 -543171 -946481 -708047 -396975 -201615
508 -201615 -366448 -551412 -304415 -400825 -226226 -322679 -524749 -438418 -574268 -624834 -938496
497i38496q8842R0951M99115P1561M71999m30175o4311m8070j40459j14367L0193
486f60901j12529j05848K65138m4774K05589j35632R9272l23755M50250J95043
476a68147k58090J62015j14191k16147L19993j49627J38194j0654L72120k86479
466b11013j94130j35028j86796j89624N57777L23981k78940J7909j91970j38550
456f26384j7588K93228j32074j78155J14293Q0876r5527K6518k18871K9730K33244
445d90710j97341j33160p4076k73170N3816N74058J67835j13357j25220K89075
435c22250J15580l09756k41517q3991l72005J77127K01986K55915J47775P3457
425c57679r0905n0477k48730K68030r3506r9641J60629j56579J87827J26323K5316
$$ plain form
497 -938496 -1027338 -936387 -437272 -365711 106288 -323887 -388198 -436268 -576727 -691094 -660901
486 -660901 -773430 -879278 -614140 -658914 -453325 -588957 -489685 -813440 -363190 -168147
476 -168147 -426237 -264222 -378413 -594560 -274567 -424194 -286000 -296654 75466 -211013
466 -211013 -405143 -540171 -726967 -916591 -358814 -34833 -313773 -295864 -487834 -626384
456 -626384 -643972 -350744 -482818 -660973 -546680 -465804 -561331 -534813 -753684 -723954 -490710
445 -490710 -688051 -821211 -895287 -1168457 -1114641 -540583 -372748 -486105 -611325 -322250
435 -322250 -206670 -516426 -757943 -841934 -1213939 -1036812 -834826 -578911 -431136 -357679
425 -357679 -448584 -499061 -747791 -479761 -573267 -672908 -512279 -668858 -481031 -354708 -329392
414c29392M6651k31852k60310K55645Q4011j68348M5499K07399n07J469j2200
403c61935j3325l6354k05608N2995M7471l71102K10378L13211r2294q9963J63472
392c83054L5595k83201L7758o6565J26271p9267M5251r5351k33648K6843K05693
381f63675K21583L2446l23197K07854k78027J42032J82320j44967L23013k0289
371c20907m3807K1932m6777j26011k09206k28192J91406k74517J35077k28644
361a129646l04564M27668M31089J41219m70672M48318R108j19113K72509j16993
351d11077k52462j63845o9560k2860J73321j57330j18132N91074K66632l47046
341e11285k36571p0028o1505K25866J49694l04548K4231J14864K54318k04291
$$ plain form
414 -329392 -282741 -514593 -774903 -519258 -435247 -603595 -558096 -350697 -351204 -349735 -361935
403 -361935 -375260 -411614 -617222 -564227 -516756 -887858 -677480 -364269 -456563 -546526 -383054
392 -383054 -347459 -630660 -592902 -659467 -533196 -612463 -567212 -662563 -896211 -869368 -663675
381 -663675 -442092 -409646 -732843 -524989 -803016 -660984 -478664 -623631 -300618 -320907
371 -320907 -364714 -342782 -389559 -515570 -724776 -952968 -761562 -1036079 -901002 -1129646
361 -1129646 -1434210 -1006542 -575453 -434234 -904906 -456588 -447480 -566593 -294084 -411077
351 -411077 -663539 -827384 -896944 -919804 -746483 -903813 -1021945 -430871 -164239 -511285
341 -511285 -747856 -817884 -879389 -653523 -503829 -808377 -784146 -669282 -414964 -619255
331f19255p911K49574Q8322k37461k06863k2301M43513l99141j8096j8601M6235
320g01985k73136K9091J56349N9481j41138M85064l5975M730k11245J26050k36565
309g39279j18238J70042o9305j85163j16054L20649j0981K33218j49739J46271
299e18579L2419M6982K10712k51784k94454l53211N82821M1600l28106j83300
289a014900N4440L55688j49549j84055L47706J05372l47394k01169p2513J10487
279i95887K57956K39291M3976j17917j21890J71790k42873K53522p3455k09375
269g94862L02536j66530l87328J98696K02993k03400k25860K10631k01691o239
259a071054j52830j78096k59248l0444K40652J40955Q8793L17073L0947L56100
$$ plain form
331 -619255 -627166 -377592 -289270 -526731 -733594 -755895 -312382 -711523 -729619 -748220 -701985
320 -701985 -975121 -946030 -789681 -730200 -871338 -386274 -422249 -417519 -628764 -502714 -739279
309 -739279 -857517 -687475 -756780 -941943 -1057997 -737348 -748329 -515111 -664850 -518579
299 -518579 -486160 -439178 -228466 -480250 -774704 -1127915 -545094 -503494 -831600 -1014900
289 -1014900 -960460 -604772 -754321 -938376 -590670 -485298 -832692 -1033861 -1106374 -995887
279 -995887 -737931 -498640 -454664 -572581 -694471 -522681 -765554 -512032 -585487 -794862
269 -794862 -492326 -658856 -1046184 -847488 -644495 -847895 -1073755 -863124 -1064815 -1071054
259 -1071054 -1223884 -1401980 -1661228 -1691672 -1451020 -1310065 -1221272 -904199 -873252 -517152
249e17152n87290l59876m5927P14125R0873K16779j06796k45469o575M6870J67775
238f32663j18972j48611j22245K96939j72649J18057J59592L868j97891K26177
228e88398M30094n0857m46638k64990l89232J34713J51586l2511J87009Q5457
218g83767l77598K5993K79979L01818M6323k40434k7271l8252l22918j20022K4345
207a231804M5870K11185J66047P7712j51387n7261j87898J67159l25874O7822
197a218429K0912k0236K46593o9041K69095J37568k13814Q620O1165M7298O2026
186f68243J32793K90231M3743j66676o9910P2020l08036l54903k50594m1703J67720
175a153558L16884l32578L527J95370Q0287l16763q6900L55552l13500J74018
$$ plain form
249 -517152 -1104442 -1464318 -1510245 -796120 -705247 -488468 -595264 -840733 -847308 -800438 -632663
238 -632663 -751635 -900246 -1022491 -725552 -898201 -780144 -620552 -616684 -814575 -588398
228 -588398 -158304 -209161 -655799 -920789 -1310021 -1175308 -1023722 -1056233 -869224 -783767
218 -783767 -1161365 -1135372 -855393 -553575 -507252 -747686 -774957 -813209 -1136127 -1256149 -1231804
207 -1231804 -1185934 -974749 -808702 -730990 -882377 -939638 -1127536 -960377 -1286251 -1218429
197 -1218429 -1197517 -1217753 -971160 -1040201 -771106 -633538 -847352 -838732 -777567 -730269 -668243
186 -668243 -535450 -245219 -201476 -368152 -438062 -366042 -674078 -1028981 -1279575 -1321278 -1153558
175 -1153558 -836674 -1169252 -1165725 -970355 -890068 -1206831 -1293731 -938179 -1251679 -1077661
165a077661K29841k80057l6363r755K22065J35764L2718Q7463j17639k75546L6028
154a053142J75375k73889k61754J16368L05797j15637m06365L53247J11333j00066
144a148733P3708J62379J55255l76849p305R2711R6733p9068j34061j96803n9820
133a421853P1206K3106K4062j6956K901J91820k44966j95506K02928m242L0539
122a336961K25202K7595l10196K47678K81469k25149O157j6196Q6479k37490J68419
111a082993q6191r3269J71231j14347N9835K14548k57126o8567J09714j78645
101a325810L97398Q0272M5541k99149j01733P0068R2713j0603J4564J18385J10593
90h07761j94704K18375J81699l88804l14758J72407j25681k12836j68115K29667
$$ plain form
165 -1077661 -847820 -1127877 -1164240 -1173995 -951930 -816166 -783448 -695985 -813624 -1089170 -1053142
154 -1053142 -877767 -1151656 -1413410 -1297042 -991245 -1106882 -1513247 -1160000 -1048667 -1148733
144 -1148733 -1075025 -912646 -757391 -1134240 -1141545 -1048834 -952101 -1031169 -1165230 -1362033 -1421853
133 -1421853 -1350647 -1327541 -1303479 -1320435 -1317534 -1125714 -1370680 -1566186 -1363258 -1367500 -1336961
122 -1336961 -1111759 -1084164 -1394360 -1146682 -865213 -1090362 -1084205 -1100401 -1013922 -1251412 -1082993
111 -1082993 -1169184 -1262453 -1091222 -1205569 -1145734 -931186 -1188312 -1256879 -1147165 -1325810
101 -1325810 -928412 -848140 -802599 -1101748 -1203481 -1133413 -1040700 -1051303 -1036739 -918354 -807761
90 -807761 -1002465 -784090 -602391 -991195 -1305953 -1133546 -1259227 -1472063 -1640178 -1410511
80a410511M3674L0578J7714L3195J65016j846j29984J78379K18221p0305L39463
69e86406k72376p9046j89860J818J01296j12371j5593O0561J66945o6701r3414
58a085147l1687l03969k4793R8118p3196p2668r5433M4975J23175K26566N6964
47a137095n8979j12984L93819O0969k3906l13561k31384q3362L2530P4758J63145
36a236050P981J48470k27599Q3447q1919o3877J9886L99139K2160l68090j28647
25a425099n2121j22359k9199Q763j10071K38323L3421L6255R36J78504r7846L2535
13a307958n9191r9743j7727J67475K63739m2564j28761N6528J2098p3464p2139
2a301707Q2188k61054
$$ plain form
80 -1410511 -1366837 -1336259 -1318545 -1285350 -1120334 -1122180 -1252164 -1073785 -855564 -925869 -586406
69 -586406 -858782 -937828 -1127688 -1125870 -1024574 -1136945 -1152538 -1091977 -925032 -991733 -1085147
58 -1085147 -1116834 -1420803 -1445596 -1347478 -1420674 -1493342 -1588775 -1543800 -1420625 -1194059 -1137095
47 -1137095 -1196074 -1309058 -915239 -854270 -878176 -1191737 -1423121 -1506483 -1473953 -1399195 -1236050
36 -1236050 -1228069 -1079599 -1307198 -1223751 -1305670 -1369547 -1349661 -950522 -928362 -1296452 -1425099
25 -1425099 -1477220 -1599579 -1628778 -1620015 -1730086 -1491763 -1458342 -1422087 -1421151 -1242647 -1340493 -1307958
13 -1307958 -1367149 -1466892 -1484619 -1317144 -1053405 -1095969 -1224730 -1168202 -1156104 -1229568 -1301707
2 -1301707 -1219519 -1480573
0a480573
$$ plain form
0 -1480573
$$ Imaginary data points
##PAGE= N=2
##DATA TABLE= (X++(I..I)), XYDATA
16383d755970N6409J4794P3959j32476O7953J54905K08567q6990j4041q3864Q1848
16372d414906Q4769K42431N2965k70897Q0754K77794M4235K76731k35736p807
16362c869667J20553J47783J11410L8140R5709j57578K20235j39808n5845p1077
16352c560145K44983j0947n9741J62462J26598M2422J27968l9311m5584n6469
16342c067764K33483j88076Q6235K34634K94365J31544o3942J9815M50728m6758
16332a915736j27512j22072j36249J32515K69809k9624K29011j88586J71637J89109
16322a527698J64929j27698k45051O1966j37448r4847K33866k12372L85122n4127
16312a553358O8419k445L36222L4422j60081K28903J18623q5740J22764J53283
$$ plain form
16383 -4755970 -4699561 -4684767 -4610808 -4743284 -4675331 -4520426 -4311859 -4398849 -4412890 -4496754 -4414906
16372 -4414906 -4330137 -4087706 -4034741 -4305638 -4224884 -3947090 -3902855 -3626124 -3861860 -3869667
16362 -3869667 -3749114 -3601331 -3489921 -3451781 -3356072 -3513650 -3293415 -3433223 -3489068 -3560145
16352 -3560145 -3315162 -3326109 -3385850 -3223388 -3096790 -3054368 -2926400 -2965711 -3011295 -3067764
16342 -3067764 -2834281 -3022357 -2936122 -2701488 -2407123 -2275579 -2339521 -2319706 -1868978 -1915736
16332 -1915736 -2043248 -2165320 -2301569 -2169054 -1899245 -1928869 -1699858 -1888444 -1716807 -1527698
16322 -1527698 -1362769 -1490467 -1735518 -1673552 -1811000 -1905847 -1671981 -1884353 -1499231 -1553358
16312 -1553358 -1484939 -1487384 -1151162 -1116740 -1276821 -1047918 -929295 -1015035 -892271 -738988
16302g38988q3293O4386J25535J79281K70635j63352P865j72779j4586L8911J87049
16291b99336J64296J76332j2528k46739J12982M3358j9339O8853M125q680J20971
16280A04295M70953Q2241k43463L382k76018L33217J45149J38670k91015L11004
16270G78415M0784K2880J25255j51575p9913K38167N643q86J7668K2211l6368
16259I82281m0681r0315J18192Q9739K72177K91608j17123Q6046l2630j41672
16249A417622R149q8630M00347o13751L130K52300P0239k68672K47062j25297
16239A303499L47764p8032J6954K1465K28857J61885L457n2547j69695k51787
16229A531820P5708J88368J63437j36931R9477j28130K10885j30738j52081J73946
$$ plain form
16302 -738988 -822281 -757895 -632360 -453079 -182444 -345796 -337931 -510710 -525296 -486385 -299336
16291 -299336 -135040 41292 28764 -217975 -104993 -61635 -80974 -12121 -7996 -16676 104295
16280 104295 575248 657489 414026 417408 141390 474607 619756 758426 467411 778415
16270 778415 819199 842079 967334 815759 735846 974013 979656 978770 996438 1018649 982281
16259 982281 941600 851285 969477 1059216 1331393 1623001 1505878 1591924 1559294 1417622
16249 1417622 1426771 1338141 1738488 1124737 1127867 1380167 1450406 1181734 1428796 1303499
16239 1303499 1651263 1573231 1590185 1611650 1840507 2002392 2005849 1953302 1783607 1531820
16229 1531820 1607528 1795896 1959333 1822402 1921879 1793749 2004634 1873896 1721815 1895761
16219A895761K3519o5323M29282K68478k88856K00060J63881J37080r4719L9857
16209B709020m46656J10147J57473K93718J22389L02851m79341k19775J98495
16200B748321L4270k04986n7989j02163L89810j85629J87911o1401j95000k12310
16190B340834L76453m4462l9783J69365J51210K45744q894l23312l03297k3422
16180B540436L86192K44393k20347m15025J26894K72349O8804j78964j11211J05484
16170B819005J47319j26228J59635K5407l58409j17292L72106K50419K7202q9964
16160C109200k40268K82143J74975j57474J55302l07255K70565J44790m24525
16151C007453l0493L27707O5256j3076J60237j06870k374j03863Q2046L20912
$$ plain form
16219 1895761 1919280 1853957 2283239 2551717 2262861 2462921 2626802 2763882 2669163 2709020
16209 2709020 2262364 2372511 2529984 2823702 2946091 3248942 2769601 2549826 2748321
16200 2748321 2782591 2577605 2519616 2417453 2807263 2621634 2809545 2748144 2553144 2340834
16190 2340834 2717287 2672825 2633042 2802407 2953617 3199361 3190467 2867155 2563858 2540436
16180 2540436 2926628 3171021 2950674 2535649 2662543 2934892 3003696 2824732 2713521 2819005
16170 2819005 2966324 2840096 2999731 3025138 2666729 2549437 2921543 3171962 3199164 3109200
16160 3109200 2868932 3151075 3326050 3168576 3323878 3016623 3287188 3431978 3007453
16151 3007453 2976960 3304667 3369923 3356847 3517084 3410214 3407840 3303977 3386023 3706935
16141C706935r6788k71473J79678M6146K68518k84010J2102q8566q6574K04042
16131C590010n8669P1543K80315k34346j20667K46707j72000n6306k75305l299
16121C267983j55373K51963L16595o7375k03147J27212K16201j1259j43358Q3960
16111C683402R9039k71345J01409j05141j84866k04427K19577K67380n5350m6244
16101C503434K68067j00671M5649m4707M436l99073j76732M71780J39044l05111
16091C406116J18534l54744O54870r7992o9788m3994j59273l6447O0701j080K18736
$$ plain form
16141 3706935 3610147 3338674 3518352 3564498 3833016 3549006 3561108 3472542 3385968 3590010
16131 3590010 3531341 3602884 3883199 3648853 3528186 3774893 3602893 3546587 3271282 3267983
16121 3267983 3112610 3364573 3681168 3613793 3410646 3537858 3754059 3742800 3599442 3683402
16111 3683402 3782441 3511096 3612505 3507364 3322498 3118071 3337648 3605028 3549678 3503434
16101 3503434 3771501 3670830 3716479 3671772 3676208 3277135 3100403 3572183 3711227 3406116
16091 3406116 3524650 3169906 3824776 3726784 3656996 3613002 3453729 3417282 3477983 3476903 3695639
$$ [...]
##END NTUPLES=NMR SPECTRUM
##END=
