##TITLE=1H_TG-2326-1
 CDCl3,8 sc, 
 6.04.2021
##JCAMPDX= 6.0         $$ Bruker NMR JCAMP-DX V2.0
##DATA TYPE= NMR SPECTRUM
##DATA CLASS= NTUPLES
##ORIGIN= UXNMR, Bruker Analytische Messtechnik GmbH
##OWNER= root
$$ XWIN-NMR		Version 3.5
$$ Tue Apr  6 10:47:07 2021 Russian Standard Time (UT+4h)  she@DPX200
##.OBSERVE FREQUENCY= 200.131506
##.OBSERVE NUCLEUS= ^1H
##.ACQUISITION MODE= SIMULTANEOUS
##.ACQUISITION SCHEME= undefined
##.AVERAGES= 8
##.DIGITISER RES= 18
##SPECTROMETER/DATA SYSTEM= spect
##.PULSE SEQUENCE= zg30
##.SOLVENT NAME= CDCl3
##.SHIFT REFERENCE= (INTERNAL, CDCl3, 0, 15.9751)
##AUDIT TRAIL= $$ (NUMBER, WHEN, WHO, WHERE, WHAT)
$$ ##TITLE= Audit trail, XWIN-NMR		Version 3.5
$$ ##JCAMPDX= 5.01
$$ ##ORIGIN= Bruker BioSpin GmbH
$$ ##OWNER= she
$$ F:/spectra/data/she/nmr/H-F/1/pdata/1/auditp.txt
$$ ##AUDIT TRAIL=  $$ (NUMBER, WHEN, WHO, WHERE, WHAT)
(   1,<2021-04-06 10:44:19.84 +0400>,<she>,<DPX200>,
      <created by zg, POWCHK disabled, PULCHK disabled
       configuration hash MD5:
       00 E9 B6 7A A2 85 ED C7 34 08 36 98 17 FE 4E 26
       data hash MD5: 16K
       8A DC 8C 20 58 6E A9 89 AC 30 E9 F7 B6 F5 AD D3>)
(   2,<2021-04-06 10:44:22.21 +0400>,<she>,<DPX200>,
      <Start of raw data processing
       efp BC_mod = 2 LB = 0.24 FT_mod = 6 PKNL = 1 PHC0 = -11121.95 PHC1 = 15.60092 SI = 16K 
       data hash MD5: 16K
       F8 20 C2 60 CB 47 EF A4 14 39 24 A9 71 AD 2E C9>)
(   3,<2021-04-06 10:44:39.76 +0400>,<she>,<DPX200>,
      <pk PHC0 = 4.73299 PHC1 = -4.400001 
       data hash MD5: 16K
       97 B9 D2 00 EC F3 6D 6B 0A 7B 8C 7A AF 8C 45 43>)
(   4,<2021-04-06 10:44:43.32 +0400>,<she>,<DPX200>,
      <abs ABSG = 5 
       data hash MD5: 16K
       ED B1 51 11 96 0A 42 B4 84 64 D6 81 3B F5 13 F4>)
$$ ##END=
$$ 
$$ hash MD5
$$ 08 D2 5B FB 77 FA 83 B4 79 C0 A7 41 BE E2 2C 42
##$RELAX= 
##$RELAX= 
##$RELAX= 
##$RELAX= 
##$RELAX= 
##$RELAX= 
$$ Bruker specific parameters
$$ --------------------------
##$DU= <F:/spectra>
##$EXPNO= 1
##$NAME= <H-F>
##$PROCNO= 1
##$TYPE= <nmr>
##$USER= <she>
##$AMP= (0..31)
100 100 100 100 100 100 100 100 100 100 100 100 100 100 100 100 100 100 
100 100 100 100 100 100 100 100 100 100 100 100 100 100 
##$AQSEQ= 0
##$AQ_mod= 1
##$AUNM= <au_zg>
##$AUTOPOS= <>
##$BF1= 200.13
##$BF2= 200.13
##$BF3= 200.13
##$BF4= 200.13
##$BF5= 200.13
##$BF6= 200.13
##$BF7= 200.13
##$BF8= 200.13
##$BYTORDA= 1
##$CFDGTYP= 0
##$CFRGTYP= 5
##$CHEMSTR= <none>
##$CNST= (0..31)
1 1 145 1 1 1 1 1 1 1 1 1 1 1 1 1 1 1 1 1 1 1 1 1 1 1 1 1 1 1 1 1 
##$CPDPRG= <>
##$CPDPRG1= <>
##$CPDPRG2= <>
##$CPDPRG3= <>
##$CPDPRG4= <mlev>
##$CPDPRG5= <mlev>
##$CPDPRG6= <mlev>
##$CPDPRG7= <mlev>
##$CPDPRG8= <mlev>
##$CPDPRGB= <>
##$CPDPRGT= <>
##$D= (0..31)
0 1.2 0 0 0 0 0 0 0 0.06 0 0.03 0 0 0 0 0.0002 0 0 0 0 0 0 0 0 0 0 0 0 
0 0 0 
##$DATE= 1617691459
##$DBL= (0..7)
120 120 120 120 120 120 120 120 
##$DBP= (0..7)
150 150 150 150 150 150 150 150 
##$DBP07= 0
##$DBPNAM0= <>
##$DBPNAM1= <>
##$DBPNAM2= <>
##$DBPNAM3= <>
##$DBPNAM4= <>
$$ [...]
##$SUBNAM3= <"">
##$SUBNAM4= <"">
##$SUBNAM5= <"">
##$SUBNAM6= <"">
##$SUBNAM7= <"">
##$SUBNAM8= <"">
##$SUBNAM9= <"">
##$SW= 16.9725357007746
##$SWIBOX= (0..15)
0 0 2 0 0 0 0 0 0 0 0 0 0 0 0 0 
##$SW_h= 3396.73913043478
##$TD= 16384
##$TD0= 1
##$TE= 0
##$TE2= 300
##$TE3= 300
##$TEG= 300
##$TL= (0..7)
0 120 120 120 120 120 120 120 
##$TP= (0..7)
150 150 150 150 150 150 150 150 
##$TP07= 0
##$TPNAME0= <>
##$TPNAME1= <>
##$TPNAME2= <>
##$TPNAME3= <>
##$TPNAME4= <>
##$TPNAME5= <>
##$TPNAME6= <>
##$TPNAME7= <>
##$TPOAL= (0..7)
0.5 0.5 0.5 0.5 0.5 0.5 0.5 0.5 
##$TPOFFS= (0..7)
0 0 0 0 0 0 0 0 
##$TUNHIN= 0
##$TUNHOUT= 0
##$TUNXOUT= 0
##$USERA1= <user>
##$USERA2= <user>
##$USERA3= <user>
##$USERA4= <user>
##$USERA5= <user>
##$V9= 5
##$VALIST= <valist>
##$VCLIST= <CCCCCCCCCCCCCCC>
##$VD= 0
##$VDLIST= <DDDDDDDDDDDDDDD>
##$VPLIST= <PPPPPPPPPPPPPPP>
##$VTLIST= <TTTTTTTTTTTTTTT>
##$WBST= 1024
##$WBSW= 4
##$XGAIN= (0..3)
0 0 0 0 
##$XL= 0
##$YL= 0
##$YMAX_a= 147944
##$YMIN_a= -118712
##$ZGOPTNS= <>
##$ZL1= 120
##$ZL2= 120
##$ZL3= 120
##$ZL4= 120
##$ABSF1= 15.96574
##$ABSF2= -1.006922
##$ABSG= 5
##$ABSL= 3
##$ALPHA= 0
##$AQORDER= 0
##$ASSFAC= 0
##$ASSFACI= 0
##$ASSFACX= 0
##$ASSWID= 0
##$AUNMP= <proc_1d>
##$AZFE= 0.1
##$AZFW= 0.1
##$BCFW= 0
##$BC_mod= 2
##$BYTORDP= 0
##$COROFFS= 0
##$CY= -3
##$DATMOD= 1
##$DC= 0
##$DFILT= <>
##$DTYPP= 0
##$F1P= 0
##$F2P= 0
##$FCOR= 1
##$FTSIZE= 16384
##$FT_mod= 6
##$GAMMA= 0
##$GB= 0
##$INTBC= 1
##$INTSCL= 2.992141e-10
##$ISEN= 128
##$LB= 0.24
##$LEV0= 0
##$LPBIN= 0
##$MAXI= 10000
##$MC2= 0
##$MEAN= 0
##$ME_mod= 0
##$MI= 1.114404
##$NCOEF= 0
##$NC_proc= -9
##$NLEV= 6
##$NOISF1= 3.799351
##$NOISF2= 2.8
##$NSP= 0
##$NTH_PI= 0
##$NZP= 0
##$OFFSET= 15.97506
##$PC= 1
##$PHC0= -11117.22
##$PHC1= 11.20092
##$PH_mod= 1
##$PKNL= yes
##$PPARMOD= 0
##$PSCAL= 0
##$PSIGN= 0
##$REVERSE= no
##$SF= 200.13000727999
##$SI= 16384
##$SIGF1= 3
##$SIGF2= 2
##$SINO= 5.538805
##$SIOLD= 16384
##$SREGLST= <1H.CDCl3>
##$SSB= 0
##$STSI= 16384
##$STSR= 0
##$SW_p= 3396.73913043479
##$SYMM= 0
##$S_DEV= 0
##$TDeff= 16384
##$TDoff= 0
##$TI= <>
##$TILT= no
##$TM1= 0
##$TM2= 0
##$TOPLEV= 0
##$USERP1= <user>
##$USERP2= <user>
##$USERP3= <user>
##$USERP4= <user>
##$USERP5= <user>
##$WDW= 1
##$XDIM= 16384
##$YMAX_p= 338071401
##$YMIN_p= -2699523
$$ End of Bruker specific parameters
$$ ---------------------------------
##NTUPLES= NMR SPECTRUM
##VAR_NAME=  FREQUENCY,     SPECTRUM/REAL,   SPECTRUM/IMAG
##SYMBOL=    X,             R,               I
##VAR_TYPE=  INDEPENDENT,   DEPENDENT,       DEPENDENT
##VAR_FORM=  AFFN,          ASDF,            ASDF
##VAR_DIM=   16384,         16384,           16384
##UNITS=     HZ,            ARBITRARY UNITS, ARBITRARY UNITS
##FACTOR=    0.207333158178282, 1,           1
##FIRST=     3197.0889667488, 0,             0
##LAST=      -199.650163685993, 0,           0
##MIN=       -199.650163685993, -2699523,    0
##MAX=       3197.0889667488, 338071401,     0
$$ Real data points
##PAGE= N=1
##DATA TABLE= (X++(R..R)), XYDATA
$$ [...]
6000C26776J67389L23790m98347p0869N60632o5034k70924o39924J27165N36481
$$ 326776 494165 817955 319608 248739 809371 744337 473413 -166511 -39346 497135
5990D97135o03355p51479J93494j23971Q63002R40308n19564j058292l51481N08940
$$ 497135 -106220 -857699 -664205 -788176 74826 1015134 495570 -562722 -914203 -405263
5980d05263P20135l34746l52367N64833n06299j94085M24550J60351k51779m06062
$$ -405263 314872 -19874 -372241 192592 -313707 -507792 -83242 77109 -174670 -580732
5970e80732r18088N33151P87976L7354N01889l81108p55660J87217l96042M72146
$$ -580732 -1498820 -965669 -177693 -140339 361550 -19558 -775218 -588001 -984043 -511897
5960e11897L25596J00663m82357L6684O440n13079K65004L19979L69531Q5810
$$ -511897 -186301 -85638 -567995 -531311 -524871 -1037950 -772946 -452967 -83436 2374
5950B374n92618l02297L84909J84002l17087O8911j70734j04467j31204k2583
$$ 2374 -590244 -892541 -507632 -323630 -640717 -571806 -742540 -847007 -978211 -1000794
5940a000794J17784P3294l12303J144947n1191n97819N51746k35458o2423j52246
$$ -1000794 -883010 -809716 -1122019 22928 -28263 -626082 -74336 -309794 -372217 -524463
5930e24463k06462m33090j8686O87663L87566n09085L59830m85531l35951K13142
$$ -524463 -730925 -1164015 -1182701 -495038 -107472 -616557 -256727 -742258 -1078209 -865067
5920h65067o22153K726n97123K93289N27331m45934J044135K13244k51622j46547
$$ -865067 -1487220 -1484494 -2081617 -1788328 -1260997 -1706931 -662796 -449552 -701174 -847721
5910h47721O84L84102k06568R3521j09412M87722l80848j068342O0964M47324
$$ -847721 -847037 -462935 -669503 -575982 -685394 -197672 -578520 -1646862 -1585898 -1138574
5900a138574J76874M68275o82194o97882L03299M55932l34428k23773K8737J20829
$$ -1138574 -961700 -493425 -1175619 -1873501 -1570202 -1114270 -1448698 -1672471 -1643734 -1522905
5890a522905m8753M5067J82592N19059j15646M03538J63871m71789j9138J53200
$$ -1522905 -1571658 -1526591 -1343999 -824940 -940586 -537048 -373177 -844966 -864104 -710904
5880g10904K78006J78541l55743n79431k68204N61003K58418q0996m45984k09059
$$ -710904 -432898 -254357 -610100 -1189531 -1457735 -896732 -638314 -719310 -1165294 -1374353
5870a374353k44513J4124K96266M53503M008n69276K63534O31574J86661k19399
$$ -1374353 -1618866 -1604742 -1308476 -854973 -850965 -1420241 -1156707 -525133 -338472 -557871
5860e57871j91924M57420L18655L0429K77991J22465n20132k65787l22844M0331
$$ -557871 -749795 -292375 26280 56709 334700 457165 -62967 -328754 -651598 -611267
5850f11267J46775m9152K28735P9263o42616k41227J09006P5083J036750l35857
$$ -611267 -464492 -513644 -284909 -205646 -848262 -1089489 -980483 -905400 131350 -204507
5840b04507q70984k2956M7831m46052L28986l32358R2767J028059K31728q45501
$$ -204507 -1075491 -1098447 -1050616 -1496668 -1167682 -1500040 -1407273 -379214 -147486 -992987
5830i92987L45802K88747L82146k03418l42581j13235m83088j55945N35181K1139
$$ -992987 -647185 -358438 23708 -179710 -522291 -635526 -1118614 -1274559 -739378 -718239
5820g18239O922Q63655N23085p56157O80999p05152l75181j66102N73178k37746
$$ -718239 -711317 152338 675423 -80734 600265 -104887 -480068 -646170 -72992 -310738
5810c10738n49028L04051R00708k26818n94781J91554k01024k31939N20853j859
$$ -310738 -859766 -555715 344993 118175 -476606 -285052 -486076 -718015 -197162 -199021
5800a99021k78699p2592k0509j56966M20336N02860l74733K14353L08674l03912
$$ -199021 -477720 -550312 -570821 -727787 -307451 195409 -179324 35029 343703 39791
5790C9791p05068k35224P32456K3411n8306l33178k62590L66220j27013m33691
$$ 39791 -665277 -900501 -168045 -144634 -202940 -536118 -798708 -432488 -559501 -993192
5780i93192M46101q8727o23855J316815N76699o81115K79067j0349p60132l71131
$$ -993192 -547091 -635818 -1259673 57142 633841 -47274 231793 221444 -538688 -909819
5770i09819j04553N44673N48888M7924J4296j47157p43275O22222K7626J80843
$$ -909819 -1014372 -469699 79189 127113 141409 -5748 -749023 -126801 -99175 81668
5760H1668n67787P35949l79105m10360M68979Q1562j68410L73771l32266j03440
$$ 81668 -486119 249830 -129275 -539635 -70656 10906 -157504 216267 -115999 -219439
5750b19439J347182j396363m31455P35394O45404K07498o32770n25140N99161
$$ -219439 1127743 -268620 -700075 35319 680723 888221 255451 -269689 329472
5741C29472K18312K988K28558o58406j5303O82747k82239l01892P24767l87748
$$ 329472 547784 550772 779330 120924 105621 788368 506129 204237 929004 541256
5731E41256L26950N57889l1386J53349n48706m16677m73549M86847P71617K45399
$$ 541256 868206 1426095 1394709 1548058 999352 582675 109126 595973 1367590 1612989
5721A612989r2524m81063R02712j273032M40880k36337j78278K70792r2385J5508
$$ 1612989 1520465 1039402 1942114 669082 1109962 873625 695347 966139 873754 889262
5711H89262j44679k8901k30255Q52222O7692k59495k53024j3470j05667n4005
$$ 889262 744583 715682 485427 1337649 1405341 1145846 892822 879352 773685 719680
5701G19680N00463P21679j5688n40345K73623K07698L72387l50913J51932l06659
$$ 719680 1220143 1941822 1926134 1385789 1659412 1867110 2239497 1888584 2040516 1733857
5691A733857L26121L45953m17760J69012m82086j1652J9505n56942J370182l22262
$$ 1733857 2059978 2405931 1988171 2157183 1675097 1663445 1682950 1126008 2496190 2173928
5681B173928l57263p49873J7544L66499M76205J09225L4521N63965j19053o36906
$$ 2173928 1816665 1066792 1084336 1450835 1927040 2036265 2070786 2634751 2515698 1878792
5671A878792k13246M22770o8650M03472l92874K17703j11600q4663k01145j37533
$$ 1878792 1665546 2088316 2019666 2423138 2030264 2247967 2136367 2051704 1850559 1713026
5661A713026L94240o25899n46846J40339M86134r4517k3654J169695L9297o69809
$$ 1713026 2107266 1481367 934521 1074860 1560994 1466477 1442823 2612518 2651815 1982006
5651A982006J82035L59850l01904J79663N70823l2924q30106P16763p78102O9392
$$ 1982006 2164041 2523891 2221987 2401650 2972473 2939549 2109443 2826206 2048104 2117496
5641B117496j13099l09845N5981P1378o7969j14219K75585N95954j20639J66599
$$ 2117496 2004397 1694552 1750533 1821911 1753942 1639723 1915308 2511262 2390623 2557222
5631B557222n40551N79581Q12960n83595j8321Q82216l26271N11347l89007n3976
$$ 2557222 2016671 2596252 3409212 2825617 2807296 3689512 3363241 3874588 3485581 3431605
5621C431605o2733N66877N0543K310J49975j45041M41758j194218q0461j30229
$$ 3431605 3368872 3935749 3986292 3988602 4138577 3993536 4435294 3241076 3160615 3030386
5611C030386M92092n42946L59930Q80302k4280j66577q11427Q5233p97973N09150
$$ 3030386 3522478 2979532 3339462 4219764 4195484 4028907 3217480 3302713 2504740 3013890
5601C013890m214J01156q1478j28108J36266l3179M66141J21686o33216l93326
$$ 3013890 3009676 3110832 3029354 2901246 3037512 3004333 3470474 3592160 2958944 2565618
5591B565618Q54100k88699p12183K52679K34249j62469l75716P5658o47653L50982
$$ 2565618 3419718 3131019 2418836 2671515 2905764 2743295 2367579 2443237 1795584 2146566
5581B146566P31804q4976O71092n00059k21337l3859M36640K45490Q81155n14921
$$ 2146566 2878370 2793394 3464486 2964427 2743090 2709231 3145871 3391361 4272516 3757595
5571C757595r79478p63103M24590L91980J36383N05644O5291m63290j95003K31821
$$ 3757595 2778117 2015014 2439604 2831584 2967967 3473611 3538902 3075612 2880609 3112430
5561C112430L44234p1109l23510l4312P41450k70971p67114M22892K24002M56477
$$ 3112430 3456664 3385555 3062045 3027733 3769183 3498212 2731098 3153990 3377992 3834469
5551C834469N6634l7403p6903l24213M47191R6432L2907n02709L16221J69244
$$ 3834469 3891103 3853700 3776797 3452584 3899775 3996207 4029114 3526405 3842626 4011870
5541D011870L80229N47113j40818J40791j63149l72120M23510n50567J59515J94145
$$ 4011870 4392099 4939212 4798394 4939185 4776036 4403916 4827426 4276859 4436374 4630519
5531D630519n22067q9057O86226N06801p70458k49845n3985N18617k21602O05097
$$ 4630519 4108452 4019395 4705621 5212422 4441964 4192119 4138134 4656751 4435149 5040246
5521E040246K57990k76632O97540m55563M13511r4792m75715J097857k37079K14543
$$ 5040246 5298236 5021604 5719144 5263581 5677092 5582300 5106585 6204442 5967363 6181906
5511F181906O53876J42703k78342q6874o33040J34678P05356q3370Q88547K47589
$$ 6181906 6835782 6978485 6700143 6613269 5980229 6114907 6820263 6736893 7625440 7873029
5501G873029N7508J040163K27275J10869m6914p55095n34492L70947R45667P98061
$$ 7873029 7930537 8970700 9197975 9308844 9261930 8506835 7972343 8343290 9288957 10087018
5491A0087018N03453N69410L06460P15114L13795j31285P74446L28025L23825
$$ 10087018 10590471 11159881 11466341 12181455 12495250 12363965 13138411 13466436 13790261
5482A3790261m03984P32982J326088J141537M07689J171943R76989N52603J766504
$$ 13790261 13386277 14119259 15445347 16586884 16994573 18166516 19143505 19696108 21462612
5473B1462612J499350K068898K810319J922462K591465K220103K018152K043825
$$ 21462612 22961962 25030860 27841179 29763641 32355106 34575209 36593361 38637186
5465C8637186J799301J965589J408176Q42120K99859L08128j160327j013647k149286
$$ 38637186 40436487 42402076 43810252 44652372 44952231 45260359 44100032 43086385 40937099
5456D0937099j766546j788386j173182k332211k434949j795618k383231j357770
$$ 40937099 39170553 37382167 36208985 33876774 31441825 29646207 27262976 25905206
5448B5905206j757679j146751p05170j201328j231658j038573p63002j154988
$$ 25905206 24147527 23000776 22295606 21094278 19862620 18824047 18061045 16906057
5440A6906057j013786l42160q29076n18079l37995L09126j204240n82091l14575
$$ 16906057 15892271 15550111 14721035 14202956 13864961 14174087 12969847 12387756 12073181
5431A2073181m70936l06811n49822j68111M83877j70587j013358o82622Q10326
$$ 12073181 11602245 11295434 10745612 10577501 11061378 10890791 9877433 9194811 10005137
5422A0005137j36419p01537p735m38465j97216K537j21771J69918O95347n24827
$$ 10005137 9868718 9167181 9159446 8720981 8523765 8526302 8404531 8574449 9269796 8744969
5412H744969j28997n77443L54449L58495K3891p50968K88036N2305q47309J57870
$$ 8744969 8615972 8038529 8392978 8751473 8775364 8024396 8312432 8364737 7517428 7675298
5402G675298n61244q51471J085826K14221k14245N36266J17162J49578k50594
$$ 7675298 7114054 6262583 7348409 7562630 7348385 7884651 8001813 8151391 7900797
5393G900797k00914K20165q91409k86176J83125o3695L10143N23026K48697l48350
$$ 7900797 7699883 7920048 7028639 6742463 6925588 6861893 7172036 7695062 7943759 7595409
5383G595409R065J52010J4013k83159J07980l42391M77521k94806n15671M63597
$$ 7595409 7604474 7756484 7770497 7487338 7595318 7252927 7730448 7435642 6919971 7383568
5373G383568M53441n13634m45741J067674J03968k29398L24208m40854J22978
$$ 7383568 7837009 7323375 6877634 7945308 8049276 7819878 8144086 7703232 7826210
5364G826210k52852M10680Q50895r25017J63354L68176n35715K86806J031170
$$ 7826210 7573358 7984038 8834933 7909916 8073270 8441446 7905731 8192537 9223707
5355I223707K14467J79482l85838K16590J03037J50709l7989j10395O5389k2714
$$ 9223707 9438174 9617656 9231818 9448408 9551445 9702154 9664165 9553770 9619159 9596445
5345I596445M89068J82799N29319L58184L73431p7946o5513n2861K01681m6057
$$ 9596445 10085513 10268312 10797631 11155815 11529246 11451300 11385787 11332926 11534607 11488550
5335A1488550j35779L14433J86589n52292J35806J023277n18764K22723J76897
$$ 11488550 11352771 11667204 11853793 11301501 11437307 12460584 11941820 12164543 12341440
5326A2341440k18988J011504J14465R1227M50027n84776J00360M61411N27839
$$ 12341440 12122452 13133956 13248421 13339648 13789675 13204899 13305259 13766670 14294509
5317A4294509k69664N91711l44461p17135J31Q06612J96991O70498k47312k1105
$$ 14294509 14024845 14616556 14272095 13554960 13555091 14361703 14558694 15229192 14981880 14960775
5307A4960775M8525k56538K64590J75169M93525n55741K98373o33135Q05049n38983
$$ 14960775 15009300 14752762 15017352 15192521 15686046 15130305 15428678 14795543 15600592 15061609
5297A5061609J09566J71620n10599J29657P84473m82642N6178k99977k78429j62408
$$ 15061609 15171175 15342795 14832196 14961853 15746326 15263684 15319862 15019885 14741456 14579048
5287A4579048O85056J55061R4849m45975m06771L11532M14956N27823m63364j89065
$$ 14579048 15264104 15419165 15514014 15068039 14661268 14972800 15387756 15915579 15452215 15263150
5277A5263150J42203N14702m47329k09848J98012j22219r84646l85882k70692
$$ 15263150 15405353 15920055 15472726 15262878 15460890 15338671 14354025 13968143 13697451
5268A3697451O87146p08426K15016L05727m86452j09367q2481k36198M32998O1127
$$ 13697451 14384597 13676171 13891187 14196914 13710462 13601095 13518614 13282416 13715414 13776541
5258A3776541j000340K48322N5151l14987o54703l50157M71875o33894N7556p1657
$$ 13776541 12776201 13024523 13079674 12764687 12109984 11759827 12231702 11597808 11655364 11583707
5248A1583707l5131k55209p12091J71393N49059J3216k4295q70778l61262M59338
$$ 11583707 11548576 11293367 10581276 10752669 11301728 11314944 11290649 10419871 10058609 10517947
5238A0517947o13066j1427j21089j19657o03234K02526l57987j20593N95587M46506
$$ 10517947 9904881 9893454 9772365 9652708 9049474 9252000 8894013 8773420 9369007 9815513
5228I815513m46983j72957n01193L77986K62533q5451k13432l00489o7741L09860
$$ 9815513 9368530 9195573 8694380 9072366 9334899 9249448 9036016 8735527 8667786 8977646
5218H977646l41979Q55498m75914p75636l06174k73115L7458k34827J16412n78193
$$ 8977646 8635667 9491165 9015251 8239615 7933441 7660326 7697784 7462957 7579369 7001176
5208G001176j88772R89180R9574q4934m01077m38417j15672R0495J10400j59513
$$ 7001176 6812404 7801584 7901158 7816224 7415147 6976730 6861058 6951553 7061953 6902440
5198F902440p7259m06102m81367o9695O23527L32044P4153o95197J43049l7467
$$ 6902440 6825181 6419079 5937712 5868017 6491544 6823588 6897741 6202544 6345593 6308126
5188F308126m11649k20864o4423j10361L05840k4393K30494j57591M24520n35189
$$ 6308126 5896477 5675613 5611190 5500829 5806669 5782276 6012770 5855179 6279699 5744510
5178E744510k11675L75024M1329L26638J44576m84824L18966m14879N81782k4094
$$ 5744510 5532835 5907859 5949188 6275826 6420402 5935578 6254544 5839665 6421447 6397353
5168F397353r81086K40846L13808j57629n92311L17866N60284m32769N529j79689
$$ 6397353 5416267 5657113 5970921 5813292 5220981 5538847 6099131 5666362 5671891 5492202
5158E492202l9724J4392m0179J15003P30507q70778n98387L36903j7439M476L26317
$$ 5492202 5452478 5466870 5426691 5541694 6272201 5401423 4803036 5139939 5122500 5126976 5453293
5147E453293K77595j61995m0571n13210k07723J036797P3338j18601m57152j25811
$$ 5453293 5730888 5568893 5528322 5015112 4807389 5844186 5917524 5798923 5341771 5215960
5137E215960J36358p25945j75049R46843O4830r2409J3140Q01077q0914j68663
$$ 5215960 5352318 4626373 4451324 5398167 5462997 5370588 5383728 6184805 6103891 5935228
5127E935228Q35401m26155k04675q94463j24604P2534j36484R424J084781p11728
$$ 5935228 6770629 6344474 6139799 5245336 5120732 5193266 5056782 5066206 6150987 5439259
5117E439259O19571P72820l44066j10525m03512k99595P3006L87224n67719N47922
$$ 5439259 6058830 6831650 6487584 6377059 5973547 5673952 5746958 6134182 5566463 6114385
5107F114385J72389J50093n09030p88593J97039Q50270j112223O376P18037M26217
$$ 6114385 6286774 6436867 5927837 5139244 5336283 6186553 5074330 5080706 5798743 6224960
5097F224960Q43564q31216m31721J35992j27278k49480O91179k25778j75866q16495
$$ 6224960 7068524 6237308 5805587 5941579 5814301 5564821 6256000 6030222 5854356 5037861
5087E037861O82667N1154l87200l78436M23752J83129l33780n77929N20782J23705
$$ 5037861 5720528 5771682 5384482 5006046 5429798 5612927 5279147 4701218 5222000 5345705
5077E345705m57960J86869R1026R23915k80637q04776N79119k09367l62962K70271
$$ 5345705 4887745 5074614 5165640 6089555 5808918 5004142 5583261 5373894 5010932 5281203
5067E281203P5721n38205K82449M84189m10901P39790o4421J70671m36103R8360
$$ 5281203 5356924 4818719 5101168 5585357 5174456 5914246 5849825 6020496 5584393 5682753
5057E682753k11011l67799R06907l99912l04414l71475m19946N72876O69353r7866
$$ 5682753 5471742 5103943 6010850 5610938 5306524 4935049 4515103 5087979 5757332 5659466
5047E659466J31918p30436p1538J06021R63886m83857n93947L63232J76738J11854
$$ 5659466 5791384 5060948 4989410 5095431 6059317 5575460 4981513 5344745 5521483 5633337
5037E633337J21052k15078m85829L12311L1114j01944k66806M34878K70922r5540
$$ 5633337 5754389 5539311 5053482 5365793 5396907 5294963 5028157 5463035 5733957 5638417
5027E638417l26427P505o7249J9462k26368O31354Q841k02885o06425O93974r4446
$$ 5638417 5311990 5319495 5252246 5271708 5045340 5676694 5685535 5482650 4876225 5570199 5475753
5016E475753r9357J31342k73572M96119k61189Q3231M48705K82627O79886l12783
$$ 5475753 5376396 5507738 5234166 5730285 5469096 5552327 6001032 6283659 6963545 6650762
5006F650762j321766J90056P29333L66863p25464L51909J98968m8856K69497j83902
$$ 6650762 5328996 5519052 6248385 6615248 5889784 6241693 6440661 6391805 6661302 6477400
4996F477400l34358J72704j17007J2326J11377j67874k89077N14208m44408q15883
$$ 6477400 6143042 6315746 6198739 6211065 6322442 6154568 5865491 6379699 5935291 5119408
4986E119408R64042J030717j26204m80467k27797N30790p67706m91883K44723
$$ 5119408 6083450 7114167 6987963 6507496 6279699 6810489 6042783 5550900 5795623
4977E795623J33483k70807M10277O18557j19519L56569P5352M92618n86838r8763
$$ 5795623 5929106 5658299 6068576 6687133 6567614 6924183 6999535 7492153 6905315 6806552
4967F806552l09682O49185K91111m10051q15837L71496O2212L95624O8806k5108
$$ 6806552 6496870 7146055 7437166 7027115 6211278 6582774 6644986 7040610 7109416 7084308
4957G084308p31823M52288J275800K551l25032K72063k0767o97507j74755Q6256
$$ 7084308 6352485 6804773 8080573 8083124 7758092 8030155 8009388 7311881 7137126 7223382
4947G223382M66815p6050m84976K12110L42599N20443O40023n11036l04170p9795
$$ 7223382 7690197 7614147 7129171 7341281 7683880 8204323 8844346 8333310 8029140 7949345
4937G949345P02847m03282J229813r9542n51893O32962J65289L89847k77233K26183
$$ 7949345 8652192 8248910 9478723 9379181 8827288 9460250 9625539 10015386 9738153 9964336
4927I964336k20788L54016k39255O31501J075779N36067N56028j54248M46767
$$ 9964336 9743548 10097564 9858309 10489810 11565589 12101656 12657684 12503436 12950203
4918A2950203j57693R94350J513056K07161Q94833M6569K23321N33760L30181
$$ 12950203 12792510 13786860 15299916 15507077 16401910 16448479 16671800 17205560 17535741
4909A7535741M08017N33954M73023J240710M27023K44838M62653n25013l919o048
$$ 17535741 17943758 18477712 18950735 20191445 20618468 20863306 21325959 20800946 20797027 20790979
4899B0790979j353407M41816j96951j266097m8063Q3373o96504j02176Q6837M9189
$$ 20790979 19437572 19879388 19682437 18416340 18368277 18451650 17755146 17652970 17739807 17788996
4889A7788996q77385l657R48413q68384K32555n91845o49961J81504M27478R2741
$$ 17788996 16911611 16907954 17856367 16987983 17220538 16628693 15978732 16160236 16587714 16680455
4879A6680455k69344k17327j11268M64815N08961J55955o02448j11492P2515m13996
$$ 16680455 16411111 16193784 16082516 16547331 17056292 17212247 16609799 16498307 16570822 16156826
4869A6156826M77533m72837L57380L78397L35017k5447L85194K66401R7490L35372
$$ 16156826 16634359 16161522 16518902 16897299 17232316 17206869 17592063 17858464 17955954 18291326
4859A8291326J74081K05849N50755O60135L0249L85846L89911j49690L2186K80400
$$ 18291326 18465407 18671256 19222011 19882146 19912395 20298241 20688152 20538462 20570648 20851048
4849B0851048J045728R28927J02066K52969N22640L98105P33547J41435J42907
$$ 20851048 21896776 22825703 22927769 23180738 23703378 24101483 24835030 24976465 25119372
4840B5119372J04404K38365J8675J248738N05903P40259R16874L86871P74518
$$ 25119372 25223776 25462141 25480816 26729554 27235457 27975716 28892590 29279461 30053979
4831C0053979R95874J63164N59741Q11047J235515L70491N23772K263813J647162
$$ 30053979 31049853 31213017 31772758 32583805 33819320 34189811 34713583 36977396 38624558
4822C8624558P76111Q6935J692509J547821J695091N64930N54050M57451O59017
$$ 38624558 39400669 39487604 41180113 42727934 44423025 44987955 45542005 45999456 46658473
4813D6658473M79954N95627j3557m05910r94827p09139l41186l13162q98003j620935
$$ 46658473 47138427 47734054 47720497 47314587 46319760 45610621 45269435 44956273 44058270 42437335
4803D2437335j559129k473696q31348j369043j427202o64105o04551j123635l08019
$$ 42437335 40878206 38404510 37573162 36204119 34776917 34112812 33508261 32384626 32076607
4794C2076607o99503j620626j135073q75225j552942q36401o05458k85544o64907
$$ 32076607 31377104 29756478 28621405 27746180 26193238 25356837 24751379 24465835 23800928
4785B3800928j059310k94962n33248n84194j106192K22048n46591p88885o90050
$$ 23800928 22741618 22446656 21913408 21329214 20223022 20445070 19898479 19109594 18419544
4776A8419544J9748p5993p28531k44191n86050P9127n82713j147800k57680n38080
$$ 18419544 18439292 18363299 17634768 17390577 16804527 16883654 16300941 15153141 14895461 14357381
4766A4357381m7355k00192l63810p8348n29707l17095N2237l97392N96540l3229
$$ 14357381 14310026 14109834 13746024 13667676 13137969 12820874 12873111 12475719 13072259 13039030
4756A3039030j036888j144797L20420J37983j89765j222174l41974L29030J93418
$$ 13039030 12002142 10857345 11177765 11315748 11125983 9903809 9561835 9890865 10084283
4747A0084283r3247k00346K7761K53394M76110m18478p53169n25442r5969k24138
$$ 10084283 9991036 9790690 9818451 10071845 10547955 10129477 9376308 8850866 8754897 8530759
4737H530759P03779O66321k67413r07885K22101m5555K96951j375069l49816K56806
$$ 8530759 9234538 9900859 9633446 8725561 8947662 8902107 9199058 7823989 7474173 7730979
4727G730979J49617k38664l37999N31071j10969l46233K52121M51104K01984p884
$$ 7730979 7880596 7641932 7303933 7835004 7724035 7377802 7629923 8081027 8283011 8275127
4717H275127m24588L9913L02246m38082m53533n78544K98937R77854l77265l11628
$$ 8275127 7850539 7890452 8192698 7754616 7301083 6722539 7021476 7999330 7622065 7310437
4707G310437R7568M8491O79237o12425r54068k643m06038P20073K26623K59000
$$ 7310437 7408005 7456496 8135733 7523308 6569240 6566597 6160559 6880632 7107255 7366255
4697G366255j92335M22065j058552J57377J073556l94481p38581P0086M46540
$$ 7366255 7173920 7595985 6537433 6694810 7768366 7373885 6635304 6705390 7151930
4688G151930p6814k96735o00898M11197Q48550m1131l65183N36074R9150j080658
$$ 7151930 7075116 6778381 6177483 6588680 7437230 7396099 7030916 7566990 7666140 6585482
4678F585482J5967J75990L82079L84495k99308N45786j35716N126L58588l33604
$$ 6585482 6601449 6777439 7159518 7544013 7244705 7790491 7654775 7659901 8018489 7684885
4668G684885K00235K60024M11413r29416R17845j10657q26621l89188j40452P40207
$$ 7684885 7885120 8145144 8556557 7627141 8544986 8434329 7607708 7218520 7078068 7818275
4658G818275o28633m0841J29032j75404L30096N84381K80968j77174N23408K2178
$$ 7818275 7189642 7148801 7277833 7102429 7432525 8016906 8297874 8120700 8644108 8666286
4648H666286j297861j15335P05979l4586r343k23714l76312j55927J81432k71192
$$ 8666286 7368425 7253090 7959069 7924483 7915140 7691426 7315114 7159187 7340619 7069427
4638G069427m42452Q53563j65519l92921j448K4677J14285M57153o52930P31999
$$ 7069427 6626975 7480538 7315019 6922098 6920650 6945327 7059612 7516765 6863835 7595834
4628G595834m28002o43303p30897J139819R70708m15713j0554K29736l16985k5978
$$ 7595834 7167832 6524529 5793632 6933451 7904159 7488446 7477892 7707628 7390643 7364665
4618G364665k6350m30272K28496J99792q77385n9543N86961J4000Q8914K08582
$$ 7364665 7338315 6908043 7136539 7336331 6458946 6399403 6986364 7000364 7089278 7297860
4608G297860J35342j32257m45955K67404Q96500n72868q91612l81127j1492M9968
$$ 7297860 7433202 7300945 6854990 7122394 8018894 7446026 6554414 6173287 6161795 6211763
4598F211763Q33532k84848p15319L68935J48464l7793l86980J25968J57514k03495
$$ 6211763 7045295 6760447 6045128 6414063 6562527 6524734 6137754 6263722 6421236 6217741
4588F217741M43041P27537m26949k44222l63768J95905j86734k53454k24139m6612
$$ 6217741 6660782 7388319 6961370 6717148 6353380 6549285 6362551 6109097 5884958 5838346
4578E838346r92765K17752J89424L49620L77477N92060n4414J25528K73197l48384
$$ 5838346 4845581 5063333 5252757 5602377 5979854 6571914 6517500 6643028 6916225 6567841
4568F567841j80279o87641o6006J32370L84575j10568L05736j79710K72404l09217
$$ 6567841 6387562 5699921 5633915 5766285 6150860 6040292 6346028 6166318 6438722 6129505
4558F129505R6389o19949N12070M49965m47088N06581O26151q19970q63946K31803
$$ 6129505 6225894 5605945 6118015 6567980 6120892 6627473 7253624 6433654 5569708 5801511
4548E801511M88348l56024k05573K74345P41805p2014N74580q35545k7394L79976
$$ 5801511 6289859 5933835 5728262 6002607 6744412 6672398 7246978 6411433 6384039 6764015
4538F764015O89986m49033K24511L32236j50765O48118n38035l56972K43168M08234
$$ 6764015 7454001 7004968 7229479 7561715 7410950 8059068 7521033 7164061 7407229 7815463
4528G815463J11079q8458M88820M22124p28875p11975K9219O24022o34435J60490
$$ 7815463 7926542 7838084 8326904 8749028 8020153 7308178 7337397 7961419 7326984 7487474
4518G487474J73621N74078J56646j68186L48975l30444L99528J89563q1501j80537
$$ 7487474 7661095 8235173 8391819 8223633 8572608 8242164 8641692 8831255 8749754 8569217
4508H569217j73863Q97507L08276q8309K66372K73066p08268p55358N34853J47166
$$ 8569217 8395354 9292861 9601137 9512828 9779200 10052266 9343998 8588640 9123493 9270659
4498I270659O6697o96904K79154Q70305O75887K74414q02817k64835M64653l30197
$$ 9270659 9337356 8640452 8919606 9789911 10465798 10740212 9937395 9672560 10137213 9807016
4488I807016k76240Q17763r0765K03198l09696j21382Q02910M1593P08082L26137
$$ 9807016 9530776 10348539 10257774 10460972 10151276 10029894 10832804 10874397 11582479 11908616
4478A1908616j52067R13340M17845J65421k99139J95799L50588N263L51034K07516
$$ 11908616 11756549 12669889 13087734 13253155 12954016 13149815 13500403 13505666 13856700 14064216
4468A4064216P68947K14245Q3020L74920l90488m6341O52336p01403P12032M93081
$$ 14064216 14833163 15047408 15130428 15505348 15114860 15068519 15720855 15019452 15731484 16224565
4458A6224565J30692L36466M10594m83630m4199J160578l00240o08618j77133
$$ 16224565 16355257 16691723 17102317 16618687 16574488 17735066 17434826 16826208 16649075
4449A6649075N55988j7290L17083N84549j17160p97472n74242j64996m78547k18448
$$ 16649075 17205063 17187773 17504856 18089405 17972245 17174773 16600531 16435535 15956988 15738540
4439A5738540q60908J70737j68598m19550k39897j01283M25255n24315K35578
$$ 15738540 14877632 15048369 14879771 14460221 14220324 14119041 14544296 14019981 14255559
4430A4255559j04144m1934j016034M32270J27322L32736M37712j86279K78456
$$ 14255559 14151415 14109481 13093447 13525717 13653039 13985775 14423487 14237208 14515664
4421A4515664p70233K12482N85793l59009r19528m23326n24902m75291P06418
$$ 14515664 13745431 13957913 14543706 14184697 13265169 12841843 12316941 11841650 12548068
4412A2548068M6762l32512r76926P608K06920k10450q8905l54092l1226j8858
$$ 12548068 12594830 12262318 11285392 11293000 11499920 11289470 11200565 10846473 10815247 10796389
4402A0796389r84764k7176O53126l83805j53010L19466m78888Q7753k00135K53544
$$ 10796389 9811625 9784449 10437575 10053770 9900760 10220226 9741338 9829091 9628956 9882500
4392I882500j66745j21465M5477N65820j03531j827j45286n70919M5240l12115
$$ 9882500 9715755 9594290 9639767 10205587 10102056 10100229 9954943 9384024 9429264 9117149
4382I117149K53336m20743k60076J55396l92497J55329N39227k77213n83639q3551
$$ 9117149 9370485 8949742 8689666 8845062 8452565 8607894 9147121 8869908 8286269 8202718
4372H202718P2543N94421m51744K86017j85268L36414k41018o86712L80411L60306
$$ 8202718 8275261 8869682 8417938 8703955 8518687 8855101 8614083 7927371 8307782 8668088
4362H668088k07074m76748N54253J26688l84530q5085P60809k39533k31014l61387
$$ 8668088 8461014 7984266 8538519 8665207 8280677 8195592 8956401 8716868 8485854 8124467
4352H124467q7502K0103P7991J3662l66184n13644j75581J90788M21433M32913
$$ 8124467 8036965 8057068 8135059 8148721 7782537 7268893 7093312 7284100 7705533 8138446
4342H138446k13043p77024L00581l25q8166J75962L00133K25812q45933k07465
$$ 8138446 7925403 7148379 7448960 7448635 7360469 7536431 7836564 8062376 7216443 7008978
4332G008978M72322J83612K03735m37103K56379J03730m34762o46216N60277m72109
$$ 7008978 7481300 7664912 7868647 7431544 7687923 7791653 7356891 6710675 7270952 6798843
4322F798843J39928K36227L70085n84519k04290j09592O67565M71177J82347r32647
$$ 6798843 6938771 7174998 7545083 6960564 6756274 6646682 7314247 7785424 7967771 7035124
4312G035124Q0278K23187K58175k73245l22069K58597n2561L04896l8194l61695
$$ 7035124 7115402 7338589 7596764 7323519 7001450 7260047 7207486 7512382 7474188 7112493
4302G112493K61468L59112l54807j11201J26671Q16865l67009m81468O77345J53465
$$ 7112493 7373961 7733073 7378266 7267065 7393736 8210601 7843592 7362124 8039469 8192934
4292H192934j6331p37933r7655j61629K68638l82234P8597N45206l20829M11941
$$ 8192934 8176603 7438670 7341015 7179386 7448024 7065790 7144387 7689593 7368764 7780705
4282G780705m6322L71730O6573Q64487m95431k64232J70201J8376n33453M95507
$$ 7780705 7734383 8106113 8172686 9037173 8541742 8277510 8447711 8466087 7932634 8428141
4272H428141k4945n20357o12492Q62076J95839p07088j34679R09978l58830o47263
$$ 8428141 8403196 7882839 7270347 8132423 8328262 7621174 7486495 8396473 8037643 7390380
4262G390380N80558L43988J02710k3783J99184j87910J10399N7031k75036M63540
$$ 7390380 7970938 8314926 8417636 8393853 8593037 8405127 8515526 8572557 8297521 8761061
4252H761061p5510j02495J57249K53599j66050o27591M48399O09552q5046k90059
$$ 8761061 8685551 8583056 8740305 8993904 8827854 8200263 8648662 9258214 9173168 8883109
4242H883109l79102M54111m76738J24151L93203M16259l19780l07997J21011l18257
$$ 8883109 8504007 8958118 8481380 8605531 8998734 9414993 9095213 8787216 8908227 8589970
4232H589970O1502K92587L38576k3185Q3120K46624l33109r1364R24442l00369
$$ 8589970 8651472 8944059 9282635 9259450 9342570 9589194 9256085 9164721 10089163 9788794
4222I788794k63060o73418R5911N43401m22806L16148J70988k3053n61791L36068
$$ 9788794 9525734 8852316 8948227 9491628 9068822 9384970 9555958 9532905 8971114 9307182
4212I307182L05348j59588M21834J53149m70042m35118l8826K25233L77594m2646
$$ 9307182 9612530 9452942 9874776 10027925 9557883 9122765 9083939 9309172 9686766 9644120
4202I644120K57830Q65859M72266k8713j34362m18339o34857J30583N11380j32709
$$ 9644120 9901950 10767809 11240075 11211362 11077000 10658661 10023804 10154387 10665767 10533058
4192A0533058K36162j27403n5731N15010J61468M5619M75655l77464L8560l69398
$$ 10533058 10769220 10641817 10586086 11101096 11262564 11308183 11783838 11406374 11444934 11075536
4182A1075536J10133k29897R1998O82312o63211K7786Q16598L63284m41468K20070
$$ 11075536 11185669 10955772 11047770 11730082 11066871 11094657 11911255 12274539 11833071 12053141
4172A2053141M55365j014317o12332M90080Q61809L28784n19323p31884K11814
$$ 12053141 12508506 11494189 10881857 11371937 12233746 12562530 12043207 11311323 11523137
4163A1523137L31733m59894Q52417K90131M39329K05931n91033k06399p6038L85125
$$ 11523137 11854870 11394976 12247393 12537524 12976853 13182784 12591751 12385352 12309314 12694439
4153A2694439k29933l45305o6338N92633R8256J67534Q09317l13882K18349P1563
$$ 12694439 12464506 12119201 12052863 12645496 12743752 12911286 13720603 13406721 13625070 13696633
4143A3696633j005988K70791K7942J100267j78223m51101P4842M46793r989l63447
$$ 13696633 12690645 12961436 12989378 14089645 13911422 13460321 13535163 13981956 13971967 13608520
4133A3608520J09040N42038j34513j09916J055184M93324K03821k20223j03455
$$ 13608520 13717560 14259598 14125085 14015169 15070353 15563677 15767498 15547275 15443820
4124A5443820J41512J99414R27163K78613r12982L45926K12322L8197p56945L69587
$$ 15443820 15585332 15784746 16711909 16990522 16077540 16423466 16635788 16673985 15917040 16286627
4114A6286627j62377K17922K55524l50509M23375N91196K43497J18928R13363
$$ 16286627 16124250 16342172 16597696 16247187 16670562 17261758 17505255 17624183 18537546
4105A8537546j10938N00490j98238o85425K22524k1915K52045J375749N66148
$$ 18537546 18426608 18927098 18728860 18043435 18265959 18244044 18496089 19871838 20437986
4096B0437986J07453K98732O95967k73254l02458P44838K31562N16171J58885
$$ 20437986 20545439 20844171 21540138 21266884 20964426 21709264 21940826 22456997 22615882
4087B2615882k9974j54481J48760q7515l43797m10112M99363K17596Q61297l01860
$$ 22615882 22585908 22431427 22580187 22492672 22148875 21738763 22238126 22455722 23317019 23015159
4077B3015159k00471N24227p92191k06050k72404k93836M47543M32355L28696
$$ 23015159 22814688 23338915 22546724 22340674 22068270 21774434 22221977 22654332 22983028
4068B2983028r08709n04821L00435J91228J65917N12749N7015N84602L76247j07156
$$ 22983028 22074319 21569498 21869933 22061161 22227078 22739827 22796842 23381444 23757691 23650535
4058B3650535r6866K83634l50632k91114r5654J78116J86396K52424M95043M6566
$$ 23650535 23553669 23837303 23486671 23195557 23099903 23278019 23464415 23716839 24211882 24258448
4048B4258448P28503k43341L55049o75955K93379Q0171K71219K21714K18236K29800
$$ 24258448 24986951 24743610 25098659 24422704 24716083 24796254 25067473 25289187 25507423 25737223
4038B5737223L99680N64844P61633N71055r7436J94752M41431q2234k8031K75631
$$ 25737223 26136903 26701747 27463380 28034435 27936999 28131751 28573182 28490948 28462917 28738548
4028B8738548M78376M28131N6677L08584K16769r128m71496J60456o87686j36401
$$ 28738548 29216924 29645055 29701732 30010316 30227085 30217957 29746461 29906917 29219231 29082830
4018B9082830k50409n51264P89253m43290r75915M25542O78665O99120M0412q68319
$$ 29082830 28832421 28281157 29070410 28627120 27651205 28076747 28755412 29454532 29494944 28626625
4008B8626625l78233m03451q8774l73044j028049Q4720R52868M8647o82848J80874
$$ 28626625 28248392 27844941 27756167 27383123 26355074 26439794 27392662 27441309 26758461 26939335
3998B6939335J35165L99037n71170m79743L28507k45704j59771N29913Q25200
$$ 26939335 27074500 27473537 26902367 26422624 26751131 26505427 26345656 26875569 27700769
3989B7700769l30835n6452j19965K79161j74516j51298P45957K69083N07245n12424
$$ 27700769 27369934 27313482 27193517 27472678 27298162 27146864 27892821 28161904 28669149 28156725
3979B8156725n98333O30975l14672L70960J255808K98743R4255j54621k67883
$$ 28156725 27558392 28189367 27874695 28245655 29501463 29800206 29894461 29739840 29471957
3970B9471957N72803k17822J34K63682J36933j59581L81339L25219p7515j86128
$$ 29471957 30044760 29826938 29827072 30090754 30227687 30068106 30449445 30774664 30697149 30511021
3960C0511021L60783K91745k7106o2037k07721J0948L44617N55674L51581O67930
$$ 30511021 30871804 31163549 31136443 31074406 30866685 30877633 31222250 31777924 32129505 32797435
3950C2797435m85166J47325J13732N64813L1929p0341j35115p0851j95810Q906
$$ 32797435 32312269 32459594 32573326 33138139 33170068 33099727 32964612 32893761 32697951 32706857
3940C2706857k0888O26257O70204j52528l84209J56741M37322O93209L58096j36380
$$ 32706857 32685969 33312226 33982430 33829902 33445693 33602434 34039756 34732965 35091061 34954681
3930C4954681j00190j94915K54669R52401Q14649l71035J98029M02087M44433
$$ 34954681 34854491 34659576 34914245 35866646 36681295 36310260 36508289 36910376 37354809
3921C7354809O89247k59330J0834M37267L50986o7975j1004Q73003n4402K71947
$$ 37354809 38044056 37784726 37795560 38232827 38583813 38515838 38504834 39377837 39323435 39595382
3911C9595382J010723l63012M20429J90719k66098P22893P29006j71841j84749
$$ 39595382 40606105 40243093 40663522 40854241 40588143 41311036 42040042 41868201 41683452
3902D1683452J3765k3026K31695o21123M59145O61567n20634m94317l32397L92530
$$ 41683452 41697217 41674191 41905886 41284763 41743908 42405475 41884841 41390524 41058127 41450657
3892D1450657L42491l66158K05395P65350j450145J65572O16809j87254J35965
$$ 41450657 41793148 41426990 41632385 42397735 40947590 41113162 41729971 41542717 41678682
3883D1678682o29933P8245k96763l72654m938L23779J05487R55135J25012n82620
$$ 41678682 41048749 41126994 40830231 40457577 40452639 40776418 40881905 41837040 41962052 41379432
3873D1379432K31833M48864K93783o44899N66447J055390K06517P48691k20282
$$ 41379432 41611265 42060129 42353912 41709013 42275460 43330850 43537367 44286058 44065776
3864D4065776L96980l68301P4326P8901K75583k39240L79574q0398j7826l7493
$$ 44065776 44462756 44094455 44168781 44247682 44523265 44284025 44663599 44583201 44565375 44527882
3854D4527882k99712J12501k52470K27050o9146L89024j22232K79385J26592m96429
$$ 44527882 44228170 44340671 44088201 44315251 44246105 44635129 44512897 44792282 44918874 44422445
3844D4422445M75069k76437J57075P25557q10183J57693J37769o99481N7068j1022
$$ 44422445 44897514 44621077 44778152 45503709 44693526 44851219 44988988 44289507 44346575 44335553
3834D4335553k67622j12820M39907J0104L06379j41473k46893Q87148P03179k4869
$$ 44335553 44067931 43955111 44395018 44405122 44711501 44570028 44323135 45210283 45913462 45888593
3824D5888593m99557m97588k7171J087965r4448J61584N83913M10945N15658M64651
$$ 45888593 45389036 44891448 44864277 45952242 45857794 46019378 46603291 47014236 47529894 47994545
3814D7994545K6837p961N27271J24173L09144R33028l21014l17029M17677P01965
$$ 47994545 48021382 48013421 48540692 48664865 48974009 49907037 49586023 49268994 49686671 50388636
3804E0388636P13188L23213J158174l6128Q9003P00798k91158K18249O93855K05622
$$ 50388636 51101824 51425037 52583211 52547083 52636086 53336884 53045726 53263975 53957830 54163452
3794E4163452l09675L29008J201480L22517L8468Q30895J84414O77690L47813
$$ 54163452 53853777 54182785 55384265 55706782 55745250 56576145 56760559 57438249 57786062
3785E7786062j72394M84071N95528m35059P34852O4373K21771L72344O69255L75334
$$ 57786062 57613668 58097739 58693267 58258208 58993060 59057433 59279204 59651548 60320803 60696137
3775F0696137K33610J139619R8041K68882J075207J463445K14029J287931O21928
$$ 60696137 60929747 62069366 62167407 62436289 63511496 64974941 65188970 66476901 67098829
3766F7098829R86223O44221P35717R17855J017227J612432m5909M21431P88137
$$ 67098829 68085052 68729273 69464990 70382845 71400072 73012504 72966595 73388026 74176163
3757G4176163P48136R25401J031712J539852Q95949N53559Q73381P33543J024597
$$ 74176163 74924299 75849700 76881412 78421264 79317213 79870772 80744153 81477696 82502293
3748H2502293P62401K37228L68860J135501n8734L05649O47948M6853J19020M63474
$$ 82502293 83264694 83501922 83870782 85006283 84947549 85253198 85901146 85947999 86067019 86530493
3738H6530493O39991j31749P53680R96418j95634M71756O68011J95105k79640
$$ 86530493 87170484 87038735 87792415 88788833 88593199 89064955 89732966 89928071 89648431
3729H9648431L52268L5681L5636P161J88906p67024r77048n22543r26046r75839
$$ 89648431 90000699 90036380 90072016 90079177 90268083 89501059 88524011 88001468 87075422 86099583
3719H6099583r76907l12666J26014J48786n05514r46049j385238j434881l91069
$$ 86099583 85122676 84810010 84936024 85084810 84579296 83633247 82248009 80813128 80422059
3710H0422059L46904o56717l23463m24596l24390l27722m41494j120580n77133
$$ 80422059 80768963 80112246 79788783 79364187 79039797 78712075 78270581 77150001 76572868
3701G6572868p17770j407807m28638m03494m73451r76208r42077J08148l53392
$$ 76572868 75855098 74447291 74018653 73615159 73141708 72165500 71223423 71331571 70978179
3692G0978179q49657r68045k31079j87555l17375j223797j23252j15918q79785
$$ 70978179 70128522 69160477 68929398 68741843 68424468 67200671 67077419 66961501 66081716
3683F6081716q27246n13369l29715m28957j346415N14054O6171n85321n2971o62335
$$ 66081716 65254470 64741101 64411386 63982429 62636014 63150068 63216239 62630918 62577947 61915612
3673F1915612r0844o06552p51892j010232l73973o20261l64429k15121q48572
$$ 61915612 61824768 61218216 60466324 59456092 59082119 58461858 58097429 57882308 57033736
3664E7033736j99989j65344k77234j32582j240505L2748m7925n6188l62163J01271
$$ 57033736 56833747 56668403 56391169 56258587 55018082 55050830 55002905 54946717 54584554 54685825
3654E4685825K611o20147l08563m09049l53822l16943l62746L73026m50006j89383
$$ 54685825 54688436 54068289 53759726 53350677 52996855 52679912 52317166 52690192 52240186 52050803
3644E2050803K85097j002548q63798k88861k23792m7049m2142K9762j06867r99807
$$ 52050803 52335900 51333352 50469554 50180693 49956901 49909852 49867710 49897472 49790605 48790798
3634D8790798K44118r6690o48796j66993j102170l88090j25756P23273Q0399j7996
$$ 48790798 49034916 48938226 48289430 48122437 47020267 46632177 46506421 47229694 47310093 47292097
3624D7292097J0538m90754l48241q67417M02581J54188q44462j240104l03988
$$ 47292097 47302635 46811881 46463640 45596223 45998804 46152992 45308530 44068426 43764438
3615D3764438j04816L29781J05651p60467p72719o49841L18673M41932r07278
$$ 43764438 43659622 43989403 44095054 43334587 42561868 41912027 42230700 42672632 41765354
3606D1765354m11399Q96125J15701J58159m83028l17297m74808R9146q84785q5850
$$ 41765354 41353955 42250080 42365781 42523940 42040912 41723615 41248807 41347953 40463168 40377318
3596D0377318O27883m01558l97262M70787j74200m28704j77700r21037M01611
$$ 40377318 41005201 40603643 40206381 40677168 40502968 40074264 39896564 38975527 39377138
3587C9377138J8862n06224l1484k98211j14204M86434J8914o56896J63163O22518
$$ 39377138 39396000 38889776 38858292 38560081 38445877 38932311 38951225 38294329 38457492 39080010
3577C9080010m92971O05932k17744n52949M56048j94412p65400J47290L7908K64610
$$ 39080010 38587039 39192971 38975227 38422278 38878326 38683914 37918514 38065804 38103712 38368322
3567C8368322L76474k78713l56790m49567j92886O80477J28839N7289J46869m34485
$$ 38368322 38744796 38466083 38109293 37659726 37466840 38147317 38276156 38333445 38480314 38045829
3557C8045829o91507j64112P4240L12273N83603L40427k25977o5141n5232Q81634
$$ 38045829 37354322 37190210 37264450 37576723 38160326 38500753 38274776 38209635 38154403 39036037
3547C9036037O16552O42138n83896m8624L35165o13243m16782J79517J29762m47084
$$ 39036037 39652589 40294727 39710831 39662207 39997372 39384129 38967347 39146864 39276626 38829542
3537C8829542J059037j69004j034420N64610n00219J78209k21045p71224L99794
$$ 38829542 39888579 39719575 38685155 39249765 38749546 38927755 38706710 37935486 38335280
3528C8335280O02504n11331K78199j08820j93574K72433l69690L927J22430j73646
$$ 38335280 38937784 38426453 38704652 38595832 38402258 38674691 38305001 38308928 38431358 38257712
3518C8257712n8711M01609l48364J14123n12236Q25462P37405l21614J21609J376163
$$ 38257712 38199001 38600610 38252246 38366369 37854133 38679595 39417000 39095386 39216995 40593158
3508D0593158K33304j174845p2692M12708j46578P03585r4270p88583K81862Q0403
$$ 40593158 40826462 39651617 39578925 39991633 39845055 40548640 40454370 39665787 39947649 40028052
3498D0028052n79056M42736l0579J8169K51450q1452k99148O49712K65809Q7362
$$ 40028052 39448996 39891732 39861153 39879322 40130772 40049320 39750172 40399884 40665693 40753055
3488D0753055k60164n61448J05194n08243k09330P10100j165564M22111N82141
$$ 40753055 40492891 39931443 40036637 39528394 39319064 40029164 38863600 39285711 39867852
3479C9867852o43695N6400L76964K53833L05915M7791j86894K41701m537J035638
$$ 39867852 39224157 39280557 39657521 39911354 40217269 40265060 40078166 40319867 40315330 41350968
3469D1350968L19501j9954Q21031k75692l81542o35793N83277r2635P3390M85105
$$ 41350968 41670469 41650515 42471546 42195854 41814312 41178519 41761796 41669161 41742551 42227656
3459D2227656K53260M17890J92660n2676k61761N02625j04895K3532P11283J273239
$$ 42227656 42480916 42898806 43091466 43038790 42777029 43279654 43174759 43198291 43909574 45182813
3449D5182813L15268o30771K26536J095708O85977N90884L00993n9814J100435
$$ 45182813 45498081 44867310 45093846 46189554 46875531 47466415 47767408 47707594 48808029
3440D8808029J377702L27289N13140P38913J136435M39077N59619M76660P63320
$$ 48808029 50185731 50513020 51026160 51765073 52901508 53340585 53900204 54376864 55140184
3431E5140184L81534J129815Q39378O17975N88411J128806J254990J270926J376146
$$ 55140184 55521718 56651533 57490911 58108886 58697297 59826103 61081093 62352019 63728165
3422F3728165J571363K586144K849495L272639L352274K912363M093211M578476
$$ 63728165 65299528 67885672 70735167 74007806 77360080 80272443 84365654 88944130
3414H8944130M397328M122667K981590K410040K104790J595625p99814j452945
$$ 88944130 93341458 97464125 100445715 102855755 104960545 106556170 105756356 104303411
3406A04303411k548520m212275n127972n364668n148311n242202l820941l725794
$$ 104303411 101754891 97542616 92414644 87049976 81901665 76659463 72838522 69112728
3398F9112728k967090k157630j904733j190102j033782q98926j722401j653252
$$ 69112728 66145638 63988008 62083275 60893173 59859391 58960465 57238064 55584812
3390E5584812j111221j069755n09756n58052p66869o09226j271255j088997o21768
$$ 55584812 54473591 53403836 52894080 52336028 51569159 50959933 49688678 48599681 47977913
3381D7977913j222659l58220K51250j19832p62528n16598m48782q69687n50473
$$ 47977913 46755254 46397034 46648284 46528452 45765924 45249326 44800544 43930857 43380384
3372D3380384J47828p020j221442n67805l89256n02617k47819l41415j84521N35360
$$ 43380384 43528212 43521192 42299750 41731945 41342689 40840072 40592253 40250838 40066317 40601677
3362D0601677l98450q2516n10767n16163O59892j022026M15625k40805q71693
$$ 40601677 40203227 40120711 39609944 39093781 39753673 38731647 39147272 38906467 38034774
3353C8034774l13749O68212n17191j02029k18484P78834m36573J65960L11809
$$ 38034774 37721025 38389237 37872046 37770017 37551533 38330367 37893794 38059754 38371563
3344C8371563l50628m38434j040471M06827K84304J48416n65959N02692L84932
$$ 38371563 38020935 37582501 36542030 36948857 37233161 37381577 36815618 37318310 37703242
3335C7703242L43270M06777O19408q9546o30908K30672M17268k99510M22845o33568
$$ 37703242 38046512 38453289 39072697 38983151 38352243 38582915 39000183 38700673 39123518 38489950
3325C8489950p40043J17072K62626K2191n4648O44152J11193m17493M36592J91471
$$ 38489950 37749907 37866979 38129605 38151796 38097148 38741300 38852493 38435000 38871592 39063063
3315C9063063L55517k72286p1926r0474Q5408J73818m69917k16100N01255M71412
$$ 39063063 39418580 39146294 39074368 38983894 39069302 39243120 38773203 38557103 39058358 39529770
3305C9529770j60224j15907o28420j2799L6833M69079J73298M7093M92276K83493
$$ 39529770 39369546 39253639 38625219 38612420 38649253 39118332 39291630 39338723 39830999 40114492
3295D0114492K80058M32061o3133j57865N08025N06225J056608l57783N32289
$$ 40114492 40394550 40826611 40763478 40605613 41113638 41619863 42676471 42318688 42850977
3286D2850977P0J95821O64821P67457K67485L59764M40528K69450K07064J275462
$$ 42850977 42851047 43046868 43711689 44479146 44746631 45106395 45546923 45816373 46023437 47298899
3276D7298899N62402Q26044O20328J241270Q11303R43786J741351J067540J085261
$$ 47298899 47861301 48687345 49307673 50548943 51360246 52304032 54045383 55112923 56198184
3267E6198184J696551J197891N71311J705350J925182J631073K008087J847043
$$ 56198184 57894735 59092626 59663937 61369287 63294469 64925542 66933629 68780672
3259F8780672J443876K935434L518733K205613K320567M392484N395828O889029
$$ 68780672 70224548 73159982 76678715 78884328 81204895 85597379 90993207 97882236
3251I7882236P757158R327525J1106632J2989068J4583713J7203464K0169923
$$ 97882236 105639394 114966919 126073551 139062619 153646332 170849796 191019719
3244A91019719K3465053K6119866K7099927K5691571K2466081J6190712O018472
$$ 191019719 214484772 240604638 267704565 293396136 315862217 332052929 338071401
3237C38071401o626642j5553283k3755509k9324850l1794402l0521769k6996792
$$ 338071401 331444759 315891476 292135967 262811117 231016715 200494946 173498154
3230A73498154k1190738j7201744j2976433j0093138p688082n404021n582448
$$ 173498154 152307416 135105672 122129239 112036101 104348019 98943998 93361550
3223I3361550m831959m479716m189437l665131k533978k741072k575032j906995
$$ 93361550 88529591 84049875 79860438 76195307 73661329 70920257 68345225 66438230
3215F6438230k201310k170541j601621j233752j214230k144445j169615n63647
$$ 66438230 64236920 62066379 60464758 59231006 58016776 55872331 54702716 54139069
3207E4139069m10165p89074r53369j67101l35221k34483j354341r5665K82707
$$ 54139069 53728904 52939830 51986461 51819360 51484139 51249656 49895315 49799650 50082357
3198E0082357r75744q36298p19482l86290r30794n04569R8674N17765K11530j981128
$$ 50082357 49106613 48270315 47550833 47164543 46233749 45729180 45827854 46345619 46557149 44576021
3188D4576021M90601O08431n06213K50263q0922K12888q77724j57066K77613L55153
$$ 44576021 45066622 45675053 45168840 45419103 45338181 45551069 44673345 44516279 44793892 45149045
3178D5149045l44860m91336m49467M61220L71794P10177j74381L90356p03918
$$ 45149045 44804185 44312849 43863382 44324602 44696396 45406573 45232192 45622548 44918630
3169D4918630M2628L66682m20512N41047n58412Q52387R61268J484M89578k53416
$$ 44918630 44961258 45327940 44907428 45448475 44890063 45742450 46703718 46705202 47194780 46941364
3159D6941364k87656L0939L78902N38073m02401j15934k55066L70985Q27538J434787
$$ 46941364 46653708 46684647 47063549 47601622 47199221 47083287 46828221 47199206 48026744 49461531
3149D9461531p46606k96792P01431R07596Q08651M74754q0571O63638M53884M89676
$$ 49461531 48714925 48418133 49119564 50027160 50835811 51310565 51229994 51893632 52347516 52837192
3139E2837192P79184K89544l62350J98093M93391J173534O19541L08855K69029
$$ 52837192 53616376 53905920 53543570 53741663 54235054 55408588 56028129 56336984 56606013
3130E6606013Q00648M68089P30747J043887K54816J276799L92566K23813P0014
$$ 56606013 57406661 57874750 58605497 59649384 59904200 61180999 61573565 61797378 61867392
3121F1867392O74328L81186J478160J247345M26868R62145J020212R96522J40068
$$ 61867392 62541720 62922906 64401066 65648411 66075279 67037424 68057636 69054158 69194226
3112F9194226N63762J251958J175484J020934K24200P41680J697040J124270P08043
$$ 69194226 69757988 71009946 72185430 73206364 73430564 74172244 75869284 76993554 77701597
3103G7701597M72316N37601J700363J424742J939978J138104J119020J272224
$$ 77701597 78173913 78711514 80411877 81836619 83776597 84914701 86033721 87305945
3095H7305945J323402J425321J465451J346608K433971J206216P01135J895164
$$ 87305945 88629347 90054668 91520119 92866727 95300698 96506914 97208049 99103213
3087I9103213J545488J130182J060103K058623K201492J622868J823055K402460
$$ 99103213 100648701 101778883 102838986 104897609 107099101 108721969 110545024 112947484
3079A12947484K230850J874156K076422K097763K741342J347915K759266L437501
$$ 112947484 115178334 117052490 119128912 121226675 123968017 125315932 128075198 131512699
3071A31512699K089330L073369L307740L053609L109440L075009L218216K961613
$$ 131512699 133602029 136675398 139983138 143036747 146146187 149221196 152439412 155401025
3063A55401025J985960J678989K580620K290057J164512J119323Q89251J924643
$$ 155401025 157386985 159065974 161646594 163936651 165101163 166220486 167109737 169034380
3055A69034380O96868j59068O16696J304875R98562J390117Q48588k19791P42789
$$ 169034380 169731248 169572180 170188876 171493751 172492313 173882430 174731018 174511227 175254016
3046A75254016J030102Q06615J998485J343649N44974J32263J046723J481875
$$ 175254016 176284118 177090733 179089218 180432867 180977841 181110104 182156827 183638702
3038A83638702N9744J007661N97555O94177J059516R84111L1343M70966M37381
$$ 183638702 183698446 184706107 185303662 185997839 187057355 188041466 188072809 188543775 188981156
3029A88981156q06Q76870O96202k8209K98826M9446l38586l7927j036777p06015
$$ 188981156 188980350 189857220 190553422 190525213 190824039 190873485 190534899 190496972 189460195 188754180
3019A88754180k95408k70264m95293q55856k17124q61426p04405j039146m61121
$$ 188754180 188458772 188188508 187693215 186837359 186620235 185758809 185054404 184015258 183554137
3010A83554137n15171L3986j243158j379112p35415r93973p67561n15957l39734
$$ 183554137 183038966 183072952 181829794 180450682 179715267 178721294 177953733 177437776 177098042
3001A77098042j288973q32069j93792j680641j581924p87818r41124Q8110m86947
$$ 177098042 175809069 174977000 174783208 173102567 171520643 170732825 169791701 169879811 169392864
2992A69392864m71601j094175P9556l61547q16450o40999M17316j22516l97660
$$ 169392864 168921263 167827088 167906644 167545097 166728647 166087648 166504964 166382448 165984788
2983A65984788J054702L51061n88391m72079q77462j55417n34103N7408J145682
$$ 165984788 167039490 167390551 166802160 166330081 165452619 165297202 164763099 164820507 165966189
2974A65966189O53859k31147M55138Q56994r7996P21600J201023m29204P52052
$$ 165966189 166620048 166388901 166844039 167701033 167603037 168324637 169525660 169096456 169848508
2965A69848508J050446O57401L83270L45815J207436P64137P61284J454721J244778
$$ 169848508 170898954 171556355 171939625 172285440 173492876 174257013 175018297 176473018 177717796
2956A77717796Q72643N13148J222307J633164J475296R14036J477180J101287
$$ 177717796 178590439 179103587 180325894 181959058 183434354 184348390 185825570 186926857
2948A86926857J365971J330695J492637J285824J319009J482413J669882J440123
$$ 186926857 188292828 189623523 191116160 192401984 193720993 195203406 196873288 198313411
2940A98313411J33081J099448J307684J555007J623234R09542O56539K64183O5176
$$ 198313411 198446492 199545940 200853624 202408631 204031865 204941407 205597946 205862129 205927305
2931B05927305Q9720k2112P05044j621n27198o6615L17001j066614j036933J8803
$$ 205927305 206017025 205994913 206699957 206698336 206171138 206104523 206421524 205354910 204317977 204336780
2921B04336780k75672l52098j049300j775626k107893n90945j572732j543893
$$ 204336780 204061108 203709010 202659710 200884084 198776191 198185246 196612514 195068621
2913A95068621o82908j527081j956026j884979j727381k102390j910617j970273
$$ 195068621 194385713 192858632 190902606 189017627 187290246 185187856 183277239 181306966
2905A81306966k083475j555471j717882k132223j952903k890277j990308j828952
$$ 181306966 179223491 177668020 175950138 173817915 171865012 168974735 166984427 165155475
2897A65155475j425741j720645j752321k270786j729561j576540k297140j681236
$$ 165155475 163729734 162009089 160256768 157985982 156256421 154679881 152382741 150701505
2889A50701505j280038j132993j609268k826584o31867m23225j268580j622090
$$ 150701505 149421467 148288474 146679206 143852622 143220755 142797530 141528950 139906860
2881A39906860q34597k201682j390017j345814r2781q75406p78331j617784j029121
$$ 139906860 139072263 136870581 135480564 134134750 134041969 133166563 132388232 130770448 129741327
2872A29741327o86410j077772q97745j873030o43491m14856j20852j477864j329301
$$ 129741327 129054917 127977145 127079400 125206370 124562879 124148023 124027171 122549307 121220006
2863A21220006m18332q86553j358099j754521j82763k34473j154299j091931j316322
$$ 121220006 120801674 119915121 118557022 116802501 116619738 116385265 115230966 114139035 112822713
2854A12822713j755738j205141k47569j428317p69031o35728k21406j632102o17750
$$ 112822713 111066975 109861834 109614265 108185948 107416917 106781189 106559783 104927681 104309931
2845A04309931p40359k179052j082732n61959j172622j119625n37285m62125j123353
$$ 104309931 103569572 101390520 100307788 99745829 98573207 97453582 96916297 96454172 95330819
2836I5330819k86802j141215r25154J04869j107740j089447k12892o81873j009613
$$ 95330819 95044017 93902802 92977648 93082517 91974777 90885330 90672438 89990565 88980952
2827H8980952j574598q59806q68122M82792M50884q63710j078190o55922j99792
$$ 88980952 87406354 86546548 85678426 86161218 86612102 85748392 84670202 84014280 83814488
2818H3814488p33299N8689k73761o96511M04256j63133l30286q66406m14574o46178
$$ 83814488 83081189 83139878 82866117 82169606 82573862 82410729 82080443 81214037 80799463 80153285
2808H0153285n21975q4042j78441k19127l32479k9017J65177o92924l05667j54758
$$ 80153285 79631310 79547268 79368827 79149700 78817221 78788204 78953381 78260457 77954790 77800032
2798G7800032q91722N25418m76527p35618N52625k76102m60731J87294k57163
$$ 77800032 76908310 77433728 76957201 76221583 76774208 76498106 76037375 76224669 75967506
2789G5967506p02895J09303M83204n06386o31474o6698m55518o34020N99500m65359
$$ 75967506 75264611 75373914 75857118 75350732 74719258 74652560 74197042 73563022 74162522 73697163
2779G3697163O2530M38150p17167l4477Q31711j94100j93388m7421n62590m05879
$$ 73697163 73759693 74197843 73480676 73446199 74277910 74083810 73890422 73843001 73280411 72874532
2769G2874532L81805L24452M48421n54106l96056L84870J194113J175976n763
$$ 72874532 73256337 73580789 74029210 73475104 73079048 73463918 74658031 75834007 75828244
2760G5828244M00607K47305J58260l4102j943R58889N33082L53191R31358M38428
$$ 75828244 76228851 76476156 76634416 76600314 76598371 77557260 78090342 78443533 79374891 79813319
2750G9813319L7115p96382Q57208O33664J471307O12191N81372P15315J111424
$$ 79813319 79850434 79054052 79911260 80544924 82016231 82628422 83209794 83925109 85036533
2741H5036533q4967Q23063R41820Q1784Q83846Q09690K17506K12680O98759j101
$$ 85036533 84951566 85774629 86716449 86798233 87682079 88491769 88709275 88921955 89620714 89619613
2731H9619613K52127R99259L5171p90263J16619J87950L47617j90623J16795L05575
$$ 89619613 89871740 90870999 90906170 90115907 90232526 90420476 90768093 90577470 90694265 90999840
2721I0999840k06032j041391Q93071l39938J90391O9561n67888n12324p42670
$$ 90999840 90793808 89752417 90645488 90305550 90495941 90565502 89997614 89485290 88742620
2712H8742620n46717n89912p04955m76861m01393K34535K6522m32701o28471q68436
$$ 88742620 88195903 87605991 86901036 86424175 86022782 86257317 86283839 85851138 85222667 84354231
2702H4354231p13066l63002M68429m08449j016958o92111n20781o53640k6375
$$ 84354231 83641165 83278163 83746592 83338143 82321185 81629074 81108293 80454653 80428278
2693H0428278j46091o34976j40256J72146M54120l37585j485332J9275L92366
$$ 80428278 80282187 79647211 79506955 79679101 80133221 79795636 78310304 78329579 78721945
2684G8721945J79543m03763k55577R45299J151143K42344J35173O80340j11902
$$ 78721945 78901488 78497725 78242148 79187447 80338590 80580934 80716107 81396447 81284545
2675H1284545K05597R61741R40268J200195R25949L50225P72670Q34159J301647
$$ 81284545 81490142 82451883 83392151 84592346 85518295 85868520 86641190 87475349 88776996
2666H8776996J113884J498071N22816J350925J231880J204073K420536M81497
$$ 88776996 89890880 91388951 91911767 93262692 94494572 95698645 98119181 98600678
2658I8600678Q80382J387164J153773J783341J476147J490924Q51667J182293
$$ 98600678 99481060 100868224 102021997 103805338 105281485 106772409 107624076 108806369
2650A08806369J680298P16945P91513J644031J125318P41870J393587J041311
$$ 108806369 110486667 111203612 111995125 113639156 114764474 115506344 116899931 117941242
2642A17941242Q89346R06733J024059J167394J118685P0882K94318M64652O1785
$$ 117941242 118830588 119737321 120761380 121928774 123047459 123118341 123412659 123877311 123939096
2633A23939096O84402M91557O33651J43407M31925J644945M59267m9000O85921
$$ 123939096 124623498 125115055 125748706 125892113 126324038 127968983 128428250 128379250 129065171
2624A29065171J402339J056914M06511J492041J469815J802214J167735J217052
$$ 129065171 130467510 131524424 131930935 133422976 134892791 136695005 137862740 139079792
2616A39079792J076841J482601J275539J720003J724494K019407K646076K305461
$$ 139079792 140156633 141639234 142914773 144634776 146359270 148378677 151024753 153330214
2608A53330214J870769K104101J772550K814679L520374J689194L468826K971634
$$ 153330214 155200983 157305084 159077634 161892313 165412687 167101881 170570707 173542341
2600A73542341K465623K638314K278886L015492L644613K987401L780112L660065
$$ 173542341 176007964 178646278 180925164 183940656 187585269 190572670 194352782 198012847
2592A98012847K749029M371569L771160L756012L577874K607038M364018L819289
$$ 198012847 200761876 205133445 208904605 212660617 216238491 218845529 223209547 227028836
2584B27028836M040557M036247M106298L344945K827700L984123L688491K590103
$$ 227028836 231069393 235105640 239211938 242556883 245384583 249368706 253057197 255647300
2576B55647300M043945L113888K520188L344658L060534K396222K533557K817110
$$ 255647300 259691245 262805133 265325321 268669979 271730513 274126735 276660292 279477402
2568B79477402J794975J215335J069665R93597J321061n88734N32130q0800j318335
$$ 279477402 281272377 282487712 283557377 284550974 285872035 285283301 285815431 285734631 284416296
2559B84416296K12437l75626j417845j792076j603420j792187k647542l108439
$$ 284416296 284628733 284253107 282835262 281043186 279439766 277647579 275000037 271891598
2551B71891598j857699k469636k613900l046440l997796k904594k966681l915242
$$ 271891598 270033899 267564263 264950363 261903923 257906127 255001533 252034852 248119610
2543B48119610l436016l584851l216915k671237m076645l967563l309924l815224
$$ 248119610 244683594 241098743 237881828 235210591 231133946 227166383 223856459 220041235
2535B20041235l094365l374444l222906k832942l987953l059350k512118k717963
$$ 220041235 216946870 213572426 210349520 207516578 203528625 200469275 197957157 195239194
2527A95239194l183839l462802k840017j977764k280984k471620k332131k290298
$$ 195239194 192055355 188592553 185752536 183774772 181493788 179022168 176690037 174399739
2519A74399739j906124j414344k064506k274449k230040k095193j320391j352542
$$ 174399739 172493615 171079271 169014765 166740316 164510276 162415083 161094692 159742150
2511A59742150q50678j465333j880528j193190j790055j583903j388230j832937
$$ 159742150 158891472 157426139 155545611 154352421 152562366 150978463 149590233 147757296
2503A47757296o11656r74140r71059j457439j406068j298971j519207j233728
$$ 147757296 147145640 146171500 145200441 143743002 142336934 141037963 139518756 138285028
2495A38285028j123904j390013j610113r37183r94023j673676j880803r42786
$$ 138285028 137161124 135771111 134160998 133223815 132229792 130556116 128675313 127732527
2487A27732527j321193j235876r15693j570030p40156j768149j434820j839179
$$ 127732527 126411334 125175458 124259765 122689735 121949579 120181430 118746610 116907431
2479A16907431j233877j693125j424946j585310r28601j182739j159036r45335
$$ 116907431 115673554 113980429 112555483 110970173 110041572 108858833 107699797 106754462
2471A06754462j970274j011958q71490r22345o82083j460033r82165j485358o62631
$$ 106754462 104784188 103772230 102900740 101978395 101296312 99836279 98854114 97368756 96706125
2462I6706125j27350l08744j167058q12995m01968r93316o13843m54337n89814
$$ 96706125 96578775 96270031 95102973 94289978 93888010 92894694 92280851 91826514 91236700
2453I1236700j680877q36152l29887m10855r72772j77809j605278j357368k80914
$$ 91236700 89555823 88719671 88389784 87978929 87006157 86828348 85223070 83865702 83584788
2444H3584788q05956n89938j200063j452131q80359m86843q83229J1130p50761
$$ 83584788 82778832 82188894 80988831 79536700 78656341 78169498 77286269 77297399 76546638
2435G6546638j446747o47842j345994j300718p09394j414226j019489j137934
$$ 76546638 75099891 74452049 73106055 71805337 71095943 69681717 68662228 67524294
2427F7524294j198602q46870j410954j312724j282648j22126j206192j379060
$$ 67524294 66325692 65478822 64067868 62755144 61472496 61350370 60144178 58765118
2419E8765118o26453o66910j900263j410878L34969q72309l23227k62636l44946
$$ 58765118 58138665 57471755 55571492 54160614 54495583 53623274 53300047 53037411 52692465
2410E2692465j317082n17806L59735r56768j017566j008631k68091j032040l71109
$$ 52692465 51375383 50857577 51217312 50260544 49242978 48234347 47966256 46934216 46563107
2401D6563107p03585N93905q10459r71112r27335R62635O84761l80298p12896
$$ 46563107 45859522 46453427 45642968 44671856 43744521 44707156 45391917 45011619 44298723
2392D4298723p96168l7410j0764m34710r99205q27249k05925L76207j032540p43718
$$ 44298723 43502555 43465145 43454381 43019671 42020466 41193217 40987292 41363499 40330959 39587241
2382C9587241K49795k40399K42198r99397j352701N4125K67413K10007j573119
$$ 39587241 39837036 39596637 39838835 38839438 37486737 37540862 37808275 38018282 36445163
2373C6445163m29967k50599m61666m7714O1719j725447j070694K47666j55428
$$ 36445163 36015196 35764597 35302931 35255217 35316936 33591489 32520795 32768461 32613033
2364C2613033p17397k11568m85826K26047n02566n64331n99139l35978j14031
$$ 32613033 31895636 31684068 31198242 31424289 30921723 30357392 29758253 29422275 29308244
2355B9308244l97944J20103q35413m37883j209453P65357M54204q56602j139575
$$ 29308244 28910300 29030403 28194990 27757107 26547654 27313011 27767215 26910613 25771038
2346B5771038J01221K12016m73882j96922k39673j88482m97526K85653M8859p23457
$$ 25771038 25872259 26084275 25610393 25413471 25173798 24985316 24487790 24773443 24822302 24098845
2336B4098845r52733k79774O92552M81275m92110o79411J42035R1911M47660k01867
$$ 24098845 23146112 22866338 23558890 24040165 23548055 22868644 23010679 23102590 23550250 23348383
2326B3348383k9086k51210k13334n93665p93039m36329J87792j26956J43352O01410
$$ 23348383 23319297 23068087 22854753 22261088 21468049 21031720 21219512 21092556 21235908 21837318
2316B1837318q79892o48784k42207L18332o14504M06763Q05144l97146l81362
$$ 21837318 20957426 20308642 20066435 20384767 19770263 20177026 20982170 20585024 20203662
2307B0203662k1228m95696m21638k08940L00133J84326k25455n90243p0138L67128
$$ 20203662 20182434 19686738 19265100 19056160 19356293 19540619 19315164 18724921 18654783 19021911
2297A9021911m14129o16125n2782L38358N79940j94354n85931l52826M40832k28554
$$ 19021911 18607782 17991657 17938875 18277233 18857173 18662819 18076888 17724062 18164894 17936340
2287A7936340J46494Q04061o99693k29811J08275m52886K1657m0918j65482J73770
$$ 17936340 18082834 18886895 18187202 17957391 18065666 17612780 17634437 17593519 17428037 17601807
2277A7601807j15882k277p74575j34580L5841m58247O34423l85947P27759m07290
$$ 17601807 17485925 17483648 16709073 16574493 16610334 16152087 16786510 16400563 17128322 16721032
2267A6721032N67588j33010o53036L10670K5746J65658K81779j294246J52911
$$ 16721032 17288620 17155610 16502574 16813244 16838990 17004648 17286427 15992181 16145092
2258A6145092m16134n22884R57442M02263l9315p30390k37452j15601J33755L20797
$$ 16145092 15728958 15206074 16163516 16565779 16526464 15796074 15558622 15443021 15576776 15897573
2248A5897573L15007J42915N1294j030512q1740R9813m6372K74596p7921o89723
$$ 15897573 16212580 16355495 16406789 15376277 15294537 15394350 15347978 15622574 15544653 14854930
2238A4854930J9186N69401K6678m01524k73563k02877N55754J89895L22141J28683
$$ 14854930 14874116 15443517 15470195 15068671 14795108 14592231 15147985 15337880 15660021 15788704
2228A5788704q27226J7415M61028n67329j07085k07661J92633N35756k25253k4858
$$ 15788704 14961478 14978893 15439921 14872592 14765507 14557846 14750479 15286235 15060982 15036124
2218A5036124p11067P66440J015288l93596M29460o87105m41011L38795j08612
$$ 15036124 14325057 15091497 16106785 15713189 16142649 15455544 15014533 15353328 15244716
2209A5244716j58922j6512o46064J30908Q32344k73635K00926K07671j12526J168539
$$ 15244716 15085794 15069282 14423218 14554126 15386470 15112835 15313761 15521432 15408906 16577445
2199A6577445o41107L29227P0152K50276j68742M19305L98839M05115j41932n3866
$$ 16577445 15936338 16265565 16335717 16585993 16417251 16836556 17235395 17640510 17498578 17444712
2189A7444712n00742j40436R79095P01953P57526J227361n11614l53069j63285
$$ 17444712 16943970 16803534 17782629 18484582 19242108 20469469 19957855 19604786 19441501
2180A9441501L23681O90538K32299R38845J97447k94131k76886j72876n66613
$$ 19441501 19765182 20455720 20688019 21626864 21824311 21530180 21253294 21080418 20513805
2171B0513805q52844l68801n45933q95372J29525j08153P3637r02005l4244j48651
$$ 20513805 19660961 19292160 18746227 17850855 17980380 17872227 17945864 17043859 17009615 16860964
2161A6860964M31898l69574r00044l02942O3579m32537K50905n55272j192151
$$ 16860964 17292862 16923288 16023244 15720302 15783881 15351344 15602249 15046977 13854826
2152A3854826J96803K49696o31538P2435j25400p24147q64200K24561j85747K28164
$$ 13854826 14051629 14301325 13669787 13742222 13616822 12892675 12028475 12253036 12067289 12295453
2142A2295453J05227L11447R5506K2928J894l40581j021655k38953l84248l70390
$$ 12295453 12400680 12712127 12807633 12830561 12832455 12491874 11470219 11231266 10847018 10476628
2132A0476628P0016q2498J12235m99330R90089m80756M32377m15857o43889r4823
$$ 10476628 10546644 10464146 10576381 10077051 11067140 10586384 11018761 10602904 9959015 9864192
2122I864192Q09969K59673q60511N94920M96218k3067j579361m92871K49479k0901
$$ 9864192 10674161 10933834 10073323 10668243 11164461 11141394 9562033 9069162 9318641 9297740
2112I297740l47409m6585P0360N4064M32502J7911n84628O4740L95868p34925
$$ 9297740 8950331 8903746 8974106 9028170 9460672 9478583 8893955 8958695 9354563 8619638
2102H619638r13399q1890L08317M92502j1033N26870m14626q48070q4819P0085
$$ 8619638 7706239 7624349 7932666 8425168 8414135 8941005 8526379 7678309 7593490 7663575
2092G663575J37957J34022P66301j3429m71672m39129J338875k34764p95682m1471
$$ 7663575 7801532 7935554 8701855 8688426 8216754 7777625 9116500 8881736 8086054 8044583
2082H044583k11354M22086l15303J09294j76640R4926K90449m42693K1221P36964
$$ 8044583 7833229 8255315 7940012 8049306 7872666 7967592 8258041 7815348 7836569 8573533
2072H573533K92100K43848j409539m19898l1944M7188O1119j08230Q1442o20024
$$ 8573533 8865633 9109481 7699942 7280044 7248100 7295288 7356407 7248177 7329619 6709595
2062F709595k6622j7359K43621l84554R08596j59038j54274M57143o8241L44657
$$ 6709595 6682973 6665614 6909235 6524681 7433277 7274239 7119965 7577108 7508867 7853524
2052G853524m04537K37587n33632K53543k34660L14707J80015o30868J96753l98428
$$ 7853524 7448987 7686574 7152942 7406485 7171825 7486532 7666547 7035679 7232432 6834004
2042F834004K24883n17494L09875m74600K7465Q14055r9550K9112o75480p30089
$$ 6834004 7058887 6541393 6851268 6376668 6404133 7218188 7118638 7147750 6472270 5742181
2032E742181P11369L13822k31755o98046M18339J9677M71013m39153q13370P37358
$$ 5742181 6453550 6767372 6535617 5837571 6255910 6275587 6746600 6307447 5494077 6231435
2022F231435q2423N77495k5468p19565m37434k81016O13882K49925l44423K62820
$$ 6231435 6149012 6726507 6701039 5981474 5544040 5263024 5876906 6126831 5782408 6045228
2012F045228L42332K09383k55502j043840K34180n369j8355m05394n84427k05446
$$ 6045228 6387560 6596943 6341441 5297601 5531781 5526412 5508057 5102663 4518236 4312790
2002D312790L91173M33490L07724j37133K99916n8675l09007P82965N2083k19961
$$ 4312790 4703963 5137453 5445177 5308044 5607960 5549285 5240278 6023243 6075326 5855365
1992E855365m75160n81282N493M05596K59821K53075m86143j11567r07935k86543
$$ 5855365 5380205 4798923 4804416 5210012 5469833 5722908 5236765 5125198 4217263 3930720
1982C930720L60622O43035K16846p203l33036J77855j7545l94316Q7077l33533
$$ 3930720 4291342 4934377 5151223 5144020 4810984 4988839 4971294 4576978 4664055 4330522
1972D330522O78109j30838o80376L01779L70672j39739l19797k4179N291K31042
$$ 4330522 5008631 4877793 4197417 4499196 4869868 4730129 4410332 4386153 4391444 4622486
1962D622486l69367Q96543m61295l27484K14304J71049O1069j022219N89256N79230
$$ 4622486 4253119 5149662 4688367 4360883 4575187 4746236 4807305 3785086 4374342 4953572
1952D953572N7046J77250K39893o60493L96638K67593j22272l74187K82396j24969
$$ 4953572 5010618 5187868 5427761 4767268 5163906 5431499 5309227 4935040 5217436 5092467
1942E092467m34365k6560l86655r7847M6141L69726j13863k58344J31328M49801
$$ 5092467 4658102 4631542 4244887 4147040 4193181 4562907 4449044 4190700 4322028 4771829
1932D771829j13782K31596M15172j19224o29853k52154Q08970K35054j74844k18765
$$ 4771829 4658047 4889643 5304815 5185591 4555738 4303584 5112554 5347608 5172764 4953999
1922D953999J44561n57761l62896Q15601N40801j95902o67864n62703K33940P78634
$$ 4953999 5098560 4540799 4177903 4993504 5534305 5338403 4670539 4107836 4341776 5120410
1912E120410j33000K62101J94567K18115o83770n40076M52776R1337r7619j7932
$$ 5120410 4987410 5249511 5444078 5662193 4978423 4438347 4891123 4982460 4884841 4866909
1902D866909K43940J40846k67198o12612J23332Q7181J42780r476J69242O78033
$$ 4866909 5110849 5251695 4984497 4371885 4495217 4582398 4725178 4715702 4884944 5562977
1892E562977j15538J20120J79810M5687L71179k26063o56373k13591O5790o9391
$$ 5562977 5447439 5567559 5747369 5793056 6164235 5938172 5281799 5068208 5133998 5064607
1882E064607N58014j40620m67282m07452P7897N02127p00209n07910Q9960J437539
$$ 5064607 5622621 5482001 5014719 4607267 4685164 5187291 4487082 3979172 4069132 5506671
1872E506671o27745l93820M71836k8684L978j12001J1212L08231o07485j28744
$$ 5506671 4878926 4485106 4956942 4928258 4932236 4820235 4831447 5139678 4532193 4403449
1862D403449J0930q67434J08974P40228J47855L18279L7177m06335K71311n8097
$$ 4403449 4414379 3546945 3655919 4396147 4544002 4862281 4899458 4493123 4764434 4706337
1852D706337k04716q41799K1033J7394N45003J39503q8127R04083j018699L76039
$$ 4706337 4501621 3659822 3680855 3698249 4243252 4382755 4294628 5198711 4180012 4556051
1842D556051P35921N68217p40590l96680P5474m03800K70498O02094L57317k89860
$$ 4556051 5291972 5860189 5119599 4722919 4798393 4394593 4665091 5267185 5624502 5334642
1832E334642l22912r7541K11499o08759N19498O98876l64999o82875Q69280O9705
$$ 5334642 5011730 4914189 5125688 4516929 5036427 5735303 5370304 4687429 5556709 5626414
1822E626414j013592L19076N58574O0240Q7179p61284O96131j77967P5043r5586
$$ 5626414 4612822 4931898 5490472 5550712 5637891 4876607 5572738 5394771 5469814 5374228
1812E374228o32830K27445N75538k81184P76109o87911m50875J076994p01201
$$ 5374228 4741398 4968843 5544381 5263197 6039306 5351395 4900520 5977514 5276313
1803E276313o49213L69280j7028l6972L49394M01839J39466n01726L98551L64245
$$ 5276313 4627100 4996380 4979352 4942380 5291774 5693613 5833079 5331353 5729904 6094149
1793F094149K11108j00395K11787K43326j313323o88710M81016L40571K60734
$$ 6094149 6305257 6204862 6416649 6659975 5346652 4657942 5138958 5479529 5740263
1784E740263K7037o6253l87268j18629L8922k38205J5561O18451k76738p01386
$$ 5740263 5767300 5701047 5313779 5195150 5234072 4995867 5011428 5629879 5353141 4651755
1774D651755N08294j176556m1220j46309K83781K34193l40791N27036K92769K34957
$$ 4651755 5160049 3983493 3942273 3795964 4079745 4313938 3973147 4500183 4792952 5027909
1764E027909L18780p16257m9465M03586q94786n24987j80876R17328M72411l35881
$$ 5027909 5346689 4630432 4580967 4984553 4089767 3564780 3383904 4301232 4773643 4437762
1754D437762j268583K18889K18854k48821R01662P5576p86549J123539l99847
$$ 4437762 3169179 3388068 3606922 3358101 4259763 4335339 3548790 4672329 4272482
1745D272482J30866J76654k25641M8707j1531p25692O1557j048029o96163Q40980
$$ 4272482 4403348 4580002 4354361 4403068 4391537 3665845 3727402 2679373 1983210 2824190
1735B824190k27785M53722j96257p2749P10967L96293q77099m18276m69576P03340
$$ 2824190 2596405 3050127 2853870 2781121 3492088 3888381 3011282 2593006 2123430 2826770
1725B826770K3471n0138J92290l08598n16132P607J59267m88357K60197j21131
$$ 2826770 2850241 2800103 2992393 2683795 2167663 2175270 2334537 1846180 2106377 1985246
1715A985246J34498K31112l14378p26192L90153N65680j23347l74744K42706l2182
$$ 1985246 2119744 2350856 2036478 1310286 1700439 2266119 2142772 1768028 2010734 1978552
1705A978552r7603l51487R76507K9467o87903k43791L45015j90970K84578M72686
$$ 1978552 1880949 1529462 2505969 2535436 1847533 1603742 1948757 1757787 2042365 2515051
1695B515051L81043J79697j95549m60019m27669K95453j66123l37537o44192R39518
$$ 2515051 2896094 3075791 2880242 2420223 1992554 2288007 2121884 1784347 1140155 2079673
1685B079673J64293l20931P00870k03392K95047K80127j3823K06793m52236Q1363
$$ 2079673 2243966 1923035 2623905 2420513 2715560 2995687 2981864 3188657 2736421 2817784
1675B817784k20686J96821m76536q6389j11268k64956o1251K00264K65182J33075
$$ 2817784 2597098 2793919 2317383 2230994 2119726 1854770 1793519 1993783 2258965 2392040
1665B392040M1014m58568o36951N49084P54384m75154P5157k03075k23271m03732
$$ 2392040 2433054 1974486 1337535 1886619 2641003 2165849 2241006 2037931 1814660 1410928
1655A410928O00005O57937l23484j40492l30279O8652p3407M52889N79585q24180
$$ 1410928 2010933 2668870 2345386 2204894 1874615 1943267 1869860 2322749 2902334 2078154
1645B078154K92873j84477n32548J20203r6912l25616L10261L75075k69483m40087
$$ 2078154 2371027 2186550 1654002 1774205 1677293 1351677 1661938 2037013 1767530 1327443
1635A327443N2964M71140m14309O60651M63896n66054l11985O38189q6295m73039
$$ 1327443 1380407 1851547 1437238 2097889 2561785 1995731 1683746 2321935 2235640 1762601
1625A762601J36463K80461n74516o6808m28977l77523P71917M68889r3899j90351
$$ 1762601 1899064 2179525 1605009 1538201 1109224 731701 1503618 1972507 1878608 1688257
1615A688257r1473k66651l90842M55871N54717k74362p56974R624P32438N86203
$$ 1688257 1596784 1330133 939291 1395162 1949879 1675517 918543 928167 1660605 2246808
1605B246808l90719p18054m59450N22862o4803m9879j25119l01083j43180L55101
$$ 2246808 1856089 1138035 678585 1201447 1136644 1086765 961646 660563 517383 872484
1595H72484k5951L08071L27040Q5166J63298J49746j26557m0365L38038M65817
$$ 872484 846533 1154604 1481644 1566810 1730108 1879854 1753297 1712932 2050970 2516787
1585B516787l55137q89687K72962r27340R6968L41316k0284O88076N7736k99496
$$ 2516787 2161650 1271963 1544925 617585 714553 1055869 1035585 1723661 1781397 1481901
1575A481901L05217j28107k83301N88417n06170l51236M84569J36991j13651K6593
$$ 1481901 1787118 1659011 1375710 1964127 1457957 1106721 1591290 1728281 1614630 1641223
1565A641223L42958j073039k98053L20289J81793M99388j92858o9538j08723L7731
$$ 1641223 1984181 911142 613089 933378 1115171 1614559 1421701 1352163 1243440 1281171
1555A281171m88201j63028r6379L65799K27848K24081m58052l66732J207133M50640
$$ 1281171 792970 629942 533563 899362 1127210 1351291 893239 526507 1733640 2184280
1545B184280k16792n63667l53992k54056M95118n97899l82256J46288O37412J92057
$$ 2184280 1967488 1403821 1049829 795773 1290891 692992 310736 457024 1094436 1286493
1535A286493k99829J6960k12710j46421J71469n39677l33013J75792K09601N31652
$$ 1286493 986664 1003624 790914 644493 815962 276285 -56728 119064 328665 860317
1525H60317O19818q6267q90684k25517N98577J51153j30167l45825q1455r61755
$$ 860317 1480135 1393868 503184 277667 876244 1027397 897230 551405 469950 -491805
1515d91805M56588N77015J58750j12209n3698N6071K52569N15401j99414p6809
$$ -491805 -35217 541798 700548 588339 534641 590712 843281 1358682 1159268 1082459
1505A082459O35739P0586R8660l32323k05018k14733J85326j04276p71377M57681
$$ 1082459 1718198 1788784 1887444 1555121 1350103 1135370 1320696 1216420 445043 902724
1495I02724L33012q18907L21969K50445m61868O64937L9605m96555K29261K52836
$$ 902724 1235736 416829 738798 989243 527375 1192312 1231917 735362 964623 1217459
1485A217459J52031O16072o76408j46380n1695m2288K88955m56268J97439m34245
$$ 1217459 1369490 1985562 1309154 1162774 1111079 1068791 1357746 901478 1098917 664672
1475F64672p82457L44025j33622J38581L19052P67083m11742q62176M24244L40915
$$ 664672 -117785 226240 92618 231199 550251 1317334 905592 43416 467660 808575
1465H08575j76274r5917M14140J3693l44012o59423L9189N04732m0561j81704
$$ 808575 632301 536384 950524 964217 620205 -39218 -29 504703 464142 282438
1455B82438R6314N83969K9555k61537J20426Q28746p19751n1872l80315J41335
$$ 282438 378752 962721 992276 730739 851165 1679911 960160 908288 527973 669308
1445F69308J01044K16487j79030n94535m32717J046673J71881L63927j62562N182
$$ 669308 770352 986839 807809 213274 -219443 827230 999111 1363038 1200476 1205658
1435A205658L05236k38904q9135m88093p1482J97013j32556M17066N6435J74670
$$ 1205658 1510894 1271990 1182855 694762 623280 820293 687737 1104803 1161238 1335908
1425A335908k23852n13683k2008J6128N99955o33952l23135J77393O36503p95158
$$ 1335908 1112056 598373 576365 592493 1192448 558496 235361 412754 1049257 254099
1415B54099k06252M84570L2564Q79228J4535K51243O839m88130j99278p00212
$$ 254099 47847 532417 564981 1444209 1458744 1709987 1716826 1228696 1029418 329206
1405C29206K39998j69880r76839J55434L28924L99748M28579n1772K12400o63652
$$ 329206 569204 399324 -577515 -422081 -93157 306591 735170 683398 895798 232146
1395B32146k83408J87226K86642Q6085l22619O1371n54476l31472J618142r4750
$$ 232146 -51262 135964 422606 508691 186072 247443 -307033 -638505 979637 884887
1385H84887P31800l05043k27557o6793o39645m15049P88740J68536l15150k78925
$$ 884887 1616687 1311644 1084087 1017294 377649 -37400 751340 919876 604726 325801
1375C25801j90297K45669j96701K94492m75310q34083J307887M35534o69532M10100
$$ 325801 135504 381173 184472 478964 3654 -830429 477458 912992 243460 653560
1365F53560P5720j15894P15552j75410m18744m0054l22040k27677p884k47114
$$ 653560 729280 613386 1328938 1153528 734784 694730 372690 145013 137129 -109985
1355a09985J11763J97574J18739l31140j72929P96342K31610r31983J21589R18606
$$ -109985 1778 199352 318091 -13049 -185978 610364 841974 -90009 31580 950186
1345I50186K7407r0448n04152k77378m75653Q66465n92518k86899J42351P34119
$$ 950186 977593 887145 382993 105615 -370038 496427 -96091 -382990 -240639 493480
1335D93480L3482J1038N4560j95344q3181R03677n00994k94126J14194L38294
$$ 493480 526962 538000 592560 397216 314035 1217712 716718 422592 536786 875080
1325H75080r58130J7550N13714n34073L08291J94754n378k20256M43211m14108
$$ 875080 -83050 -65500 448214 -85859 222432 417186 411808 191552 634763 220655
1315B20655n23087k03334N6058L28034P80242O5116N82773K68811j447493o12276
$$ 220655 -302432 -505766 -449708 -121674 658568 723684 1306457 1575268 127775 -484501
1305d84501K58173N15680L90633j89628o3751n97020j87014j40976N99482M0660
$$ -484501 -226328 289352 679985 490357 426606 -170414 -357428 -498404 101078 141738
1295A41738r8173J00634M39590q42856N5583K59420O93044P26270l50892m44550
$$ 141738 43565 144199 583789 -259067 -203484 55936 748980 1475250 1124358 679808
1285F79808k85206J63803l11048l25908j07714O68599M23501o12103j93013Q14212
$$ 679808 394602 558405 247357 -78551 -186265 482334 905835 293732 100719 914931
1275I14931N14299o08124m53754P9639N28751K6401J96690q40084J65251Q84754
$$ 914931 1429230 821106 367352 446991 975742 1002143 1198833 358749 524000 1408754
1265A408754j004560L8535L40602k4768j74501J17237q8916J26561J71107M22742
$$ 1408754 404194 442729 783331 758563 584062 701299 612383 738944 910051 1332793
1255A332793m58950K89037O1306K73342m62833m04700J057752J076866K14422
$$ 1332793 873843 1162880 1224186 1497528 1034695 629995 1687747 2764613 2979035
1246B979035o60822J5406n30185q34468J81620l86123m05629k14160M85332R5834
$$ 2979035 2318213 2333619 1803434 968966 1150586 764463 358834 144674 630006 725840
1236G25840J90476O64468J85156p29318j009485K38304N7153j86863m34581j65292
$$ 725840 916316 1580784 1765940 1036622 27137 265441 322594 135731 -298850 -464142
1226d64142p6362O61046k78454K68993m2827J22764J21246q46460O71665J079533
$$ -464142 -540504 120542 -157912 111081 68254 191018 312264 -534196 137469 1217002
1216A217002l39779q9142j42374O6637j84931j96660M53552m2845l43768o00975
$$ 1217002 877223 788081 645707 712344 527413 330753 784305 741460 397692 -203283
1206b03283O8668N76967J41663Q8851Q4261k66381J22212J00524K4480j96820
$$ -203283 -134615 442352 584015 672866 757127 490746 612958 713482 737962 541142
1196E41142L55038L7955k97506L52063K21070k90208p98668n3963M64299P52202
$$ 541142 896180 934135 636629 988692 1209762 919554 120886 66923 531222 1283424
1186A283424m82172l01510p3268L2006K20831j14373J3940q2457L41417j81078
$$ 1283424 801252 499742 426474 458480 679311 564938 578878 496421 837838 656760
1176F56760J59225j047310M18823N52993N81292k30062P7148k77458m01963M66251
$$ 656760 815985 -231325 187498 740491 1321783 1091721 1168869 891411 489448 955699
1166I55699L90289j29974J75442m22530q8162n39126q8908O21167n10294J94717
$$ 955699 1345988 1216014 1391456 968926 880764 341638 252730 873897 363603 558320
1156E58320k46101J78333J72971m83870r04469Q11280R37186J96775o61642p70418
$$ 558320 312219 490552 663523 179653 -724816 86464 1023650 1220425 558783 -211635
1146b11635N95527Q9393l27969L41588O4324N8880J12744L89197K63161m40983
$$ -211635 383892 473285 145316 486904 551228 610108 722852 1112049 1375210 934227
1136I34227K12572P72068k08738j87438j90236j79795l63977K83160j71983m298
$$ 934227 1146799 1918867 1710129 1522691 1332455 1152660 788683 1071843 899860 895562
1126H95562K97773M58950K91372n02528m45253N05738L32244O9133L69107p52032
$$ 895562 1193335 1652285 1943657 1441129 995876 1501614 1833858 1902991 2272098 1520066
1116A520066p1467J21494R0406J172483L08788n30357p18594J27575j44583N35545
$$ 1520066 1448599 1570093 1660499 2832982 3141770 2611413 1892819 2020394 1875811 2411356
1106B411356k81404q26286l34774k36735Q68427L06605p80767J19157J26912j83073
$$ 2411356 2129952 1303666 968892 732157 1600584 1907189 1126422 1245579 1372491 1189418
1096A189418P30269Q05211r30832l78871N37413l82048J88246N00302K91747m24081
$$ 1189418 1919687 2724898 1794066 1415195 1952608 1570560 1758806 2259108 2550855 2126774
1086B126774L33089P81604m90109o90054M26341L8328q20285m42070L93749J030217
$$ 2126774 2459863 3241467 2751358 2061304 2487645 2525973 1705688 1263618 1657367 2687584
1076B687584q3693L47663M00086r83140j75185O55037J07527L95917K73415P68138
$$ 2687584 2603891 2951554 3351640 2368500 2193315 2848352 2955879 3351796 3625211 4393349
1066D393349J24069o42077q66269J81288J523332L66242K23630q64818n142R4359
$$ 4393349 4517418 3875341 3009072 3190360 4713692 5079934 5303564 4438746 4433604 4527963
1056D527963Q4707J2542N4839J46216p73822j74087M57129L75137L41681q9952
$$ 4527963 4612670 4625212 4680051 4826267 4052445 3878358 4335487 4710624 5052305 4962353
1046D962353j411K10637o6464O4192N39861k94847l1202N33409N03604m18681
$$ 4962353 4960942 5171579 5105115 5169307 5709168 5414321 5383119 5916528 6420132 6001451
1036F001451m29537N60677N08467l76508n81790R3793N78041M47466J64281j20948
$$ 6001451 5571914 6132591 6641058 6264550 5682760 5776553 6354594 6802060 6966341 6845393
1026F845393K95382q3727j92178j18981l78983L7855R21613J008603M14719n72719
$$ 6845393 7140775 7057048 6864870 6745889 6366906 6404761 7326374 8334977 8749696 8176977
1016H176977n4409M04297Q35878o13745q30477O46377Q53308P12667J308009J272921
$$ 8176977 8122568 8526865 9362743 8748998 7918521 8564898 9418206 10130873 11438882 12711803
1006A2711803K14816n41144L03740j907L72427O69173J190834J254852Q60014
$$ 12711803 12926619 12385475 12689215 12687308 13059735 13728908 14919742 16174594 17034608
997A7034608J065169J87854J165824R95684O42189J522365J270733J348342Q18462
$$ 17034608 18099777 18287631 19453455 20449139 21091328 22613693 23884426 25232768 26051230
988B6051230R98354K671912K394893J252576J709199K980940J551606K319828
$$ 26051230 27049584 29721496 32116389 33368965 35078164 38059104 39610710 41930538
980D1930538L295821L909240L165513M486989O237189Q734690J0402093J2006003
$$ 41930538 45226359 49135599 52301112 56788101 63025290 71759980 82162073 94168076
972I4168076J4125959J6206673J9240450J9608741J9881851K6423253K7460162
$$ 94168076 108294035 124500708 143741158 163349899 183231750 209655003 237115165
965B37115165L0596679K7006177r360329m5011032n4572472m3084331k7903509
$$ 237115165 267711844 294718021 285357692 240346660 185774188 142689857 114786348
958A14786348j8792262j3387288j0505872p543981n568028l898292l979107l063654
$$ 114786348 95994086 82606798 72100926 64556945 58988917 55090625 51111518 48047864
950D8047864k710449r95488j208162k779334l631776k767145l180693j898443
$$ 48047864 45337415 44341927 43133765 40354431 36722655 33955510 30774817 28876374
942B8876374j819291j953371j751862j657195o64679o00085j154679j318432n39241
$$ 28876374 27057083 25103712 23351850 21694655 21029976 20429891 19275212 17956780 17417539
933A7417539n43240m78801l37439n83209j277598n50791m44111n27400j103930
$$ 17417539 16874299 16395498 16058059 15474850 14197252 13646461 13202350 12674950 11571020
924A1571020m63445J79391l38231l14123l44601p99176n24440r06493j71756n49521
$$ 11571020 11107575 11286966 10948735 10634612 10290011 9490835 8966395 8059902 7888146 7338625
914G338625N03476J33332o86350l03031M96487n70046j77179l79747n14623j59713
$$ 7338625 7842101 7975433 7289083 6986052 7482539 6912493 6735314 6355567 5840944 5681231
904E681231j48712N13278K23046m80878J06188o94388p98883K80995K84356L55582
$$ 5681231 5532519 6045797 6268843 5787965 5894153 5199765 4400882 4681877 4966233 5321815
894E321815o86612n59222K36676J89778r09466j91338k82619L96173Q50452j14139
$$ 5321815 4635203 4075981 4312657 4502435 3592969 3401631 3119012 3515185 4365637 4251498
884D251498K55121o44283r5174K65569l54556m60196n34381K77186k86590m80027
$$ 4251498 4506619 3862336 3767162 4032731 3678175 3217979 2683598 2960784 2674194 2194167
874B194167N83532j52429r810L04855l90794J80167k07388J31628j272209k22726
$$ 2194167 2777699 2625270 2615460 2920315 2529521 2709688 2502300 2633928 1361719 1138993
864A138993J277927k50170l25588K88949K10578m29509n28838m141L18338J96866
$$ 1138993 2416920 2166750 1841162 2130111 2340689 1911180 1382342 1378201 1696539 1893405
854A893405k76235L8384K14193r56165j63323K45092P79680L43639l9814q63667
$$ 1893405 1617170 1655554 1869747 913582 750259 995351 1775031 2118670 2078856 1215189
844A215189m43778n07748O40900O69481M66572k70463k27979M31086l58639L17928
$$ 1215189 771411 263663 904563 1574044 2040616 1770153 1542174 1973260 1614621 1932549
834A932549l00790j36086O2231m80680n0893j62233k13538K83915j0491J269684
$$ 1932549 1631759 1495673 1557904 1077224 1026331 864098 650560 934475 923984 2193668
824B193668o92875k74086k56706o33000P7774K45229J07497m33475J24742R7345
$$ 2193668 1500793 1226707 970001 337001 414775 660004 767501 334026 458768 556113
814E56113l27433M11878K0751l90205p06803m44068j30711N79658m8655m5819
$$ 556113 228680 640558 661309 271104 -435699 -879767 -1010478 -430820 -479475 -525294
804e25294P20116J49831m55066M39246J10708o28430R663J61462N8572n22365
$$ -525294 194822 344653 -110413 328833 439541 -188889 -179226 -17764 40808 -481557
794d81557M25163k46163o11231n18300J253330k37307n64692Q20782L99932P5231
$$ -481557 -56394 -302557 -913788 -1432088 -178758 -416065 -980757 -159975 239957 315188
784C15188j52292n33177J06549P78780l62625m48518N37820R36441K58890k11330
$$ 315188 162896 -370281 -263732 515048 152423 -296095 241725 1178166 1437056 1225726
774A225726q7927p30520o53475o74853L77931M45969J09839k68823K84297N27777
$$ 1225726 1137799 407279 -246196 -921049 -543118 -97149 12690 -256133 28164 555941
764E55941r49185k14368J2293Q63579k26315j55772L26966l78797l72032K04462
$$ 555941 -393244 -607612 -595319 268260 41945 -113827 213139 -165658 -537690 -333228
754c33228L32378K2906J80830j09946J18407L82539N80733K02503j6545m32797
$$ -333228 -850 22056 202886 92940 211347 593886 1174619 1377122 1360577 927780
744I27780o54595m06022n54285M14833k4462R1979n76089J38503L40877J01270
$$ 927780 273185 -132837 -687122 -272289 -296751 -204772 -780861 -642358 -301481 -200211
734b00211n59j29334P9318m37413O24834m69738K22554M11353l59473L87942N4679
$$ -200211 -200770 -330104 -250786 -688199 -63365 -533103 -310549 100804 -258669 129273 183952
723A83952J8844o29501j10243m0809n5560n5664L80476M28839l84206j74353K92467
$$ 183952 202796 -426705 -536948 -577757 -633317 -688981 -308505 120334 -263872 -438225 -145758
712a45758m68969M4328k62372N2588O07981J53593m8312J40953n06446N70963
$$ -145758 -614727 -570399 -832771 -780183 -172202 -18609 -66921 74032 -432414 138549
702A38549p5934o12381K20415k08767N1570j75322M99153k02018J282743m99465
$$ 138549 62615 -549766 -329351 -538118 -486548 -661870 -162717 -364735 918008 418543
692D18543n67295n57581l12768N87501L80075j37764m06040M48425j72804o5071
$$ 418543 -148752 -706333 -1019101 -431600 -51525 -189289 -595329 -146904 -319708 -384779
682c84779K60142J56059Q50526O05473k60340n81515K59460r9879o33068k23110
$$ -384779 -124637 31422 881948 1487421 1227081 645566 905026 805147 172079 -51031
672e1031J85088P37312K42776j271568m41081K71311m3717o4454K92257L32808
$$ -51031 134057 871369 1114145 -157423 -598504 -327193 -370910 -435364 -143107 189701
662A89701m94596o08703j54867L70043M8530n01044k86806Q60895p0408m16999
$$ 189701 -304895 -913598 -1068465 -698422 -649892 -1150936 -1437742 -576847 -647255 -1064254
652a064254m3380l36158P85494j45612L72603j71051L68884k7373j40076L3097
$$ -1064254 -1107634 -1443792 -658298 -803910 -431307 -602358 -233474 -260847 -400923 -367826
642c67826J17784L48194o46765o43236M51232J149419k51399l44651n79231M9362
$$ -367826 -250042 98152 -548613 -1191849 -740617 408802 157403 -187248 -766479 -717117
632g17117n94673M72522J20024K81801j06715Q5817m8335m28263L42929M14004
$$ -717117 -1311790 -839268 -719244 -437443 -544158 -458341 -506676 -934939 -592010 -178006
622a78006n80068j33303M25022L86616j19907r39154K43285o63781J93038K90105
$$ -178006 -758074 -891377 -466355 -79739 -199646 -1138800 -895515 -1559296 -1366258 -1076153
612a076153k13233O58502j01655K87367l94521l60004N20898K74277o87559k45265
$$ -1076153 -1289386 -630884 -732539 -445172 -839693 -1199697 -678799 -404522 -1092081 -1337346
602a337346N41808k54637L55014l49963M15630J49566m7107L91327O01503k0505
$$ -1337346 -795538 -1050175 -695161 -1045124 -629494 -479928 -527035 -135708 465795 445290
592D45290j011672J55304K71312r1251l5791o14953p31487P30982K09448n96871
$$ 445290 -566382 -411078 -139766 -231017 -266808 -881761 -1613248 -882266 -672818 -1269689
582a269689O35654R02924q68584n33440q9843J19688j11487K9324j29277j28084
$$ -1269689 -634035 268889 -599695 -1133135 -1222978 -1103290 -1214777 -1185453 -1314730 -1442814
572a442814k44508K45636N48330R1738J85565p28804Q28995n40965o17556R09031
$$ -1442814 -1687322 -1441686 -893356 -801618 -616053 -1344857 -515862 -1056827 -1674383 -765352
562g65352J38168P2771n61505P11089L31918o97064l71969p3243p47561k43212
$$ -765352 -627184 -554413 -1115918 -404829 -72911 -769975 -1141944 -1215187 -1962748 -2205960
552b205960K33485L85482Q97498O12381k19369m53114q99716j62877Q96396N78399
$$ -2205960 -1972475 -1586993 -689495 -77114 -296483 -749597 -1649313 -1812190 -915794 -337395
542c37395j40830k07390n17614n08763K05722L50004P58236k03703P2198p52798
$$ -337395 -478225 -685615 -1203229 -1711992 -1506270 -1156266 -398030 -601733 -529535 -1282333
532a282333m34935K56918J13897M39628K47923j08037N7882K43937m63311p12451
$$ -1282333 -1717268 -1460350 -1346453 -906825 -658902 -766939 -709057 -465120 -928431 -1640882
$$ [...]
##END NTUPLES=NMR SPECTRUM
##END=
