##TITLE=1H_TG-2325
 CDCl3,8 sc, 
 1.04.2021
##JCAMPDX= 6.0         $$ Bruker NMR JCAMP-DX V2.0
##DATA TYPE= NMR SPECTRUM
##DATA CLASS= NTUPLES
##ORIGIN= UXNMR, Bruker Analytische Messtechnik GmbH
##OWNER= root
$$ XWIN-NMR		Version 3.5
$$ Thu Apr  1 09:53:47 2021 Russian Standard Time (UT+4h)  she@DPX200
##.OBSERVE FREQUENCY= 200.131506
##.OBSERVE NUCLEUS= ^1H
##.ACQUISITION MODE= SIMULTANEOUS
##.ACQUISITION SCHEME= undefined
##.AVERAGES= 8
##.DIGITISER RES= 18
##SPECTROMETER/DATA SYSTEM= spect
##.PULSE SEQUENCE= zg30
##.SOLVENT NAME= CDCl3
##.SHIFT REFERENCE= (INTERNAL, CDCl3, 0, 15.9564)
##AUDIT TRAIL= $$ (NUMBER, WHEN, WHO, WHERE, WHAT)
$$ ##TITLE= Audit trail, XWIN-NMR		Version 3.5
$$ ##JCAMPDX= 5.01
$$ ##ORIGIN= Bruker BioSpin GmbH
$$ ##OWNER= she
$$ F:/spectra/data/she/nmr/H-F/1/pdata/1/auditp.txt
$$ ##AUDIT TRAIL=  $$ (NUMBER, WHEN, WHO, WHERE, WHAT)
(   1,<2021-04-01 09:52:41.39 +0400>,<she>,<DPX200>,
      <created by zg, POWCHK disabled, PULCHK disabled
       configuration hash MD5:
       00 E9 B6 7A A2 85 ED C7 34 08 36 98 17 FE 4E 26
       data hash MD5: 16K
       91 4B F4 11 72 B6 C6 A3 32 88 3E BF 73 FA 15 1F>)
(   2,<2021-04-01 09:52:43.96 +0400>,<she>,<DPX200>,
      <Start of raw data processing
       efp BC_mod = 2 LB = 0.24 FT_mod = 6 PKNL = 1 PHC0 = -11115.38 PHC1 = 5.600932 SI = 16K 
       data hash MD5: 16K
       0A 26 D2 84 7A D5 7C CB 01 FE 24 3F 57 4B 3D FC>)
(   3,<2021-04-01 09:53:03.78 +0400>,<she>,<DPX200>,
      <pk PHC0 = -0.1568979 PHC1 = 0 
       data hash MD5: 16K
       86 B4 C1 3D 21 50 5E DF A1 06 6B F7 E8 6B CA 68>)
(   4,<2021-04-01 09:53:07.18 +0400>,<she>,<DPX200>,
      <abs ABSG = 5 
       data hash MD5: 16K
       52 A8 29 58 F1 51 7D 4E A0 A7 CB 0C 6D D4 88 3A>)
$$ ##END=
$$ 
$$ hash MD5
$$ BA 1F E1 09 FB 70 37 27 C7 8C DD 6B 7F 7D 5B D6
##$RELAX= 
##$RELAX= 
##$RELAX= 
##$RELAX= 
##$RELAX= 
##$RELAX= 
$$ Bruker specific parameters
$$ --------------------------
##$DU= <F:/spectra>
##$EXPNO= 1
##$NAME= <H-F>
##$PROCNO= 1
##$TYPE= <nmr>
##$USER= <she>
##$AMP= (0..31)
100 100 100 100 100 100 100 100 100 100 100 100 100 100 100 100 100 100 
100 100 100 100 100 100 100 100 100 100 100 100 100 100 
##$AQSEQ= 0
##$AQ_mod= 1
##$AUNM= <au_zg>
##$AUTOPOS= <>
##$BF1= 200.13
##$BF2= 200.13
##$BF3= 200.13
##$BF4= 200.13
##$BF5= 200.13
##$BF6= 200.13
##$BF7= 200.13
##$BF8= 200.13
##$BYTORDA= 1
##$CFDGTYP= 0
##$CFRGTYP= 5
##$CHEMSTR= <none>
##$CNST= (0..31)
1 1 145 1 1 1 1 1 1 1 1 1 1 1 1 1 1 1 1 1 1 1 1 1 1 1 1 1 1 1 1 1 
##$CPDPRG= <>
##$CPDPRG1= <>
##$CPDPRG2= <>
##$CPDPRG3= <>
##$CPDPRG4= <mlev>
##$CPDPRG5= <mlev>
##$CPDPRG6= <mlev>
##$CPDPRG7= <mlev>
##$CPDPRG8= <mlev>
##$CPDPRGB= <>
##$CPDPRGT= <>
##$D= (0..31)
0 1.2 0 0 0 0 0 0 0 0.06 0 0.03 0 0 0 0 0.0002 0 0 0 0 0 0 0 0 0 0 0 0 
0 0 0 
##$DATE= 1617256360
##$DBL= (0..7)
120 120 120 120 120 120 120 120 
##$DBP= (0..7)
150 150 150 150 150 150 150 150 
##$DBP07= 0
##$DBPNAM0= <>
##$DBPNAM1= <>
##$DBPNAM2= <>
##$DBPNAM3= <>
##$DBPNAM4= <>
##$DBPNAM5= <>
$$ [...]
##$SUBNAM3= <"">
##$SUBNAM4= <"">
##$SUBNAM5= <"">
##$SUBNAM6= <"">
##$SUBNAM7= <"">
##$SUBNAM8= <"">
##$SUBNAM9= <"">
##$SW= 16.9725357007746
##$SWIBOX= (0..15)
0 0 2 0 0 0 0 0 0 0 0 0 0 0 0 0 
##$SW_h= 3396.73913043478
##$TD= 16384
##$TD0= 1
##$TE= 0
##$TE2= 300
##$TE3= 300
##$TEG= 300
##$TL= (0..7)
0 120 120 120 120 120 120 120 
##$TP= (0..7)
150 150 150 150 150 150 150 150 
##$TP07= 0
##$TPNAME0= <>
##$TPNAME1= <>
##$TPNAME2= <>
##$TPNAME3= <>
##$TPNAME4= <>
##$TPNAME5= <>
##$TPNAME6= <>
##$TPNAME7= <>
##$TPOAL= (0..7)
0.5 0.5 0.5 0.5 0.5 0.5 0.5 0.5 
##$TPOFFS= (0..7)
0 0 0 0 0 0 0 0 
##$TUNHIN= 0
##$TUNHOUT= 0
##$TUNXOUT= 0
##$USERA1= <user>
##$USERA2= <user>
##$USERA3= <user>
##$USERA4= <user>
##$USERA5= <user>
##$V9= 5
##$VALIST= <valist>
##$VCLIST= <CCCCCCCCCCCCCCC>
##$VD= 0
##$VDLIST= <DDDDDDDDDDDDDDD>
##$VPLIST= <PPPPPPPPPPPPPPP>
##$VTLIST= <TTTTTTTTTTTTTTT>
##$WBST= 1024
##$WBSW= 4
##$XGAIN= (0..3)
0 0 0 0 
##$XL= 0
##$YL= 0
##$YMAX_a= 501333
##$YMIN_a= -378479
##$ZGOPTNS= <>
##$ZL1= 120
##$ZL2= 120
##$ZL3= 120
##$ZL4= 120
##$ABSF1= 15.95641
##$ABSF2= -1.016252
##$ABSG= 5
##$ABSL= 3
##$ALPHA= 0
##$AQORDER= 0
##$ASSFAC= 0
##$ASSFACI= 0
##$ASSFACX= 0
##$ASSWID= 0
##$AUNMP= <proc_1d>
##$AZFE= 0.1
##$AZFW= 0.1
##$BCFW= 0
##$BC_mod= 2
##$BYTORDP= 0
##$COROFFS= 0
##$CY= -3
##$DATMOD= 1
##$DC= 0
##$DFILT= <>
##$DTYPP= 0
##$F1P= 0
##$F2P= 0
##$FCOR= 1
##$FTSIZE= 16384
##$FT_mod= 6
##$GAMMA= 0
##$GB= 0
##$INTBC= 1
##$INTSCL= 2.992141e-10
##$ISEN= 128
##$LB= 0.24
##$LEV0= 0
##$LPBIN= 0
##$MAXI= 10000
##$MC2= 0
##$MEAN= 0
##$ME_mod= 0
##$MI= 1.114404
##$NCOEF= 0
##$NC_proc= -7
##$NLEV= 6
##$NOISF1= 3.799351
##$NOISF2= 2.8
##$NSP= 0
##$NTH_PI= 0
##$NZP= 0
##$OFFSET= 15.95641
##$PC= 1
##$PHC0= -11115.54
##$PHC1= 5.600932
##$PH_mod= 1
##$PKNL= yes
##$PPARMOD= 0
##$PSCAL= 0
##$PSIGN= 0
##$REVERSE= no
##$SF= 200.130011012515
##$SI= 16384
##$SIGF1= 3
##$SIGF2= 2
##$SINO= 5.538805
##$SIOLD= 16384
##$SREGLST= <1H.CDCl3>
##$SSB= 0
##$STSI= 16384
##$STSR= 0
##$SW_p= 3396.73913043479
##$SYMM= 0
##$S_DEV= 0
##$TDeff= 16384
##$TDoff= 0
##$TI= <>
##$TILT= no
##$TM1= 0
##$TM2= 0
##$TOPLEV= 0
##$USERP1= <user>
##$USERP2= <user>
##$USERP3= <user>
##$USERP4= <user>
##$USERP5= <user>
##$WDW= 1
##$XDIM= 16384
##$YMAX_p= 405300981
##$YMIN_p= -573456
$$ End of Bruker specific parameters
$$ ---------------------------------
##NTUPLES= NMR SPECTRUM
##VAR_NAME=  FREQUENCY,     SPECTRUM/REAL,   SPECTRUM/IMAG
##SYMBOL=    X,             R,               I
##VAR_TYPE=  INDEPENDENT,   DEPENDENT,       DEPENDENT
##VAR_FORM=  AFFN,          ASDF,            ASDF
##VAR_DIM=   16384,         16384,           16384
##UNITS=     HZ,            ARBITRARY UNITS, ARBITRARY UNITS
##FACTOR=    0.207333158178282, 1,           1
##FIRST=     3193.35659067726, 0,            0
##LAST=      -203.382539757534, 0,           0
##MIN=       -203.382539757534, -573456,     0
##MAX=       3193.35659067726, 405300981,    0
$$ Real data points
##PAGE= N=1
##DATA TABLE= (X++(R..R)), XYDATA
$$ [...]
$$ plain form
6070 618387 316514 343950 384614 476789 272339 479665 538477 493139 438583 317108 269745
6059 269745 280138 404568 409349 272910 324949 303489 416318 443545 428845 278076 293652
6048 293652 306637 431504 476287 438684 303484 268383 355068 387798 316542 327115 386498
6037 386498 359701 479111 428010 321488 332251 390110 325862 399303 261158 245134 272783
6026 272783 344688 452884 465925 215548 298462 335666 349183 318150 480097 411312 296440
6015 296440 288585 226046 486949 534252 555613 362904 260502 239310 250944 431857 408881
6004 408881 420707 501489 581985 699342 651997 550473 754244 671363 482208 428514 375593
5993 375593 390551 567136 486140 368938 249298 390048 373380 252868 377205 302972
$$ packed form
6070F18387l01873K7436M0664R2175k04450K07326N8812m5338n4556j21475m7363
6059B69745J0393J24430M781j36439N2039k1460J12829K7227j4700j50769J5576
6048B93652J2985J24867M4783l7603j35200l5101Q6685L2730p1256J0573N9383
6037C86498k6797J19410n1101j06522J0763N7859o4248P3441j38145j6024K7649
6026B72783P1905J08196J3041k50377Q2914L7204J3517l1033J61947o8785j14872
6015B96440p855o2539K60903M7303K1361j92709j02402k1192J1634J80913k2976
6004D08881J1826Q0782Q0496J17357m7345j01524K03771q2881j89155n3694n2921
5993C75593J4958J76585q0996j17202j19640J40750j6668j20512J24337p4233
$$ plain form
5983 302972 412773 599996 380838 426323 457368 322375 463345 368348 351587 262021 186591
5972 186591 265279 234568 366231 254008 235257 350260 497504 459141 383773 367033 335755
5961 335755 390875 254710 362196 446666 317668 273809 336609 410904 482153 370038 233916
5950 233916 134474 82606 261306 309298 264568 243966 141075 159745 135384 177204 256613
5939 256613 279869 273567 288241 266295 127498 266623 320177 257968 231534 238927 154374 167110
5927 167110 269757 216784 114734 115236 169808 172528 61366 130040 221673 236670 271546 280758
5915 280758 22494 -28097 147974 111661 50306 59932 72953 114300 100968 47209 110839
5904 110839 117806 186127 157938 161759 253481 258764 128580 119055 -15248 118804 120835 367388
$$ packed form
5983C02972J09801J87223k19158M5485L1045j34993J40970r4997j6761q9566p5430
5972A86591P8688l0711J31663j12223j8751J15003J47244l8363p5368j6740l1278
5961C35755N5120j36165J07486Q4470j28998m3859O2800P4295P1249j12115j36122
5950B33916r9442n1868J78700M7992m4730k0602j02891J8670k4361M1820P9409
5939B56613K3256o302J4674k1946j38797J39125N3554o2209k6434P393q4553J2736
5927A67110J02647n2973j02050N02N4572K720j11162O8674R1633J4997L4876R212
5915B80758k58264n0591J76071l6313o1355R626J3021M1347j3332n3759O3630
5904A10839O967O8321k8189L821R1722N283j30184r525j34303J34052K031K46553
$$ plain form
5892 367388 442274 276839 256538 233215 202892 166476 69347 97514 34554 67680 208038
5881 208038 229513 261725 116193 228994 196322 229020 202173 104652 161870 140750 244277
5870 244277 64081 67889 797 63090 114318 74296 129404 129448 103438 81575 1949 128262
5858 128262 240023 225299 123580 140677 109980 114305 31357 -111489 -19127 63735 145996
5847 145996 229354 228651 172779 171203 158341 292711 231368 67162 72787 81648 214525 384788
5835 384788 264471 136108 -92900 47692 59954 196113 309504 466976 428979 226751
5825 226751 207261 192134 396800 392517 187969 202546 238832 436408 324264 146753 192270
5814 192270 180747 188015 318705 256077 123705 283546 293581 185685 117432 70376 112832
$$ packed form
5892C67388P4886j65435k0301k3323l0323l6416r7129K8167o2960L3126J40358
5881B08038K1475L2212j45532J12801l2672L2698k6847r7521N7218k1120J03527
5870B44277j80196L808o7092O2293N1228m0022N5108M4k6010k1863p9626J26313
5858A28262J11761j4724j01719J7097l0697M325q2948j42846R2362Q2862Q2261
5847A45996Q3358p03n5872j576j2862J34370o1343j64206N625Q861J32877J70263
5835C84788j20317j28363k29008J40592J2262J36159J13391J57472l7997k02228
5825B26751j9490j5127K04666m283k04548J4577L6286J97576j12144j77511M5517
5814A92270j1523P268J30690o2628j32372J59841J0035j07896o8253m7056M2456
$$ plain form
5803 112832 148802 94017 73622 175845 105816 247765 246829 279067 361738 391373 445908 385932
5791 385932 350793 55097 127154 254494 389298 340497 322516 342735 395988 321709 302046
5780 302046 325695 245052 211195 237374 335730 240248 260051 189327 197430 199597 139239 212586
5768 212586 339652 243952 209483 222531 325004 233099 208495 251329 348672 338577 416819
5757 416819 622821 466013 255127 110637 76431 -42945 -24495 145465 186863 271797
5747 271797 249340 236140 106952 36706 213705 256466 201667 112951 50897 179309 142615
5736 142615 21956 68797 132417 359661 325242 414332 324425 437851 372530 223034 90336
5725 90336 -118190 13405 -22847 13396 152530 182253 223315 140167 143653 15294 185504
$$ packed form
5803A12832L5970n4785k0395J02223p0029J41949r36L2238Q2671K9635N4535n9976
5791C85932l5139k95696P2057J27340J34804m8801j7981K0219N3253p4279j9663
5780C02046K3649q0643l3857K6179R8356r5482J9803p0724Q103K167o0358P3347
5768B12586J27066r5700l4469J3048J02473r1905k4604M2834R7343j0095P8242
5757D16819K06002j56808k10886j44490l4206j19376J8450J69960M1398Q4934
5747B71797k2457j3200j29188p0246J76999M2761n4799q8716o2054J28412l6694
5736A42615j20659M6841O3620K27244l4419Q9090q9907J13426o5321j49496j32698
5725I0336k08526J31595l6252L6243J39134K9723M1062q3148L486j28359J70210
$$ plain form
5714 185504 331880 352486 448819 350330 415247 206970 -13203 -110370 41047 234471 259922
5703 259922 218415 219729 260799 91008 117081 184544 148099 224181 360764 427153 359582
5692 359582 317761 204460 160219 340472 272735 345670 314893 246491 191310 185011 275210
5681 275210 212421 241865 151791 27362 190193 157935 169447 189275 68372 128101 308586
5670 308586 271299 180836 200007 338113 127909 98782 186633 169152 278067 258895 366742
5659 366742 238290 252652 212386 267481 196892 234854 245608 228873 233506 150171 142194 291780
5647 291780 250345 236146 112408 97174 286141 340048 422902 385620 441534 313051 322757
5636 322757 377328 256386 372900 292613 407288 459464 360699 409727 320386 321845 185591
$$ packed form
5714A85504J46376K0606R6333r8489O4917k08277k20173r7167J51417J93424K5451
5703B59922m1507J314M1070j69791K6073O7463l6445P6082J36583O6389o7571
5692C59582m1821j13301m4241J80253o7737P2935l0777o8402n5181o299R0199
5681B75210o2789K9444r0074j24429J62831l2258J1512J9828j20903N9729J80485
5670C08586l7287r0463J9171J38106k10204k9127Q7851j7481J08915j9172J07847
5659C66742j28452J4362m0266N5095p0589L7962J0754j6735M633q3335p977J49586
5647B91780m1435j4199j23738j5234J88967N3907Q2854l7282N5914j28483R706
5636C22757N4571j20942J16514q0287J14675N2176r8765M9028q9341J459j36254
$$ plain form
5625 185591 228901 493537 530744 389734 311407 342194 400446 469725 421661 377077 228720
5614 228720 158660 308940 349389 453907 442523 373947 417142 437706 388859 431199 560308
5603 560308 386650 318737 382658 512208 573302 564181 410679 448325 526564 581862 586845
5592 586845 547195 614694 596951 537891 505883 588546 572949 608482 493770 527263 670179
5581 670179 616259 646798 628297 645084 578043 466764 649274 639826 512909 473149 611789
5570 611789 590306 560763 533273 579427 754143 633390 675646 763784 728351 771758 655574
5559 655574 666655 664892 686602 796907 720940 620222 666661 780905 878202 734690 844432
5548 844432 771310 701107 721885 632626 834448 895251 981010 1009059 1001643 827382 994545
$$ packed form
5625A85591M3310K64636L7207j41010p8327L0787N8252O9279m8064m4584j48357
5614B28720p0060J50280M0449J04518j1384o8576M3195K0564m8847M2340J29109
5603E60308j73658o7913O3921J29550O1094r121j53502L7646P8239N5298M983
5592E86845l9650O7499j7743n9060l2008Q2663j5597L5533j14712L3493J42916
5581F70179n3920L0539j8501J6787o7041j11279J82510r448j26917l9760J38640
5570F11789k1483k9543k7490M6154J74716j20753M2256Q8138l5433M3407j16184
5559F55574J1081j763K1710J10305p5967j00718M6439J14244R7297j43512J09742
5548H44432p3122p0203K0778q9259K01822O0803Q5759K8049p416j74261J67163
$$ plain form
5537 994545 1102930 1018073 957327 938483 1099630 1222961 1083493 1099385 1280206 1176726
5527 1176726 1204724 1337419 1265930 1118849 1170955 1125276 1301547 1282058 1309638 1324832 1393440
5516 1393440 1455785 1385664 1354142 1368909 1540940 1652914 1771337 1801903 1796367 1672295 1680657
5505 1680657 1666865 1732626 1804974 1922122 2104200 1932266 1927246 2142715 2256843 2324090 2450294
5494 2450294 2252638 2226504 2313014 2513777 2666862 2749584 2960859 2897553 2985150 2997812 3027356
5483 3027356 3147883 3174962 3388063 3595108 3657229 3658786 3879397 4072851 4143983 4213136 4263204
5472 4263204 4575775 4777461 4849893 5014207 5077093 5220886 5534671 5592442 5682013 5960844
5462 5960844 6370188 6404848 6662769 6893893 7324936 7677056 8005772 8253797 8601041 9013282
$$ packed form
5537I94545J08385q4857o0746j8844J61147J23331j39468J5892J80821j03480
5527A176726K7998J32695p1489j47081N2106m5679J76271j9489K7580J5194O8608
5516A393440O2345p0121l1522J4767J72031J11974J18423L0566n536j24072Q362
5505A680657j3792O5761P2348J17148J82078j71934n020K15469J14128O7247J26204
5494B450294j97656k6134Q6510K00763J53085Q2722K11275o3306Q7597J2662K9544
5483C027356J20527K7079K13101K07045O2121J557K20611J93454P1132O9153N0068
5472D263204L12571K01686P2432J64314O2886J43793L13785N7771Q9571K78831
5462E960844M09344L4660K57921K31124M31043L52120L28716K48025L47244M12241
$$ plain form
5452 9013282 9429203 10022175 10494787 11107558 11556084 12027140 12690672 13461049 14121343 15076532
5442 15076532 16169718 17326650 18676402 19994957 21495926 23287433 24960744 27038054
5434 27038054 29313959 31632453 34021368 36354839 38560440 40344728 42093864 43349561
5426 43349561 44151910 44173659 43569672 42439733 40935705 39176989 36956855 34721275 32497366
5417 32497366 30380688 28427293 26522079 24995407 23485064 22002953 20672686 19612907
5409 19612907 18604729 17515847 16560576 15579575 14711309 13844749 13160764 12377431 11667431
5400 11667431 11132065 10778581 10324552 9946398 9628023 9406079 9297250 9200305 8917515 8707062
5390 8707062 8488859 8147902 7846801 7464859 7058303 6910491 6601802 6418709 6126839 5822174
$$ packed form
5452I013282M15921N92972M72612O12771M48526M71056O63532P70377O60294R55189
5442A5076532J093186J156932J349752J318555J500969J791507J673311K077310
5434B7038054K275905K318494K388915K333471K205601J784288J749136J255697
5426D3349561Q02349K1749o03987j129939j504028j758716k220134k235580k223909
5417C2497366k116678j953395j905214j526672j510343j482111j330267j059779
5409A9612907j008178j088882r55271r81001q68266q66560o83985p83333p10000
5400A1667431n35366l53484m54029l78154l18375k21944j08829r6945k82790k10453
5390H707062k18203l40957l01101l81942m06556j47812l08689j83093k91870l04665
$$ plain form
5380 5822174 5818055 5683162 5458457 5230317 5112737 4856875 4638989 4505616 4429050 4262290
5370 4262290 4200974 4266155 4072767 3928926 3823745 3835843 3814010 3749831 3718634 3547103 3443727
5359 3443727 3350204 3364691 3495359 3457258 3365842 3383704 3483613 3428701 3286466 3313331 3346579
5348 3346579 3259592 3291354 3432108 3407549 3304608 3508714 3445351 3305407 3342167 3347079 3373232
5337 3373232 3249915 3371343 3237700 3198928 3301872 3312811 3246955 3211270 3259303 3118722
5327 3118722 3192540 3380850 3497643 3416249 3283450 3294355 3291760 3433248 3473862 3324522 3236500
5316 3236500 3184804 3179412 3219390 3160165 3160013 3183054 3263482 3290456 3286557 3303206 3240682 3296396
5304 3296396 3217494 3398448 3440717 3493591 3660589 3527618 3635086 3769829 3827103 3922489
$$ packed form
5380E822174m119j34893k24705k28140j17580k55862k17886j33373p6566j66760
5370D262290o1316O5181j93388j43841j05181J2098k1833o4179l1197j71531j03376
5359C443727r3523J4487J30668l8101r1416J7862R9909n4912j42235K6865L3248
5348C346579q6987L1762J40754k4559j02941K04106o3363j39944L6760M912K6153
5337C373232j23317J21428j33643l8772J02944J0939o5856l5685M8033j40581
5327C118722P3818J88310J16793q1394j32799J0905k595J41488M0614j49340q8022
5316C236500n1696n392L9978n9225j52K3041Q0428K6974l899J6649o2524N5714
5304C296396p8902J80954M2269N2874J66998j32971J07468J34743N7274R5386
$$ plain form
5294 3922489 3931975 3902905 3988819 4162362 4326756 4355412 4368708 4473725 4577286 4730828 4899244
5283 4899244 5127652 5413070 5649736 5892697 6020622 6207649 6474041 6734424 6857994 6844137
5273 6844137 6759375 6765479 6538631 6498273 6609135 6526337 6669966 6849546 7064588 7107173 7184185
5262 7184185 7557845 7754954 8094301 8166221 8307390 8484299 8744585 8706708 8474935 8379310
5252 8379310 8406569 8393175 8595666 8677543 8798365 9051426 9205832 9175126 9291195 9441359
5242 9441359 9637007 9766103 9744164 9787812 9940658 10299305 10541494 10699197 10669387 10905451
5232 10905451 11058705 11329504 11454031 11535050 11621914 11710241 11879498 12175556 12174111 12287475
5222 12287475 12474854 12616370 12791892 12804103 12855189 13071553 13101742 13223666 13212461 13247743
$$ packed form
5294C922489R486k9070Q5914J73543J64394K8656J3296J05017J03561J53542J68416
5283D899244K28408K85418K36666K42961J27925J87027K66392K60383J23570j3857
5273F844137q4762O104k26848m0358J10862q2798J43629J79580K15042M2585P7012
5262G184185L73660J97109L39347P1920J41169J76909K60286l7877k31773r5625
5252H379310K7259j3394K02491Q1877J20822K53061J54406l0706J16069J50164
5242I441359J95648J29096k1939M3648J52846L58647K42189J57703k9810K36064
5232A0905451J53254K70799J24527Q1019Q6864Q8327J69257K96058j445J13364
5222A2287475J87379J41516J75522J2211N1086K16364L0189J21924j1205L5282
$$ plain form
5212 13247743 13319132 13472340 13333588 13457345 13533243 13645651 13734060 13703350 13743971 13798002
5202 13798002 13721484 13712599 13593452 13611226 13569546 13610519 13795740 13675811 13530883 13347913
5192 13347913 13366229 13313216 13230108 13095039 12998482 12789858 12734702 12581799 12529495 12541372 12344875
5181 12344875 12322581 12226333 11984358 11913081 11812093 11580629 11548846 11520604 11343842 11320173
5171 11320173 11073954 10929462 10727859 10617399 10434475 10227552 9964858 9815365 9759191 9760156
5161 9760156 9538049 9257402 9025531 8880979 8830564 8656395 8473261 8242682 8071916 7950233
5151 7950233 7824683 7640377 7448885 7454048 7219124 7155540 6993885 6748262 6722922 6550633
5141 6550633 6312426 6132225 6070483 6025172 5874786 5757249 5686041 5564954 5375830 5453056
$$ packed form
5212A3247743P1389J53208j38752J23757P5898J12408Q8409l0710M0621N4031
5202A3798002p6518q885j19147J7774m1680M0973J85221j19929j44928j82970
5192A3347913J8316n3013q3108j35069r6557k08624n5156j52903n2304J1877j96497
5181A2344875k2294r6248k41975p1277j00988k31464l1783k8242j76762k3669
5171A1320173k46219j44492k01603j10460j82924k06923k62694j49493n6174R65
5161I760156k22107k80647k31871j44552n0415j74169j83134k30579j70766j21683
5151G950233j25550j84306j91492N163k34924o3584j61655k45623k5340j72289
5141F550633k38207j80201o1742m5311j50386j17537p1208j21087j89124P7226
$$ plain form
5131 5453056 5363298 5330687 5258889 5180267 5146397 4996405 4906305 4868354 5017226 5008185 4833333
5120 4833333 4642992 4525437 4369239 4382503 4467726 4379454 4314201 4230825 4117250 4150984 4007321
5109 4007321 3909509 3926515 3987677 4020008 3726297 3695286 3668474 3604866 3771103 3727733 3790107
5098 3790107 3726156 3925197 3787209 3873446 3748952 3756781 3835620 3842443 3805230 3735401 3695946
5087 3695946 3788586 3891229 3952936 3900694 3842599 3845767 3869798 3795640 3824059 3972724 4061349
5076 4061349 3958997 3877984 4175083 4160832 4176911 4295456 4408309 4383263 4497087 4666427
5066 4666427 4721685 4636031 4625409 4790875 4871008 4869011 4839434 4853451 4976715 5007197 5152410
5055 5152410 5322787 5380394 5410990 5552925 5619564 5802566 5838801 5811522 6089386 6129153 6186859
$$ packed form
5131E453056q9758l2611p1798p8622l3870j49992r0100l7951J48872r041j74852
5120D833333j90341j17555j56198J3264Q5223q8272o5253q3376j13575L3734j43663
5109D007321r7812J7006O1162L2331k93711l1011k6812o3608J66237m3370O2374
5098C790107o3951J99041j37988Q6237j24494P829P8839O823l7213o9829l9455
5087C695946R2640J02643O1707n2242n8095L168K4031p4158K8419J48665Q8625
5076D061349j02352q1013K97099j4251J6079J18545J12853k5046J13824J69340
5066D666427N5258q5654j0622J65466Q0133j997k9577J4017J23264L0482J45213
5055E152410J70377N7607L0596J41935O6639J83002L6235k7279K77864L9767N7706
$$ plain form
5044 6186859 6400734 6568920 6658255 6604721 6746030 6834947 7104358 7169037 7162128 7262460 7414706
5033 7414706 7370135 7653925 7951776 8035099 8083171 8068489 8093293 8326385 8609294 8668484 8792657
5022 8792657 8930787 9108025 9377658 9559873 9693967 9647251 9672440 9780366 9867544 10107277
5012 10107277 10262789 10303067 10394124 10561252 10541154 10545710 10400579 10290378 10274448 10472420
5002 10472420 10630850 10554026 10547688 10563434 10680989 10699997 10594141 10653549 10601768 10583843 10619299
4991 10619299 10691193 10751845 10704039 10800133 10809780 10851233 10919330 11013449 11040972 10998693 11026874
4980 11026874 10921006 10841328 10819894 10746778 10564252 10289888 10182092 10086628 9953386 9832920
4970 9832920 9640589 9427155 9311392 9322823 9278627 9089345 9023471 8706673 8546509 8578843
$$ packed form
5044F186859K13875J68186Q9335n3534J41309Q8917K69411O4679o909J00332J52246
5033G414706m4571K83790K97851Q3323M8072j4682K4804K33092K82909N9190J24173
5022H792657J38130J77238K69633J82215J34094m6716K5189J07926Q7178K39733
5012A0107277J55512M0278R1057J67128k0098M556j45131j10201j5930J97972
5002A0472420J58430p6824o338J5746J17555J9008j05856N9408n1781j7925L5456
4991A0619299P1894O0652m7806R6094R647M1453O8097R4119K7523m2279K8181
4980A1026874j05868p9678k1434p3116j82526k74364j07796r5464j33242j20466
4970I832920j92331k13434j15763J1431m4196j89282o5874l16798j60164L2334
$$ plain form
4960 8578843 8472220 8553504 8374364 8263429 8274337 8299964 8070626 7923587 7902794 7893388 7862174
4949 7862174 7692955 7486701 7475403 7368338 7311938 7150129 7025145 6861028 6629995 6532884
4939 6532884 6522607 6397988 6219751 6211198 6183810 6102045 5946991 5773598 5816443 5771794 5700199
4928 5700199 5566341 5306630 5358248 5337453 5326560 5170307 5166470 5160192 5207384 5100726 5092790
4917 5092790 5054446 4994306 5037004 5039160 5068070 4969790 4917415 4921982 4841427 4840492 4946521 4971351
4905 4971351 5021310 5014191 5150837 5147999 5194941 5154592 5094728 5192222 5252509 5269307 5282445 5322006
4893 5322006 5325185 5355633 5482031 5467177 5590562 5579769 5580734 5779922 5727681 5871328 5950242
4882 5950242 5979198 6036575 6071841 6199655 6296056 6290288 6363868 6448728 6460588 6468238 6474344 6591435
$$ packed form
4960H578843j06623Q1284j79140j10935J0908K5627k29338j47039k0793r406l1214
4949G862174j69219k06254j1298j07065n6400j61809j24984j64117k31033r7111
4939F532884j0277j24619j78237q553k7388q1765j55054j73393M2845m4649p1595
4928E700199j33858k59711N1618k0795j0893j56253l837o278M7192j06658p936
4917E092790l8344o0140M2698K156K8910r8280n2375M567q0555r35J06029K4830
4905D971351M9959p119J36646k838M6942m0349n9864R7494O0287J6798J3138L9561
4893E322006L179L0448J26398j4854J23385j0793R65J99188n2241J43647P8914
4882E950242K8956N7377L5266J27814R6401n768P3580Q4860J1860P650O106J17091
$$ plain form
4870 6591435 6547060 6666201 6915605 6896631 6929172 7042808 7169984 7397090 7548699 7740101
4860 7740101 7850527 7922462 7987637 8338300 8558901 8703021 8815349 9090793 9311451 9659914
4850 9659914 9964055 10227737 10631349 10892334 11364830 11633635 11916498 12252157 12660866 13225152
4840 13225152 13910274 14558238 15370879 15897240 16407391 17119022 18120389 18858457 19738114
4831 19738114 20542118 21441143 22673539 23782212 25127451 26615161 28240419 29875182
4823 29875182 31479487 33342652 35357100 37154208 39051024 40886333 42614178 43923751
4815 43923751 44860457 45228859 45198285 44691772 43716234 42452028 40826186 39038596 36967232
4806 36967232 35119121 33183032 31607727 29961119 28455028 27029058 25780476 24298359
$$ packed form
4870F591435m4375J19141K49404j8974L2541J13636J27176K27106J51609J91402
4860G740101J10426P1935O5175L50663K20601J44120J12328K75444K20658L48463
4850I659914L04141K63682M03612K60985M72496K68805K82863L35659M08709N64286
4840A3225152O85122O47964Q12641N26361N10151P11631J001367P38068Q79657
4831A9738114Q04004Q99025J232396J108673J345239J487710J625258J634763
4823B9875182J604305J863165K014448J797108J896816J835309J727845J309573
4815D3923751R36706L68402l0574n06513r75538j264206j625842j787590k071364
4806C6967232j848111j936089j575305j646608j506091j425970j248582j482117
$$ plain form
4798 24298359 23046285 22070913 21066654 20061247 19040462 18193831 17353313 16763595 16066485
4789 16066485 15372812 14738454 14323693 13771291 13471668 13085680 12454284 12110857 11751220
4780 11751220 11407519 11281418 11150263 10953183 10774889 10512916 10227536 9950555 9789606
4771 9789606 9773814 9635120 9511105 9253910 9167659 9123305 9212186 9291140 8973874 8864382
4761 8864382 8782259 8728295 8702973 8653292 8426765 8387110 8443398 8438479 8291574 8166251 8217376
4750 8217376 8227824 8029629 7871883 7891046 7907239 8032715 8009525 8082791 8054518 8224844 8242032
4739 8242032 8353433 8395206 8278463 8276247 8435072 8438985 8500359 8600701 8706075 8794071 8894506
4728 8894506 9007809 9168585 9265778 9296125 9342067 9378461 9724752 9891258 9970955 10134964
$$ packed form
4798B4298359j252074r75372j004259j005407j020785q46631q40518n89718o97110
4789A6066485o93673o34358m14761n52402k99623l85988o31396l43427l59637
4780A1751220l43701j26101j31155j97080j78294k61973k85380k76981j60949
4771I789606j5792j38694j24015k57195q6251m4354Q8881P8954l17266j09492
4761H864382q2123n3964k5322m9681k26527l9655N6288m919j46905j25323N1125
4750H217376J0448j98195j57746J9163J6193J25476k3190P3266k8273J70326J7188
4739H242032J11401M1773j16743k216J58825L913O1374J00342J05374Q7996J00435
4728H894506J13303J60776R7193L0347M5942L6394L46291J66506P9697J64009
$$ plain form
4718 10134964 10240500 10239859 10356326 10564173 10921463 11073621 11185294 11353496 11532464 11804605
4708 11804605 11824584 11991819 12092616 12143489 12306885 12606091 12709517 12799395 12996938 13091691
4698 13091691 13203377 13320799 13375060 13504342 13736161 13831104 13842697 13933748 14008061 14184842
4688 14184842 14411409 14628784 14699344 14775074 14642597 14667784 14832786 14757870 15027728 15066163
4678 15066163 15008341 14917074 14895360 15100614 15144369 15134303 15020668 15028797 15207793 15178006 15287340
4667 15287340 15262660 15001542 15134946 15160122 14935990 14722341 14771443 14676906 14601581 14547179
4657 14547179 14347389 14270690 14163739 14173438 13924713 13647872 13698954 13668321 13473871 13361843
4647 13361843 13264238 13219146 12881787 12748025 12484595 12448199 12334663 12190805 12071824 11804447
$$ packed form
4718A0134964J05536o41J16467K07847L57290J52158J11673J68202J78968K72141
4708A1804605J9979J67235J00797N0873J63396K99206J03426Q9878J97543R4753
4698A3091691J11686J17422N4261J29282K31819R4943J1593R1051P4313J76781
4688A4184842K26567K17375P0560P5730j32477K5187J65002p4916K69858L8435
4678A5066163n7822r1267k1714K05254M3755j0066j13635Q129J78996k9787J09334
4667A5287340k4680k61118J33404K5176k24132k13649M9102r4537p5325n4402
4657A4547179j99790p6699j06951R699k48725k76841N1082l0633j94450j12028
4647A3361843r7605m5092l37359j33762k63430l6396j13536j43858j18981k67377
$$ plain form
4637 11804447 11507232 11323812 11207117 10982752 10838262 10592839 10390161 10021527 10009469 10033730
4627 10033730 9821817 9671929 9528590 9465775 9314909 9165284 8970493 8777404 8680993 8480909
4617 8480909 8283616 8267095 8200519 8201523 7950786 7751024 7625311 7505900 7362737 7271464
4607 7271464 7199505 7034673 7001195 6872802 6742453 6575228 6399554 6324599 6402411 6449214
4597 6449214 6451207 6343505 6257295 6302836 6261012 6075121 6085668 6067632 6076094 6046141 5909516
4586 5909516 5838472 5641455 5530899 5493270 5518220 5522799 5558217 5572608 5696914 5686934 5583896
4575 5583896 5662998 5652343 5776412 5619952 5521977 5697313 5816542 5860659 5728335 5698554
4565 5698554 5611384 5723627 5796831 5828776 5933069 5789927 5842431 5995445 5947245 5852872 5867757
$$ packed form
4637A1804447k97215j83420j16695k24365j44490k45423k02678l68634j2058K4261
4627A0033730k11913j49888j43339o2815j50866j49625j94791j93089r6411k00084
4617H480909j97293j6521o6576J004k50737j99762j25713j19411j43163r1273
4607G271464p1959j64832l3478j28393j30349j67225j75674p4955P7812M6803
4597F449214J993j07702q6210M5541m1824j85891J0547j8036Q462k9953j36625
4586E909516p1044j97017j10556l7629K4950M579L5418J4391J24306r980j03038
4575E583896P9102j0655J24069j56460r7975J75336J19229M4117j32324k9781
4565E698554q7170J12243P3204L1945J04293j43142N2504J53014m8200r4373J4885
$$ plain form
4554 5867757 5906330 5966299 5910354 5940616 5895610 6006504 6107980 6007470 6007425 6219498 6352497
4543 6352497 6394359 6380820 6327666 6421490 6530323 6672376 6569710 6620255 6693511 6848790 6876317
4532 6876317 6862050 7004801 7031743 7170640 7286645 7186799 7273831 7446658 7540616 7595648 7741118
4521 7741118 7954015 8092572 8158925 8302188 8562399 8799164 8966884 9133595 9392840 9340645
4511 9340645 9539933 9783486 10102949 10366807 10605879 10670707 10959380 11194274 11468615 11710593
4501 11710593 11913350 12356926 12527442 12846402 13131800 13319543 13413732 13633631 14147717 14460973
4491 14460973 14727530 15143771 15405825 15553685 15896763 16427684 16807032 17188353 17755988
4482 17755988 18266536 18708325 19247552 19910630 20462560 21017372 21599977 22299832 23150889
$$ packed form
4554E867757L8573N9969n5945L0262m5006J10894J01476j00510m5K12073J32999
4543F352497M1862j3539n3154R3824J08833J42053j02666N0545P3256J55279K7527
4532F876317j4267J42751K6942J38897J16005r9846Q7032J72827R3958N5032J45470
4521G741118K12897J38557O6353J43263K60211K36765J67720J66711K59245n2195
4511I340645J99288K43553L19463K63858K39072O4828K88673K34894K74341K41978
4501A1710593K02757M43576J70516L18960K85398J87743R4189K19899N14086L13256
4491A4460973K66557M16241K62054J47860L43078N30921L79348L81321N67635
4482A7755988N10548M41789N39227O63078N51930N54812N82605O99855Q51057
$$ plain form
4473 23150889 24079274 24885710 25707988 26723240 27879745 29106479 30341252 31547526 32801265
4464 32801265 34172950 35713436 37450361 39051698 40943525 42976845 45294375 47669248
4456 47669248 50320815 53499588 56799196 60440953 64494076 68782696 73520080 78718222
4448 78718222 84588464 90918263 97718232 105010273 112578116 120250501 127870510 135511408
4440 135511408 142799579 149153536 154383552 158260746 160363524 160829106 159508384 156532872
4432 156532872 152074133 146420457 140015133 133204891 126215657 119246992 112460144 106260473
4424 106260473 100265790 94671160 89593272 84982828 81019837 77403021 74349174 71481116
4416 71481116 68955840 66667066 64737255 63006335 61329224 59921101 58607362 57509302
$$ packed form
4473B3150889R28385Q06436Q22278J015252J156505J226734J234773J206274J253739
4464C2801265J371685J540486J736925J601337J891827K033320K317530K374873
4456D7669248K651567L178773L299608L641757M053123M288620M737384N198142
4448G8718222N870242O329799O799969P292041P567843P672385P620009P640898
4440A35511408P288171O353957N230016L877194K102778M65582j320722k975512
4432A56532872m458739n653676o405324o810242o989234o968665o786848o199671
4424A06260473n994683n594630n077888m610444l962991l616816l053847k868058
4416G1481116k525276k288774j929811j730920j677111j408123j313739j098060
$$ plain form
4408 57509302 56487223 55761425 55223709 54662658 54326577 54227153 54267857 54351024 54426759 54653636
4398 54653636 55148819 55643410 56142102 56795258 57632327 58622772 59793037 61189038 62553532
4389 62553532 63955898 65594292 67468693 69218279 70808939 72683762 74446344 76354270
4381 76354270 77730550 78808985 79654734 80211478 80636791 80520626 80077331 79564210 78847114
4372 78847114 78135116 77275201 76435595 75665238 75132384 74792264 74392056 74216870 74079126
4363 74079126 73895007 73929672 74090039 74012719 74097998 74013263 73819468 73548634 73128674 72355832
4353 72355832 71427924 70153342 68597832 67070269 65371578 63622545 61781535 59791110
4345 59791110 57913418 56186178 54458322 52516330 50815712 49157862 47657983 46026676
$$ packed form
4408E7509302j022079p25798n37716n61051l36081r9424M0704Q3167P5735K26877
4398E4653636M95183M94591M98692O53156Q37069R90445J170265J396001J364494
4389F2553532J402366J638394J874401J749586J590660J874823J762582J907926
4381G6354270J376280J078435Q45749N56744M25313j16165m43295n13121p17096
4372G8847114p11998q59915q39606p70357n32854l40120m00208j75186j37744
4363G4079126j84119L4665J60367p7320Q5279q4735j93795k70834m19960p72842
4353G2355832r27908j274582j555510j527563j698691j749033j841010j990425
4345E9791110j877692j727240j727856j941992j700618j657850j499879j631307
$$ plain form
4337 46026676 44573488 43305961 42134176 40897822 39525802 38427453 37441506 36573439
4329 36573439 35543974 34638539 33685871 32660751 31770864 30853637 29918796 28927261 27951815
4320 27951815 27125144 26202849 25555052 24806566 24036024 23430139 22609859 21976328 21416134
4311 21416134 20832424 20285794 19579406 19130953 18675735 18274445 17723087 17319236 16961840
4302 16961840 16658547 16367550 15853578 15433334 15266308 15190523 14799708 14543806 14256887 14099428
4292 14099428 13931034 13568148 13276609 13096502 12633776 12338765 12003576 11790642 11560805
4283 11560805 11324279 11053862 10874575 10804069 10584670 10505970 10315982 10149063 10032677 9800402
4273 9800402 9655113 9665752 9615184 9494923 9450432 9385610 9207668 9142371 9099800 8914129 8953229
$$ packed form
4337D6026676j453188j267527j171785j236354j372020j098349r85947q68067
4329C6573439j029465r05435r52668j025120q89887r17227r34841r91535r75446
4320B7951815q26671r22295o47797p48486p70542o05885q20280o33531n60194
4311B1416134n83710n46630p06388m48453m55218m01290n51358m03851l57396
4302A6961840l03293k90997n13972m20244j67026p5785l90815k55902k86919j57459
4292A4099428j68394l62886k91539j80107m62726k95011l35189k12934k29837
4283A1560805k36526k70417j79287p0506k19399p8700j89988j66919j16386k32275
4273I800402j45289J0639n0568j20261m4491o4822j77942o5297m2571j85671L9100
$$ plain form
4262 8953229 8850341 8748681 8755275 8638982 8680393 8610990 8566244 8551731 8538194 8406054 8318933
4251 8318933 8190448 8329427 8435492 8342240 8276619 8294181 8259326 8267146 8214519 8146068 8190563
4240 8190563 8172994 8199775 8501184 8527593 8509501 8525038 8338625 8351414 8449010 8693767 8677369
4229 8677369 8846797 8944638 9113007 9255288 9215033 9244307 9339801 9629746 9753242 9981557
4219 9981557 10080724 10223935 10302539 10409641 10471569 10524427 10822869 11121206 11429583 11605722
4209 11605722 11688166 11953822 12335822 12537404 12663578 13096679 13513952 13847059 14202069 14269773
4199 14269773 14679096 15050021 15346224 15892653 16248724 16654988 17118747 17612861 18210446
4190 18210446 18509149 18827199 19341496 19918974 20525266 21021354 21693331 22316384 22706941
$$ packed form
4262H953229j02888j01660O594j16293M1411o9403m4746j4513j3537j32140q7121
4251H318933j28485J38979J06065r3252o5621J7562l4855P820n2627o8451M4495
4240H190563j7569K6781L01409K6409j8092J5537j86413J2789R7596K44757j6398
4229H677369J69428R7841J68369J42281m0255K9274R5494K89945J23496K28315
4219I981557R9167J43211P8604J07102O1928N2858K98442K98337L08377J76139
4209A1605722Q2444K65656L82000K01582J26174M33101M17273L33107L55010O7704
4199A4269773M09323L70925K96203N46429L56071M06264M63759M94114N97585
4190A8210446K98703L18050N14297N77478O06292M96088O71977O23053L90557
$$ plain form
4181 22706941 23152324 23560038 24073956 24590163 24901235 25413888 25998889 26476358 27039784
4172 27039784 27429088 27821517 28098148 28552300 28792830 29216604 29493441 29771227 30085934
4163 30085934 30250182 30603892 30892290 31276894 31438358 31520349 31788699 32031617 32206919 32255756
4153 32255756 32366313 32506878 32568088 32656920 32695326 32772832 32815802 32784331 32768001 32746077 32618942
4142 32618942 32573894 32595462 32571034 32495437 32430679 32232923 32029842 31785899 31530963 31384221
4132 31384221 31420728 31317941 30915990 30583494 30239732 30020093 29768365 29288940 28872046 28520848
4122 28520848 28235034 27990508 27678558 27290942 27068469 26695562 26305859 25860436 25541874
4113 25541874 25351663 25089466 24577779 24145365 23851987 23587501 23073389 22721898 22364435
$$ packed form
4181B2706941M45383M07714N13918N16207L11072N12653N85001M77469N63426
4172B7039784L89304L92429K76631M54152K40530M23774K76837K77786L14707
4163C0085934J64248L53710K88398L84604J61464Q1991K68350K42918J75302M8837
4153C2255756J10557J40565O1210Q8832L8406P7506M2970l1471j6330k1924j27135
4142C2618942m5048K1568k4428p5597o4758j97756k03081k43943k54936j46742
4132C1384221L6507j02787m01951l32496l43762k19639k51728m79425m16894l51198
4122B8520848k85814k44526l11950l87616k22473l72907l89703m45423l18562
4113B5541874j90211k62197n11687m32414k93378k64486n14112l51491l57463
$$ plain form
4104 22364435 21968025 21495787 21156697 20679413 20137727 19805150 19410826 18920163 18465847
4095 18465847 17927883 17353227 16874135 16548681 16174712 15663374 15111147 14823465 14574688
4086 14574688 14338487 14021224 13722985 13443251 13080166 12875262 12604462 12413880 12033142
4077 12033142 11678315 11319754 11150568 10868206 10539642 10386311 10119329 10097893 10005410 9740175
4067 9740175 9419871 9241220 9011411 8846591 8745790 8658754 8622093 8525364 8430142 8380673
4057 8380673 8286333 8067093 8074598 8054483 8186051 8077400 8062654 8223359 8257043 8169037 7968524
4046 7968524 7776975 7710589 7442694 7409564 7466564 7352401 7206906 7173304 6948386 6780945
4036 6780945 6806210 6808059 6688104 6846805 6888887 6934831 6807679 6666106 6580080 6534917 6603812
$$ packed form
4104B2364435l96410m72238l39090m77284n41686l32577l94324m90663m54316
4095A8465847n37964n74656m79092l25454l73969n11338n52227k87682k48777
4086A4574688k36201l17263k98239k79734l63085k04904k70800j90582l80738
4077A2033142l54827l58561j69186k82362l28564j53331k66982k1436r2483k65235
4067I740175l20304j78651k29809j64820j00801q7036l6661r6729r5222m9469
4057H380673r4340k19240P505k0115J31568j08651j4746J60705L3684q8006k00513
4046G968524j91549o6386k67895l3130N7000j14163j45495l3602k24918j67441
4036F780945K5265J849j19955J58701M2082M5944j27152j41573q6026m5163O8895
$$ plain form
4025 6603812 6550648 6514665 6713973 6693345 6659959 6756798 6675258 6471576 6463953 6494649 6533543
4014 6533543 6557236 6549630 6448731 6473221 6419472 6508563 6473596 6408807 6362913 6467162 6573964
4003 6573964 6354142 6224943 6308387 6484958 6417668 6319885 6254777 6274560 6286410 6395474 6489227
3992 6489227 6351984 6101101 6209608 6346611 6313868 6242633 6270442 6239781 6259965 6059147
3982 6059147 6106948 6136801 6237270 6195034 6180280 6261004 6262745 6135625 6146481 6151835 5962168
3971 5962168 5990777 6062933 6168471 6332270 6109073 6100024 5917345 5801363 5725654 5757394 5722078
3960 5722078 5875901 6063121 5982028 5891780 5883754 5930634 5855766 5881737 5917289 6012020 5995649
3949 5995649 6151348 6164263 6079017 6022327 6158060 6099757 6037649 6045283 6150180 6260188 6252206
$$ packed form
4025F603812n3164l5983J99308k0628l3386R6839q1540k03682p623L0696L8894
4014F533543K3693p606j00899K4490n3749Q9091l4967o4789m5894J04249J06802
4003F573964k19822j29199Q3444J76571o7290r7783o5108J9783J1850J09064R3753
3992F489227j37243k50883J08507J37003l2743p1235K7809l0661K0184k00818
3982F059147M7801K9853J00469m2236j4754Q0724J741j27120J0856N354j89667
3971E962168K8609P2156J05538J63799k23197r049j82679j15982p5709L1740l5316
3960E722078J53823J87220q1093r0248q026M6880p4868K5971L5552R4731j6371
3949E995649J55699J2915q5246n6690J35733n8303o2108P634J04897J10008p982
$$ plain form
3938 6252206 6195610 6141792 6145013 6130586 6186501 6084415 6296016 6376540 6291357 6351593 6313168
3927 6313168 6426890 6491987 6569739 6446315 6573527 6596568 6651149 6659869 6558433 6649417 6628746
3916 6628746 6612424 6678148 6701113 6668718 6758463 6697346 6612251 6579969 6695082 6743676 6878181
3905 6878181 6912437 6841038 6725966 6808712 6623386 6685832 6800378 6830509 6775066 6878398 6972898
3894 6972898 7041688 7161825 7195199 7249967 7316939 7285815 7376431 7465626 7343076 7486599 7381552
3883 7381552 7357445 7425310 7542455 7656105 7628254 7590132 7591753 7684297 7746018 7694594 7655291
3872 7655291 7631508 7562027 7679298 7878644 7804474 7842907 7792927 7924167 8039761 7964735 8059986
3861 8059986 8085539 8195202 8130035 8025493 8108542 8170170 8437312 8467633 8563427 8712902 8843006
$$ packed form
3938F252206n6596n3818L221j4427N5915j02086K11601Q0524q5183O0236l8425
3927F313168J13722O5097P7752j23424J27212K3041N4581Q720j01436R0984k0671
3916F628746j6322O5724K2965l2395Q9745o1117q5095l2282J15113M8594J34505
3905F878181L4256p1399j15072Q2746j85326O2446J14546L0131n5443J03332R4500
3894F972898O8790J20137L3374N4768O6972l1124R0616Q9195j22550J43523j05047
3883G381552k4107O7865J17145J13650k7851l8122J621R2544O1721n1424l9303
3872G655291k3783o9481J17271J99346p4170L8433m9980J31240J15594p5026R5251
3861H059986K5553J09663o5167j04542Q3049O1628K67142L0321R5794J49475J30104
$$ plain form
3850 8843006 8819252 8759828 8885005 8768375 8876946 9042073 9232958 9236835 9381981 9558142
3840 9558142 9444097 9496009 9591099 9763473 9821428 10145227 10355495 10401657 10362246 10467528
3830 10467528 10556039 10634130 10811533 11131887 11284082 11453239 11651346 11657563 11823093 12112165
3820 12112165 12254669 12559110 12745782 12928934 13177979 13447759 13598151 13714674 13969553
3811 13969553 14297727 14477489 14717969 14972093 15402353 15750971 15940691 16331294 16569376
3802 16569376 16917919 17322494 17730206 18006782 18378354 18846309 19262179 19494161 19692720
3793 19692720 20001637 20511098 20927349 21334253 21725012 22117836 22452025 22868102 23249905
3784 23249905 23592225 24169240 24582819 25177153 25685233 26151329 26527076 26903825 27431240
$$ packed form
3850H843006k3754n9424J25177j16630J08571J65127J90885L877J45146J76161
3840I558142j14045N1912R5090J72374N7955L23799K10268M6162l9411J05282
3830A0467528Q8511P8091J77403L20354J52195J69157J98107O217J65530K89072
3820A2112165J42504L04441J86672J83152K49045K69780J50392J16523K54879
3811A3969553L28174J79762K40480K54124M30260L48618J89720L90603K38082
3802A6569376L48543M04575M07712K76576L71572M67955M15870K31982J98559
3793A9692720L08917N09461M16251M06904L90759L92824L34189M16077L81803
3784B3249905L42320N77015M13579N94334N08080M66096L75747L76749N27415
$$ plain form
3775 27431240 28088424 28728612 29359677 29890345 30775019 31708918 32520676 33359095 34374225
3766 34374225 35784014 37120163 38775446 40278540 41736950 42612546 43312688 43747345 44110052
3757 44110052 44569452 44986575 45356505 45577340 45494828 45522765 45521076 45694509 46038460 46455734
3747 46455734 47135110 47918888 48766739 49369427 50307018 51194232 52122894 53159375 54272173
3738 54272173 55378342 56639849 58070080 59518829 61205072 62755105 64202558 65863582
3730 65863582 67604001 69485006 71273544 73200196 75246184 77413287 79700048 82054345
3722 82054345 84676418 87437764 90449395 93174516 95656317 97782298 99650181 100873626
3714 100873626 101493046 101891436 101961618 101473926 100856897 99984867 98935853 97901081 96677720
$$ packed form
3775B7431240O57184O40188O31065N30668Q84674R33899Q11758Q38419J015130
3766C4374225J409789J336149J655283J503094J458410Q75596P00142M34657L62707
3757D4110052M59400M17123L69930K20835q2512K7937j689J73433L43951M17274
3747D6455734O79376P83778Q47851O02688R37591Q87214R28662J036481J112798
3738E4272173J106169J261507J430231J448749J686243J550033J447453J661024
3730F5863582J740419J881005J788538J926652K045988K167103K286761K354297
3722H2054345K622073K761346L011631K725121K481801K125981J867883J223445
3714A00873626O19420L98390P0182m87692o17029q72030j049014j034772j223361
$$ plain form
3705 96677720 95217170 93876051 92512948 91329833 90083498 89108461 88310651 87508523 86723311
3696 86723311 85961877 85314551 84535456 83868025 83124236 82404756 81655860 80930680 80132192
3687 80132192 79413080 78824985 78325091 77934901 77872704 77870140 78194524 78412766 78789808 79238915
3677 79238915 79770260 80286153 80801210 81508445 82139328 82758214 83108532 83702772 84364296
3668 84364296 84992754 85603953 86337410 87176624 87917930 88882782 89859942 90804681 91573383
3659 91573383 92344983 93345617 94380007 95112202 95885536 96808939 97512813 98001701 98482932
3650 98482932 99177017 99994811 100847362 101640566 102782218 103862515 105075145 106651343 108259599
3641 108259599 110059673 112065731 114397913 116585865 118951753 121524955 123941776 126691577
$$ packed form
3705I6677720j460550j341119j363103j183115j246335r75037p97810q02128p85212
3696H6723311p61434o47326p79095o67431p43789p19480p48896p25180p98488
3687H0132192p19112n88095m99894l90190o2197k564L24384K18242L77042M49107
3677G9238915N31345N15893N15057P07235O30883O18886L50318N94240O61524
3668H4364296O28458O11199P33457Q39214P41306R64852R77160R44739P68702
3659I1573383P71600J000634J034390P32195P73334R23403P03874M88888M81231
3650I8482932O94085Q17794Q52551P93204J141652J080297J212630J576198J608256
3641A08259599J800074K006058K332182K187952K365888K573202K416821K749801
$$ plain form
3633 126691577 129306026 131792301 134154021 136300473 138519839 140179452 141836271 143294685
3625 143294685 144721920 145962940 147182396 148621592 149980863 151448499 152821393 154455113
3617 154455113 155854140 157243315 158494161 159831575 160803374 161661306 162575788 162936660 163198979
3608 163198979 162989533 162357282 161614696 160848726 159868965 158498329 157035388 155402655 153745076
3599 153745076 152062913 150132949 148188743 146164912 144022821 141928488 139854421 137682353
3591 137682353 135811287 133826854 131902080 130031825 128096019 126189279 124404928 122836506
3583 122836506 121287057 119598998 117950321 116390161 114873018 113235356 111484474 109768880
3575 109768880 108230663 106262867 104191255 102187743 100147563 98000571 95789460 93460152
$$ packed form
3633A26691577K614449K486275K361720K146452K219366J659613J656819J458414
3625A43294685J427235J241020J219456J439196J359271J467636J372894J633720
3617A54455113J399027J389175J250846J337414R71799Q57932R14482L60872K62319
3608A63198979k09446o32251p42586p65970r79761j370636j462941j632733j657579
3599A53745076j682163j929964j944206k023831k142091k094333k074067k172068
3591A37682353j871066j984433j924774j870255j935806j906740j784351j568422
3583A22836506j549449j688059j648677j560160j517143j637662j750882j715594
3575A09768880j538217j967796k071612k003512k040180k146992k211111k329308
$$ plain form
3567 93460152 91280216 89235301 86886036 84874701 83043059 81165845 79266144 77510436
3559 77510436 75901169 74510263 73229172 71772585 70674662 69630360 68390023 67433287
3551 67433287 66729673 66055218 65455205 64650085 64001678 63718573 63403710 63079906 62775376
3542 62775376 62340116 61951588 61672587 61464281 61070991 60299112 59393901 58318765 57246073
3533 57246073 55947741 54762353 53521206 52342937 51232210 50154196 49144970 48396698
3525 48396698 47462266 46648838 45823095 45099859 44314159 43718758 43162156 42365887 41795511
3516 41795511 41087678 40389715 39713467 38996112 38196724 37593658 37058518 36505008 35836978
3507 35836978 35276672 34661333 34179843 34011363 33582533 33137765 32838379 32417873 32356601 32116317
$$ packed form
3567I3460152k179936k044915k349265k011335j831642j877214j899701j755708
3559G7510436j609267j390906j281091j456587j097923j044302j240337r56736
3551F7433287p03614o74455o00013q05120o48407k83105l14863l23804l04530
3542F2775376m35260l88528k79001k08306l93290p71879r05211j075136j072692
3533E7246073j298332j185388j241147j178269j110727j078014j009226p48272
3525D8396698r34432q13428q25743p23236p85700n95401n56602p96269n70376
3516D1795511p07833o97963o76248p17355p99388o03066n35140n53510o68030
3507C5836978n60306o15339m81490j68480m28830m44768k99386m20506o1272k40284
$$ plain form
3497 32116317 31923880 31809767 31861891 31905320 31815794 32033969 32093834 32218528 32185039 32105057
3487 32105057 32291849 32323756 32668630 32666504 32598989 32792183 32703772 32769525 32546262 32476452 32276666
3476 32276666 32314017 32275215 32020114 31638022 31455769 31597973 31495340 31345051 31225778 31185463
3466 31185463 31228544 31351861 31353928 31355523 31634479 31745161 31780949 31966155 32236946 32472287
3456 32472287 32758115 32936915 33230390 33598453 33982149 34416853 34951227 35527453 35971426
3447 35971426 36556280 37171855 37696944 38532456 39090858 39844734 40620098 41615312 42630581
3438 42630581 43568318 44763517 45835897 47279228 48757560 50247182 52068531 53902432
3430 53902432 55804042 57805966 59760283 61940282 64233929 66740567 69257687 72082674
$$ packed form
3497C2116317j92437j14113N2124M3429q9526K18175N9865J24694l3489p9982
3487C2105057J86792L1907L44874k126o7515J93194q8411O5753k23263o9810j99786
3476C2276666L7351l8802k55101l82092j82253J42204j02633j50289j19273m0315
3466C1185463M3081J23317K067J595K78956J10682L5788J85206K70791K35341
3456C2472287K85828J78800K93475L68063L83696M34704N34374N76226M43973
3447C5971426N84854O15575N25089Q35512N58402P53876P75364R95214J015269
3438D2630581R37737J195199J072380J443331J478332J489622J821349J833901
3430E3902432J901610K001924J954317K179999K293647K506638K517120K824987
$$ plain form
3422 72082674 75239275 78446126 82021462 86049718 90348951 94957397 100386028 106275219
3414 106275219 112919010 120305052 128793525 138827476 149899187 162790140 177456292
3407 177456292 194020212 212198935 232112468 252724414 273134275 292341188 308860445
3400 308860445 321204188 327982920 328814530 324067375 314770312 302219076 288174968 274032743
3392 274032743 260353113 247197926 234301031 221513940 208774031 195890881 183031162
3385 183031162 170581307 158602758 147513925 137325543 128353155 119933831 112501115
3378 112501115 105807158 99679093 94244112 89186788 84810387 80674895 76767403 73466951
3370 73466951 70519062 67785442 65227295 63052710 60866107 58923713 57035907 55434155
$$ packed form
3422G2082674L156601L206851L575336M028256M299233M608446N428631N889191
3414A06275219O643791P386042Q488473J0033951J1071711J2890953J4666152
3407A77456292J6563920J8178723J9913533K0611946K0409861J9206913J6519257
3400C08860445J2343743O778732Q31610m747155r297063j2551236j4044108j4142225
3392B74032743j3679630j3155187j2896895j2787091j2739909j2883150j2859719
3385A83031162j2449855j1978549j1088833j0188382q972388q419324p432716
3378A12501115o693957o128065n434981n057324m376401m135492l907492l300452
3370G3466951k947889k733620k558147k174585k186603j942394j887806j601752
$$ plain form
3362 55434155 54072616 52561415 51282987 50095547 49006350 48110457 47128564 46476474 45754862
3353 45754862 44967091 44253400 43671346 43159160 42533059 42079097 41645143 41095816 40628644
3344 40628644 40099851 39596935 39047004 38664716 38241550 37502916 37170794 36659564 36125725
3335 36125725 35686016 35196053 34886202 34599512 34097755 33835752 33621972 33565682 33314008 33069851
3325 33069851 32884564 32770636 32600072 32495079 32403591 32360794 32341943 32124959 32003817 31762130
3315 31762130 31587551 31604784 31448318 31383641 31301511 31157507 30934186 30888526 30720661 30648791
3305 30648791 30638613 30805715 31162195 31406977 31582160 31742174 31950065 32257543 32436104 32888775
3295 32888775 33085306 33301810 33448149 33708220 33984443 34005693 34114123 34267124 34492167 34669962
$$ packed form
3362E5434155j361539j511201j278428j187440j089197q95893r81893o52090p21612
3353D5754862p87771p13691n82054n12186o26101m53962m33954n49327m67172
3344D0628644n28793n02916n49931l82288m23166p38634l32122n11230n33839
3335C6125725m39709m89963l09851k86690n01757k62003k13780n6290k51674k44157
3325C3069851j85287j13928j70564j04993r1488m2797j8851k16984j21142k41687
3315C1762130j74579J7233j56466o4677q2130j44004k23321m5660j67865p1870
3305C0648791j0178J67102L56480K44782J75183J60014K07891L07478J78561M52671
3295C2888775J96531K16504J46339K60071K76223K1250J08430J53001K25043J77795
$$ plain form
3285 34669962 34906871 35196397 35509653 35668302 35986094 36429284 37191091 37845084 38711567
3276 38711567 39553988 40560972 41888402 43242537 44743172 45902375 47278846 48774496
3268 48774496 50231383 51278756 52082923 52797319 53557884 54339423 55235469 56314671 57557004
3259 57557004 58920071 60434873 62307116 64473036 66794885 69316379 72306111 75683647
3251 75683647 79576619 83850163 88830813 95008337 102327113 111192731 122319513 136107986
3243 136107986 153906085 175957273 202723832 234574682 270872884 309024473 345260963
3236 345260963 376347820 397582539 405300981 399295660 380472843 350985531 315370392
3229 315370392 278257898 242570767 211194047 185032881 163962175 147264215 134051733
$$ packed form
3285C4669962K36909K89526L13256J58649L17792M43190P61807O53993Q66483
3276C8711567Q42421J006984J327430J354135J500635J159203J376471J495650
3268D8774496J456887J047373Q04167P14396P60565P81539Q96046J079202J242333
3259E7557004J363067J514802J872243K165920K321849K521494K989732L377536
3251G5683647L892972M273544M980650O177524P318776Q865618J1126782J3788473
3243A36107986J7798099K2051188K6766559L1850850L6298202L8151589L6236490
3236C45260963L1086857K1234719P718442o005321j8822817k9487312l5615139
3229C15370392l7112494l5687131l1376720k6161166k1070706j6697960j3212482
$$ plain form
3222 134051733 123250504 113943758 106037897 98960096 92462252 86569337 81103105 76379906
3214 76379906 72016259 68246638 64936945 61908320 59410839 56961525 55046561 53111835
3206 53111835 51481353 50170544 48998362 47941720 46817616 45839282 44878061 44055853 43190833
3197 43190833 42242078 41227003 40122840 39335903 38579725 37752920 36978139 36140460 35349422
3188 35349422 34471585 33641817 32981655 32405596 31807051 31346062 30930590 30252682 29837941
3179 29837941 29507519 29116519 28658483 28456102 28139038 27814643 27606780 27380457 27085085
3170 27085085 26800112 26544323 26343421 26149227 25712081 25602728 25482456 25261170 25079148
3161 25079148 24792810 24399111 24212154 23886409 23548886 23286550 22972713 22595280 22412135
$$ packed form
3222A34051733j0801229r306746p905861p077801o497844n892915n466232m723199
3214G6379906m363647l769621l309693l028625k497481k449314j914964j934726
3206E3111835j630482j310809j172182j056642j124104r78334r61221q22208q65020
3197D3190833r48755j015075j104163p86937p56178q26805p74781q37679p91038
3188C5349422q77837q29768o60162n76059n98545m60989m15472o77908m14741
3179B9837941l30422l91000m58036k02381l17064l24395k07863k26323k95372
3170B7085085k84973k55789k00902j94194m37146j09353j20272k21286j82022
3161B5079148k86338l93699j86957l25745l37523k62336l13837l77433j83145
$$ plain form
3152 22412135 22123626 21886324 21697448 21687678 21573252 21531761 21598353 21661601 21611642 21688359 21739946
3141 21739946 21846625 21998753 21946529 21784902 21507762 20968739 20276871 19772549 19294916 18974666
3131 18974666 18648318 18271461 18032107 17826856 17785145 17613566 17457449 17341156 17320567 17291463
3121 17291463 17149475 16942043 16632222 16743203 16759331 16723706 16577659 16541792 16578473 16600217
3111 16600217 16658514 16401329 16351704 16515485 16616089 16671389 16498290 16347978 16316436 16295320
3101 16295320 16253991 16343073 16454953 16616315 16681557 16759457 16913646 17058165 17008903 16957603
3091 16957603 17056239 17080528 17103020 17069692 17014288 17038498 16992050 17017818 17177996 17409136 17577185
3080 17577185 17679855 17996462 18036698 18113193 18394517 18524671 18742949 18846054 18989926 19121854
$$ packed form
3152B2412135k88509k37302j88876r770j14426m1491O6592O3248m9959P6717N1587
3141B1739946J06679J52128n2224j61627k77140n39023o91868n04322m77633l20250
3131A8974666l26348l76857k39354k05251m1711j71579j56117j16293k0589k9104
3121A7291463j41988k07432l09821J10981J6128l5625j46047l5867L6681K1744
3111A6600217N8297k57185m9625J63781J00604N5300j73099j50312l1542k1116
3101A6295320m1329Q9082J11880J61362O5242P7900J54189J44519m9262n1300
3091A6957603R8636K4289K2492l3328n5404K4210m6448K5768J60178K31140J68049
3080A7577185J02670L16607M0236P6495K81324J30154K18278J03105J43872J31928
$$ plain form
3070 19121854 19318983 19455250 19514123 19582942 20031022 20271900 20409549 20718150 21010970 21290600
3060 21290600 21490025 21756560 22025252 22310622 22654017 23013702 23473992 23942680 24489612
3051 24489612 24964395 25502438 26034931 26581203 27280493 28167720 29037420 30005660 30892485
3042 30892485 31868827 33081152 34225353 35279507 36574899 38042409 39734046 41311910
3034 41311910 42996735 44879218 46969647 49155525 51740526 54497794 57398607 60561532
3026 60561532 63984746 67575703 70834210 74138917 77117847 79785637 81848701 83239539
3018 83239539 83729493 83312350 82472106 80941169 78993604 77003009 75187113 73698362 72085474
3009 72085474 70697345 69323452 68595562 68072000 67823233 67675231 67842059 68153678 68777053
$$ packed form
3070A9121854J97129J36267N8873O8819M48080K40878J37649L08601K92820K79630
3060B1290600J99425K66535K68692K85370L43395L59685M60290M68688N46932
3051B4489612M74783N38043N32493N46272O99290Q87227Q69700R68240Q86825
3042C0892485R76342J212325J144201J054154J295392J467510J691637J577864
3034D1311910J684825J882483K090429K185878K585001K757268K900813L162925
3026F0561532L423214L590957L258507L304707K978930K667790K063064J390838
3018H3239539M89954m17143q40244j530937j947565j990595j815896j488751j612888
3009G2085474j388129j373893p27890n23562k48767j48002J66828L11619O23375
$$ plain form
3000 68777053 69774340 70545843 71527976 72873320 74380735 76050640 78020804 80004442 82084170
2991 82084170 84465744 86934245 89521633 92343412 95224442 97991056 101131463 104282935
2983 104282935 107482662 110799470 114223095 117597965 120897339 124219823 127628126 131214652
2975 131214652 134642088 137808057 140967168 144059534 147023623 149788096 152456126 154910456
2967 154910456 157283722 159600155 161481885 163157417 164704438 166170670 167514884 168355689
2959 168355689 168856883 169321148 169521150 169511696 169324947 168683557 167979314 167120682 165832381
2950 165832381 164413068 162886414 161338164 159362598 157783250 155807559 153545608 151184520
2942 151184520 148840450 146683443 144200150 141611205 138924754 136450098 133901128 131375220
$$ packed form
3000F8777053R97287P71503R82133J345344J507415J669905J970164J983638K079728
2991H2084170K381574K468501K587388K821779K881030K766614L140407L151472
2983A04282935L199727L316808L423625L374870L299374L322484L408303L586526
2975A31214652L427436L165969L159111L092366K964089K764473K668030K454330
2967A54910456K373266K316433J881730J675532J547021J466232J344214Q40805
2959A68355689N01194M64265K00002r454j86749o41390p04243q58632j288301
2950A65832381j419313j526654j548250j975566j579348j975691k261951k361088
2942A51184520k344070k157007k483293k588945k686451k474656k548970k525908
$$ plain form
2934 131375220 128775728 126150997 123681595 121409792 118970926 116534664 114197226 111781025
2926 111781025 109572438 107342181 105170795 103067381 100734531 98742115 96799516 94703654
2918 94703654 92684561 90847838 89107290 87308544 85570325 84058368 82589243 80982414
2910 80982414 79565432 77915326 76384886 75001158 73769454 72142792 70947448 69656892
2902 69656892 68434205 66934230 65584554 64398995 62954893 61749919 60437282 59001353
2894 59001353 57476371 56359627 55279243 54164899 52697945 51292011 49979964 48559465
2886 48559465 47254410 46135607 44846743 43626706 42402069 41329833 39969442 38668341
2878 38668341 37592866 36394010 35416684 34457251 33501964 32304388 31304789 30288445 29466683
$$ packed form
2934A31375220k599492k624731k469402k271803k438866k436262k337438k416201
2926A11781025k208587k230257k171386k103414k332850j992416j942599k095862
2918I4703654k019093j836723j740548j798746j738219j511957j469125j606829
2910H0982414j416982j650106j530440j383728j231704j626662j195344j290556
2902F9656892j222687j499975j349676j185559j444102j204974j312637j435929
2894E9001353j524982j116744j080384j114344j466954j405934j312047j420499
2886D8559465j305055j118803j288864j220037j224637j072236j360391j301101
2878C8668341j075475j198856r77326r59433r55287j197576r99599j016344q21762
$$ plain form
2869 29466683 28523724 27638348 26969926 26088446 25479769 24816892 24189907 23438290 22827391
2860 22827391 22248466 21624217 21063591 20642410 20193643 19776866 19378791 18923877 18471510
2851 18471510 18048021 17662976 17289336 16932274 16546182 16293892 15950263 15642796 15187423
2842 15187423 15065192 14819985 14585576 14347149 14135999 14043736 13882404 13876086 13723075 13441449
2832 13441449 13061879 12876868 12695914 12593829 12402769 12321081 12348411 12307725 12116835 12094805
2822 12094805 11919307 11823946 11832107 11786605 11645191 11672069 11479935 11396480 11360707 11398413 11559135
2811 11559135 11562302 11437119 11230378 11288564 11282487 11117213 11072751 11091396 11194133 10902801 10930930
2800 10930930 10978212 10819910 10934026 10903403 10869053 10757809 10929284 10845655 10910961 10975846
$$ packed form
2869B9466683r42959q85376o68422q81480o08677o62877o26985p51617o10899
2860B2827391n78925o24249n60626m21181m48767m16777l98075m54914m52367
2851A8471510m23489l85045l73640l57062l86092k52290l43629l07467m55373
2842A5187423j22231k45207k34409k38427k11150r2263j61332o318j53011k81626
2832A3441449l79570j85011j80954j02085j91060q1688K7330m0686j90890k2030
2822A2094805j75498r5361Q161m5502j41414K6878j92134q3455l5773L7706J60722
2811A1559135L167j25183k06741N8186o077j65274m4462J8645J02737k91332K8129
2800A0930930M7282j58302J14116l0623l4350j11244J71475q3629O5306O4885
$$ plain form
2790 10975846 11007261 11144280 11312351 11231055 11188102 11191419 11256826 11335237 11424317 11430136 11552776
2779 11552776 11650155 11689001 11815763 11907110 11972004 12029401 12138285 12182757 12342978 12611685
2769 12611685 12703512 12843645 12983074 13149426 13269223 13542368 13707957 13738577 13839564 13916256
2759 13916256 14135969 14405457 14469869 14543109 14839411 15018663 15092752 15315387 15456683 15532342
2749 15532342 15600676 15940244 15922173 16006921 16352497 16346424 16351033 16447008 16694836 16918895 17105700
2738 17105700 17281662 17264567 17328638 17413819 17665124 17834818 17757413 17737544 17879979 18048265
2728 18048265 18321010 18563516 18730677 18934157 18992834 19178979 19344537 19366112 19465497 19649047
2718 19649047 19888924 20157441 20369591 20445278 20560686 20849119 20953605 21392126 21578882 21890922
$$ packed form
2790A0975846L1415J37019J68071q1296m2953L317O5407P8411Q9080N819J22640
2779A1552776R7379L8846J26762R1347O4894N7397J08884M4472J60221K68707
2769A2611685R1827J40133J39429J66352J19797K73145J65589L0620J00987P6692
2759A3916256K19713K69488O4412P3240K96302J79252P4089K22635J41296P5659
2749A5532342O8334L39568j8071Q4748L45576o073M609R5975K47828K24059J86805
2738A7105700J75962j7095O4071Q5181K51305J69694p7405j9869J42435J68286
2728A8048265K72745K42506J67161K03480N8677J86145J65558K1575R9385J83550
2718A9649047K39877K68517K12150P5687J15408K88433J04486M38521J86756L12040
$$ plain form
2708 21890922 22215460 22511614 22861297 23056653 23399200 23614506 23966518 24141832 24388547
2699 24388547 24940373 25185607 25538174 25868496 26295989 26677231 27124658 27534708 27816010
2690 27816010 28241767 28732705 29251809 29771766 30158028 30431024 30786305 31308758 31726933
2681 31726933 32229263 32689302 33158321 33544387 34205177 34741172 35370433 36068203 36657546
2672 36657546 37396350 38144983 38776027 39446528 40147212 40824456 41507468 42484476 43406847
2663 43406847 44162124 45111368 45931629 46853417 47928633 48681098 49656061 50564187 51648662
2654 51648662 52639766 53375065 54472559 55611539 56839604 57915343 59128982 60179592
2646 60179592 61314275 62614297 64142021 65563760 66709180 68183925 69698821 71223280
$$ packed form
2708B1890922L24538K96154L49683J95356L42547K15306L52012J75314K46715
2699B4388547N51826K45234L52567L30322M27493L81242M47427M10050K81302
2690B7816010M25757M90938N19104N19957L86262K72996L55281N22453M18175
2681C1726933N02330M60039M69019L86066O60790N35995O29261O97770N89343
2672C6657546P38804P48633O31044O70501P00684O77244O83012R77008R22371
2663D3406847P55277R49244Q20261R21788J075216P52465R74963R08126J084475
2654E1648662R91104P35299J097494J138980J228065J075739J213639J050610
2646F0179592J134683J300022J527724J421739J145420J474745J514896J524459
$$ plain form
2638 71223280 72969645 74671396 76424529 78332707 80225844 82237203 84403706 86475990
2630 86475990 88587371 90870536 93316498 95726402 98227322 100746666 103423033 106301463
2622 106301463 108968286 111661417 114577512 117383972 120311296 123068504 125906859 128997426
2614 128997426 131963359 134688700 137705488 140576608 143367693 146162454 148634267 151164084
2606 151164084 153703536 155967185 158390115 160408036 162005434 163789927 165402030 166644412
2598 166644412 168040615 169350343 170449153 171562351 172712891 173772227 174866825 175952200
2590 175952200 177056126 178231149 179517416 180516112 181967199 183390639 184747403 186579042
2582 186579042 188485932 190504677 192870256 195562603 198583512 201869153 205464664 209444122
$$ packed form
2638G1223280J746365J701751J753133J908178J893137K011359K166503K072284
2630H6475990K111381K283165K445962K409904K500920K519344K676367K878430
2622A06301463K666823K693131K916095K806460K927324K757208K838355L090567
2614A28997426K965933K725341L016788K871120K791085K794761K471813K529817
2606A51164084K539452K263649K422930K017921J597398J784493J612103J242382
2598A66644412J396203J309728J098810J113198J150540J059336J094598J085375
2590A75952200J103926J175023J286267R98696J451087J423440J356764J831639
2582A86579042J906890K018745K365579K692347L020909L285641L595511L979458
$$ plain form
2574 209444122 213719684 218519975 223471145 229019300 234835069 240960274 246871917 252751464
2566 252751464 258684707 264476296 270057389 274909744 279462594 283572289 287135640 290213458
2558 290213458 292825739 295200079 297195651 298694568 300118616 301147653 301838084 302158286
2550 302158286 301979807 301282221 300175139 298713077 296737415 294551083 292046121 289299397
2542 289299397 286432419 283748254 280926298 278216350 275796641 273486851 271395282 269695061
2534 269695061 268005323 266644045 265372597 264287413 263201500 262375033 261561580 260732805
2526 260732805 260225896 259807554 259304330 258905868 258556250 258009535 257468426 256745810 255980713
2517 255980713 255068639 253878066 252297526 250553532 248724138 246704812 244472726 242184707
$$ packed form
2574B09444122M275562M800291M951170N548155N815769O125205N911643N879547
2566B52751464N933243N791589N581093M852355M552850M109695L563351L077818
2558B90213458K612281K374340J995572J498917J424048J029037O90431L20202
2550C02158286j78479o97586j107082j462062j975662k186332k504962k746724
2542B89299397k866978k684165k821956k709948k419709k309790k091569j700221
2534B69695061j689738j361278j271448j085184j085913q26467q13453q28775
2526B60732805n06909m18342n03224l98462l49618n46715n41109p22616p65097
2517B55980713r12074j190573j580540j743994j829394k019326k232086k288019
$$ plain form
2509 242184707 239495580 236786862 233992886 231004519 227990604 225059339 221897309 218547993
2501 218547993 215413744 212336245 209226694 206164048 202983590 199886642 196755003 193773085
2493 193773085 191245179 188787620 186547902 184321006 182443374 180801563 179500016 178537913
2485 178537913 177922645 177518361 177531770 177858215 178383282 179302267 180544222 182119468 184097155
2476 184097155 186402949 188900282 191598261 194784331 198195639 201731013 205628333 209858147
2468 209858147 214324987 218989294 223996915 229172093 234493640 240018831 245935944 251840981
2460 251840981 257726177 263570957 269211071 274703336 279881516 284574391 288724730 292340588
2452 292340588 295335811 297663854 299170321 299998265 300157412 299567119 298332932 296406937
$$ packed form
2509B42184707k689127k708718k793976k988367l013915k931265l162030l349316
2501B18547993l134249l077499l109551l062646l180458l096948l131639k981918
2493A93773085k527906k457559k239718k226896j877632j641811j301547r62103
2485A78537913o15268m04284J3409L26445N25067R18985J241955J575246J977687
2476A84097155K305794K497333K697979L186070L411308L535374L897320M229814
2468B09858147M466840M664307N007621N175178N321547N525191N917113N905037
2460B51840981N885196N844780N640114N492265N178180M692875M150339L615858
2452B92340588K995223K328043J506467Q27944J59147n90293j234187j925995
$$ plain form
2444 296406937 293899482 290877174 287268554 282997645 278182161 272775857 266871224 260345760
2436 260345760 253330803 245842022 237993305 229889588 221626896 213093185 204492483 196124320
2428 196124320 188003037 180017700 172234864 164892686 158051966 151602306 145344676 139465838
2420 139465838 134069950 129058473 124436838 120407836 116498697 112980137 109692813 106629888
2412 106629888 103903944 101403777 99014990 96839325 94696147 92763818 90982568 89338227
2404 89338227 87736866 86438930 85105787 83848715 82628584 81302098 80105614 78877995
2396 78877995 77562874 76161241 74742474 73386546 72088971 70807549 69334648 67932910
2388 67932910 66642039 65163389 63718666 62144704 60706772 59219421 57793063 56179186
$$ packed form
2444B96406937k507455l022308l608620m270909m815484n406304n904633o525464
2436B60345760p014957p488781p848717q103717q262692q533711q600702q368163
2428A96124320q121283p985337p782836p342178o840720o449660o257630n878838
2420A39465838n395888n011477m621635m029002l909139l518560l287324l062925
2412A06629888k725944k500167k388787k175665k143178j932329j781250j644341
2404H9338227j601361j297936j333143j257072j220131j326486j196484j227619
2396G8877995j315121j401633j418767j355928j297575j281422j472901j401738
2388F7932910j290871j478650j444723j573962j437932j487351j426358j613877
$$ plain form
2380 56179186 54730249 53184911 51527556 49990417 48298313 46760608 45433961 43978550
2372 43978550 42627875 41154404 39789032 38375241 37050371 35818295 34675508 33613218
2364 33613218 32587260 31598800 30520323 29475352 28526252 27558758 26769291 25926214 25204706
2355 25204706 24342679 23732286 23258318 22576978 22035380 21258949 20659742 20282331 19682304
2346 19682304 19151615 18778183 18387386 17885122 17344058 16996733 16493287 16105778 15964900
2337 15964900 15692624 15252622 14830747 14513569 14031456 13789228 13437078 13221099 13232940 13018733
2327 13018733 12660284 12381002 12233040 11983130 11808191 11535177 11504966 11267914 11154692 11031146
2317 11031146 10784566 10542539 10290506 10254721 10185630 9993431 9825058 9644554 9494113 9478721
$$ packed form
2380E6179186j448937j545338j657355j537139j692104j537705j326647j455411
2372D3978550j350675j473471j365372j413791j324870j232076j142787j062290
2364C3613218j025958r88460j078477j044971r49100r67494p89467q43077p21508
2355B5204706q62027o10393m73968o81340n41598p76431n99207l77411o00027
2346A9682304n30689l73432l90797n02264n41064l47325n03446l87509j40878
2337A5964900k72276m40002m21875l17178m82113k42228l52150k15979J1841k14207
2327A3018733l58449k79282j47962k49910j74939k73014l0211k37052j13222j23546
2317A1031146k46580k42027k52033l5785o9091j92199j68373j80504j50441j5392
$$ plain form
2307 9478721 9367644 9270936 9145892 9206967 8910289 8635551 8456727 8401297 8354866 8147933
2297 8147933 8076648 7847049 7869950 7905388 7853810 7765113 7806090 7768817 7523208 7390826 7181472
2286 7181472 7079820 7041922 6891254 6827320 6818408 6745796 6682073 6726660 6638921 6612418 6528331
2275 6528331 6477351 6483549 6562384 6460676 6309335 6371852 6250246 6100679 6130293 6076708 6047886
2264 6047886 6051550 6052783 5856443 5737868 5786826 5878403 5806404 5878022 5955875 5765189 5744178
2253 5744178 5782662 5701702 5633519 5349132 5537126 5733480 5814292 5712232 5619933 5707404 5673659
2242 5673659 5599292 5487030 5516309 5653396 5542330 5502894 5399964 5366368 5288639 5166932
2232 5166932 5105982 5166582 5202341 5220357 5344871 5200125 5153311 5067120 5058328 5054643 5072072
$$ packed form
2307I478721j11077r6708j25044O1075k96678k74738j78824n5430m6431k06933
2297H147933p1285k29599K2901L5438n1578q8697M0977l7273k45609j32382k09354
2286G181472j01652l7898j50668o3934q912p2612o3723M4587q7739k6503q4087
2275F528331n0980O198P8835j01708j51341O2517j21606j49567K9614n3585k8822
2264F047886L664J233j96340j18575M8958R1577p1999P1618P7853j90686k1011
2253E744178L8484q0960o8183k84387J87994J96354Q0812j02060r2299Q7471l3745
2242E673659p4367j12262K9279J37087j11066l9436j02930l3596p7729j21707
2232E166932o0950O0600L5759J8016J24514j44746m6814q6191q792l685J7429
$$ plain form
2221 5072072 4948245 5009515 5054084 5050283 4870255 4823601 4841642 4930077 4877494 4961164 4890622
2210 4890622 4819939 4913289 4891605 4807521 4755482 4731798 5002132 5091641 4883752 5085070 5125330
2199 5125330 5252265 5335283 5367290 5439136 5510000 5531422 5530244 5502066 5509608 5283377 5221059
2188 5221059 5189075 5117437 5025867 4973080 4997183 4742419 4655075 4683916 4604724 4407211 4230311
2177 4230311 4236707 4321969 4252986 4206081 4197610 4267084 4171802 4059274 3984514 3969948 3994155 4010616
2165 4010616 3925160 3849188 3881129 3954883 3685020 3660880 3670474 3598341 3585227 3449355 3418475
2154 3418475 3364638 3293674 3271886 3266977 3207466 3208382 3398103 3368474 3239908 3257658 3235749 3116142
2142 3116142 2930301 2993984 3091374 3027984 3000162 2944006 2879659 2906234 2819296 2812448 2701038
$$ packed form
2221E072072j23827O1270M4569l801j80028m6654J8041Q8435n2583Q3670p0542
2210D890622p0683R3350k1684q4084n2039k3684K70334Q9509k07889K01318M0260
2199E125330J26935Q3018L2007P1846P0864K1422j178k8178P542k26231o2318
2188E221059l1984p1638r1570n2787K4103k54764q7344K8841p9192j97513j76900
2177D230311O396Q5262o8983m6905q471O9474r5282j12528p4760j4566K4207J6461
2165D010616q5456p5972L1941P3754k69863k4140R594p2133j3114j35872l0880
2154C418475n3837p0964k1788m909n9511R16J89721k9629j28566J7750k1909j19607
2142C116142j85841O3683R7390o3390k7822n6156o4347K6575q6938o848j11410
$$ plain form
2131 2701038 2659472 2645407 2735151 2701490 2578749 2579234 2534356 2457842 2268270 2183653 2154947
2120 2154947 2255388 2402961 2357207 2197549 2112648 2126840 2096680 1969291 1944938 1874381 1871199
2109 1871199 1775250 1695290 1668955 1467060 1345908 1480579 1406496 1526711 1611752 1532343 1529758
2098 1529758 1543082 1493184 1397278 1234777 1243409 1352544 1413752 1292739 1189934 1228343 1310731
2087 1310731 1320839 1308456 1220846 1201855 1317523 1396761 1436947 1244674 1331094 1123914 1138648
2076 1138648 1072943 1182386 1133994 1085606 1127014 979961 892798 860065 875473 867793 833514
2065 833514 920058 951383 916272 910390 971762 943693 792075 823175 666198 747281 706544
2054 706544 637404 672618 679295 721816 748400 809298 706124 766759 823467 659738 540767
$$ packed form
2131B701038m1566j4065Q9744l3661j22741M85m4878p6514j89572q4617k8706
2120B154947J00441J47573m5754j59658q4901J4192l0160j27389k4353p0557l182
2109A871199r5949p9960k6335k01895j21152J34671p4083J20215Q5041p9409k585
2098A529758J3324m9898r5906j62501Q632J09135O1208j21013j02805L8409Q2388
2087A310731J0108j2383q7610j8991J15668P9238M0186j92273Q6420k07180J4734
2076A138648o5705J09443m8392m8388M1408j47053q7163l2733J5408p680l4279
2065H33514Q6544L1325l5111n882O1372k8069j51618L1100j56977Q1083m0737
2054G06544o9140L5214O677M2521K6584O0898j03174O0635N6708j63729j18971
$$ plain form
2043 540767 577705 561928 551614 570717 635028 638709 447681 509190 382065 450721 550423
2032 550423 444566 395918 205524 339960 220060 328992 397144 401570 394252 316383 316928
2021 316928 404982 207131 210198 226471 250635 422857 329829 426616 367216 269856 332687
2010 332687 339255 322642 270665 159309 132531 214513 253903 190284 293851 324787 321413 159857
1998 159857 200502 255265 212672 127456 108862 278170 205220 247423 244894 252857 279241 468266
1986 468266 544359 449473 207204 -13170 82336 63687 115716 67396 135834 147772 174743
1975 174743 163229 168847 132120 145747 63134 196662 110785 115894 220116 211933 221354 74256
1963 74256 130144 46473 178058 218357 98832 114063 171834 82827 48784 106351 106533 185077
$$ packed form
2043E40767L6938j5777j0314J9103O4311L681j91028O1509j27125O8656R9702
2032E50423j05857m8648j90394J34436j19900J08932O8152M426p318p7869N45
2021C16928Q8054j97851L067J6273K4164J72222r3028R6787n9400r7360O2831
2010C32687O568j6613n1977j11356k6778Q1982L9390o3619J03567L0936l374j61556
1998A59857M0645N4763m2593q5216j8594J69308p2950M2203k529P963K6384J89025
1986D68266P6093r4886k42269k20374R5506j8649N2029m8320O8438J1938K6971
1975A74743j1514N618l6727J3627q2613J33528q5877N109J04222q183R421j47098
1963G4256N5888q3671J31585M0299j19525J5231N7771q9007l4043N7567J82P8544
$$ plain form
1951 185077 112242 78305 48890 226357 241075 117216 62035 187065 216659 174557 63193
1940 63193 13707 148508 -19043 122647 185930 150055 126353 242856 233262 76988 -50317
1929 -50317 -62432 26648 80884 148770 48620 -49906 44267 203252 101979 107964 -95053
1918 -95053 -62832 -11646 139232 265888 71864 83386 75589 90915 65154 109526 174201
1907 174201 206795 196546 273921 199121 199695 129495 170122 -58766 -170877 20894 97729
1896 97729 78221 127705 194464 33344 189781 220811 65378 67436 113470 209595 137131
1885 137131 -2338 40051 15478 -98419 -100091 -111119 -78598 55155 134545 131968 164099
1874 164099 145422 101087 113517 118628 57991 169945 257513 257486 226597 5992 66812 146830
$$ packed form
1951A85077p2835l3937k9415J77467J4718j23859n5181J25030K9594m2102j11364
1940F3193m9486J34801j67551J41690O3283l5875k3702J16503r594j56274j27305
1929e0317j2115Q9080N4236O7886j00150r8526R4173J58985j01273N985k03017
1918i5053L2221N1186J50878J26656j94024J1522p797J5326k5761M4372O4675
1907A74201L2594j0249P7375p4800N74p0200M0627k28888j12111J91771P6835
1896I7729j9508M9484O6759j61120J56437L1030j55433K058M6034R6125p2464
1885A37131j39469M2389k4573j13897j672j1028L2521J33753P9390k577L2131
1874A64099j8677m4335J2430N111o0637J11954Q7568k7l0889k20605O0820Q0018
$$ plain form
1862 146830 140391 155157 308960 328350 133852 93581 113033 55757 145567 232764 353202
1851 353202 328182 253709 176402 107812 93008 103242 132110 193949 220692 188170 153389 291894
1839 291894 316921 264596 260130 269305 199040 278366 269883 284823 244816 455791 574275 581755
1827 581755 506693 440694 497063 378577 417533 454709 575845 392848 349432 301806 295558
1816 295558 372952 349626 188355 238532 199111 210995 318919 426523 361130 336071 346650
1805 346650 248688 326909 212348 116528 121722 5963 49655 50880 52839 32365 162817 248982
1793 248982 265935 169152 93328 31843 82142 181247 137688 134412 252098 170629 118665 87264
1781 87264 123659 176881 192601 149862 162619 207561 201280 253886 233280 76515 25028 -7653
$$ packed form
1862A46830o439J4766J53803J9390j94498m0271J9452n7276Q9810Q7197J20438
1851C53202k5020p4473p7307o8590j4804J0234K8868O1839K6743l2522l4781J38505
1839B91894K5027n2325m466R175p0265P9326q483J4940m0007K10975J18484P480
1827E81755p5062o5999N6369j18486L8956L7176J21136j82997m3416m7626o248
1816B95558P7394k3326j61271N0177l9421J1884J07924J07604o5393k5059J0579
1805C46650r7962P8221j14561r5820N194j15759M3692J225J959k0474J30452Q6165
1793B48982J6953r6783p5824o1485N0299R9105m3559l276J17686q1469n1964l1401
1781H7264L6395N3222J5720m2739J2757M4942o281N2606k0606j56765n1487l2681
$$ plain form
1769 -7653 -78815 59392 90374 93639 73794 73123 195785 103052 105194 -24965 -111932 -81405
1757 -81405 -46870 -94535 -181732 -26134 -145255 -145007 -173605 -123514 -142213 -113128 -178214 -103636
1745 -103636 -31770 80992 101966 -75228 -58591 35122 -78614 -132295 -129720 -147410 -161758
1734 -161758 -255099 -101888 -245110 -208195 -158506 -165997 -53399 -159088 -56718 -109141 -86549
1723 -86549 61552 -87727 -227946 -312277 -187252 -285045 -363207 -239523 -271420 -231266 -283665
1712 -283665 -163638 -219212 -244577 -235826 -108439 -84792 -234845 -244303 -140137 -164189 -411638
1701 -411638 -420051 -330107 -355271 -324571 -308234 -273917 -184763 -208133 -180282 -218955 -349885 -279671
1689 -279671 -243194 -171832 -193721 -241923 -357581 -438920 -234109 -212510 -230371 -34249 -139841
$$ packed form
1769g653p1162J38207L0982L265j9845o71J22662r2733K142j30159q6967L0527
1757h1405L4535m7665q7197J55598j19121K48k8598N0091j8699K9085o5086P4578
1745a03636P1866J12762K0974j77194J6637R3713j13736n3681K575j7690j4348
1734a61758r3341J53211j43222L6915M9689p491J12598j05689J02370n2423K2592
1723h6549J48101j49279j40219q4331J25025r7793p8162J23684l1897M0154n2399
1712b83665J20027n5574k5365Q751J27387K3647j50053r458J04166k4052k47449
1701d11638q413Q9944k5164L0700J6337L4317Q9154k3370K7851l8673j30930P0214
1689b79671L6477P1362k1889m8202j15658q1339K04811K1599j7861J96122j05592
$$ plain form
1678 -139841 -267849 -323593 -154837 -257595 -403668 -405886 -431088 -200872 -288958 -247583 -207823
1667 -207823 -241378 -244642 -241638 -124560 -253482 -184331 -227969 -289559 -264390 -253524 -428547
1656 -428547 -437585 -249895 -153032 -238935 -258882 -233334 -105557 91057 -106531 -200192 -211549
1645 -211549 -190454 -265193 -226811 -307592 -243717 -280165 -265654 -396122 -573456 -535312 -356982
1634 -356982 -311648 -434451 -386349 -252634 -118040 -161946 -281138 -282029 -203726 -206424 -265463
1623 -265463 -139438 37407 -152177 -205919 -47122 -159735 -156137 -298894 -299556 -279973 -312767
1612 -312767 -388965 -431395 -466223 -430150 -360119 -389727 -432186 -467166 -414690 -375923 -445277 -285748
1600 -285748 -290481 -276833 -414325 -259128 -189262 -285612 -198793 -224560 -72292 -111948 -267007
$$ packed form
1678a39841j28008n5744J68756j02758j46073k218k5202K30216q8086M1375L9760
1667b07823l3555l264L004J17078j28922O9151m3638o1590K5169J0866j75023
1656d28547r038J87690R6863q5903j9947K5548J27777J96614j97588r3661j1357
1645b11549K1095p4739L8382q0781O3875l6448J4511j30468j77334L8144J78330
1634c56982M5334j22803M8102J33715J34594m3906j19192q91P8303k698n9039
1623b65463J26025J76845j89584n3742J58797j12613L598j42757o62J9583l2794
1612c12767p6198m2430l4828L6073P0031k9608m2459l4980N2476L8767o9354J59529
1600b85748m733J3648j37492J55197O9866r6350Q6819k5767J52268l9656j55059
$$ plain form
1589 -267007 -359350 -319671 -241852 -307344 -415091 -222900 -41417 -139928 -168272 -106701 -13725
1578 -13725 -136493 -310926 -226903 -255616 -232124 -335454 -192683 -179659 -83585 -77263 -158158
1567 -158158 -207639 -340104 -108485 -205710 -315014 -139071 -113450 -81959 -224917 -177408 -228574
1556 -228574 -120496 -110935 -226174 -159394 -203771 -381129 -387657 -363446 -453446 -382440 -176694
1545 -176694 -224925 -251518 -170449 -129489 -180746 -245638 -302839 -201164 -161238 -124666 -155985
1534 -155985 -182072 -155553 -202269 -211560 -240891 -148162 -2748 -4287 -159575 -172015 -158908 -25357
1522 -25357 -163171 -197350 -273978 -217318 -158136 -105313 -276730 -274173 -341865 -245196 -222495 -193425
1510 -193425 -276614 -325284 -249172 -208927 -90591 -287181 -322041 -239894 -114376 -208007 -195827
$$ packed form
1589b67007r2343L9679P7819o5492j07747J92191J81483r8511k8344O1571R2976
1578a3725j22768j74433Q4023k8713K3492j03330J42771J3024R6074O322q0895
1567a58158m9481j32465K31619r7225j09304J75943K5621L1491j42958M7509n1166
1556b28574J08078R561j15239O6780m4377j77358o528K4211r0000P1006K05746
1545a76694m8231k6593Q1069M0960n1257o4892n7201J01675L9926L6572l1319
1534a55985k6087K6519m6716r291k9331R2729J45414j539j55288j2440J3107J33551
1522b5357j37814l4179p6628N6660N9182N2823j71417K557o7692R6669K2701K9070
1510a93425q3189m8670P6112M0245J18336j96590l4860Q2147J25518r3631J2180
$$ plain form
1499 -195827 -252934 -232589 -212678 -226845 -249467 -204171 -133442 -88843 -89162 -294361 -228925 -205297
1487 -205297 -227553 -284901 -371385 -195788 -209692 -161530 -335209 -384398 -331850 -161326 65605
1476 65605 -104394 -76939 -96978 -39297 -90134 -70604 48142 -30990 -96167 -264506 -248667
1465 -248667 -135912 -175559 -281978 -235343 -152861 -185671 -243301 -86780 -100097 -138261 -246695
1454 -246695 -105086 -226299 -228288 -205094 -151430 -121481 -233248 -93786 -164543 -238874 -112436
1443 -112436 -100476 -273037 -287349 -192678 -124970 -112719 -41543 -51054 -113536 -158873 -149235 -152821
1431 -152821 -86351 -116865 -52134 -108149 -195025 -268072 -182155 -244260 -246797 -144104 -141973 -228918
1419 -228918 -200213 -14993 -181486 -222150 -271843 -143523 -38553 -102810 -142441 -208978 -161899
$$ packed form
1499a95827n7107K0345J9911j4167k2622M5296P0729M4599l19k05199O5436K3628
1487b05297k2256n7348q6484J75597j3904M8162j73679m9189N2548J70524K26931
1476F5605j69999K7455k0039N7681n0837J9530J18746p9132o5177j68339J5839
1465b48667J12755l9647j06419M6635Q2482l2810n7630J56521j3317l8164j08434
1454b46695J41609j21213j989K3194N3664K9949j11767J39462p0757p4331J26438
1443a12436J1960j72561j4312R4671O7708J2251P1176r511o2482m5337R638l586
1431a52821O6470l0514O4731n6015q6876p3047Q5917o2105k537J02693K131q6945
1419b28918K8705J85220j66493m0664m9693J28320J04970o4257l9631o6537M7079
$$ plain form
1408 -161899 -85889 -111611 -174260 -216835 -43245 114018 29601 -195263 -225860 -116693 -36157
1397 -36157 -68747 -210829 -135650 -220880 -150790 -108542 -138849 -236485 -233482 -51867 -74215 -334576
1385 -334576 -158535 -147645 -199299 -172119 -240883 -210854 -175067 -222883 -316826 -400846 -337450
1374 -337450 -217069 -162686 -162065 -125432 -112411 -183485 -108260 -131591 -261468 -238706 -19459
1363 -19459 -135571 -281860 -292526 -210777 -132817 -154485 -197392 -81906 -161754 -223736 -182057
1352 -182057 -174536 -62000 -178089 -123974 -27687 -58843 -140267 -128470 -216970 -313955 -201058
1341 -201058 -324144 -217792 -187512 -183585 -68205 -155543 -183340 -239003 -240497 -380480 -283429
1330 -283429 -79835 -155887 -64111 -210071 -168592 -202284 -269916 -251680 -267105 -230185 -238089
$$ packed form
1408a61899P6010k5722o2649m2575J73590J57263q4417k24864l0597J09167Q0536
1397c6157l2590j42082P5179q5230P0090M2248l0307r7636L003J81615k2348k60361
1385c34576J76041J0890n1654K7180o8764L0029L5787m7816r3943q4020O3396
1374c37450J20381N4383O21L6633J3021p1074P5225k3331j29877K2762K19247
1363a9459j16112j46289j0666Q1749P7960k1668m2907J15486p9848o1982M1679
1352a82057P521J12536j16089N4115R6287l1156q1424J1797q8500r6985J12897
1341b01058j23086J06352L0280L927J15380q7338k7797n5663j494j39983R7051
1330b83429K03594p6052R1776j45960M1479l3692o7632J8236j5425L6920p904
$$ plain form
1319 -238089 -173696 -130437 -167924 -115224 -180023 -118086 -68516 -43789 -98926 -157774 -135087 -122647
1307 -122647 -271030 -439618 -329541 -352564 -149772 -168582 -182250 -270497 -201822 -39654 -234116
1296 -234116 -258663 -196865 -279563 -257782 -254865 -250804 -249493 -77549 -123080 -268701 -293680 -271371
1284 -271371 -27744 52763 43085 -158891 -169523 -151502 -191152 -225849 -205998 -193552 -36119
1273 -36119 -228512 -8761 18284 -75913 -59148 -148933 67607 -3283 -6866 -32282 39764
1262 39764 -122469 -134997 -115909 -17522 -178663 107410 52464 -243962 -251973 -39708 -54660
1251 -54660 -66526 -115713 -320216 -252191 -11712 39798 -137472 -220789 -133816 -107325 -118202
1240 -118202 -49232 -210693 63044 -57759 -153667 -163953 -178086 -99615 -19935 8663 -182126
$$ packed form
1319b38089O4393M3259l7487N2700o4799O1937M9570K4727n5137n8848K2687J2440
1307a22647j48383j68588J10077k3023K02792j8810j3668q8247O8675J62168j94462
1296b34116k4547O1798q2698K1781K917M061J311J71944m5531j45621k4979K2309
1284b71371K43627Q0507r678k01976j0632J8021l9650l4697J9851J2446J57433
1273c6119j92393K19751K7045r4197J6765q9785K16540p0890l583k5416P2046
1262C9764j62233j2528J9088R8387j61141K86073n4946k96426q011K12265j4952
1251e4660j1866m9187k04503O8025K40479N1510j77270q3317Q6973K6491j0877
1240a18202O8970j61461K73737j20803r5908j0286j4133P8471P9680K8598j90789
$$ plain form
1229 -182126 -166337 -252357 -148365 -76853 -198945 -206177 -150244 -60839 -198620 -115026 -68496
1218 -68496 -68946 -23030 -184323 -169956 -58325 39733 -86419 -181891 -8808 -85474 19890
1207 19890 32676 82852 -2656 -79238 -127433 -149212 -138633 28165 108756 41726 4922 -9081
1195 -9081 104790 134673 -170468 -70278 -64974 40825 -49329 -105129 -148727 -102566 44505
1184 44505 -47466 -76294 -261012 -100091 -8787 -54818 -125103 50701 1121 -100467 -73139
1173 -73139 -34578 -63439 -43961 -151196 -168305 -98826 -60845 19424 95819 -129749 -48345
1162 -48345 -37143 -12697 75366 -66251 -23719 -104555 -107568 -94831 18027 30259 116513 193037
1150 193037 42474 53177 40628 -175760 -130776 -15907 -63478 -54551 -65173 85911 5247
$$ packed form
1229a82126J5789q6020J03992P1512j22092p232N5933Q9405j37781Q3594M6530
1218f8496m50M5916j61293J4367J11631R8058j26152r5472J73083p6666J05364
1207A9890J2786N0176q5508p6582m8195k1779J0579J66798Q0591o7030l6804j4003
1195i081J13871K9883l05141J00190N304J05799r0154n5800m3598M6161J47071
1184D4505r1971k8828j84718J60921R1304m6031p0285J75804m9580j01588K7328
1173g3139L8561k8861J9478j07235j7109O9479L7981Q0269P6395k25568Q1404
1162d8345J1202K4446Q8063j41617M2532q0836l013J2737J12858J2232Q6254P6524
1150A93037j50563J0703j2549k16388M4984J14869m7571Q927j0622J51084q0664
$$ plain form
1139 5247 -147946 -26255 199709 35241 -88077 -118899 -72665 46897 104292 12780 -10428
1128 -10428 -80805 -66716 -98192 -145972 -138770 12186 86389 112352 58887 -32632 103431 88998
1116 88998 95056 114154 195212 102719 171533 101405 88666 69925 88163 204962 302452 152313
1104 152313 56449 -22854 -29542 -6311 178329 207852 45946 17893 60557 300350 196563
1093 196563 108220 -3877 85756 125983 256798 180821 79401 52568 -4619 115132 151590
1082 151590 180826 190050 282218 190839 99769 161231 226265 195755 210047 378252 282670 315851
1070 315851 384099 187526 246494 239083 472630 348062 379894 473756 269653 402161 422666
1059 422666 477333 494947 402485 402049 406814 626500 684240 621539 603599 666324 777980 698174
$$ packed form
1139E247j53193J21691K25964j64468j23318l0822M6234J19562N7395r1512k3208
1128a0428p0377J4089l1476m7780P202J50956P4203K5963n3465r1519J36063j4433
1116H8998O058J9098Q1058r2493O8814p0128j2739j8741J8238J16799R7490j50139
1104A52313r5864p9303o688K3231J84640K9523j61906k8053M2664K39793j03787
1093A96563q8343j12097Q9633M0227J30815p5977j01420k6833n7187J19751L6458
1082A51590K9236R224R2168r1379r1070O1462O5034l0510J4292J68205r5582L3181
1070C15851O8248j96573N8968p411K33547j24568L1832R3862k04103J32508K0505
1059D22666N4667J7614r2462m36M765K19686N7740o2701j7940O2725J11656p9806
$$ plain form
1047 698174 751432 674401 650181 521017 410075 466453 820978 735661 610757 606309 708785
1036 708785 641044 694860 722157 689898 730710 753228 903401 813758 927577 867678 851583
1025 851583 789645 730299 963533 1267756 1200162 1234481 1286981 1321149 1395290 1368389 1399286
1014 1399286 1546446 1584048 1708791 1829948 1939988 2170864 2258723 2372519 2447723 2554944
1004 2554944 2549077 2768173 2982653 3368637 3597676 3709560 3874323 4205985 4570939 4861432
994 4861432 5235220 5607122 6282432 6965731 8017210 9130041 10622778 12728219 15411676
985 15411676 18473886 21858393 26077529 30501993 34057157 35559480 30650711 22795735
977 22795735 17348555 14238122 12172365 10663631 9644850 8717955 7951715 7315869 6692557
$$ packed form
1047F98174N3258p7031k4220j29164j10942N6378L54525q5317j24904m448J02476
1036G08785o7741N3816K7297l2259M0812K2518J50173q9643J13819n9899j6095
1025H51583o1938n9346K33234L04223o7594L4319N2500L4168P4141k6901L0897
1014A399286J47160L7602J24743J21157J10040K30876Q7859J13796P5204J07221
1004B554944n867K19096K14480L85984K29039J11884J64763L31662L64954K90493
994D861432L73788L71902O75310O83299J051479J112831J492737K105441K683457
985A5411676L062210L384507M219136M424464L555164J502323m908769p854976
977B2795735n447180l110433k065757j508734j018781r26895p66240o35846o23312
$$ plain form
968 6692557 6214389 5721870 5327859 5136432 4835509 4421721 3715617 3403888 3001319 2753987
958 2753987 2620740 2652414 2409630 2304869 2078509 1936883 1958960 1733001 1540438 1540204 1696112
947 1696112 1667196 1531034 1555208 1488394 1335227 1275660 1169799 1092740 779426 942128 938556
936 938556 994060 960554 876363 1028984 1012306 924729 921917 957141 857468 797663 719070 607302
924 607302 588891 691730 596552 573580 565639 637849 498923 497273 447457 404001 256551 299316
912 299316 247807 218125 343366 354198 481721 624277 647090 536732 466564 399972 376099
901 376099 379346 461565 519742 516474 421312 508704 560238 350905 246493 259755 177590 98935
889 98935 162750 286720 329225 78830 31036 93304 147992 165751 97141 -21523 73791
$$ packed form
968F692557m78168m92519l94011j91427l00923m13788p06104l11729m02569k47332
958B753987j33247L1674k42784j04761k26360j41626K2077k25959j92563k34J55908
947A696112k8916j36162K4174o6814j53167n9567j05861p7059l13314J62702l572
936I38556N5504l3506q4191J52621j6678q7577k812L5224r9673n9805p8593j11768
924F07302j8411J02839r5178k2972p941P2210j38926j650m9816m3456j47450M2765
912B99316n1509k9682J25241J0832J27523J42556K2813j10358p0168o6592k3873
901C76099L247Q2219N8177l268r5162Q7392N1534k09333j04412J3262q2165p8655
889I8935O3815J23970M2505k50395m7794O2268N4688J7759o8610j18664R5314
$$ plain form
878 73791 107153 89953 104307 120143 47857 22647 133494 118260 94642 260991 144035
867 144035 117249 163499 118749 103716 -7535 94262 -12404 -44405 -137422 49979 37738
856 37738 -19136 -153673 -121395 64597 146259 153868 185086 166880 133521 96311 -80582 -121273
844 -121273 77872 204315 217399 272208 301478 224012 143337 -59193 -75961 64720 -22431
833 -22431 81502 83638 167442 125043 203887 93841 -6074 82543 -10706 285668 118254
822 118254 78691 -10462 -1044 -10034 -62350 -123889 -30776 -140238 -89269 37902 39902 62868
810 62868 22448 29995 -48287 6109 25176 115251 -79673 -142304 -108111 27696 99025 113960
798 113960 174066 37447 10457 61815 50847 104480 32548 -56101 -118800 -72089 -53439 108494
$$ packed form
878G3791L3362j7200J4354J5836p2286k5210J10847j5234k3618J66349j16956
867A44035k6786M6250m4750j5033j11251J01797j06666l2001r3017J87401j2241
856C7738n6874j34537L2278J85992Q1662P609L1218j8206l3359l7210j76893m0691
844a21273J99145J26443J3084N4809K9270p7466q0675k02530j6768J40681q7151
833b2431J03933K136Q3804m2399P8844j10046r9915Q8617r3249K96374j67414
822A18254l9563q9153R418q990n2316o1539R3113j09462N0969J27171K000K2966
810F2868m0420P547p8282N4396J9067R0075j94924o2631L4193J35807P1329J4935
798A13960O0106j36619k6990N1358j0968N3633p1932q8649o2699M6711J8650J61933
$$ plain form
786 108494 217568 245381 138108 108673 -6903 5047 -172151 -149952 -153004 -8592 126770
775 126770 189179 201227 -136225 -129097 -97345 5211 63642 62208 98308 28150 -81916 -53317
763 -53317 77616 113411 65393 82903 194245 198587 33056 -40873 -70724 65162 13679
752 13679 -15830 35916 50131 97145 -14602 55694 -20669 63101 185785 115542 -156463
741 -156463 -94589 84139 -2664 -164837 -140361 -14136 93598 174854 50224 -7537 -16686
730 -16686 -16066 -91860 -119929 -287027 -298527 -171025 -152022 -125186 -61067 110134 311470 -11604
718 -11604 -34508 -22782 64924 91984 -77884 56518 5030 10578 112268 50704 -20094 6306
706 6306 159406 109747 48888 45828 -15512 5125 70259 245203 43678 17467 94140 83134
$$ packed form
786A08494J09074K7813j07273k9435j15576J1950j77198K2199l052J44412J35362
775A26770O2409J2048l37452P128L1752J02556N8431j434L6100p0158j10066K8599
763e3317J30933L5795m8018J7510J11342M342j65531p3929k9851J35886n1483
752A3679k9509N1746J4215M7014j11747P0296p6363Q3770J22684p0243k72005
741a56463O1874J78728q6803j62173K4476J26225J07734Q1256j24630n7761r149
730a6686O20p5794k8069j67098j1500J27502J9003K6836O4119J71201K01336l23074
718a1604k2904J1726Q7706K7060j69868J34402n1488N548J01690o1564p0798K6400
706F306J53100m9659o0859l060o1340K0637O5134J74944k01525k6211P6673j1006
$$ plain form
694 83134 99516 41772 20205 26635 21957 86428 146585 178924 193552 160320 178855 81251
682 81251 5834 17054 63941 -148543 -11919 42174 78617 -50426 -60029 7933 246193
671 246193 171773 -48603 20869 -38861 -38554 -13013 168867 159711 28743 -56860 91556 89565
659 89565 123899 4937 -114535 6065 59236 98753 220093 138978 -10629 -99415 -94069
648 -94069 -68413 15444 55946 -744 189525 124608 179911 150869 90591 208864 88921
637 88921 20046 17319 -37529 162840 18799 -29960 -19330 151124 260925 159492 42243
626 42243 -32201 187461 150692 147915 29043 2503 28379 44675 5371 113449 36799 -5020
614 -5020 14306 45265 -91647 -21962 2228 121367 106675 151561 126551 123509 147822 54842
$$ packed form
694H3134J6382n7744k1567O430m678O4471O0157L2339J4628l3232J8535r7604
682H1251p5417J1220M6887k12484J36624N4093L6443j29043r603O7962K38260
671B46193p4420k20376O9472n9730L07K5541J81880r156j30968q5603J48416j991
659H9565L4334j18962j19472J20600N3171L9517J21340q1115j49607q8786N346
648i4069K5656Q3857M0502n6690J90269o4917N5303k9042o0278J18273j19943
637H8921o8875k727n4848K00369j44041m8759J0630J70454J09801j01433j17249
626D2243p4444K19662l6769k777j18872k6540K5876J6296l9304J08078p6650m1819
614e020J9326L0959j36912O9685K4190J19139j4692M4886k5010l042K4313r2980
$$ plain form
602 54842 6641 20828 233644 195930 224680 151821 147410 33082 -31072 -43546 63616 -46200
590 -46200 -176341 95972 122831 9836 -12988 40645 -23292 148777 166440 41050 -89896
579 -89896 37943 118672 85878 73607 107695 14781 128675 119239 110723 92811 105965 49120
567 49120 -141353 -4808 -15627 148013 152683 69492 8807 14303 116727 133596 129244 19815
555 19815 8772 27132 -46225 69490 41812 68603 15856 -15451 -72912 199295 263352 191281
543 191281 217075 309801 160045 68256 90530 130342 154096 81736 110965 89078 193395
532 193395 71806 157923 91107 114964 158662 97062 163635 -5668 82732 98099 112136
521 112136 144261 160557 74006 -34367 166228 163290 -13357 3142 138661 222684 105814
$$ packed form
602E4842m8201J4187K12816l7714K8750p2859m411j14328o4154j2474J07162j09816
590d6200j30141K72313K6859j12995k2824N3633o3937J72069J7663j25390j30946
579h9896J27839Q0729l2794j2271L4088r2914J13894r436q516j7912J3154n6845
567D9120j90473J36545j0819J63640M670q3191o0685N496J02424J6869m352j09429
555A9815j1043J8360p3357J15715k7678K6791n2747l1307n7461K72207O4057p2071
543A91281K5794R2726j49756r1789K2274L9812K3754p2360K9229k1887J04317
532A93395j21589Q6117o6816K3857M3698o1600O6573j69303Q8400J5367J4037
521A12136L2125J6296q6551j08373K00595k938j76647J6499J35519Q4023j16870
$$ plain form
510 105814 19647 63191 305185 42809 26635 51802 18731 64236 58402 143059 26763
499 26763 9393 47511 34275 -1063 99430 85153 90220 244891 220831 150176 204593 113414
487 113414 290760 81643 160164 88713 135253 50328 -14104 221308 219575 252247 160083
476 160083 149667 139769 267643 77994 95322 144069 62312 37879 208057 227041 123282
465 123282 121171 186214 67798 109677 139750 146798 180332 184986 32488 -8742 126859 153318
453 153318 159483 50132 -21964 102408 142484 235251 214124 69465 -12067 32182 97856
442 97856 195964 208766 108705 -332 21739 58421 -8665 32580 -23976 33622 161761
431 161761 89873 -11398 28499 65099 95559 95575 157593 253862 166269 150817 63506 10617
$$ packed form
510A05814q6167M3544K41994k62376j6174K5167l3071M5505n834Q4657j16296
499B6763j7370L8118j3236l5338J00493j4277N067J54671k4060p0655N4417r1179
487A13414J77346k09117P8521p1451M6540q4925o4432K35412j733L2672r2164
476A60083j0416r898J27874j89649J7328M8747q1757k4433J70178J8984j03759
465A23282k111O5043j18416M1879L0073P048L3534M654j52498m1230J35601K6459
453A53318O165j09351p2096J24372M0076R2767k1127j44659q1532M4249O5674
442I7856R8108J2802j00061j09037K2071L6682o7086M1245n6556N7598J28139
431A61761p1888j01271L9897L6600L0460J6O2018R6269q7593j5452q7311n2889
$$ plain form
419 10617 289450 337555 115887 51177 -69156 -4777 176519 222239 226885 220187 252020 52763
407 52763 118756 134183 150004 251946 330400 77524 -83383 7704 102026 66739 161729
396 161729 7320 6191 152555 346422 214158 200468 185695 162580 121124 92067 -113362
385 -113362 -226223 32529 338178 146870 118013 234556 186734 167671 101048 28828 155817
374 155817 227156 51581 117311 58295 42030 186270 178153 279389 188503 257290 312235
363 312235 258864 5422 -44619 44745 -25727 150973 69629 53987 124665 138786 215820
352 215820 334694 46362 -148864 8552 196189 131032 87929 84258 241947 323845 308828
341 308828 253241 211215 192147 218161 50461 75127 26175 -43744 -2367 59922 170179
$$ packed form
419A0617K78833M8105k21668o4710j20333O4379J81296M5720M646o698L1833j99257
407E2763O5993J5427J5821J01942P8454k52876j60907R1087R4322l5287R4990
396A61729j54409j129J46364J93867j32264j3690j4773k3115m1456k9057k05429
385a13362j12861K58752L05649j91308k8857J16543m7822j9063o6623p2220J26989
374A55817P1339j75575O5730n9016j6265J44240q117J01236r0886O8787N4945
363C12235n3371k53442n0041Q9364p0472J76700q1344j5642P0678J4121P7034
352B15820J18874k88332j95226J57416J87637o5157m3103l671J57689Q1898j5017
341C08828n5587m2026j9068K6014j67700K4666m8952o9919M1377O2289J10257
$$ plain form
330 170179 177336 13715 -531 129625 76313 -79369 36727 27307 86008 168018 384107
319 384107 412162 269243 162884 25246 229719 264035 306020 351039 117210 131606 81170
308 81170 77360 212672 287186 161124 190107 169257 195500 124558 147294 114517 117120 52645
296 52645 76747 135330 254260 182941 98795 115789 71745 127263 248934 262732 68780
285 68780 -16305 86962 38730 87905 18962 103414 144658 201286 268177 164897 172989 187854
$$ packed form
330A70179P157j63621j4246J30156n3312j55682J16096r420N8701Q2010K16089
319C84107K8055j42919j06359j37638K04473L4316M1985M5019k33829J4396n0436
308H1170l810J35312P4514j26062K8983k0850K6243p0942K2736l2777K603o4475
296E2645K4102N8583J18930p1319q4146J6994m4044N5518J21671J3798j93952
285F8780q5085J03267m8232M9175o8943Q4452M1244N6628O6891j03280Q092J4865
$$ [...]
##END NTUPLES=NMR SPECTRUM
##END=
