##TITLE=1H_TG-2324
 CDCl3,8 sc, 
 31.03.2021
##JCAMPDX= 6.0         $$ Bruker NMR JCAMP-DX V2.0
##DATA TYPE= NMR SPECTRUM
##DATA CLASS= NTUPLES
##ORIGIN= UXNMR, Bruker Analytische Messtechnik GmbH
##OWNER= root
$$ XWIN-NMR		Version 3.5
$$ Wed Mar 31 10:06:00 2021 Russian Standard Time (UT+4h)  she@DPX200
##.OBSERVE FREQUENCY= 200.131506
##.OBSERVE NUCLEUS= ^1H
##.ACQUISITION MODE= SIMULTANEOUS
##.ACQUISITION SCHEME= undefined
##.AVERAGES= 8
##.DIGITISER RES= 18
##SPECTROMETER/DATA SYSTEM= spect
##.PULSE SEQUENCE= zg30
##.SOLVENT NAME= CDCl3
##.SHIFT REFERENCE= (INTERNAL, CDCl3, 0, 15.9937)
##AUDIT TRAIL= $$ (NUMBER, WHEN, WHO, WHERE, WHAT)
$$ ##TITLE= Audit trail, XWIN-NMR		Version 3.5
$$ ##JCAMPDX= 5.01
$$ ##ORIGIN= Bruker BioSpin GmbH
$$ ##OWNER= she
$$ F:/spectra/data/she/nmr/H-F/1/pdata/1/auditp.txt
$$ ##AUDIT TRAIL=  $$ (NUMBER, WHEN, WHO, WHERE, WHAT)
(   1,<2021-03-31 10:04:34.96 +0400>,<she>,<DPX200>,
      <created by zg, POWCHK disabled, PULCHK disabled
       configuration hash MD5:
       00 E9 B6 7A A2 85 ED C7 34 08 36 98 17 FE 4E 26
       data hash MD5: 16K
       2F 43 FE 4D 89 B7 21 EE 12 24 75 EF 0D 2D 5C 02>)
(   2,<2021-03-31 10:04:37.09 +0400>,<she>,<DPX200>,
      <Start of raw data processing
       efp BC_mod = 2 LB = 0.24 FT_mod = 6 PKNL = 1 PHC0 = -11116.23 PHC1 = 9.000929 SI = 16K 
       data hash MD5: 16K
       25 B9 8C BB 3D 79 EB 18 01 F2 BC 6E 8F 55 7D 13>)
(   3,<2021-03-31 10:05:07.62 +0400>,<she>,<DPX200>,
      <pk PHC0 = -0.9980453 PHC1 = -0.8 
       data hash MD5: 16K
       26 92 F1 A6 C2 ED 33 68 3E A4 E4 B2 36 2E FB 15>)
(   4,<2021-03-31 10:05:12.64 +0400>,<she>,<DPX200>,
      <abs ABSG = 5 
       data hash MD5: 16K
       45 56 B2 44 E6 E3 41 EA 1D D6 8F 9A 35 B6 18 B8>)
$$ ##END=
$$ 
$$ hash MD5
$$ D0 46 58 DE 71 41 0A 8F 5D 91 50 1A 07 64 BE 24
##$RELAX= 
##$RELAX= 
##$RELAX= 
##$RELAX= 
##$RELAX= 
##$RELAX= 
$$ Bruker specific parameters
$$ --------------------------
##$DU= <F:/spectra>
##$EXPNO= 1
##$NAME= <H-F>
##$PROCNO= 1
##$TYPE= <nmr>
##$USER= <she>
##$AMP= (0..31)
100 100 100 100 100 100 100 100 100 100 100 100 100 100 100 100 100 100 
100 100 100 100 100 100 100 100 100 100 100 100 100 100 
##$AQSEQ= 0
##$AQ_mod= 1
##$AUNM= <au_zg>
##$AUTOPOS= <>
##$BF1= 200.13
##$BF2= 200.13
##$BF3= 200.13
##$BF4= 200.13
##$BF5= 200.13
##$BF6= 200.13
##$BF7= 200.13
##$BF8= 200.13
##$BYTORDA= 1
##$CFDGTYP= 0
##$CFRGTYP= 5
##$CHEMSTR= <none>
##$CNST= (0..31)
1 1 145 1 1 1 1 1 1 1 1 1 1 1 1 1 1 1 1 1 1 1 1 1 1 1 1 1 1 1 1 1 
##$CPDPRG= <>
##$CPDPRG1= <>
##$CPDPRG2= <>
##$CPDPRG3= <>
##$CPDPRG4= <mlev>
##$CPDPRG5= <mlev>
##$CPDPRG6= <mlev>
##$CPDPRG7= <mlev>
##$CPDPRG8= <mlev>
##$CPDPRGB= <>
##$CPDPRGT= <>
##$D= (0..31)
0 1.2 0 0 0 0 0 0 0 0.06 0 0.03 0 0 0 0 0.0002 0 0 0 0 0 0 0 0 0 0 0 0 
0 0 0 
##$DATE= 1617170674
##$DBL= (0..7)
120 120 120 120 120 120 120 120 
##$DBP= (0..7)
150 150 150 150 150 150 150 150 
##$DBP07= 0
##$DBPNAM0= <>
##$DBPNAM1= <>
##$DBPNAM2= <>
##$DBPNAM3= <>
##$DBPNAM4= <>
$$ [...]
##$SUBNAM3= <"">
##$SUBNAM4= <"">
##$SUBNAM5= <"">
##$SUBNAM6= <"">
##$SUBNAM7= <"">
##$SUBNAM8= <"">
##$SUBNAM9= <"">
##$SW= 16.9725357007746
##$SWIBOX= (0..15)
0 0 2 0 0 0 0 0 0 0 0 0 0 0 0 0 
##$SW_h= 3396.73913043478
##$TD= 16384
##$TD0= 1
##$TE= 0
##$TE2= 300
##$TE3= 300
##$TEG= 300
##$TL= (0..7)
0 120 120 120 120 120 120 120 
##$TP= (0..7)
150 150 150 150 150 150 150 150 
##$TP07= 0
##$TPNAME0= <>
##$TPNAME1= <>
##$TPNAME2= <>
##$TPNAME3= <>
##$TPNAME4= <>
##$TPNAME5= <>
##$TPNAME6= <>
##$TPNAME7= <>
##$TPOAL= (0..7)
0.5 0.5 0.5 0.5 0.5 0.5 0.5 0.5 
##$TPOFFS= (0..7)
0 0 0 0 0 0 0 0 
##$TUNHIN= 0
##$TUNHOUT= 0
##$TUNXOUT= 0
##$USERA1= <user>
##$USERA2= <user>
##$USERA3= <user>
##$USERA4= <user>
##$USERA5= <user>
##$V9= 5
##$VALIST= <valist>
##$VCLIST= <CCCCCCCCCCCCCCC>
##$VD= 0
##$VDLIST= <DDDDDDDDDDDDDDD>
##$VPLIST= <PPPPPPPPPPPPPPP>
##$VTLIST= <TTTTTTTTTTTTTTT>
##$WBST= 1024
##$WBSW= 4
##$XGAIN= (0..3)
0 0 0 0 
##$XL= 0
##$YL= 0
##$YMAX_a= 432997
##$YMIN_a= -418221
##$ZGOPTNS= <>
##$ZL1= 120
##$ZL2= 120
##$ZL3= 120
##$ZL4= 120
##$ABSF1= 15.97403
##$ABSF2= -0.9986324
##$ABSG= 5
##$ABSL= 3
##$ALPHA= 0
##$AQORDER= 0
##$ASSFAC= 0
##$ASSFACI= 0
##$ASSFACX= 0
##$ASSWID= 0
##$AUNMP= <proc_1d>
##$AZFE= 0.1
##$AZFW= 0.1
##$BCFW= 0
##$BC_mod= 2
##$BYTORDP= 0
##$COROFFS= 0
##$CY= -3
##$DATMOD= 1
##$DC= 0
##$DFILT= <>
##$DTYPP= 0
##$F1P= 0
##$F2P= 0
##$FCOR= 1
##$FTSIZE= 16384
##$FT_mod= 6
##$GAMMA= 0
##$GB= 0
##$INTBC= 1
##$INTSCL= 2.992141e-10
##$ISEN= 128
##$LB= 0.24
##$LEV0= 0
##$LPBIN= 0
##$MAXI= 10000
##$MC2= 0
##$MEAN= 0
##$ME_mod= 0
##$MI= 1.114404
##$NCOEF= 0
##$NC_proc= -7
##$NLEV= 6
##$NOISF1= 3.799351
##$NOISF2= 2.8
##$NSP= 0
##$NTH_PI= 0
##$NZP= 0
##$OFFSET= 15.99371
##$PC= 1
##$PHC0= -11117.23
##$PHC1= 8.200929
##$PH_mod= 1
##$PKNL= yes
##$PPARMOD= 0
##$PSCAL= 0
##$PSIGN= 0
##$REVERSE= no
##$SF= 200.130003548141
##$SI= 16384
##$SIGF1= 3
##$SIGF2= 2
##$SINO= 5.538805
##$SIOLD= 16384
##$SREGLST= <1H.CDCl3>
##$SSB= 0
##$STSI= 16384
##$STSR= 0
##$SW_p= 3396.73913043479
##$SYMM= 0
##$S_DEV= 0
##$TDeff= 16384
##$TDoff= 0
##$TI= <>
##$TILT= no
##$TM1= 0
##$TM2= 0
##$TOPLEV= 0
##$USERP1= <user>
##$USERP2= <user>
##$USERP3= <user>
##$USERP4= <user>
##$USERP5= <user>
##$WDW= 1
##$XDIM= 16384
##$YMAX_p= 458463429
##$YMIN_p= -620644
$$ End of Bruker specific parameters
$$ ---------------------------------
##NTUPLES= NMR SPECTRUM
##VAR_NAME=  FREQUENCY,     SPECTRUM/REAL,   SPECTRUM/IMAG
##SYMBOL=    X,             R,               I
##VAR_TYPE=  INDEPENDENT,   DEPENDENT,       DEPENDENT
##VAR_FORM=  AFFN,          ASDF,            ASDF
##VAR_DIM=   16384,         16384,           16384
##UNITS=     HZ,            ARBITRARY UNITS, ARBITRARY UNITS
##FACTOR=    0.207333158178282, 1,           1
##FIRST=     3200.82115183308, 0,            0
##LAST=      -195.917978601709, 0,           0
##MIN=       -195.917978601709, -620644,     0
##MAX=       3200.82115183308, 458463429,    0
$$ Real data points
##PAGE= N=1
##DATA TABLE= (X++(R..R)), XYDATA
$$ [...]
8778 2169916 1942911 1923781 2196926 2248633 2369865 2474785 2529378 2390898 2393862 2604388
8768 2604388 2689189 2595679 2630250 2653725 2865444 3000170 2943520 3065109 3339400 3384071 3289045
8757 3289045 3405550 3545152 3504105 3666521 3823653 3841258 3935215 4120127 4160711 4436592
8747 4436592 4383404 4316140 4270276 4343782 4608415 4807715 4873919 4935132 5101787 5235178 5171770
8736 5171770 5411108 5646167 5626322 5703147 5882648 5863740 5795020 6109499 6410968 6591358
8726 6591358 6736869 6955019 7057480 7243989 7251800 7461797 7565306 7938840 8369831 8537728
8716 8537728 8698843 9054903 9526443 9782819 10101018 10363676 10806564 11270408 11527837 11817180
8706 11817180 12387177 12877479 13373230 13866881 14564579 15305924 15964964 16547720 16935738
8697 16935738 17901421 18903231 19904955 20652473 21632572 22923888 24338778 25920321 27430572
8688 27430572 29090143 31183422 33464964 35707937 38342868 41150685 44360763 48122057
8680 48122057 52260741 56687043 61367426 66119052 70828885 75652850 80336822 84123277
8672 84123277 87200121 89335418 90163581 89503460 87328792 84169929 79994595 75202637
8664 75202637 69974925 64570828 59208340 54020060 49164438 44832621 40895687 37318517
8656 37318517 34302280 31459732 29034409 26819358 24777068 23291507 21748809 20442465
8648 20442465 19243881 18155706 17261072 16268568 15361046 14666201 14019565 13387314 12700451
8639 12700451 12081101 11530734 11118995 10780181 10668616 10030821 9474125 9186305 8958343
8630 8958343 8279979 7850447 7663530 7359190 7072285 6954745 6838111 6761838 6550397 6393894
8620 6393894 6172053 5832779 5867087 5649249 5353616 5337527 5522186 5177378 4853077 4725448
8610 4725448 4529342 4417726 4455621 4325387 4290828 3936132 3892262 4127040 4092770 3960083
8600 3960083 3701628 3793667 3688974 3620650 3419129 3405128 3421998 3335616 3311484 3145648 3206324
8589 3206324 3013521 2902260 2817701 3025324 2873065 2768584 2837998 2848201 2878926 2757744
8579 2757744 2662392 2590511 2422213 2627856 2681887 2528401 2665005 2470115 2182505 2198981
8569 2198981 2515521 2404481 2044994 2063193 1993211 2022196 2120354 2176873 2218330 2061634 2022203
8558 2022203 1917720 1865591 1923191 1953859 2035802 1845640 1868969 1855370 1708917 1630953 1504034
8547 1504034 1507311 1613287 1654536 1753736 1723753 1570950 1529079 1490976 1393041 1554249 1543085
8536 1543085 1558585 1429580 1408769 1596801 1687948 1595096 1318736 1519103 1632637 1580564
8526 1580564 1444612 1484563 1407784 1328782 1376868 1391357 1523501 1301809 1310426 1328576 1292937
8515 1292937 1357137 1447928 1432757 1291591 1178469 1248580 1099948 1104806 1270596 1309636 1441027
8504 1441027 1366088 1468988 1349098 1279428 1359703 1336260 1337100 1357590 1305852 1430060 1343025
8493 1343025 1131160 1094273 1042371 1192561 1321891 1351206 1290948 1078146 1089450 1243142
8483 1243142 1322622 1317305 1321837 1371902 1294595 1200462 1376208 1526293 1432287 1399034 1328351
8472 1328351 1050901 1158189 1127466 1150118 1267006 1440852 1335789 1227338 1182242 1092505
8462 1092505 1315126 1372606 1297865 1232427 1224099 1066264 1233653 1201927 1116434 1117380 1367873
8451 1367873 1479790 1312433 1228874 1258122 1510617 1515951 1430861 1308149 1536746 1583382 1513687
8440 1513687 1564942 1512778 1471110 1543042 1421901 1418490 1547635 1535225 1737793 1722275 1681799
8429 1681799 1776768 1736613 1695241 1527082 1525947 1498746 1404792 1483279 1253249 1136166 1326588
8418 1326588 1343907 1245365 1105834 1050399 1394514 1321486 1210536 1125731 1133213 1365702 1285895
8407 1285895 1101892 1308734 1313306 1312828 1644819 1533160 1493209 1366186 1311189 1246390 1348343
8396 1348343 1354804 1090436 1041953 1041133 958883 1015202 1173775 1341653 1233159 1294000 1357722
8385 1357722 1093503 1056201 1182003 1000169 990495 838992 794023 1025157 1193704 1224971
8375 1224971 868815 911973 1042943 884622 780743 1012411 1126235 1094603 1157488 1217370
8365 1217370 1394704 1174635 900649 1069268 1050285 948177 910690 1106510 981640 1074120
8355 1074120 1167566 1100783 1150864 996443 795494 901072 890424 708394 846318 854778 1111013
8344 1111013 1052133 891487 919731 874148 879151 838413 920512 1059442 1086139 1061480 960460
8333 960460 874640 698143 915799 1021683 930923 889994 850134 998183 1054423 1049576 962579
8322 962579 922480 1049746 975295 882082 1171913 1181439 1131010 1180463 1201688 1205313 1462332
8311 1462332 1449830 1382063 1125192 1155718 1259860 1119966 1140510 1287427 1159639 1075503
8301 1075503 1060994 1021881 1017155 1088938 1171616 1099672 1089328 1217456 1274343 1081058 992618
8290 992618 1103125 894090 896493 939694 954006 1052088 1056939 1068525 1183939 1302174 1246214
8279 1246214 950421 1000757 1161158 1140700 1142190 1057220 967556 962112 1162726 959145 1201907
8268 1201907 1080122 1106303 1053903 978421 1170530 1305828 1249201 1092966 1045445 1063201 1038109
8257 1038109 1261065 1106255 1079654 1209807 1072231 1130347 982437 941520 967061 1151618
8247 1151618 1240261 1126746 1169147 1420413 1431775 1244063 1243621 1253868 1288193 1190709 1184345
8236 1184345 973360 1016696 1315254 1545646 1535624 1507279 1350555 1289869 1307826 1240149 1380433
8225 1380433 1388934 1698588 1783273 1774793 1655047 1647077 1644231 1626455 1443976 1558930 1783274
8214 1783274 1736304 1557765 1761210 1866857 2010545 2029078 2100016 1941045 1846423 1942512
8204 1942512 2033204 1978746 1939675 1916575 1960739 1875716 1891346 1832224 1835802 1962193 1783539
8193 1783539 1383748 448812 1200649 1637327 1648446 1706589 1749863 1732669 1642579 1753674
8183 1753674 1588825 1528522 1714293 1826781 1854899 1910102 1876566 1844357 1735046 1685779 1621113
8172 1621113 1736182 1804252 1724501 1849427 2005117 1920300 1620979 1597280 1600488 1729598 1867388
8161 1867388 1942683 2001702 1961528 1716956 1879761 2046876 1842840 1829930 1876774 2043606
8151 2043606 1939013 1937726 1885413 1990378 2126902 2071077 2077394 2046278 2106794 1995381 2037012
8140 2037012 1967942 1859333 2025905 2044726 1961424 1841639 1917256 1863692 1885928 2016994 1880959
8129 1880959 2001175 2091789 2000676 1864832 1821394 1860672 1805607 1847286 1898519 1925576 2081732
8118 2081732 1933889 1780589 2013725 2078416 2060496 2112146 2073481 2266277 2232960 2027727
8108 2027727 2036549 1962550 1881712 1938719 2023520 1899628 2102556 2132286 2084288 1917602 2053896
8097 2053896 2037310 2192132 2322357 2205901 2384466 2346938 2261517 2131530 2122259 2224123
8087 2224123 2246841 2328040 2393703 2364313 2476685 2351445 2205742 2302449 2475536 2434024 2557990
8076 2557990 2606567 2711087 2792398 2758496 2667741 2769535 2771348 2611737 2778488 3005361 2806189
8065 2806189 2659702 2852909 2748236 2682163 2852326 3152940 3224143 3120729 3045238 3106690
8055 3106690 3120948 3030489 3058911 3231353 3490815 3468172 3509738 3554379 3666980 3735013 3604616
8044 3604616 3616040 3794537 3658128 3863261 4128185 4095625 3889610 3932856 3958479 3743855
8034 3743855 4078844 4164696 4118341 4171106 4286844 4340690 4454235 4342980 4352309 4314055 4509995
8023 4509995 4589396 4686575 4717487 4846242 5018598 5293910 5192500 5323348 5481491 5509762
8013 5509762 5855310 5870274 5959755 6174419 6405944 6693194 6817293 6748300 6940159 7068942
8003 7068942 7295831 7532320 7653965 7744295 7912727 8260421 8494514 8961249 9488506 9685065
7993 9685065 10124620 10694929 11400020 11966513 12315263 13156899 13947210 14785183 15992845
7984 15992845 17160203 19070529 21555857 24575999 27534613 31030598 35021292 38152800
7976 38152800 39929946 39348474 35600150 30394904 25646751 21701165 19194104 17459162
7968 17459162 15931058 14599334 13480190 12688516 12055607 11604719 11163948 10757913 10469744
7959 10469744 10139927 10064692 10038664 9656288 9622163 9547206 9396103 9295005 9282781 9232761
7949 9232761 9280663 9485610 9678668 9759580 9760730 9839369 10049772 9983858 9791868 9857538 10038304
7938 10038304 10100616 9928323 10105403 10333838 10409538 10421102 10516475 10634769 10656716 10855325
7928 10855325 10897611 10912251 10918456 10822067 10909523 10832398 10868330 10653621 10763071 10807503 11006635
7917 11006635 11106175 11157680 11546850 11690211 11998177 12323783 12532890 12625796 12737655 12580939
7907 12580939 12750187 12815269 12753976 12686365 12780335 12893929 12933501 13148623 13114143 13179307 13681205
7896 13681205 13853911 13930569 14073889 14475446 14484317 14778635 15031032 14990113 15162905 15473835
7886 15473835 15439660 15397141 15334739 15089380 14936480 14674296 14576369 14419109 14564088 14547213
7876 14547213 14541405 14817125 14951311 14985875 15391766 15592709 15733735 15942618 16040408 16057239
7866 16057239 16205367 16133837 15902880 16148812 16175097 16038386 16031001 16013781 16131211 16223616
7856 16223616 16378177 16375918 16461344 16595556 16979794 17295396 17535977 17587624 17852566 18251110
7846 18251110 18256492 18420292 18679593 18663550 18900503 18977023 19083503 19467997 19732930 19998924
7836 19998924 20585773 20895241 21453416 22381023 23104910 23534544 24151707 24926613 25530838
7827 25530838 25933815 26357295 26514138 26497194 26439558 26224533 26150267 25888090 25779975 25713297
7817 25713297 25455203 25457979 25663964 25808528 26342408 26748228 27191026 27681008 28165145 28865061
7807 28865061 29407787 29694325 30268619 30453802 30373874 30472896 30254316 30118334 29965881 29744446
7797 29744446 29633715 29554171 29718992 29811687 30173804 30718190 31420367 32061164 32646139 33433604
7787 33433604 34078988 34610065 34649967 34658870 34537793 34107626 33690851 33443941 33130129 32238331
7777 32238331 31484885 30897546 30815480 30795862 30790723 30880488 31329821 31686080 32163878 32824925
7767 32824925 33363880 33935114 34448325 34513850 34400914 34185363 33759762 33190831 32562597 31861919
7757 31861919 31016868 30417840 29829027 29405865 29018590 28940057 28966527 29234291 29329156 29638590
7747 29638590 30361482 30881310 31654020 32707761 33712214 34791761 36009896 37588186 38996603
7738 38996603 40126096 40837972 41038337 40526647 39898530 39321978 38785451 38663000 39037712
7729 39037712 39748119 40695871 41567474 42201029 42318014 41509176 40097447 38028364 35886334
7720 35886334 33662443 31430279 29772446 28587458 27483922 26361756 25648545 24842943
7712 24842943 24302736 24113893 23909541 23596848 23477243 23766055 23861314 24122248 24274398 24401680
7702 24401680 24495367 24721769 25119654 25546085 26505490 27647034 29167705 30816657 32271902
7693 32271902 33980686 35539170 36451933 36960695 36787911 36187761 35546905 34904378 34375144
7684 34375144 34257620 34782275 35554779 36562868 37246676 37370867 36844053 35769800 34044945
7675 34044945 32232591 30554793 28715830 27218964 26305179 25231440 24077449 23180384
7667 23180384 22387828 21628899 20980941 20415498 19927015 19436569 19279933 19060683 18663303
7658 18663303 18154681 17803228 17156611 16536614 16036377 15275675 14581115 13963212 13388987
7649 13388987 12871749 12433043 11912512 11412364 11241071 11134087 10986418 10657639 10630569 10487499
7639 10487499 10448393 10385616 10155702 10068001 9958957 10160837 10308482 10330061 10341992 10493885
7629 10493885 10679501 10871969 11006539 11362538 11390079 11333691 11490157 11520078 11463561 11368473
7619 11368473 11218626 11192958 11245414 11235621 11214168 11101806 11144641 11358866 11249926 11091419
7609 11091419 10644006 10489613 10393176 10084338 9640917 9458505 9291634 9225653 9240727 9050661
7599 9050661 8921171 8984735 8983145 8854255 8765154 8688287 8774987 9020813 9163976 9154956 9049782
7588 9049782 8993798 9031676 9203557 9478898 9623238 9798426 9939857 10101846 10238793 10087669
7578 10087669 10300223 10608933 10819552 11062571 11312911 11421201 11652436 11917861 12143440
7569 12143440 12411128 12993405 13467324 13866634 14407216 14865727 15414675 15895018 16547443
7560 16547443 17031195 17750565 18424776 19036122 19691263 20443083 21486864 22547669 23674344
7551 23674344 24606009 25274111 25746964 25840933 25643724 25540772 25110770 24987001 24831859 24826820
7541 24826820 25070591 25199041 25460714 25363014 25203837 24856130 24496266 23905385 23218942 22629407
7531 22629407 22158327 21587712 21230583 21155779 21164204 21064341 21398551 21781011 22145014 22624617
7521 22624617 23382761 24332609 25056405 25832074 26642441 27255063 28228986 29512010 30715577
7512 30715577 31909829 33145233 34467516 36077087 37365156 38209420 38846092 39136166 38912618
7503 38912618 38535318 38188995 37667041 37071618 36527183 36189156 35679164 35558441 34903974
7494 34903974 34317635 33559752 32317026 30850708 29417377 27992758 26635486 25239638
7486 25239638 23820527 22658072 21803737 21136833 20585957 20156554 19588195 19287772 19255042
7477 19255042 19190012 19192708 19491805 19617764 19726233 19889816 20370404 20778072 21336787 21842225
7467 21842225 22301792 23014921 23676229 23872364 24101389 24172333 23962997 23543008 22819802 22257604
7457 22257604 21959668 21385908 20879814 20644480 20311317 19910720 19509343 19058979 18315302
7448 18315302 17384544 16248685 15064185 13856784 13237603 12288117 11493409 10922807 10358785
7439 10358785 9860744 9442925 9129070 8720645 8336318 7847089 7844369 7514590 7340558 7289166
7429 7289166 7223698 7086373 6961707 6863679 6858780 6838073 6928645 6839199 6621060 6504177 6546259
7418 6546259 6172897 6204787 6078752 5869245 5857234 5625623 5443792 5480315 5675364 5374690
7408 5374690 4980883 4881890 4573674 4260987 4161296 3948314 3998339 4023822 3803609 3544122
7398 3544122 3419156 3107109 3115052 3290525 3285510 3197053 3180577 2878143 2832598 2784109 2744844
7387 2744844 2603791 2459368 2371426 2195686 2200016 2457263 2217694 2179899 2230186 2225397 2202158
7376 2202158 2261593 2344062 2343708 1987646 1910373 1732856 1848843 1953248 1943743 1970430 1696217
7365 1696217 1761550 1750242 1611544 1617485 1526043 1444695 1659224 1603546 1479835 1379382 1646964
7354 1646964 1406758 1281849 1513444 1419601 1488852 1363943 1308097 1461276 1505476 1495339
7344 1495339 1245583 1209735 1158288 1176202 1135479 1247633 1314034 1311336 1322772 1249478 1241336
7333 1241336 1108360 878273 902537 1022661 1082037 1121139 1029541 1086736 1153954 1065564 1036688
7322 1036688 1056474 1075089 1074974 857611 919085 880422 720866 550660 579301 494902 528550
7311 528550 464150 578579 679484 762302 665982 692021 677326 517650 607475 542043 525644
7300 525644 464600 481564 584651 764336 833770 667160 567759 589819 825474 892462 708697
7289 708697 600286 652700 776665 525975 374606 439319 578273 558105 411326 329524
7279 329524 444230 193394 150980 228790 426290 635169 560166 561449 355809 241923 500303
7268 500303 446384 362026 303830 372776 339944 292652 331634 389804 399808 464970 244353
7257 244353 235151 351220 402651 395356 470058 512824 578194 351366 186812 178174 204326 188173
7245 188173 132383 194350 330357 412794 449983 302114 324141 215568 112801 350385 243580
7234 243580 279680 379382 432261 210372 98475 266826 308719 229456 225533 93071 269844
7223 269844 310490 266977 275427 177539 204798 227809 50899 195820 50394 -62799 51008
7212 51008 136072 193052 148117 101551 -49289 -7073 32336 147934 100167 127166 60118
7201 60118 5468 123551 64841 201794 61111 41717 261915 28627 -61714 65219 75485
7190 75485 74274 106683 -13571 88946 82778 144384 135011 -15858 301832 311187 226680 147716
7178 147716 76803 -27641 87972 170294 201209 146950 2858 -8458 138623 91758 -127116
7167 -127116 -192583 -182732 2763 203178 290881 209662 118790 209025 51845 -74439 -20686
7156 -20686 33500 -9461 58218 42185 105424 230036 207651 89275 -112825 -2221 44004
7145 44004 128955 83652 91326 156436 54168 -35823 21326 34089 -75493 -119881 -33600 73224
7133 73224 89869 235623 105395 -20810 42673 155960 154299 183483 -10545 20311 35336
7122 35336 10770 -83020 -50313 -62059 -65112 20320 -147033 -3770 132173 54640 -21108
7111 -21108 -30050 -14378 108309 -17918 -75172 10091 263286 87890 11928 -34580 -133550
7100 -133550 -54495 -130216 -78952 48016 74176 -94981 -145848 -240175 -175693 -261917 -264557
7089 -264557 -133265 -25289 92279 -174827 -209765 -122416 -170562 -53214 91498 -175050
7079 -175050 -255953 -293710 -144984 -69875 -185997 -285891 -399623 -358122 -350707 -192045 -17544
7068 -17544 1013 -67044 122958 87025 70989 152032 -101139 -131203 -16567 69421 -34166
7057 -34166 -17410 15016 5566 22562 72530 100677 -113467 25651 -229086 -141119 -199583
7046 -199583 -37977 232051 99488 62501 -81858 -59754 -97708 -133204 -48951 49377 -61673
7035 -61673 -18974 -104812 -58978 -198672 -276716 -296151 -354060 -262778 -80902 -217551 -176489
7024 -176489 -232268 -378077 -189402 -148563 -143101 -50869 -45802 -161408 -277893 -251997 -191440
7013 -191440 -40461 -222262 -203246 75953 20344 -154969 -107956 -119900 -251614 -258538 -269016
7002 -269016 -380566 -346840 -290287 -465999 -277928 -209167 -350413 -240245 -139189 -34853
6992 -34853 561 -189630 -308286 -422668 -430131 -329091 -275488 -371735 -502108 -351412 -186680
6981 -186680 -212192 -290771 -292862 -496208 -298083 -349033 -346511 -391239 -209412 -371705 -599500
6970 -599500 -350801 -300711 -262353 -340779 -339773 -390098 -138334 -160271 -225675 -53722 7216
6959 7216 -17244 80075 150842 -114934 -239574 -387956 -433093 -210792 -330192 -375178 -362198
6948 -362198 -339038 -306651 -26474 -72259 -176587 -172617 -16138 -34750 -63386 -208722 -218793
6937 -218793 -253363 -206819 -170739 -129142 -17363 -176738 -240578 -6479 -44268 -1686 40731
6926 40731 36550 76317 145829 47642 -149180 -275457 -195287 -151511 -210666 -100679 -14128
6915 -14128 -16566 -94029 -90309 -32108 -107067 -126548 -24169 35007 92353 103705 48552 -10538
6903 -10538 -142103 -166168 -116714 25598 -178771 60025 232763 134304 202249 283615 330310
6892 330310 136701 272678 243304 285077 345611 445453 361296 561876 734724 802006 787162
6881 787162 925309 989608 843258 1084300 1431505 1510335 1528592 1586178 1646663 1721821 1734600
6870 1734600 1590234 1677058 1851545 1718311 1421734 1169174 1011900 904159 584549 459821
6860 459821 562804 732052 561545 507029 494373 146635 172754 156748 184651 269009 47581
6849 47581 96628 171484 138064 56382 132468 10453 78208 134076 -63820 -125401 52896
6838 52896 237126 -79969 -146681 33879 177755 189475 -34561 -138162 -14885 20775
6828 20775 -28145 -85699 -115622 -168220 -179212 -65516 -96355 -130119 -27977 -114489 -139423
6817 -139423 -200195 -360961 -126642 -45277 -38133 -23280 -98475 -30226 -263582 -394324 -241218
6806 -241218 -191090 -77272 -109412 -169247 5895 -105524 -309747 -252118 -45074 -35623 -95879
6795 -95879 -291768 -361987 -500621 -350358 -129526 -44928 -167962 -182356 -78253 -162981 -285311
6784 -285311 -395001 -213942 -320450 -390782 -314390 -355627 -431553 -321892 -199281 -359757
6774 -359757 -307445 -253640 -298552 -96870 -150148 -174960 -293994 -208123 -202327 -105843 -150256
6763 -150256 -179994 -66730 -160722 -195650 -242098 -245646 -195568 -311945 -313760 91608 -126268
6752 -126268 -312256 -80627 -144795 -135953 -173189 -337872 -321403 -230353 -192231 -318087 -291521
6741 -291521 -242845 -91343 -269446 -278755 -166348 -309257 -420552 -469301 -223758 -133968 -202759
6730 -202759 -217309 -142414 -296023 -293052 -169802 -159503 -136147 -8455 -5492 19896 -50285
6719 -50285 -163625 -239690 -82328 132848 -106956 -52114 -61573 -274650 -356310 -141019 -45240
6708 -45240 -35580 -95594 -46340 -176186 -86626 -38565 81306 148346 -231188 -560086 -448312
6697 -448312 -320607 -620644 -503873 -234040 -195666 -336979 -356043 -314251 -115743 -247002
6687 -247002 -154972 -289345 -446265 -497028 -401478 -338270 -441573 -303005 -456186 -373405 -122021
6676 -122021 -146647 -345985 -346584 -377933 -433438 -236625 -334538 -576275 -467819 -448376 -511828
6665 -511828 -486548 -527741 -581645 -245352 -290157 -448553 -378291 -335593 -271634 -334764 -433441
6654 -433441 -425553 -373858 -237631 -407380 -432188 -346791 -410037 -405156 -428595 -491058 -390303
6643 -390303 -288352 -291193 -347734 -199878 -384907 -504939 -277334 -420231 -418726 -360577 -279883
6632 -279883 -206480 -366248 -336081 -419752 -337186 -385483 -401494 -210407 -460411 -505012 -421332
6621 -421332 -325821 -314546 -242484 -78088 -231461 -132262 -24981 -203821 -205072 -196521 -329709
6610 -329709 -285802 -238237 -218601 -372214 -517336 -307680 -217106 -324121 -277910 -263008 -374026
6599 -374026 -367356 -406835 -223923 -120087 -156232 -277282 -252977 -86633 -207451 -335407 -318850
6588 -318850 -296008 -228725 -263475 -135313 -24276 -17954 -46623 47408 -210417 -181414 -183990
6577 -183990 -349851 -388867 -391339 -360125 -306500 -265370 -216089 -114052 -5593 -185378 -261795
6566 -261795 -164761 -122393 -92180 -127562 -294760 -272595 -123155 -222268 -156185 -126037 -344723
6555 -344723 -353794 -319982 -201608 -102996 -86131 -182218 -323446 -219231 -50196 -154632 54293
6544 54293 95126 -11449 -115097 -88116 63656 -32353 -228862 -539140 -559969 -312266 -113670
6533 -113670 -213614 -328688 -237494 4589 -27938 -430229 -353206 -356422 -472696 -242000 -63039
6522 -63039 89999 25775 -12002 -58355 -172512 -110310 67227 -200039 -435647 -300334 -160043
6511 -160043 -156797 -149323 -195451 -303432 -344306 -137386 -100361 -115931 -204140 -178850 -206993 -157158
6499 -157158 -241868 -204648 -84697 3580 63357 44814 -69267 -121907 -56141 55331 -144799
6488 -144799 -17633 81240 74602 -53561 -156477 -123334 -146232 -90443 -73146 -134297 -127975
6477 -127975 -109885 -149656 -1025 -128237 -86817 17007 183620 107038 70340 242996 174527
6466 174527 -19521 -165803 14941 110754 97303 -113723 -278201 -185531 -299847 -419803
6456 -419803 -492266 -322588 -130352 -116459 -115566 47391 74116 -125355 -127165 -395447 -596215
6445 -596215 -470923 -198570 -149481 -58142 14292 28241 24755 -1692 -51515 -126725 -5826
6434 -5826 -57299 -204826 -336128 -273355 -250460 -129375 -119290 -46561 -50662 -177510 -131942
6423 -131942 -73111 -118502 145075 114941 -152675 -310295 -300355 -274121 -141059 30017 -150142
6412 -150142 -126235 -1298 -44237 -49800 145725 -33795 -33417 39270 141113 186315 155518
6401 155518 -104897 27462 69785 -101341 -39051 -13419 -73294 -262753 -204960 -53119 -84830
6390 -84830 -152383 7215 44792 148172 -80131 -90943 -10788 -5222 -15348 97191 26229
6379 26229 -179311 -107047 -93125 -101262 30371 176674 -76825 -34336 79422 -79397 -208609
6368 -208609 -141140 -102869 -360101 -307008 -14299 -120289 -253232 -13975 3099 6871 -19945
6357 -19945 -131487 -302551 -178585 -105421 56800 128762 281774 360088 266929 -68437 -199565
6346 -199565 -232935 -23663 193956 74729 137153 162779 -70456 -174001 -45068 -43100 58261
6335 58261 206142 218656 28104 -134545 -10482 -29944 -56783 163177 99057 50298 1756
6324 1756 19111 135174 38692 132603 193367 154766 16042 -23482 196729 225252 250471
6313 250471 196240 -100449 44032 37486 -52061 96823 60152 104527 17495 200245 -51876
6302 -51876 -90933 120140 133659 124866 140466 -76190 65292 189008 28805 -11774 -20914
6291 -20914 -57751 118925 182869 81026 159197 45138 36496 65801 72894 199186 -32782
6280 -32782 -74532 -18807 4548 43588 73810 183164 333405 197411 -69187 -56147 134655
6269 134655 113299 269098 213790 123643 157701 140217 162588 184853 158067 103068 163162
6258 163162 280623 441362 510307 446245 284057 388675 277002 30306 -116221 26108
6248 26108 -12402 27422 412993 602966 448650 377532 96869 -33564 89882 247371
6238 247371 215404 88872 -138879 -46801 199645 293794 236664 172291 25166 -78440 -22863
6227 -22863 -25215 103555 85329 178277 56308 55615 -11274 78374 229140 201841 186653 148153
6215 148153 181223 -16318 198803 211159 292105 368720 353701 385219 405684 435253 211043
6204 211043 244270 188630 105359 40663 206119 290576 278999 302521 300089 415835 362030
6193 362030 350222 365921 470764 505296 247658 54924 123065 304464 265845 379930 237254
6182 237254 294467 303776 390531 547228 577786 348002 212578 266203 174083 213304 92937
6171 92937 285347 386162 179978 112551 219039 170172 91945 283222 375944 185816 298639
6160 298639 337400 398330 337538 170780 298875 341294 300350 322742 266890 333086 480479
6149 480479 371357 343972 320771 356497 365316 393381 361781 482422 522960 373723 161383
6138 161383 198231 355231 459626 400861 324579 385296 245515 222126 190342 302584 356592
6127 356592 190912 -18044 138855 120330 275427 471960 450684 520315 368525 303240
6117 303240 408541 340970 340694 273767 411620 181370 144432 295728 127664 288266 176642
6106 176642 -32058 193366 308054 106596 89421 188179 238013 201393 -16562 146615
6096 146615 237445 165317 268918 498504 404461 361049 168689 122634 93015 94387 308118
6085 308118 277287 154339 183354 403127 503451 408167 240268 117432 42769 324624
6075 324624 281233 331237 299634 196949 70978 188615 262236 436844 337317 399043 358449
6064 358449 327228 430172 214211 54644 70453 279236 178595 185670 198984 141247 121697
6053 121697 184221 157751 217434 129604 243690 417608 413975 319413 378045 301184 283306
6042 283306 174251 235398 309958 205416 215709 95657 270984 140294 31989 8040
6032 8040 52908 171563 234852 248619 221963 206629 319994 287703 209702 323658 335890
6021 335890 292362 379814 435832 318896 385384 323387 363159 499404 370106 449170 260236
6010 260236 351368 528928 391446 396773 451156 105209 6099 14220 121581 199390 320945
5999 320945 371552 505766 664047 524424 360254 448658 465994 364958 482229 409612
5989 409612 171677 295338 463649 321953 306218 82534 181515 301002 241400 177259
5979 177259 78910 -30513 27324 143715 46744 98557 -62785 86933 75138 62620 -24457
5968 -24457 59516 -33768 -40233 133277 122030 113483 -41372 185195 277029 235978 23299
5957 23299 88858 118174 319038 422970 244832 297414 338375 174266 312563 162626 266510
5946 266510 363631 311559 201866 211521 278941 178634 287571 240623 38787 242903 331836
5935 331836 163284 175829 266885 155059 349867 322245 25501 163876 265037 378036
5925 378036 350741 370838 91645 -11981 28137 -61576 199728 241869 251657 224828 287033
5914 287033 235289 323944 292267 309645 327161 277518 383383 300626 216239 344548 224049
5903 224049 225003 285651 255864 421169 412045 438568 254100 183550 156739 84270 49990 236168
5891 236168 144781 213249 273140 452578 384943 212433 247430 300912 181693 33479 30476
5880 30476 116275 148098 235568 164886 199825 221272 149224 240975 273260 258162 220365 130999
5868 130999 116743 313435 424510 152863 -63846 -92047 -29428 69303 85899 176625 45646
5857 45646 281790 323580 396260 297087 161006 244476 279059 221337 335103 412043 337843
5846 337843 284467 301319 416392 311943 285471 239039 140538 388173 300650 234440 364747
5835 364747 251942 25617 26643 222960 225504 229271 325588 85117 176098 204131 162854
5824 162854 115758 155795 105831 169011 33989 96202 156910 191184 352302 301800 327054
5813 327054 176747 215190 255107 354805 115892 47448 211404 211459 264626 423457 312811
5802 312811 405731 270051 325765 276280 212934 191188 180205 102498 109291 153371 274044
5791 274044 281682 289163 374707 368843 471105 344756 360576 456432 401407 368241 337142 208503
5779 208503 234423 494973 469563 417541 352316 335764 39086 154398 265522 246173 344422
5768 344422 416061 466249 490869 310277 308012 350734 336471 238600 175158 313914 245868
5757 245868 204589 71136 57515 183814 228417 88545 191557 177349 216718 223020 175716
5746 175716 409261 357724 335409 385421 247509 94776 105556 99792 48891 54616 42978
5735 42978 155882 93531 166002 141288 268955 249611 149896 204749 339762 130273 176200
5724 176200 161969 96892 382015 502611 599617 436073 365348 391143 474015 359758 345085
5713 345085 494438 425100 248282 148634 264855 307366 331311 352537 400836 322608 255826
5702 255826 274597 430285 419676 320684 226673 235061 298698 230512 411255 544490 354524
5691 354524 404142 601731 645076 579402 416025 495770 493447 442571 375874 302917 321376
5680 321376 349616 521219 567610 517784 232392 342107 418325 392576 161424 318952 240848
5669 240848 110930 454771 443470 272930 408402 454987 326603 583747 587380 380882
5659 380882 451396 503087 316959 524125 484117 407950 572574 561249 423513 492891 578084
5648 578084 357551 301433 417726 425943 522373 584756 602710 489576 471160 528893 472734
5637 472734 470337 591595 683922 483245 639329 462262 417387 538398 530876 439152 547920
5626 547920 519275 568442 812869 862520 878162 700455 547864 517613 653900 456461 400976
5615 400976 482688 585028 562297 675905 599286 755853 709911 603885 741402 706434 584875
5604 584875 662424 694687 629225 853972 672652 603560 638348 580364 570586 580277 826856
5593 826856 764087 728211 724333 659019 724077 821749 829532 886140 783104 694645 779553 815420
5581 815420 752885 905851 1008837 711987 485593 702598 738083 654530 746501 996152
5571 996152 815868 851122 807670 842504 1120309 1074608 888007 752978 810057 828596 898031
5560 898031 932261 1050464 985543 785400 819545 743495 962972 1058193 1132759 1012925 965303
5549 965303 1106223 1212772 1201105 970144 1088147 1052129 1096328 1078350 1072119 1088405 1209113
5538 1209113 1323834 1187592 1165337 933474 912110 944197 875845 1160895 1329074 1470673
5528 1470673 1241136 1362370 1539161 1524265 1599437 1610102 1452355 1474718 1481233 1616644 1475394
5517 1475394 1500544 1301105 1367957 1483242 1406038 1696298 1732682 1474654 1480323 1873515 1886387
5506 1886387 1916469 2014418 1934812 1924871 1856616 1768277 2159807 2325965 2229741 2179572 2094366
5495 2094366 2134180 2223866 2293034 2354195 2423179 2373658 2514544 2589257 2478068 2307806 2296507
5484 2296507 2455414 2535018 2592189 2812899 2858537 2859459 3128780 3055250 3114386 3230699 3355374
5473 3355374 3444451 3626223 3838518 3638540 3727507 3718923 3844560 4164852 4402957 4284866
5463 4284866 4275423 4425075 4350112 4572091 4759541 4798435 4673832 4811998 5079922 5299880
5453 5299880 5453722 5568696 5702582 5864894 6061744 6290696 6840704 7096392 7293959 7628290
5443 7628290 7979015 8340766 8746570 9365930 9933429 10562007 11376871 12146655 12858270 13984272
5433 13984272 15281685 16570930 17940410 19111095 20212963 21062388 21603536 21846589 21462659
5424 21462659 20619378 19451105 17983333 16351932 14881736 13480901 12222047 11104138
5416 11104138 10222090 9235460 8637054 8109269 7545720 7053895 6559965 6309932 5776632
5407 5776632 5711684 5562342 5199848 4844198 4869095 4811405 4727072 4418483 4359749 4185431
5397 4185431 4156631 4257890 4148428 4140279 3907594 3979672 3955401 3838881 3514827 3682886
5387 3682886 3758886 3575129 3335559 3278381 3312679 3344115 3177421 2986139 2884005 2916346
5377 2916346 2987763 2795325 2853276 2905446 2694405 2678130 2672437 2735975 2442534 2341744 2440288
5366 2440288 2504656 2549442 2506420 2322516 2365244 2357136 2335710 2355827 2430397 2455998 2445909
5355 2445909 2346732 2346853 2205217 2071723 2087795 2205634 2116822 2221429 2263165 2185487 2283130
5344 2283130 2353499 2423010 2455338 2297244 2018163 2066391 2087090 2243295 2362263 2438972 2332678
5333 2332678 2294963 2300063 2426945 2526540 2496553 2505553 2570339 2516217 2400229 2226857 2353097
5322 2353097 2464431 2568791 2457138 2511260 2617521 2626793 2663821 2776365 2631828 2575095
5312 2575095 2572584 2594196 2654101 2618434 2701728 2716327 2703970 2599548 2546365 2647164 2681167
5301 2681167 2599718 2628977 2675590 2662026 2577575 2505768 2473158 2548163 2694166 2711665 2589563
5290 2589563 2537797 2472060 2495340 2482885 2491105 2696513 2605168 2511124 2319706 2365034 2424248
5279 2424248 2451349 2416285 2536344 2582261 2649297 2683095 2825661 2779834 2797982 2886183 2780106
5268 2780106 2795920 2810258 2734195 2660531 2704877 2882173 2824946 2746452 2773566 2739933 2745887
5257 2745887 2795328 3019858 3171401 3270011 3338250 3408317 3310723 3289903 3282892 3220769 2947929
5246 2947929 3155897 3131813 3046577 2906914 3024868 3103318 2983396 3206901 3062770 3125154
5236 3125154 3306328 3431655 3377801 3603574 3767073 3429550 3316661 3368748 3440729 3540839
5226 3540839 3755472 3986282 4062190 4018369 4069463 4380000 4599123 4675040 4712351 4700575 4754467
5215 4754467 4992380 5123324 4997133 4912183 5062258 5192461 5192452 5263746 5185585 5282525 5492650
5204 5492650 5588876 5616935 5804333 5870085 6186193 6272181 6361331 6716211 7085940 7306191
5194 7306191 7689582 8158648 8419559 8602831 8828629 8924431 9139850 9157135 9072899 8884198
5184 8884198 8685755 8529564 8295377 8299812 8295158 8277890 8255202 8189435 8119048 8279310 8357466
5173 8357466 8441171 8616793 8854654 9171460 9692178 9952153 10058166 10561020 10860461 11181738
5163 11181738 11542472 11792383 11997184 12006440 11983309 11782131 11479535 11177535 10864891 10585068
5153 10585068 10418961 10079206 9775018 9353931 9080345 8971765 8899094 8825292 8657381 8612425
5143 8612425 8548872 8576034 8738334 8795499 8834975 8930471 9148013 9362493 9576041 9488240 9598757
5132 9598757 9809001 9630256 9137977 8972642 8709513 8259436 8111941 7951483 7561783 7354086
5122 7354086 7070135 6830661 6506162 6324713 6113206 5939651 5985851 5964650 5836087 5717059
5112 5717059 5671155 5500993 5421191 5466204 5476976 5294488 5169017 5228699 5223168 4936003 4933952
5101 4933952 4799651 4841128 4745121 4566275 4444587 4291458 4154663 3827970 3653598 3658828
5091 3658828 3289865 3371757 3531165 3406935 3266491 3272431 3319228 3332534 3360671 3216233 3083409
5080 3083409 3255209 3285352 3215520 3309361 3198596 3001265 2949318 2646387 2797185 2864755
5070 2864755 2803154 2937451 2959810 2965658 2902012 2852617 2708489 2696547 2735635 2776578 2643868
5059 2643868 2549077 2632395 2686426 2752792 2677463 2436030 2647869 2687303 2479223 2664082 2706043
5048 2706043 2494914 2483509 2563052 2557067 2674991 2757265 2505142 2453951 2628347 2720638 2525754
5037 2525754 2490546 2319656 2271124 2339290 2344127 2289590 2387896 2342617 2507210 2591682 2583626
5026 2583626 2590894 2781602 2757113 2729745 2728611 2771972 2676190 2459861 2466935 2639895 2719988
5015 2719988 2446440 2383663 2693027 2686500 2625842 2598845 2574230 2509859 2664018 2621122 2574243
5004 2574243 2614045 2338003 2389246 2653455 2815452 2676509 2694168 2696247 2636802 2550264 2713087
4993 2713087 2758805 2776017 2899817 2780686 2677857 2656667 2711921 2768099 2633823 2612280 2743958
4982 2743958 2833641 2859621 2918775 2854626 2691375 2661359 2861468 2641825 2615332 2713536 2733143
4971 2733143 2800046 3082580 2972655 2926744 2975379 2870133 2689808 2897758 2824151 2834693
4961 2834693 2950902 3002273 2802662 2887508 2978171 2885109 3163448 3247655 2988925 2939488 3067086
4950 3067086 3176860 3061775 3041854 3057914 3103442 3060624 2953926 3056399 3079386 3049126 3032118
4939 3032118 3271814 3271255 3225482 3084260 2897850 2983821 3163149 3139756 3174695 3247498 3435619
4928 3435619 3479307 3454683 3319315 3303931 3457031 3332052 3441059 3462568 3281304 3441104
4918 3441104 3417970 3387890 3451273 3520796 3526308 3530989 3334360 3392402 3477576 3591254 3465115
4907 3465115 3495017 3603270 3619650 3644300 3645965 3609536 3643333 3796953 3776171 3860616 3849675
4896 3849675 3903155 3758842 3866151 3825655 3770793 3899056 4100835 4162159 4186027 4208275 4113904
4885 4113904 4201867 4130703 4225983 4300852 4381164 4436137 4609199 4590916 4562332 4686352 4925926
4874 4925926 4792667 4754189 4679907 4447961 4335971 4263449 4296880 4501365 4371479 4410646
4864 4410646 4508790 4539004 4611200 4816877 4801806 4763579 4791881 4610948 4633233 4898114 5100905
4853 5100905 5046621 5299224 5338911 5218997 5454219 5317109 5279614 5657588 5610118 5642424
4843 5642424 5930565 6084994 6040847 6133799 6257611 6255616 6508929 6832150 6741494 6938823
4833 6938823 7233364 7244862 7451487 7651953 7652258 7819613 8244260 8278375 8514817 8870788
4823 8870788 8982581 9185897 9532900 9869957 10305578 10824574 11111292 11490774 12160608 12581760
4813 12581760 13030493 13782027 14164106 14723080 15493434 16299725 17096141 18210024 19051991
4804 19051991 20054905 20846339 21843049 22593726 23202091 23504745 23573632 23412331 22514426
4795 22514426 21304184 20265436 19223364 17867384 16674543 15645496 14786702 14048626
4787 14048626 13273315 12581611 12046856 11566552 10949319 10536088 10217121 9913280 9519939
4778 9519939 9219029 8976057 8822141 8820790 8592851 8436932 8226631 8200874 8144380 7925218
4768 7925218 7822691 7756436 7586670 7453904 7279642 7277000 7248741 7331575 7403855 7373066 7298931
4757 7298931 7136496 7068645 6943009 6882308 7058293 7096734 7108922 7086943 7155318 7202160 7123696
4746 7123696 7018316 7026504 7053679 6824955 7035672 7257408 7026869 6901572 6913276 6900016
4736 6900016 6851524 6826461 6738585 6793546 6872507 6677434 6555776 6582105 6601485 6628735 6675036
4725 6675036 6695066 6506315 6794645 6830005 6835764 6888317 6782394 6544474 6612218 6742321 6592121
4714 6592121 6718325 6693856 6815685 6762443 6848634 6884689 6735951 6893751 6900748 6919525 7127397
4703 7127397 7124070 6949629 6999920 7072507 7132505 7275226 7164408 7204000 7319661 7273935 7261887
4692 7261887 7250720 7294142 7364180 7312636 7310905 7463765 7434703 7408161 7315017 7299495 7485528
4681 7485528 7380385 7593664 7745271 7613264 7530549 7454486 7622940 7685212 7852476 7870209
4671 7870209 7954019 7779121 7732854 7966869 8045220 8196032 8399858 8461334 8274395 8196727
4661 8196727 8396776 8464100 8574488 8653865 8707623 8756039 8762375 9117337 9345739 9288949 9127146
4650 9127146 9236649 9296157 9200270 9293222 9336882 9269598 9345693 9233174 9140927 9282410 9381574
4639 9381574 9242394 9124457 9145384 9291402 9387992 9558274 9463590 9404823 9541218 9527323
4629 9527323 9652464 9818797 9813993 9861285 9931373 9882052 10050893 10281352 10341489 10314305 10533531
4618 10533531 10588611 10495694 10766589 10986650 10882092 10974607 11090873 11107393 11227631 11416517
4608 11416517 11704452 11935881 12051271 12170944 12371012 12676090 12849124 12766747 12877800 13070012
4598 13070012 13348820 13363123 13609581 13652414 13696783 13684938 13877908 14014984 14172498 14658331
4588 14658331 14790454 15106790 15413814 15730992 16094263 16243319 16399357 16713930 17080616
4579 17080616 17361115 17315778 17385039 17519332 17791721 17980137 18128015 18069730 18133563 18240901
4569 18240901 18253891 18546663 18749999 18848193 19217471 19399126 19471673 19431435 19752628 19983882
4559 19983882 20108922 20347421 20422222 20548225 20653154 20540701 20594223 20789153 20713796 20628095
4549 20628095 20767226 20990417 21211638 21365703 21228155 21227443 21499565 21538179 21459529 21548788
4539 21548788 21726154 21643329 21611978 21581416 21391211 21513235 21314820 21186471 21254511 21322532
4529 21322532 21256905 21317401 21231341 21234671 21360548 21453780 21633189 21815977 21931769 21953723 22135092
4518 22135092 22114406 22124988 22181854 22302084 22178908 21910815 21836753 21647541 21553336 21468187
4508 21468187 21578289 21437351 21423875 21369040 21463737 21492299 21732199 22189432 22155238 22297770
4498 22297770 22640000 22644601 22607722 22726583 22878037 22810271 22790900 22844497 22884307 23086431 23022924
4487 23022924 23162666 23111959 23117366 23183517 23175827 23241605 23273612 23538726 23916455 23833060 23890014
4476 23890014 24343327 24403357 24515076 24823871 25137380 25238800 25703553 26124132 26281142 26603957
4466 26603957 27085672 27710199 28098689 28629692 29165366 29876701 30663901 31099722 31707051
4457 31707051 32549418 33521572 34414055 35267143 36203275 37501523 38797826 40105588 41615408
4448 41615408 43362739 45027425 46904160 49401174 51914614 54535924 57540100 60873893
4440 60873893 64285017 68526161 72859081 77605040 83170007 88940471 95148846 101805561
4432 101805561 108438548 114828429 120730712 126166117 130444137 133341487 134348650 133367102
4424 133367102 130347386 125403076 119092602 112280093 104860900 97340603 90138961 83411709
4416 83411709 77076436 71171146 65772000 61010219 56814439 53284615 50135989 47484467
4408 47484467 45241016 43094374 41357417 39650767 38182337 36840847 35737518 34625312
4400 34625312 33447386 32486235 31894987 31159439 30440481 29987250 29535429 29144767 28652359
4391 28652359 28257603 27924989 27577679 27225078 27035544 26880282 26915390 27034186 27091783 27192370
4381 27192370 27273602 27478143 27694026 28010450 27815286 28185740 28675894 29045371 29731492 30599895
4371 30599895 31255406 32182005 33403681 34800013 36023966 37062240 37734083 37882876 37794851
4362 37794851 36966263 35608093 34226334 32859000 31432884 30408565 29597301 28840062 28385751
4353 28385751 28210752 27971011 27534894 27594566 27432415 27608166 28101513 28232006 28769902 29436472
4343 29436472 30050572 30988839 31731367 32277063 32611512 32524494 32178486 31395580 30432732 29535840
4333 29535840 28173551 26972980 25948572 25099045 24622125 24358717 24087810 23706819 23540503
4324 23540503 23492958 23604103 23602010 23696304 23668017 24022805 24155728 23778925 23666256 23424518
4314 23424518 23314475 22904599 22155817 21633593 21099803 20822458 20478209 20196712 19828527
4305 19828527 19480874 19209666 18821418 18502449 18348090 18019882 17887598 17782984 17704869 17684726
4295 17684726 17598960 17414715 17335137 17399820 17558590 17477593 17358494 17566142 17662249 17655434 17743182
4284 17743182 18047111 18246915 18359709 18494654 18941713 19157427 19253971 19568626 20077954 20530685
4274 20530685 21123354 21858226 22466917 23033295 23592248 24413469 24955073 25351239 25723011
4265 25723011 26003850 25875656 25756149 25890986 26001124 25963469 25589277 25327576 25091263 24862102
4255 24862102 24712313 24553752 24363454 24234560 24162153 24310779 24304330 24577544 25226697 25561677
4245 25561677 26026578 26746443 27608948 28575758 29294861 30172485 31173518 31886079 32484355
4236 32484355 32899928 33304952 33544129 33801051 34115193 34204338 34054509 33635340 33301173 32877606
4226 32877606 32266168 31422041 30543487 29632497 28376832 27143637 26319757 25779911 25006378
4217 25006378 24279031 23807716 23531475 23253780 23114666 23147472 23046775 23085986 22990796 23152374
4207 23152374 23012168 23286289 23754726 23776333 23711593 23690292 23811437 23796929 23625706 23295333
4197 23295333 23091958 22289679 21777423 20933906 20116664 19497923 18524230 17803694 17391301
4188 17391301 16685276 15766493 15231546 15052437 14574870 14175196 13801241 13394744 13209408
4179 13209408 13020659 12715363 12527921 12275127 12078453 11876380 11814187 11644105 11637874 11614365
4169 11614365 11502611 11369936 11356758 11194958 10899326 10933963 10907284 11035784 10965959 10883361
4159 10883361 10660864 10698042 10502748 10326737 10605505 10681957 10402338 10349870 10214548 10119415
4149 10119415 10099762 10085627 10119986 10134606 10023571 10002849 10030975 9984393 9756318 9884600 9903977
4138 9903977 9845494 9820129 9736052 9476878 9710130 9740297 9692963 9877765 9715562 9652812 9623443
4127 9623443 9661889 9698947 10015258 10139087 9787755 9965274 10186674 10107153 10329813 10710113
4117 10710113 10963244 11075690 11391745 11556972 11554115 11685822 11388175 11057272 10743550 10564536
4107 10564536 10398814 10367467 10309357 10061540 10221140 10164988 10045810 10112837 10113347 9904659 9872951
4096 9872951 9679043 9691752 9769196 9743675 9746491 9733242 9676487 9718083 9829150 9858159 9692728
4085 9692728 9681382 9537003 9552445 9627688 9458566 9351985 9349965 9355544 9329428 9551622 9633529
4074 9633529 9392524 9511744 9677867 9628602 9619465 9733125 9776102 9857987 10096387 10080842 10007239
4063 10007239 10073700 10069474 10102153 10157040 10075986 10163186 10679675 11006690 11148852 11348178 11312982
4052 11312982 11726729 11913422 12007704 11941216 11771406 11685379 11677872 11582804 11340391 11373486 11315248
4041 11315248 11335571 11121589 11068293 11345834 11263498 11324965 11395507 11448435 11550219 11555944 11621372
4030 11621372 11861923 11939681 11947499 12135666 12154652 12223857 12506412 12665128 12667761 12937062 13164555
4019 13164555 13368340 13469119 13638191 13699309 14029794 14183406 14227933 14406037 14785526 15276389
4009 15276389 15806508 16173847 16706699 17204863 17607303 18293422 18840068 19478049 20151805
4000 20151805 21225639 22068050 22749935 23602388 23995067 24473684 24997851 25279537 25479529
3991 25479529 25515006 25543721 25501375 25695975 25575383 25342874 25254179 25197415 25266483 25321403 25603611
3980 25603611 25615728 25715465 26149570 26474706 26693089 27135266 27842385 28351641 29027475 29643469
3970 29643469 30299574 31137658 31909711 32578119 32976053 33319786 33529961 33553835 33383056 33175950
3960 33175950 33048727 32709974 32193277 31946358 31541773 30953469 30383888 29667693 28809930
3951 28809930 27938336 27220591 26289083 25804686 25307825 24787891 24317293 23899694 23599428
3942 23599428 23527093 23618903 23577655 23657902 23796631 23850664 24117509 24105836 24361848 24526274
3932 24526274 24551988 24589983 24436442 24232368 23921263 23634696 23208002 22837530 22382148 21861580
3922 21861580 21155684 20704780 20287168 19607138 19106311 18982664 18610788 18593543 18442704 17960963
3912 17960963 17761944 17652593 17471159 17211740 17060534 16970376 17166065 17130735 16875028 16773453
3902 16773453 16719028 16761449 16797364 16929460 17024412 17228491 17409626 17477206 17603797 17835915
3892 17835915 18093157 18055289 18161584 18326883 18425176 18647890 18873352 18824883 18971469 19196573
3882 19196573 19061319 19193271 19362035 19609010 19668930 20076456 20100720 20219292 20538676 20789490
3872 20789490 21267979 21379752 21590624 21875799 22262145 22325852 22476214 22841531 23025064 23058164
3862 23058164 23414253 23739936 24018483 24049249 24434911 24991993 25323251 25734394 25830713 26192203
3852 26192203 26585842 26873491 27238557 27368855 27502922 28071801 28407554 28807815 29239005
3843 29239005 29521828 29923686 30407568 30898012 31418324 31853761 32491471 33115096 33692113
3834 33692113 34299171 35007974 35819780 36558687 37069737 37935620 38799439 39378723 40324996
3825 40324996 41436396 42243560 43432010 44864415 45934145 47455498 48889592 50388740
3817 50388740 52134320 54135709 56022778 57813685 59779380 61846905 64045572 66509314
3809 66509314 68864500 71789715 75145697 78428226 81799759 85516139 89747431 94346664
3801 94346664 99618685 105444135 111936808 119429069 127628527 136647739 146747519 158257565
3793 158257565 171590969 187920412 208711728 235164866 267461285 305016856 346143175
3786 346143175 387821391 424506079 450399667 458463429 445314026 411818593 364727761
3779 364727761 313872691 266317585 227766928 198098055 175668252 158120177 143995683
3772 143995683 132766300 123387721 115517481 108927272 103392384 98854310 94942862 91875273
3764 91875273 89088705 86504181 84788287 83569949 82419177 81631663 80993445 80491913 80265360
3755 80265360 80391009 80705442 81030674 81439054 81816653 82428447 83092274 83751486 84465130
3746 84465130 85592489 86829301 88298628 90308690 92237008 94591872 97309200 100076173
3738 100076173 103216935 107100419 111302833 116378638 122191193 128614846 135781714 144260180
3730 144260180 153679555 164114138 176761031 192047274 210846219 234360397 262617518
3723 262617518 295920924 333879601 373826591 411105016 440387363 455673130 452197045
3716 452197045 431372759 396561784 352864366 306223482 263059720 227537405 200586014
3709 200586014 180189570 164331686 151575830 141176501 132848718 125845841 120171585
3702 120171585 115511749 111605991 107966028 104804601 102011183 99397351 97080715 94839511
3694 94839511 92659534 90754571 89138401 87545307 86113677 84812443 83603371 82310287
3686 82310287 81070248 80104194 79202039 78291766 77315939 76585972 75688405 75063264 74544204
3677 74544204 74051246 73693141 73403621 73066406 73014256 72781973 72682646 72722093 73051454 73587257
3667 73587257 74001485 74704171 75189925 75680310 76409351 77295120 78064006 78909898 80038440
3658 80038440 81251618 82602320 84058797 85835803 87571236 89470535 91771943 93943790
3650 93943790 96402638 99268752 102468824 105866354 109648770 114012869 118569224 123506129
3642 123506129 129269286 135812837 143113519 150839594 159491083 168863568 179155511 189766602
3634 189766602 200781072 211838204 222150952 231297107 238437563 243420397 246198931 246105095
3626 246105095 243694107 238752771 231670773 223182927 213414665 202864921 191670555 180358568
3618 180358568 169433012 158874131 148631867 139116712 130486368 122502802 115224668 108672327
3610 108672327 102753947 97476423 92526661 87992266 84108266 80402367 77216154 74219376
3602 74219376 71409400 68973543 66717383 64510600 62704388 61013396 59356189 57846983
3594 57846983 56292117 55063420 53782327 52721786 51619626 50597213 49605534 48421914
3586 48421914 47494998 46588832 45637267 44782662 44054812 43422549 42777001 42327391 41670150
3577 41670150 41052819 40584128 40485208 40095123 39604593 39103501 38772778 38334164 38022672 37608954
3567 37608954 37257548 36883834 36203051 35937733 35711212 35315014 34901969 34605726 34552830 34180702
3557 34180702 33883088 33890041 33687132 33727797 33492086 33053174 32912656 32544193 32067661 31838732
3547 31838732 31647854 31637330 31533379 31320450 31119815 31002388 31049934 30832889 30983191 31086337
3537 31086337 31078049 31333361 31391637 31602617 31663802 31679610 31603156 31535799 31258846 30985716 30912776
3526 30912776 30855871 30708789 30647091 30585889 30596335 30532416 30743185 30989560 31200454 31687242
3516 31687242 32149270 32440308 32841129 33167700 33377380 33413360 32984900 32713808 32195566 31746950
3506 31746950 31375412 31075221 30748974 30446891 30289281 30223141 30009311 29897339 29772140 29815112
3496 29815112 30017916 30044230 30070900 30149669 30129211 30298850 30473688 30552075 30889238 31102150
3486 31102150 31295901 31641058 32057713 32290770 32578289 33105490 33735816 34225449 34868044
3477 34868044 35279470 35545142 36017051 36096774 36176382 36109686 35773348 35553207 35170079 34880910
3467 34880910 34614899 34351525 34441666 34364323 34443603 34425722 34568402 34925672 35265392 35579539
3457 35579539 35819382 36590905 37301386 37890732 38598207 39211431 39600821 40020888 40428945
3448 40428945 40713987 40894066 41077511 41250241 41333508 41518966 41915687 42408557 42859356 43351157
3438 43351157 44072336 44671320 45540821 46289734 47040642 47910642 48905160 49886244 50809427
3429 50809427 51903164 53121854 54605859 56030058 57710534 59743716 61983263 64359716
3421 64359716 66800136 69521726 72491154 75707332 79460278 83288619 87274987 91767523
3413 91767523 96803435 102119989 107967839 114545951 122386288 131425765 142182145 155275840
3405 155275840 170604755 187912581 206264043 224671076 241372960 253404842 258206399
3398 258206399 253738483 240271008 220423687 198162139 177197448 158884607 143700367
3391 143700367 131660860 122053404 114241088 108163689 103672835 100244501 97817169 96342784
3383 96342784 95191723 93985975 92675919 90950470 88644558 85491647 81134505 76415833
3375 76415833 71427767 67084078 63204024 59540869 56408038 53790345 51454556 49227785
3367 49227785 47361714 45639040 44029764 42821389 41478461 40206831 39215600 38398543
3359 38398543 37640169 37031969 36439633 35984193 35472899 35095396 34672064 34188461 33868922
3350 33868922 33390348 33349147 33439635 33448306 33244276 33025460 32613194 32474489 32307971 31872051
3340 31872051 31801042 31846485 31698110 31306922 31060934 31021338 30698853 30351314 30459003 30232074
3330 30232074 30109325 29928487 29556454 29264233 29000469 28579146 27978414 27682873 27188551
3321 27188551 26587502 26230632 25915843 25751536 25360530 24823875 24493233 24306177 24207773 24137383
3311 24137383 24142673 24078485 24015910 24055180 24073710 23893738 23916816 24004839 23864960 23861472 23865450
3300 23865450 23967027 24056438 24114610 24280223 24514304 24763857 24961868 25151243 25443370 25636371
3290 25636371 25878108 26123493 26222608 26378427 26317675 26151823 25893697 25436449 24753448 24519933
3280 24519933 24145557 23709098 23309550 22944806 22642691 22503715 22260049 22227045 22070500 21885896
3270 21885896 21664733 21346319 21251222 21029720 20851025 20871875 20837571 20885075 20762458 20555270
3260 20555270 20695920 20988490 21002196 21029089 21257877 21174749 20934016 21160283 21302162 21175451
3250 21175451 21060385 20888175 21007722 21249304 21221030 21344097 21421001 21359762 21377715 21570034
3240 21570034 21569779 21736528 22025935 22258766 22389213 22785438 23127752 23212905 23514049 23725499
3230 23725499 23718438 23680883 23880102 24020446 24167544 24566336 24553783 24611595 24900782 25240568
3220 25240568 25516629 25769966 26091496 26294433 26656590 26891313 27326253 27973634 28776733
3211 28776733 29452970 30358306 31133493 31951144 32860628 33649046 34476419 35304422 36023555
3202 36023555 36608951 36873069 36946557 36786259 36536389 36293975 35854455 35416859 34960401 33924960
3192 33924960 33282853 32345069 31399749 30731024 29796326 29190398 28848603 28598997 28546735 28455878
3182 28455878 28453443 28537660 28614285 28864701 29072564 29379202 29597684 29795554 30043729 30353437
3172 30353437 30490552 30670374 31129147 31140158 31016714 30700285 30585943 30644742 30699201 30377691
3162 30377691 30215635 30194149 30255487 30073759 30157221 30145008 30282601 30485613 30743636 31120479
3152 31120479 31521412 31822298 32167879 32460343 32938111 33479737 33760563 34280794 34938196
3143 34938196 35714638 36402871 36959916 37655678 38391067 39169982 40077307 40970508 42203960
3134 42203960 43497637 45064943 46678247 48633226 50956546 53400069 56120099 59362399
3126 59362399 62741748 66083588 69565507 72929714 75908581 78734444 80956643 82129793
3118 82129793 82477517 81764144 80110919 77701704 74655371 71044886 67378139 63850752
3110 63850752 60703616 58034242 55462086 53490491 51868953 50347148 49113248 48070550
3102 48070550 47058933 46298572 45602012 45015868 44546449 44257094 43852665 43552474 43162201
3093 43162201 42736285 42439573 42308480 42065622 42101882 42341008 42630072 43083832 43465444 43591081
3083 43591081 43576853 43666344 43442102 43132365 42931458 42659222 42587687 42340792 42525379 42586258
3073 42586258 42991299 43292781 43788265 44570814 45281182 46172976 47022940 48054136 49034608
3064 49034608 49942358 51076282 52166170 53697440 55329905 57175817 59250827 61555837
3056 61555837 63673529 66658128 69587788 72757007 76506891 81049070 86095669 91547222
3048 91547222 97371902 103759000 110716542 118512332 127813089 139888690 156016245 178162877
3040 178162877 204363130 234025433 265828813 299507626 327372075 343317085 339556747
3033 339556747 311029910 267111018 220155223 183065028 155275575 135307104 120032421
3026 120032421 107990947 98184333 90367283 83632975 78294336 73758188 69901707 66333913
3018 66333913 63269756 60060850 57561704 55408094 53403998 51463232 50122297 48611658
3010 48611658 47313312 46207680 45369327 44415120 43631878 42854561 41860577 41136249 40272113
3001 40272113 39413414 39062831 38485073 37711460 37226049 36827949 36586618 36551871 36326757 35916601
2991 35916601 35753678 36067637 36014286 36234844 36484352 36434025 36661215 37031453 37361988 37770087
2981 37770087 38338151 38952256 39480271 40168075 41038400 41547267 42337704 43103997 44085889
2972 44085889 45308986 46440514 47241166 48520927 49650874 51150989 52786522 54297000
2964 54297000 55744998 57364797 59024877 60594842 62658183 64304943 65960251 68239148
2956 68239148 70423456 72348660 74301780 76535182 78695791 80734805 83033203 84981741
2948 84981741 87209255 89353228 91220114 93275244 95157473 96789166 98313968 100176317
2940 100176317 101877941 103277247 104439381 105815318 106863060 107950108 108748364 109586934
2932 109586934 110234960 110607923 111022247 111054344 110967294 110691551 110321650 109862623 109266503 108536590
2922 108536590 107464268 106617906 105523850 104289544 103130947 101536295 99614012 98022357
2914 98022357 95935762 94054393 92091513 89811276 87242289 85079124 82995358 80747692
2906 80747692 78410403 76244324 73844193 71611007 69646286 67351475 65140313 63098934
2898 63098934 61110068 58960855 57192624 55191038 53149636 51362974 49361897 47699148
2890 47699148 45869166 44175967 42543322 41441945 40216777 38645146 37458163 36088071
2882 36088071 34803078 33837102 32776980 31573995 30685530 29561783 28686418 27782155 27155745
2873 27155745 26390088 25800347 25126059 24135611 23402802 22962340 22464231 21683568 21164992
2864 21164992 20676746 20300878 19908195 19669172 19376063 18991591 18666855 18456517 18149554
2855 18149554 17870163 17554259 17521714 17366484 17078555 16950229 16726672 16792373 16426041 16263806
2845 16263806 16092926 16129104 15960654 16046784 15938922 15840494 15844757 15982601 15782503 15763075
2835 15763075 15901337 15888230 15877461 16047641 16111610 16156462 16292935 16399200 16467287 16708719
2825 16708719 16655417 16592001 16915980 17028057 17194771 17379315 17380038 17285705 17373916 17378591 17274020
2814 17274020 17291858 17398446 17199232 17496634 17799253 17560510 17622893 17630627 17631211 17818227 17712997
2803 17712997 17630848 17680434 17683015 17587059 17674446 17638914 17465247 17499866 17638940 17426965 17588305
2792 17588305 17977669 18217145 18183620 18258070 18288325 18697290 18970620 19148980 19563533 20095591
2782 20095591 20579316 20964862 21328870 21807113 22285706 22889641 23315566 23682379 24033109
2773 24033109 23911822 24067740 24011460 23769535 23871968 23690844 23357299 23199515 23246967 23033826
2763 23033826 22686452 22769122 22625160 22390947 22188487 21719169 20942723 20739947 20161846 19452057
2753 19452057 18944572 18238501 17535237 17029575 16656390 16208532 15790394 15391839 15203696
2744 15203696 15351121 15117873 14801872 14720392 14613064 14536268 14386781 14371311 14396768 14268591
2734 14268591 14266166 14233286 14524650 14596072 14640005 14836826 14998658 14770107 14758862 14804033 14792431
2723 14792431 14670943 14639889 14417450 14239923 14346341 14012722 14103418 14138967 14103798 14047374
2713 14047374 14183151 14164987 14149575 14408280 14442644 14468699 14609998 14654112 14585349 14857757
2703 14857757 15079630 15016299 15148938 15276454 15077930 14977667 15051663 14972091 15178873 15152170
2693 15152170 15144697 15326884 15232946 14949885 15111820 15268308 15470350 15703599 15649275 15529289
2683 15529289 15517594 15166834 15032799 15343564 15487863 15599422 15543608 15497236 15544502 15527691
2673 15527691 15568522 15657060 15950671 15875188 15997180 16227065 16249166 16308383 16414829 16504650
2663 16504650 16642332 16851880 17110696 17045772 17373996 17572135 17613059 17986092 18304613 18434526
2653 18434526 18630269 19060507 19157831 19555753 19752492 19949369 20360052 20482192 20741212 21018460
2643 21018460 21356079 21610968 21628795 22343066 22690058 22748885 23359290 23703910 23871855 23920955
2633 23920955 24247968 24695118 24984246 25293838 25576596 26030981 26356263 26915321 27351610
2624 27351610 27771931 28067200 28705404 29274659 29941650 30479194 30975492 31781179 32359994
2615 32359994 32860309 33551622 34363572 35182516 35866937 36852250 37920804 38653012 39861069
2606 39861069 41134477 42196315 43191711 44235150 45302340 46732364 47959270 49355323
2598 49355323 50705548 52034138 53497739 54878098 56376436 57967718 59551714 61216352
2590 61216352 62768459 64382209 65908230 67398115 69295814 70875147 72091336 73689656
2582 73689656 75246620 76547356 77962744 79503270 80754842 81917103 83419949 84431056
2574 84431056 85765876 86947093 87809717 88912170 89761215 90588082 91356039 92171813 92572812
2565 92572812 93086813 93804176 94596551 95258124 95884557 96648917 97313180 98182878 99054049
2556 99054049 100024152 101166730 102152748 103293421 104632750 105994088 107599951 109211419
2548 109211419 110579157 112163002 114188739 116310494 118496298 120784854 123304576 125764081
2540 125764081 128642212 131524312 134479482 137616504 140769620 143922259 147285121 150717454
2532 150717454 154095595 157781042 161314011 164837886 168531777 172078606 175525747 178866994
2524 178866994 182232876 185352920 188560216 191631685 194711270 197954433 201057886 204096432
2516 204096432 207058446 209983480 212851785 215697354 218365953 220677352 223130438 225240673
2508 225240673 226983269 228756482 230569718 232124172 233806724 235649283 237218883 239044992
2500 239044992 240852017 242773089 244939881 246977502 248777036 250450452 252278220 253590730
2492 253590730 254612033 255410752 255931979 255934315 255684062 255051515 254158926 253271141 251986155
2483 251986155 250352281 248544005 246674387 244441103 241965872 239231876 235969571 232703680
2475 232703680 228865098 224729474 220281188 215488270 210477806 205379708 200545085 195416269
2467 195416269 190305893 185156508 180154435 175180285 170397389 165624934 161069056 156307366
2459 156307366 151921186 147601606 143649109 139614912 135615261 131858051 128327824 124974708
2451 124974708 121947161 119129836 116392758 114092960 111688396 109407572 107705541 105739815
2443 105739815 103864727 102186728 100666474 99448059 98332200 97186104 96326875 95689627
2435 95689627 95440496 95180084 95014772 95051972 95543562 96450858 97228151 98020323 99203520
2426 99203520 100676914 102274498 104418916 106688445 109027911 111747084 114955696 118411908
2418 118411908 122267068 126430015 130447155 134869572 139110276 142886293 146354853 149352253
2410 149352253 151472564 152829809 153432437 153232256 152756185 151719791 150180272 148730765
2402 148730765 147279813 145472217 143622523 141723795 139539127 137173453 134489819 131176313
2394 131176313 127357457 122931297 117489493 111654794 105808966 99688507 93630649 87620005
2386 87620005 82104368 77081497 72495816 67976759 63953445 60689691 57358174 54184036
2378 54184036 51733456 49469635 47256554 45255675 43675741 41921717 40502159 39083983
2370 39083983 37729143 36628135 35543028 34441812 33591342 32630439 31590610 30951040 30166331
2361 30166331 29397573 28794719 28150622 27572714 27107312 26558807 25951114 25435675 24968477
2352 24968477 24480564 23871927 23774812 23495713 23126572 22717303 22336974 22002512 21653461 21207092
2342 21207092 20996947 20634593 20375518 20254001 19771717 19308684 19273713 19231499 18787413 18465493
2332 18465493 18224180 17963618 17741433 17477478 17274338 17100033 16792873 16558626 16243465
2323 16243465 16189934 16124908 15994426 15943351 15599355 15390958 15331134 15130882 14830990 14860215
2313 14860215 14661987 14428277 14383057 14166111 14023692 14031359 13882420 13858620 13866958 13729883
2303 13729883 13567075 13532940 13541148 13373042 13337947 13168031 13014785 12979598 13043294 12911396
2293 12911396 13082226 13113209 13084011 12785436 12682044 12660166 12823138 12769304 12732737 12724901 12629953
2282 12629953 12523472 12507994 12376661 12326595 12453628 12395072 12449004 12493756 12404686 12363882 12448028
2271 12448028 12483951 12437168 12667894 12615809 12399294 12532298 12637741 12585701 12566553 12637493
2261 12637493 12775984 12607973 12876108 12961478 12958667 13147545 13013286 13005651 13092017 13105366 13267712
2250 13267712 13383688 13342391 13515969 13758791 13595254 13667750 13796061 13846946 13875549 14005091
2240 14005091 14098429 14106956 14392693 14461743 14485924 14614902 14821227 14910499 15164879 15202355 15203988
2229 15203988 15429340 15682475 15715194 16028830 16114687 16119729 16238485 16456965 16705138 16885978
2219 16885978 16918067 17256323 17549551 17587892 17708153 18026025 18186997 18283468 18656837 18910495
2209 18910495 19202910 19546217 19720882 19827624 20052189 20268058 20511325 20834701 21048116
2200 21048116 21173271 21414316 21708924 21941711 22135318 22431555 22860079 23183918 23642014
2191 23642014 23847222 24257316 24752331 25016061 25315456 25915820 26372501 26744040 27306906
2182 27306906 27879149 28541596 29320027 29639452 30155124 31010847 31728855 32526132 33635915
2173 33635915 34721482 35443706 36315325 37436475 38728674 40260365 41747542 43100507
2165 43100507 44613349 46203724 47712924 49211002 50945939 52576442 54072250 55316486
2157 55316486 56343057 57019099 57309500 57154075 56654878 56094041 55108069 53917105 52773061
2148 52773061 51439402 50345605 49269327 47978274 46866853 46057438 45112965 44168042 43425727
2139 43425727 42571559 41719718 41102331 39885232 38921203 38042613 36902792 35602039 34356292
2130 34356292 33293186 31772450 30323695 29075189 27799139 26598758 25458830 24466320
2122 24466320 23697615 23040020 22104976 21426676 20922276 20330339 19521150 18741235 18338858
2113 18338858 17914052 17546140 17104265 16621422 16210511 15998272 15657985 15399291 14927893
2104 14927893 14315311 14247765 14173685 13898690 13822667 13505006 13124743 13094395 12860832 12683349
2094 12683349 12510168 12348317 12041070 11874781 11655283 11483364 11326863 11259556 11119761 11006847
2084 11006847 11086282 10791735 10576806 10527902 10442500 10188952 10097677 9950402 9956051 9628208
2074 9628208 9287672 9069124 9195997 9232995 9128017 9008694 8861370 8692618 8601337 8421183
2064 8421183 8358216 8388685 8288205 8361183 8164121 8035287 8045882 7851625 7658588 7519885
2054 7519885 7577533 7684141 7698259 7578791 7542163 7689885 7550167 7353529 7041265 6971711
2044 6971711 7009502 7006615 6997760 6927888 6902946 6828269 6668744 6626765 6617318 6618232 6631030 6536244
2032 6536244 6278838 6293306 6079059 6013117 6151534 6301437 6580879 6278569 5912349 5936400
2022 5936400 5826244 5673314 5741228 5856975 5903573 5850804 5843100 5801512 5795636 5763443 5663785
2011 5663785 5675768 5597529 5446992 5394959 5424281 5368476 5448277 5583462 5492904 5381379 5330763
2000 5330763 5235820 5222339 5244340 5145685 5185118 5180770 5032807 5147682 5121989 4916420 4908619
1989 4908619 5098254 5142293 5094818 4929480 4753529 4822550 5043676 5029447 4924982 5102800
1979 5102800 4991759 4941262 4739255 4696680 4852775 4771383 4601502 4744751 4627545 4594204
1969 4594204 4535868 4534944 4586376 4560341 4604155 4473300 4495607 4465987 4487854 4465604 4369743 4471595
1957 4471595 4400616 4313937 4225501 4362958 4519056 4560192 4479602 4288833 4363650 4367022 4362962
1946 4362962 4417507 4282435 4261734 4350146 4363519 4313500 4445376 4507783 4304167 4426471 4500260
1935 4500260 4360279 4339865 4415299 4362356 4199367 4110410 4292395 4288928 4362566 4283557 4022474
1924 4022474 4233582 4368824 4289830 4246020 4216563 4425945 4234567 4231493 4377243 4286723 4347443
1913 4347443 4415595 4378059 4376702 4448221 4530534 4521546 4415455 4471310 4554794 4531604 4472283 4540501
1901 4540501 4578629 4678353 4745503 4722707 4743013 4768586 4963523 4735784 4753127 4936155 5001198
1890 5001198 5224729 5309647 5262988 5223053 5404840 5344670 5266187 5644219 5646683 5456168 5509813
1879 5509813 5544393 5756156 5969501 5737518 5731318 5801337 5875683 5739117 5747822 5991913 6078964
1868 6078964 6094764 6040719 6277871 6523312 6509685 6491517 6518875 6489208 6543126 6643176 6806390
1857 6806390 6659549 6820372 6816755 6772441 6930831 6917473 6993647 7112630 7081566 7214655 7509019
1846 7509019 7582111 7595139 7563707 7855186 7950523 8089169 8243151 8489304 8788276 8809354
1836 8809354 9014649 8997193 9246476 9360203 9505132 9698157 9929751 10106498 10336663 10513472
1826 10513472 10589441 10840019 11191628 11358763 11522904 11638940 11781440 11936459 11967041 12211954
1816 12211954 12381992 12282206 12184324 12499355 12576836 12416214 12727856 13115610 13346695 13587311
1806 13587311 13846139 14213082 14458019 14740202 14995670 15390992 15899622 16468632 17010610
1797 17010610 17532756 17807437 17894216 18307724 18612123 18524540 18528460 18254222 17710801 17106539
1787 17106539 16501616 16395784 16051680 15505101 15325714 15241081 14950492 14880717 15031623 15009837
1777 15009837 15088716 15221621 15280964 15396142 15633165 15803154 15677543 15708614 15860363 15955921
1767 15955921 16053008 15995234 16035610 16066996 15779791 15444242 15319390 15108660 14560584 14292375
1757 14292375 13871336 13485441 13122380 12705310 12359390 12236752 12168856 11739894 11571140 11401351
1747 11401351 11256290 11005727 10775110 10703538 10572470 10650595 10449889 10242565 9985769 9695403
1737 9695403 9421898 9213154 9106900 8783231 8457624 8184590 8040253 8111687 7864213 7561261
1727 7561261 7263249 6970537 6843840 6693114 6651833 6483704 6361791 6185605 6031706 5869875
1717 5869875 5899893 5723566 5612725 5627886 5563247 5481330 5501246 5361075 5237318 4956993
1707 4956993 4842070 4852936 4800779 4712889 4644159 4380465 4441402 4583714 4351198 4292916 4378650
1696 4378650 4469839 4323005 4220760 4144270 4064969 3994978 3869619 3803365 3638823 3698499 3654328
1685 3654328 3496757 3497458 3278411 3080271 3195829 3281872 3350569 3213987 3088588 3055624 2946981
1674 2946981 2794806 2884197 2897424 2619112 2525300 2737277 2791187 2644982 2741870 2626749
1664 2626749 2532293 2479766 2500000 2451080 2485966 2575680 2441159 2292430 2226652 2111342 2093496
1653 2093496 2051952 2095334 1999874 1921404 1844462 1816623 2027303 2070469 1943155 2115468 1840063
1642 1840063 1692916 1791966 1649799 1826683 1923950 1738834 1581069 1477333 1446791 1575907
1632 1575907 1714618 1451052 1557465 1635673 1558460 1538935 1493742 1485722 1338959 1485612 1458620
1621 1458620 1282009 1319996 1301061 1323408 1393908 1300929 1110424 1161971 1182387 1269199 1282042
1610 1282042 1236948 1240090 1219820 1038467 966922 934623 936962 1018948 1014990 1142762 795849
1599 795849 848777 1133950 1145069 1081945 998401 930719 1021735 909968 968737 857089 804513
1588 804513 663306 781944 813838 755544 754209 779172 731486 630580 568236 441582 633913
1577 633913 570302 480591 394962 619863 753362 770087 908468 853561 760715 780688 679437
1566 679437 747558 598606 375257 422332 509392 615663 565103 402454 477785 546332 552964
1555 552964 565040 701666 802461 720910 596374 706507 680715 520546 623272 708846
1545 708846 513336 483554 515015 603031 483895 481388 404689 381846 401854 380496 439417
1534 439417 447763 454003 431267 422455 328270 417945 297503 303608 405533 548959 523630 432746
1522 432746 432242 382076 370835 553354 372162 375182 106263 -3855 85756 264761 305968
1511 305968 255949 258265 248682 521717 473826 132097 160172 247830 132764 13952 78351
1500 78351 253029 301442 356573 344507 410552 362335 410465 459835 440411 241812 307842
1489 307842 485585 413062 385017 244002 -38325 88259 258226 299493 -16586 80896
1479 80896 100933 68230 269653 305719 201249 295057 262787 336768 385867 389098 371482 390212
1467 390212 143997 205366 388366 302757 357138 301677 192309 185444 253126 190353 322446
1456 322446 151522 91761 -38646 -37768 115794 237258 282006 325546 300762 398761 491641
1445 491641 417716 273282 363453 168255 153056 107738 -159605 -168377 28186 65392 96431
1434 96431 199250 317084 66656 166533 143054 73004 98289 32385 42212 216378 200493
1423 200493 333128 281987 148110 34098 -22769 -126805 -74639 -34840 73496 191484
1413 191484 151917 76348 17367 -11029 782 61797 77648 67771 -102021 -193441 -126483 127609
1401 127609 30032 86434 -30957 94840 153058 20647 -23024 21042 82777 65070 -230681
1390 -230681 -115748 -41605 205620 9965 -265446 52808 89017 -71504 19723 -47207
1380 -47207 46581 -83234 -83965 121967 326736 250449 -33988 126956 112369 35728 27245
1369 27245 -200852 -52582 -54440 -39434 132758 125819 123665 89526 76156 -93343 -100977 149446
1357 149446 109789 109923 175777 -68320 -96980 -92213 -156206 -243239 -340291 -64229 -90252 -38378
1345 -38378 -31026 -75026 -108826 -77153 -191246 -114629 -52131 -54214 -53602 -60890 23299 47920 116433
1332 116433 29660 87592 51971 -6371 33923 -99794 -257775 -145517 15673 125974 -38300
1321 -38300 -82608 53599 90522 12351 -86297 -1724 50311 195821 152986 -142309 -74302
1310 -74302 -83983 -42795 28980 156901 92511 -3001 -35987 -20284 110657 89390 74012 -34692
1298 -34692 -225493 -87526 41981 -2302 -15750 15215 -159599 -78549 -12107 167521 -23906
1287 -23906 -90197 11075 10734 -188025 32433 34900 9850 -92941 -181904 13156 -66388
1276 -66388 28652 -36825 11526 -97191 -104551 10422 -93938 3747 150678 42496 -104711
1265 -104711 -122260 7044 11708 -241903 -63398 81073 -18706 -212610 -69994 -77393 -8414
1254 -8414 125550 195486 146169 7138 33232 -43303 -104470 -59466 -107696 105479 138468
1243 138468 76280 211906 -492 -192287 -173282 -104166 -205653 -49014 130327 237635
1233 237635 154410 228962 63283 27383 -13038 58938 170374 198512 213536 222907 122389
1222 122389 172910 313111 106870 -5307 -34396 -37687 -68386 -8912 139262 24597 -11200
1211 -11200 83981 -8671 -89898 19678 79971 129644 97860 27789 -104746 -176529 -169102 -136237
1199 -136237 59422 90625 -185590 -315812 -190468 6214 215602 334323 305584 291091
1189 291091 67962 -31564 -191227 -4091 41891 -55617 -6231 -70279 141642 148497 -121384
1178 -121384 -149595 -123552 -126463 -165156 116283 -35873 -167803 -49737 -80418 173152 290323
1167 290323 144973 136451 104572 73201 90639 -53854 81455 178910 197104 66253 124178
1156 124178 100684 22265 23569 180503 230611 33879 -79338 -10780 -81668 -62413 181405
1145 181405 200373 212569 106377 7523 114359 198726 125285 48827 260650 -66951 42217
1134 42217 146347 -5672 23319 105446 211909 142457 -38711 102421 189444 92947 286383
1123 286383 120531 36493 -18506 176145 300416 394882 371373 190501 93837 224005 205779
1112 205779 54785 28119 276268 242903 278582 354079 265478 258013 24568 37296 192421
1101 192421 150725 346677 348423 389030 355268 84769 371171 292452 170973 372632 398208
1090 398208 189462 474975 515055 497458 602103 340390 230587 335616 344449 434320 518731
1079 518731 602176 602181 512247 760351 579412 403901 326569 163920 436106 559466 547248
1068 547248 632997 778831 865517 900836 746064 844533 858277 802396 736429 761072 688567
1057 688567 783430 891230 840316 705716 617262 683338 872297 1080427 1051285 1148630 1120324
1046 1120324 1033576 904689 1059681 967234 919705 961746 967695 1072432 1092274 1103176 1269972
1035 1269972 1335397 1201908 1157512 1057028 1096994 1267040 1217301 1289647 1479530 1329800
1025 1329800 1308577 1329851 1414811 1411638 1620262 1500662 1459826 1643626 1618302 1652929 1519063
1014 1519063 1616287 1770546 1971142 1823600 1871985 2001587 1817466 2052492 2103589 1904535
1004 1904535 2023871 2201864 2174402 2068524 2274440 2456783 2317187 2272791 2323644 2328609
994 2328609 2307223 2671705 2727654 2851179 3140426 3152416 3064788 3210501 3366149 3289145 3539273
983 3539273 3688442 3988093 4211393 4319995 4436493 4783379 4914985 5115954 5485004 5502120
973 5502120 5791538 6097307 6345952 6779706 7091723 7499294 7869840 8357705 9004352 9633021
963 9633021 10303673 11106550 11824105 12566977 13583182 14588581 15407126 16531291 17705087
954 17705087 19253282 21091174 23105534 26245916 30710086 35670867 41206380 47349409
946 47349409 54062945 59282669 62150995 61195569 54964801 45915193 37274261 30534895
938 30534895 25484890 22059838 19278721 16990002 15106247 13718316 12643273 11494706
930 11494706 10750656 10149165 9549676 9131524 8469120 7670693 6958379 6334778 6059680 5772819
920 5772819 5302891 5084030 4751757 4664717 4333623 4154701 3991259 3628926 3419036 3288596
910 3288596 3368601 3306421 2929927 2895801 2711518 2637676 2708443 2539271 2441130 2456540 2240378
899 2240378 2086652 2123971 2215061 2280685 2105057 1933758 1829214 1949393 2058212 1838015
889 1838015 1727815 1671770 1657008 1610569 1535535 1324593 1386988 1523068 1446773 1369786 907233
878 907233 1109184 1192278 1144451 1049277 1099490 980719 869280 937700 876575 975439 980691
867 980691 906881 753628 729006 888705 786486 727690 776641 686028 627297 678489 899165
856 899165 844774 743960 652223 647327 614256 464576 449514 548203 674414 695799 626996
845 626996 449417 497440 637034 583816 557703 617615 683325 442509 466127 532132 324396
834 324396 344156 181713 123228 132288 265200 442510 403989 258744 190237 259961 228120
823 228120 193403 265204 422534 428915 315730 118288 184275 58901 -15784 20100 176395
812 176395 263699 153876 -144078 3198 265939 263770 96508 58387 193754 187311 115236
801 115236 179478 123932 246704 273839 -46608 -94497 -45044 165728 155559 117443 3603
790 3603 -66530 134973 147940 282219 339464 86800 -73860 -39635 -71001 -105110 8731
779 8731 80858 180679 250917 338026 156408 98050 -25707 -89693 -210678 -16715 -28272
768 -28272 -73741 -77755 -129277 -113407 71587 92143 82047 83509 170449 169596 -46259 112186
756 112186 -43980 47974 219194 45738 -26739 134993 98560 71959 -85115 -87477 -34519
745 -34519 -45383 69367 -78406 -114996 -89651 111961 136042 151448 206150 93347 92829 -69780
733 -69780 -107958 -2778 13094 47657 -42993 -111573 104570 149181 -7015 -95269 -114112
722 -114112 -41249 -160452 -164910 -74976 -20014 -69566 -55973 10692 -9011 -128730 -76143 -130999
710 -130999 -177830 -61989 -249145 -140082 -118352 -49624 171142 172502 -8044 -5573 -168306
699 -168306 -208768 -24978 -75444 -110784 -61421 20962 -161554 -125506 -51065 92943 44392
688 44392 54820 94988 -12032 21549 48626 -24539 -82583 -142477 -157276 238195 144498 68215
676 68215 16541 3294 -69318 -171667 -25097 -22956 -107097 -184628 -74525 38156 30108 37450
664 37450 144313 251153 142445 182187 347870 388940 235634 235823 281041 92731 -67309
653 -67309 -64933 -111006 -81936 -113425 -161533 -184307 73892 197813 -41038 -91680 -166205 -19947
641 -19947 -70930 -321970 -203207 -66106 77832 -127018 -276844 -252756 -265885 -252922 -169918
630 -169918 -154683 -134886 -72930 -129956 -200113 -212374 -86742 -88082 -181963 41605 -65163
619 -65163 -63101 101053 -4494 -209523 -187202 -10521 -186594 -164542 -186079 -202137 -231859
608 -231859 -61507 -240011 -274396 -234306 -346975 -286900 -112240 -192964 -166912 -120761 -109787
597 -109787 -153659 8081 -209286 -280440 56244 -37477 -164132 -87715 -73487 -147775 -92144
586 -92144 -10983 -199658 11741 77039 -108297 46866 -75260 -255338 -290561 -153159 -82058
575 -82058 -29872 71276 18865 -95720 -112344 -154746 -460782 -598961 -566813 -433849 -144444
564 -144444 30541 -23043 -21962 -62011 -142847 -79012 -54800 -36220 -33166 -60414 -292569 -46768
552 -46768 -32442 -93407 -73521 -5138 -42993 69117 206036 107877 -144802 -261802 -279312
541 -279312 -162552 -50028 -46255 -126939 -137417 -124593 -57223 -185498 -362474 -96905 117186
530 117186 53465 -57513 -259655 -237513 -44556 -240277 -169910 -145762 -193209 -206727 -28478
519 -28478 -182798 -363179 -206076 -257777 -100031 58345 -54396 -237765 -102714 69253
509 69253 -178431 -209079 -180220 -190648 -142257 -71560 -39273 -90186 -232309 -234412 4358 -5234
497 -5234 -12514 -55228 -15450 -16539 -249207 -246829 -176471 -229910 -30183 -117968 -286935 -303069
485 -303069 -153767 -246755 -115090 -5369 -31331 -109918 -147602 -90017 -106752 -116924 -204670
474 -204670 -158624 -65186 -278349 -244694 26045 -183231 -332170 -266369 -68436 -159943 -71994
463 -71994 -17946 77605 65243 92099 -67754 -53496 -54849 -131194 63060 138543 -126259 -238999
451 -238999 -204485 -268270 -223789 -79943 -87686 -219974 -185902 98988 14432 -256244 -98144
440 -98144 156447 309056 215814 210053 13097 5012 -87065 -45993 56037 2702 -41996 -117177
428 -117177 -181572 -132059 68569 7366 39086 89589 91165 -214165 -381064 -157486 10107
417 10107 -26392 76025 9082 -94973 -119784 -236145 -170836 -64115 3276 -134179 -145520
406 -145520 46418 -41699 7838 -84469 57230 27792 -54350 -218304 -459966 -227495 -103043
395 -103043 -89750 -45176 -101614 -292944 -22265 25967 -72535 -128157 -158205 -227651 23969
384 23969 23269 -29210 60202 -71274 -72841 -13196 -17502 -100445 -174959 -279302 -222227 -178966
372 -178966 -194737 -106918 -140232 -197019 -136469 -251679 -324647 -99169 -31936 -128758 77864
361 77864 56462 -233848 719 -105929 -92462 -445 -36098 -153186 -70635 103665 -139603
350 -139603 -89200 3417 -9426 -56089 8802 -111198 -188361 -64556 14830 -83791 -249264
339 -249264 -163232 -45805 -153021 -221746 -299898 -190931 -282512 -359058 -390019 -266687 -98316
328 -98316 -192220 -61519 -169160 -279844 -94743 -139296 -246171 -23667 -54928 -70026 -20827
317 -20827 -124121 -127454 46770 83646 -182106 -274337 -181431 -296262 -228417 -107788 -166560
306 -166560 -208205 -153909 -139990 -66863 198297 188768 87807 75607 -69286 -136579 -25665
295 -25665 -240625 -326509 -302892 -401672 -141982 -140926 -184572 -256065 -122380 -14216 -1251
284 -1251 -37969 -127826 -112197 -139874 -109854 -55129 -116739 -281800 -302563 -154411 -132682 -263809
272 -263809 -370534 -275341 -273235 10911 107568 -45698 -115097 -114293 -62372 51074 90903 83494
260 83494 160977 -164899 -252298 -127634 59670 25336 51361 -125689 -219829 -314677 -285300
249 -285300 -204297 -35733 -174021 -109830 -111869 -138814 -152779 -241225 -170848 -175701 -313874 -328070
237 -328070 -192384 -209190 -120694 -236336 -126433 69324 14994 -9302 -247420 -338010 -346988
226 -346988 -199087 -243878 -316974 30366 -33666 -88644 49793 -214713 -323618 -24287 3634
215 3634 -172349 -191342 -283951 -372084 -236636 -200473 -261658 -286812 -125008 -248357 -191177
204 -191177 -237735 -294394 -63834 -7530 -177035 -274489 -153702 -195717 -295577 -82463 -62727
193 -62727 -216437 -344658 -320560 -276369 -156697 -264916 -294938 -234835 -235377 -172179 -49436
182 -49436 -134852 -103417 -236177 -136494 -171917 -253635 -85552 -53892 -113301 -192505 -211722 -447509
170 -447509 -282506 -259850 -183245 -199464 -163113 -150481 -75102 -123330 -24808 -101396 -196083 -321290
158 -321290 -365670 -457388 -369006 -206222 -61601 -26085 -185862 -167827 -258624 -332447 -371658
147 -371658 -258089 -192428 -179204 -197276 -124665 -220199 -278122 -216022 -226150 -165733 -114480 -124946
135 -124946 -190502 -264942 -214766 -259417 -33454 -91504 -180141 -171283 -323729 -288262 -287634 -397844
123 -397844 -423443 -237280 -191971 -64748 50967 1197 -217088 -306132 -398178 -339539 -106300
112 -106300 -92934 -111003 -180607 -250152 -324480 -174729 -60083 -202885 -235882 -135940 -155608
101 -155608 -203750 -188244 -107163 -259358 -142650 -193310 -273240 -228761 -235061 -207749 -173951 -229753
89 -229753 -306634 -171839 -251239 -341823 -320688 -296814 -197328 -216290 -302341 -285788 -295027 -253660
77 -253660 -312664 -285185 -237601 -142531 -126487 -65407 -53821 -232508 -225322 -142454 -305278 -313437
65 -313437 -189264 -276255 -246105 -188923 -156639 -179352 -276717 -247975 -386085 -394016 -304474 -357415
53 -357415 -352668 -227344 -293643 -233836 -130051 -263745 -225581 -196043 -190250 -236662 -224611 -188054
41 -188054 -135251 -170444 -238518 -269538 -241271 -212049 -174725 -246123 -134293 -189483 -343846 -408314
29 -408314 -370385 -314398 -213445 -321220 -284537 -199140 -271278 -286087 -375874 -300362 -160368
18 -160368 -171632 -185548 -188992 -399091 -361063 -302221 -269755 -226451 -242206 -253763 -219484 -245395
6 -245395 -219735 -177097 -242021 -355023 -279742 -316761
0 -316761
$$ Imaginary data points
##PAGE= N=2
##DATA TABLE= (X++(I..I)), XYDATA
16383 -5683561 -5687123 -5509071 -5453337 -5407871 -5302293 -5211164 -5208208 -5153314 -5029899 -4983150 -5049471
16372 -5049471 -4969064 -4821016 -4639064 -4624138 -4617454 -4406993 -4341224 -4382128 -4178010 -4163204 -4193757
16361 -4193757 -4087937 -3976129 -3854652 -3896075 -3754329 -3763981 -3723380 -3674469 -3717171 -3613047
16351 -3613047 -3437368 -3329617 -3289751 -3309481 -3217537 -3076711 -2977321 -3119824 -3005034 -2839973
16341 -2839973 -2792248 -2910098 -2892981 -2786715 -2723748 -2426240 -2457037 -2489172 -2335749 -2215316
16331 -2215316 -2238271 -2156603 -2204138 -2019270 -1868828 -1951815 -1890542 -1771355 -1820488 -1725906 -1625101
16320 -1625101 -1447344 -1356853 -1498476 -1509372 -1427676 -1215691 -1190902 -1037018 -901777 -1025177
16310 -1025177 -1048036 -973313 -850596 -790872 -603224 -652949 -718995 -672882 -515355 -567819 -559664
16299 -559664 -340578 -198316 -174628 -192512 -203025 -267474 -102363 -71625 -38677 73249 99251
16288 99251 359896 318369 277976 329908 449370 465735 485066 431072 410392 448233 643817
16277 643817 642174 666204 777985 779122 871025 1078906 1064184 986289 1065423 1034782 1205673
16266 1205673 1126330 1108573 1209160 1461960 1291156 1107358 1151871 1349687 1390087 1447474
16256 1447474 1546034 1674155 1670495 1591854 1598129 1702772 1833111 1809358 1858708 1890090 1950884
16245 1950884 2101973 2102194 2067709 2248531 2260952 2270238 2307473 2434451 2496935 2414295 2546819
16234 2546819 2522449 2525832 2478901 2518031 2572768 2379741 2374896 2652962 2697035 2577237 2618760
16223 2618760 2610674 2679157 2742015 2705979 2699979 2836304 3039618 3189280 3087232 2930726 2977833
16212 2977833 2973271 2930747 2998226 2926004 2963862 3100734 3160518 3331937 3173677 3114030 3194854
16201 3194854 3286028 3231311 3308855 3346205 3366413 3470822 3310252 3247955 3402017 3484362 3423540
16190 3423540 3464789 3326036 3370410 3609924 3635496 3603519 3624720 3728213 3846772 3806375
16180 3806375 3760461 3671975 3719540 3719930 3733861 3874104 3877058 4051633 3952961 3924769 4001719
16169 4001719 3912820 3936389 3931092 3912763 3767256 3742433 3886574 3870468 3926506 4167683 4056022
16158 4056022 3969905 3958492 4129936 4195637 4167980 4135134 3994562 4001050 4155331 4174429 4168748
16147 4168748 4231005 4217142 4181252 4151725 4169544 4133687 4194809 4047713 4067574 4139192 4077488
16136 4077488 4170387 4264758 4413808 4329288 4283399 4496205 4273496 4250583 4155646 4392642
16126 4392642 4499095 4234112 4199279 4153193 3990474 4045231 4246145 4104311 4072344 4248929
16116 4248929 4311755 4412364 4498260 4417413 4363599 4413902 4611378 4545814 4336996 4434702 4331480
16105 4331480 4354908 4476986 4296618 4369805 4291852 4416934 4446522 4296150 4305970 4477706
16095 4477706 4457863 4404087 4580375 4493613 4570422 4683864 4606337 4551029 4690304 4725690 4510929
16084 4510929 4473937 4420099 4371556 4311449 4557410 4672367 4715063 4614550 4683705 4796964
16074 4796964 4788969 4881306 4879128 4721997 4785500 4652603 4610927 4364451 4350184 4578310 4493501
16063 4493501 4560307 4690322 4644556 4696046 4696099 4741950 4716077 4487769 4466117 4468426 4582568
16052 4582568 4731532 4779139 4622131 4600100 4677577 4697660 4440196 4549770 4469275 4561526
16042 4561526 4547618 4799158 4776509 4727520 4783711 4808777 4557681 4572687 4578045 4443983 4689895
16031 4689895 4722053 4668567 4664030 4759890 4661183 4682225 4721662 4755770 4831083 4822965 4725302 4729596
16019 4729596 4532801 4622094 4557560 4666366 4567210 4631398 4631207 4651717 4773954 5029673 4987642
16008 4987642 4702342 4588930 4521550 4683996 4656992 4580888 4707315 4663214 4689835 4758403
15998 4758403 4626544 4643208 4631170 4552423 4702882 4546475 4554108 4438957 4446764 4933716 4919961
15987 4919961 4757549 4873397 4957802 4698445 4738238 4664141 4635725 4437698 4475959 4481068 4478089
15976 4478089 4332482 4351223 4511675 4469738 4599881 4726919 4787979 4887771 4935044 4901964
15966 4901964 4663828 4720090 4799634 4610076 4530131 4494414 4394018 4516224 4578019 4498749
15956 4498749 4562025 4483653 4450551 4717728 4822432 4849314 4905099 4819052 4804728 4634110 4677287
15945 4677287 4558407 4485853 4678767 4477052 4645135 4659490 4685023 4654548 4679033 4673155 4689974
15934 4689974 4785085 4782630 4781186 4857401 4683798 4630734 4833256 4697615 4622859 4677922 4576475
15923 4576475 4810858 4958745 4914758 4817148 4734542 4866720 4798036 4648506 4561557 4629345
15913 4629345 4650978 4613718 4720126 4777066 4646186 4709150 4815170 4791739 4753139 4701297 4787461
15902 4787461 4861542 4830645 4778499 4616171 4611675 4560868 4695445 4758551 4663249 4530911 4784400
15891 4784400 4870863 4647716 4548608 4806631 4714862 4902803 4829720 4812696 5021357 5010239
15881 5010239 4993811 4955292 4892292 4547825 4562012 4625648 4731292 4614797 4701278 4582825
15871 4582825 4572948 4931787 4854720 4889680 4955039 4915152 4816765 5033381 4896873 4860950 4632260
15860 4632260 4706251 4666891 4722942 4856477 4911774 4934977 4854165 4714481 4810216 4791644 4730579
15849 4730579 4848325 4854011 4942018 4995191 4792080 4695508 4700696 4674539 4797247 4787761 4838755
15838 4838755 4841844 4959624 4853057 4741910 4871147 4839136 4792035 4989257 4866291 4907217
15828 4907217 4841448 4824463 4768391 4762147 4772833 4923305 4951874 4763796 4888539 5071669 4996842
15817 4996842 4724821 4610128 4691567 4542516 4704005 4760657 4731251 4749659 4750955 4643411
15807 4643411 4672350 4693525 4661050 4802912 4872748 4627222 4678807 4915107 5187847 4894560
15797 4894560 4701689 4839869 4864578 4881724 4785052 4722084 4674688 4771406 4797445 4904267 4916256
15786 4916256 4743594 4525211 4690161 4746726 4777862 4892341 4838334 4828997 4920214 4998679 4972929
15775 4972929 4852083 4726352 4706763 4756542 4827369 4865023 4747703 4706999 5049148 5106696
15765 5106696 4833616 4888392 4956708 4928595 4755649 4665288 4762083 4747143 4726109 4857389 4771764
15754 4771764 4932085 4903054 4645635 4759987 4948355 4816439 4668370 4831185 4710614 4827044
15744 4827044 4875504 4719997 4666020 4716433 4750793 4710185 4663961 4658195 4795138 4811413 4742222
15733 4742222 4670736 4626224 4638711 4796777 4759997 4726255 4857705 4865421 4669336 4743534 4858087
15722 4858087 4796669 4779121 4696989 4843754 4746707 4705961 4794065 4805222 4702211 4710483 4803691
15711 4803691 4624502 4847677 5026446 4901377 4814751 4731519 4786263 4873854 4809301 4837646
15701 4837646 5046233 4998968 4865827 4654137 4872999 4845982 4829716 4903476 4883326 4977625
15691 4977625 4849448 4754063 4895814 4993770 4944877 4933399 4756522 4738293 4640491 4816600
15681 4816600 4984259 5036968 5010096 4958750 4767991 4835535 4955045 4874257 4946139 4913547 4787973
15670 4787973 4688718 4755318 4964697 4847799 4868424 4886813 4730549 4763682 4845943 4857711 4924159
15659 4924159 5002073 4867545 4980365 5013251 5100428 4947875 4875989 4807212 4802754 5004401 4954344
15648 4954344 4903045 4987728 4902408 4763422 4902755 4823157 4851079 4853591 4844792 4651196 4747987
15637 4747987 4888732 4960482 4887180 4672953 4819989 4993770 4975547 4950527 4946368 4832798
15627 4832798 4910902 5052122 4946102 4829745 4626992 4599792 4707385 4715979 4781488 4902383
15617 4902383 4936473 4872514 4754287 4942038 4934073 4812012 4902308 4906988 4889637 4968083 4888470
15606 4888470 4696081 4708478 4793193 4799557 4823531 4723128 4800152 4921666 4825030 4709665 4850125
15595 4850125 4773912 4732715 4900087 4905909 4876764 4812472 4973663 5060118 5036545 4866825 5058496
15584 5058496 5079819 4980315 4933070 4909055 4966397 4832946 4735038 4696684 4779233 4992352 4973912
15573 4973912 4814137 4950319 5158070 4967872 4892602 5022508 5029196 4908915 4855485 4901959
15563 4901959 4855968 4813453 4904061 5002650 5058339 5059160 5024550 4750804 4737668 4692864 4789514
15552 4789514 4749657 4680136 4802837 4942140 4902725 4861121 4808381 4882175 4977806 4862872 4826716
15541 4826716 4830869 4832250 4901843 4826417 4780940 4898493 4860577 4975432 4990557 4822676 4883500
15530 4883500 4892756 4859967 4838474 4992456 4897575 4821991 4920240 4920231 4908463 5064317 4903677 4939349
15518 4939349 4856932 4872682 5059135 4957581 5097050 5236993 5098599 4978082 5234203 5138196
15508 5138196 4831631 4731393 4863978 4908232 5014878 5074045 4932281 4795342 4941778 5006810
15498 5006810 5175145 5152567 5054278 5088608 5043224 4965058 5006391 5038774 5020714 4919947 5036067
15487 5036067 4934773 4828408 4886832 5005591 5165530 5044362 4936932 5010854 5027158 5235586
15477 5235586 5181760 4980751 4916447 5084108 5044953 4841603 4829577 4822630 5026260 5074927 5052266
15466 5052266 5073197 5093190 4900586 4916722 5160856 5118287 4883359 4922572 5080055 5199340
15456 5199340 5159628 5104762 5083718 5127417 5127554 4926911 5052584 5131594 5050024 5001137 4961353
15445 4961353 4766515 4839177 4877414 4821621 4991262 5060348 4741060 4614950 5038050 5018443
15435 5018443 4759873 4920398 4916724 4952508 5082044 5054603 4773941 4875126 5040639 4846204
15425 4846204 4993607 5118392 4887343 4885374 4718528 4753314 4822085 4753867 4796014 4870291 5148855
15414 5148855 5124404 4822851 4947523 4985927 4810471 4878407 4710637 4801962 4862197 4846896
15404 4846896 4955905 4957322 4924795 4908770 4850920 4836792 4901868 4998475 4908829 4892571 4830537
15393 4830537 4797839 4908746 4803643 4808539 4883446 4950779 4896791 5038836 5128855 4949863 4815789
15382 4815789 5033133 5118020 4905737 5051523 5092788 5054607 5082490 5152464 5018712 4917765
15372 4917765 4966056 5120243 5108219 5073194 4951115 4902894 4861719 4880568 4945969 4904171 4827141
15361 4827141 5023614 4946567 4906014 5044366 5136373 5040984 5085456 5084687 4897588 4828049 4766249
15350 4766249 4853884 5040049 5086638 5068345 5022534 5089784 5095913 4956687 4994985 5037394 5045523
15339 5045523 5049938 4949427 4837148 4926266 4914591 4810691 4859394 4945234 4993122 4970876 5111277
15328 5111277 5143957 5075645 4919193 4934574 4946979 4803871 4771162 4787301 4910692 4839245 5000218
15317 5000218 5066183 4903675 5043454 5051032 4859108 4866861 5059369 5117522 5018372 5108561 4897366
15306 4897366 4764713 4891361 4908258 4828339 4867144 4874499 4905661 4968255 5102415 5084324 5232021
15295 5232021 5198070 5203713 5081194 4910998 5010949 5009586 5002213 5127712 5258911 4919441 5094685
15284 5094685 5264155 5061414 4965078 4828077 4714381 5010532 5212711 5189946 5160122 5031262
15274 5031262 4946989 4883270 5114936 4987794 5091984 5366314 5174908 5144557 5045124 4880211
15264 4880211 4867811 5143382 5112826 4952385 5236211 5030846 4814215 4868497 4961190 4903444
15254 4903444 4977798 5053454 5010712 5171955 5291900 5055887 5067786 5142633 5057191 5014816 5126521
15243 5126521 5150554 5092500 5004985 4834607 4924478 5034078 4930829 4912691 5077662 5041592
15233 5041592 5076917 5145496 5092560 5099349 5202601 5112345 5026499 5215843 5293836 5154070 5072227
15222 5072227 5035531 4982717 5006335 5065866 4974172 4801175 4870649 5007482 5048017 5092510 5108009
15211 5108009 5120222 5056148 5154349 5004316 5056105 5017548 5123630 5214583 5158768 5311751 5120091
15200 5120091 5084065 5139950 5135183 4956060 4909715 4925100 4866800 5218649 5015353 4790135 4974916
15189 4974916 4936155 4908779 4948454 4999267 5007463 4979114 5074398 5082575 5102614 5091106 5131396 5161747
15177 5161747 5082587 5065498 5036106 5091207 5103174 5069252 4993662 5030293 4965629 5081622 5013810
15166 5013810 5103055 5107452 5000309 5060571 5155392 5034597 5007092 5175960 5244439 5137044 5178407
15155 5178407 5070197 4970768 5183248 5143922 5153618 5291810 5299960 5028098 5015935 5006625 4919784
$$ [...]
##END NTUPLES=NMR SPECTRUM
##END=
