##TITLE=1H_TG-2324-3
 CDCl3,8 sc, 
 2.04.2021
##JCAMPDX= 6.0         $$ Bruker NMR JCAMP-DX V2.0
##DATA TYPE= NMR SPECTRUM
##DATA CLASS= NTUPLES
##ORIGIN= UXNMR, Bruker Analytische Messtechnik GmbH
##OWNER= root
$$ XWIN-NMR		Version 3.5
$$ Fri Apr  2 10:18:05 2021 Russian Standard Time (UT+4h)  she@DPX200
##.OBSERVE FREQUENCY= 200.131506
##.OBSERVE NUCLEUS= ^1H
##.ACQUISITION MODE= SIMULTANEOUS
##.ACQUISITION SCHEME= undefined
##.AVERAGES= 8
##.DIGITISER RES= 18
##SPECTROMETER/DATA SYSTEM= spect
##.PULSE SEQUENCE= zg30
##.SOLVENT NAME= CDCl3
##.SHIFT REFERENCE= (INTERNAL, CDCl3, 0, 15.9709)
##AUDIT TRAIL= $$ (NUMBER, WHEN, WHO, WHERE, WHAT)
$$ ##TITLE= Audit trail, XWIN-NMR		Version 3.5
$$ ##JCAMPDX= 5.01
$$ ##ORIGIN= Bruker BioSpin GmbH
$$ ##OWNER= she
$$ F:/spectra/data/she/nmr/H-F/1/pdata/1/auditp.txt
$$ ##AUDIT TRAIL=  $$ (NUMBER, WHEN, WHO, WHERE, WHAT)
(   1,<2021-04-02 10:16:17.21 +0400>,<she>,<DPX200>,
      <created by zg, POWCHK disabled, PULCHK disabled
       configuration hash MD5:
       00 E9 B6 7A A2 85 ED C7 34 08 36 98 17 FE 4E 26
       data hash MD5: 16K
       D3 6B 8A B2 E0 36 57 22 B0 81 BB C9 07 F2 2D 11>)
(   2,<2021-04-02 10:16:31.87 +0400>,<she>,<DPX200>,
      <Start of raw data processing
       efp BC_mod = 2 LB = 0.24 FT_mod = 6 PKNL = 1 PHC0 = -11126.09 PHC1 = 17.60091 SI = 16K 
       data hash MD5: 16K
       8C 63 54 8E DE BC F8 AC 8C 2B C2 A2 73 4D 19 80>)
(   3,<2021-04-02 10:16:50.81 +0400>,<she>,<DPX200>,
      <pk PHC0 = -0.8151834 PHC1 = 0.6 
       data hash MD5: 16K
       BB 85 14 1B 40 B0 0F 63 BE 3E CE 1E 68 CF 4D B1>)
(   4,<2021-04-02 10:16:54.65 +0400>,<she>,<DPX200>,
      <abs ABSG = 5 
       data hash MD5: 16K
       5E 5A BE F4 43 3A CD 89 4E CC 63 0B F0 2E E1 40>)
$$ ##END=
$$ 
$$ hash MD5
$$ 2E A6 17 E5 21 47 A0 7E 86 21 40 33 C2 1F 4D CF
##$RELAX= 
##$RELAX= 
##$RELAX= 
##$RELAX= 
##$RELAX= 
##$RELAX= 
$$ Bruker specific parameters
$$ --------------------------
##$DU= <F:/spectra>
##$EXPNO= 1
##$NAME= <H-F>
##$PROCNO= 1
##$TYPE= <nmr>
##$USER= <she>
##$AMP= (0..31)
100 100 100 100 100 100 100 100 100 100 100 100 100 100 100 100 100 100 
100 100 100 100 100 100 100 100 100 100 100 100 100 100 
##$AQSEQ= 0
##$AQ_mod= 1
##$AUNM= <au_zg>
##$AUTOPOS= <>
##$BF1= 200.13
##$BF2= 200.13
##$BF3= 200.13
##$BF4= 200.13
##$BF5= 200.13
##$BF6= 200.13
##$BF7= 200.13
##$BF8= 200.13
##$BYTORDA= 1
##$CFDGTYP= 0
##$CFRGTYP= 5
##$CHEMSTR= <none>
##$CNST= (0..31)
1 1 145 1 1 1 1 1 1 1 1 1 1 1 1 1 1 1 1 1 1 1 1 1 1 1 1 1 1 1 1 1 
##$CPDPRG= <>
##$CPDPRG1= <>
##$CPDPRG2= <>
##$CPDPRG3= <>
##$CPDPRG4= <mlev>
##$CPDPRG5= <mlev>
##$CPDPRG6= <mlev>
##$CPDPRG7= <mlev>
##$CPDPRG8= <mlev>
##$CPDPRGB= <>
##$CPDPRGT= <>
##$D= (0..31)
0 1.2 0 0 0 0 0 0 0 0.06 0 0.03 0 0 0 0 0.0002 0 0 0 0 0 0 0 0 0 0 0 0 
0 0 0 
##$DATE= 1617344176
##$DBL= (0..7)
120 120 120 120 120 120 120 120 
##$DBP= (0..7)
150 150 150 150 150 150 150 150 
##$DBP07= 0
##$DBPNAM0= <>
##$DBPNAM1= <>
##$DBPNAM2= <>
##$DBPNAM3= <>
##$DBPNAM4= <>
$$ [...]
##$SUBNAM3= <"">
##$SUBNAM4= <"">
##$SUBNAM5= <"">
##$SUBNAM6= <"">
##$SUBNAM7= <"">
##$SUBNAM8= <"">
##$SUBNAM9= <"">
##$SW= 16.9725357007746
##$SWIBOX= (0..15)
0 0 2 0 0 0 0 0 0 0 0 0 0 0 0 0 
##$SW_h= 3396.73913043478
##$TD= 16384
##$TD0= 1
##$TE= 0
##$TE2= 300
##$TE3= 300
##$TEG= 300
##$TL= (0..7)
0 120 120 120 120 120 120 120 
##$TP= (0..7)
150 150 150 150 150 150 150 150 
##$TP07= 0
##$TPNAME0= <>
##$TPNAME1= <>
##$TPNAME2= <>
##$TPNAME3= <>
##$TPNAME4= <>
##$TPNAME5= <>
##$TPNAME6= <>
##$TPNAME7= <>
##$TPOAL= (0..7)
0.5 0.5 0.5 0.5 0.5 0.5 0.5 0.5 
##$TPOFFS= (0..7)
0 0 0 0 0 0 0 0 
##$TUNHIN= 0
##$TUNHOUT= 0
##$TUNXOUT= 0
##$USERA1= <user>
##$USERA2= <user>
##$USERA3= <user>
##$USERA4= <user>
##$USERA5= <user>
##$V9= 5
##$VALIST= <valist>
##$VCLIST= <CCCCCCCCCCCCCCC>
##$VD= 0
##$VDLIST= <DDDDDDDDDDDDDDD>
##$VPLIST= <PPPPPPPPPPPPPPP>
##$VTLIST= <TTTTTTTTTTTTTTT>
##$WBST= 1024
##$WBSW= 4
##$XGAIN= (0..3)
0 0 0 0 
##$XL= 0
##$YL= 0
##$YMAX_a= 149364
##$YMIN_a= -108166
##$ZGOPTNS= <>
##$ZL1= 120
##$ZL2= 120
##$ZL3= 120
##$ZL4= 120
##$ABSF1= 15.97713
##$ABSF2= -0.995532
##$ABSG= 5
##$ABSL= 3
##$ALPHA= 0
##$AQORDER= 0
##$ASSFAC= 0
##$ASSFACI= 0
##$ASSFACX= 0
##$ASSWID= 0
##$AUNMP= <proc_1d>
##$AZFE= 0.1
##$AZFW= 0.1
##$BCFW= 0
##$BC_mod= 2
##$BYTORDP= 0
##$COROFFS= 0
##$CY= -3
##$DATMOD= 1
##$DC= 0
##$DFILT= <>
##$DTYPP= 0
##$F1P= 0
##$F2P= 0
##$FCOR= 1
##$FTSIZE= 16384
##$FT_mod= 6
##$GAMMA= 0
##$GB= 0
##$INTBC= 1
##$INTSCL= 2.992141e-10
##$ISEN= 128
##$LB= 0.24
##$LEV0= 0
##$LPBIN= 0
##$MAXI= 10000
##$MC2= 0
##$MEAN= 0
##$ME_mod= 0
##$MI= 1.114404
##$NCOEF= 0
##$NC_proc= -9
##$NLEV= 6
##$NOISF1= 3.799351
##$NOISF2= 2.8
##$NSP= 0
##$NTH_PI= 0
##$NZP= 0
##$OFFSET= 15.97092
##$PC= 1
##$PHC0= -11126.91
##$PHC1= 18.20091
##$PH_mod= 1
##$PKNL= yes
##$PPARMOD= 0
##$PSCAL= 0
##$PSIGN= 0
##$REVERSE= no
##$SF= 200.130008109031
##$SI= 16384
##$SIGF1= 3
##$SIGF2= 2
##$SINO= 5.538805
##$SIOLD= 16384
##$SREGLST= <1H.CDCl3>
##$SSB= 0
##$STSI= 16384
##$STSR= 0
##$SW_p= 3396.73913043479
##$SYMM= 0
##$S_DEV= 0
##$TDeff= 16384
##$TDoff= 0
##$TI= <>
##$TILT= no
##$TM1= 0
##$TM2= 0
##$TOPLEV= 0
##$USERP1= <user>
##$USERP2= <user>
##$USERP3= <user>
##$USERP4= <user>
##$USERP5= <user>
##$WDW= 1
##$XDIM= 16384
##$YMAX_p= 463580844
##$YMIN_p= -2551520
$$ End of Bruker specific parameters
$$ ---------------------------------
##NTUPLES= NMR SPECTRUM
##VAR_NAME=  FREQUENCY,     SPECTRUM/REAL,   SPECTRUM/IMAG
##SYMBOL=    X,             R,               I
##VAR_TYPE=  INDEPENDENT,   DEPENDENT,       DEPENDENT
##VAR_FORM=  AFFN,          ASDF,            ASDF
##VAR_DIM=   16384,         16384,           16384
##UNITS=     HZ,            ARBITRARY UNITS, ARBITRARY UNITS
##FACTOR=    0.207333158178282, 1,           1
##FIRST=     3196.26027087183, 0,            0
##LAST=      -200.478859562964, 0,           0
##MIN=       -200.478859562964, -2551520,    0
##MAX=       3196.26027087183, 463580844,    0
$$ Real data points
##PAGE= N=1
##DATA TABLE= (X++(R..R)), XYDATA
$$ [...]
6147F232942K25854J00735O11472k48428n0748l42011j516O19120l45578L89695
6137G191537K46199o44764L89199j36581k13469n69337o3576Q89969m36363o82495
6127E970319K07643K95880M28963J45698P7490q44877j28472M33171L22776K53854
6117G162445Q2006n65560K99131P1656M67683o03968n51295l9038O07685j9962
6107F910783o92009N73704L53192l05684K86137o5747q64577O80655M409O301
6097F887164L44520n18621n38611m67927l85952K89408R56656r3097R113m28026
6087F054627N18279M18199n21471K01496J53995K61702m08035l87279J058462
6078G349975P223r95586m27165N68600P42633k59200J10604j42993J14321K7447
$$ plain form
6147 6232942 6458796 6559531 7171003 6922575 6871827 6529816 6528300 7147420 6801842 7191537
6137 7191537 7437736 6792972 7182171 7045590 6832121 6262784 6199208 7089177 6652814 5970319
6127 5970319 6177962 6473842 6902805 7048503 7125993 6281116 6152644 6585815 6908591 7162445
6117 7162445 7244451 6678891 6978022 7049678 7517361 6913393 6362098 6323060 6930745 6910783
6107 6910783 6218774 6792478 7145670 6839986 7126123 7060376 6195799 6876454 6880863 6887164
6097 6887164 7231684 6713063 6174452 5706525 5320573 5609981 6566637 6473540 6482653 6054627
6087 6054627 6572906 6991105 6469634 6671130 6825125 7086827 6678792 6291513 7349975
6078 7349975 7357198 6361612 5934447 6503047 7245680 6986480 7097084 6954091 7068412 7095859
6068G095859j53514m38741o37150n93084J077518o00773n03617P32414M05736
6059F384648J5536N59973k29073N619l61888k19812L8118l51908J21957Q5451
6049F048621l80768N24777M253P9320O25302k90640k90986m47290M40686L63506
6039F676781l99059l41220L72089N50862q9486N83185j25113j02014p26804n7265
6029F341956n2557L06569l43845l36347K31685K70863l16519k51419k91297n84831
6019D974258k33306P92044k27061l6131M2468n13854O28957J43516K22531j89215
6009E604207K32257k29318J52531K40357n0142k24714J10758K33357l67038l21674
5999E380581M34822m89666l0572k74216P5608o01033l16829P42970l3709j68159
$$ plain form
6068 7095859 6942345 6503604 5866454 5273370 6350888 5750115 5246498 5978912 6384648
6059 6384648 6400184 6960157 6731084 6736703 6374815 6155003 6193121 5841213 5963170 6048621
6049 6048621 5667853 6192630 6196883 6276203 6901505 6610865 6319879 5872589 6313275 6676781
6039 6676781 6277722 5936502 6308591 6859453 6769967 7353152 7228039 7126025 6399221 6341956
6029 6341956 6289399 6595968 6252123 5915776 6147461 6418324 6101805 5850386 5559089 4974258
6019 4974258 4740952 5532996 5305935 5269804 5312272 4798418 5427375 5570891 5793422 5604207
6009 5604207 5836464 5607146 5759677 6000034 5949892 5725178 5835936 6069293 5702255 5380581
5999 5380581 5815403 5325737 5295165 5020949 5096557 4495524 4178695 4921665 4887956 4719797
5989D719797L88829K1116M06026k14895M97862r17121l49789P74774k58304l36393
5979D731902K39104L03807o09809J09322l7670k14551M65571p25891n33713J043946
5969D772018J02380L13417Q5840k95713J33264J31644K0324o22822r8023k27352
5959D314977K63004O14405K15992j204213R6617L05156m96204J11920O93266j24226
5949D790694k51219n75600J65422J54330K33844j26963N75234m17553j99553l78619
5939C970017K67800J004038j86350m28618O49957m17692o48953l88825o98779
5930C122595P77112N9729K3444K01200J63251j20730m49519M09386J52369l39753
5920C999084M73227l33370L92419k98917K33868K92839o98985J43545Q6503J14717
$$ plain form
5989 4719797 5108626 5129742 5535768 5320873 5818735 4901614 4551825 5326599 5068295 4731902
5979 4731902 4971006 5274813 4665004 4774326 4736656 4522105 4987676 4261785 3728072 4772018
5969 4772018 4874398 5187815 5273655 4977942 5111206 5242850 5263174 4640352 4542329 4314977
5959 4314977 4577981 5192386 5408378 4204165 4300782 4605938 4109734 4221654 4914920 4790694
5949 4790694 4539475 3963875 4129297 4283627 4517471 4390508 4965742 4548189 4348636 3970017
5939 3970017 4237817 5241855 5055505 4626887 5276844 4859152 4210199 3821374 3122595
5930 3122595 3899707 3959436 3982880 4184080 4347331 4226601 3777082 4186468 4338837 3999084
5920 3999084 4472311 4138941 4531360 4232443 4466311 4759150 4060165 4203710 4290213 4404930
5910D404930J68684q32823M71488J80942K06336k11501k70671l19476R3478k53622
5900C637765O47158O26343l56831q61632k5219k56306N26192L77330M31837l78834
5890D367803n35307k97810K68918k18716j90470J48740n0554J460182p0493n13599
5880D368694N7212m9638n62861m9883m84692O8062j86543J86643R60682l97994
5870C909682J68770q21249N85289K32265J21015M42716l33316n41511k33543L01364
5860C831482N24686k12298l49411k384j01624q2877j31110L8729K79654P7328
5850C872175j79527J59881j49358J28621M91175Q4285k28275l44672J05224N66359
5840D505888r33663m52157k48060O60992N38505n66618P05043n13878j76831M68598
$$ plain form
5910 4404930 4573614 3740791 4212279 4393221 4599557 4388056 4117385 3797909 3891387 3637765
5900 3637765 4284923 4911266 4554435 3692803 3667584 3411278 3937470 4314800 4746637 4367803
5890 4367803 3832496 3534686 3803604 3584888 3394418 3543158 3492604 4952786 4882293 4368694
5880 4368694 4425906 4376268 3813407 3763524 3278832 3346894 3160351 3346994 4307676 3909682
5870 3909682 4078452 3257203 3842492 4074757 4195772 4638488 4305172 3763661 3530118 3831482
5860 3831482 4356168 4143870 3794459 3792075 3690451 3607574 3476464 3515193 3794847 3872175
5850 3872175 3692648 3852529 3703171 3831792 4322967 4407252 4178977 3834305 3939529 4505888
5840 4505888 3572225 3120068 2872008 3533000 4071505 3504887 4209930 3696052 3519221 3987819
5830C987819O7162j59284r18529r7314q9844k10826M45741K41876J44580O93428
5820D104809r16170m0N80784n21114k04247K85875O09091L0348k44306m78962
5810C246068k02340M6502p0325j5855O77308j80234j54841n07304p83473Q26807
5800B882313k0769J87693M8709J93342p1472r6090n1378J3834o64626l59923O77304
5789B738937k10737J1356K5139o4570M72844M05431M36089k66723n06903j83141
5779B857722j96841n15394K1769K01495j59518p79050P93959M15823j61339K79174
5769B757800M83914p17402O75805J7837l37143P4686M48635l14344j8060q42595
5759B229133Q08620m42283j125492J382607K94150N04504m61819k94872j60453
$$ plain form
5830 3987819 4054981 3895697 2977168 2879854 2790010 2579184 3024925 3266801 3411381 4104809
5820 4104809 3188639 3188599 3769383 3248269 3044022 3329897 3938988 3969336 3725030 3246068
5810 3246068 3043728 3090230 3019905 3004050 3681358 3501124 3346283 2838979 2055506 2882313
5800 2882313 2861544 3049237 3097946 3291288 3219816 3123726 3072348 3086182 2421556 2061633 2738937
5789 2738937 2528200 2539556 2564695 2500125 2972969 3378400 3814489 3547766 3040863 2857722
5779 2857722 2660881 2145487 2167256 2368751 2209233 1430183 2224142 2639965 2478626 2757800
5769 2757800 3241714 2524312 3200117 3217954 2880811 2955497 3404132 3089788 3071728 2229133
5759 2229133 3037753 2595470 1469978 2852585 3146735 3651239 3189420 2894548 2734095
5750B734095K75857j18436J54525k10117L534k39198P25672o44834n56784M9780
5740B174094N81079p8162k97526j0823r23953K30041O8105j14549J01924p6306
5730A653924J36085M10358K9755k09440J59331r8658O58204J34103j03277n14320
5720B256065M62697L94922k96392j33815n19326K45682p1221K31537K22342M9543
5710B842034L62624J64215k15546m40443K86804J2723l0873j81912l99490m5890
5700B354246O11903l67559J64614R51101p32038J49936J87899p62992L37969N3421
5690B948500M3954M33044L05308k04068l78981O66389J67930L4342k55315l81308
5680C379795n33659N89176l08602K99260L77757k32833Q44559J72041K95333M1907
$$ plain form
5750 2734095 3009952 2891516 3046041 2835924 2839458 2600260 3325932 2681098 2124314 2174094
5740 2174094 2755173 2677011 2379485 2368662 1444709 1674750 1742855 1628306 1730230 1653924
5730 1653924 1790009 2200367 2230122 2020682 2180013 2081355 2739559 2873662 2770385 2256065
5720 2256065 2718762 3113684 2817292 2683477 2164151 2409833 2338612 2570149 2792491 2842034
5710 2842034 3204658 3368873 3153327 2712884 2999688 3012411 2981538 2799626 2400136 2354246
5700 2354246 2966149 2598590 2763204 3714305 2982267 3132203 3320102 2557110 2895079 2948500
5690 2948500 2992454 3425498 3730806 3526738 3147757 3814146 3982076 4016418 3761103 3379795
5680 3379795 2846136 3435312 3126710 3425970 3803727 3570894 4415453 4587494 4882827 4924734
5670D924734N21999k74593k89763l8218r16317p02328p53773O67153L73829o15716
5660B897007k73209P58796L58216n27165J13812k6747p83501q9892J103060J96787
5650C727164j19876m20491n85744k19528M86980M81059Q37381k94782p63450k0091
5640C108622L07533Q13904k37590p04458M95518j32740N8119K46096N60902o4995
5630D450911N39851k52052m2701J91128n45649P36350q6648O2209K91164q2116
5620E262447j92544J62144M82075l30180j43724P4700k52562m832q23210j00682
5610D133632N35426o47395O68057k63813M58945K53641p84830k94766N32380m6345
5600D544932j141024m77182K04114P31755m50633j9735m89623Q359K29197k43124
$$ plain form
5670 4924734 5446733 5172140 4882377 4844159 3927842 3225514 2471741 3138894 3512723 2897007
5660 2897007 2623798 3382594 3740810 3213645 3327457 3300710 2517209 2427317 3530377 3727164
5650 3727164 3607288 3186797 2601053 2381525 2868505 3349564 4186945 3892163 3128713 3108622
5640 3108622 3416155 4230059 3992469 3288011 3783529 3650789 3708908 3955004 4515906 4450911
5630 4450911 4990762 4738710 4696009 4887137 4341488 5077838 4991190 5053399 5344563 5262447
5620 5262447 5069903 5232047 5714122 5383942 5240218 5314918 5062356 5057524 4234314 4133632
5610 4133632 4669058 4021663 4689720 4425907 4884852 5138493 4353663 4058897 4591277 4544932
5600 4544932 3403908 2926726 3130840 3862595 3411962 3392227 2902604 2910963 3140160 2897036
5590B897036r36148m1162R53078J01070K54459R69967m42804k72652j79826J98590
5580C501608k40915l25013j71878L46316Q5918M20077q3062R97487j20547n97485
5570C812506o83044N01963L11766N06717p4842m64066L56214l02219M57821Q7144
5560D509960K95410r88640L56006J25550O8897P51070L0269m85358R7299n2274
5550D708189R29952l77627m60482J010672P32025j097544j28165J83402m25254
5541E075168M54918J06107l06607j39668L32210M36094k67538L65585O07682o1219
5531F602732j34258J93587M08832N90258l41397n13254O30911o62577J03093N34993
5521G412920K63273j94748L16017L81680p99406K13381N41361P61482K03804N44652
$$ plain form
5590 2897036 1960888 1919726 2872804 2973874 3228333 4198300 3755496 3482844 3303018 3501608
5580 3501608 3260693 2935680 2763802 3110118 3196036 3616113 3533051 4530538 4409991 3812506
5570 3812506 3129462 3631425 3943191 4449908 4375066 3911000 4267214 3964995 4422816 4509960
5560 4509960 4805370 3816730 4172736 4298286 4367183 5118253 5148522 4663164 4760463 4708189
5550 4708189 5638141 5260514 4800032 5810704 6542729 5445185 5317020 5500422 5075168
5541 5075168 5530086 5636193 5329586 5189918 5522128 5958222 5690684 6056269 6663951 6602732
5531 6602732 6468474 6662061 7070893 7661151 7319754 6806500 7437411 6774834 6877927 7412920
5521 7412920 7676193 7481445 7797462 8179142 7379736 7593117 8134478 8895960 9099764 9644416
5511I644416P49850o09305m02053M40060M99251O84334J061577K34277k05539
5502A2096868O81463M70200P03532O50622p32952Q23431o44885P67513R55119
5493A5770911p2966N81577N63036M97487Q12056M27172M80192K70287P75092O26506
5483B0731350R38676J571843J24396J698542R74595J203149J949645R40998J039131
5474C1172325K101155K669360K744005L045430K882270L157401L425651L480832
5466E4678429K835380L022491M424342M036146M493573L034618K938160K461198
5458H1924337J096404J77687j441646k730082m616288m173911m470438n101651
5450F0664412m635173l971013l385529l298539l322458l237309j860090k620411
$$ plain form
5511 9644416 10394266 9784961 9382908 9822968 10322219 11006553 12068130 12302407 12096868
5502 12096868 12778331 13248531 13952063 14602685 13869733 14693164 14048279 14815792 15770911
5493 15770911 15697945 16279522 16842558 17340045 18152101 18579273 19059465 19329752 20104844 20731350
5483 20731350 21670026 23241869 23366265 25064807 26039402 27242551 29192196 30133194 31172325
5474 31172325 33273480 35942840 38686845 41732275 44614545 47771946 51197597 54678429
5466 54678429 57513809 60536300 64960642 68996788 73490361 76524979 79463139 81924337
5458 81924337 83020741 83198428 81756782 79026700 74410412 70236501 65766063 60664412
5450 60664412 56029239 52058226 48672697 45374158 42051700 38814391 36954301 34333890
5442C4333890j965072j662939k515153k449204k177055j249892R0861j005425
5434B1400011r56636j440140j593592n89734n97141m65117m8631r1546r93226
5425A4624248o75242k93002j400425j97194L68908q90677o75851m41153N67117
5416A0986729L04099j84490J40760k51187l82119m4503k38476n15473l22389j86408
5406I306543j341239O02545p40713p70961K77001J0225O0892n97453P54374m07038
5396G154176j18463J11984R3072k35677o17807p0571k93398k84729n41380L87745
5386E584952N15729K52149j06880o15125j139820k9083k77622K47162l93835K35468
5376D273095L73300J1015o54589j96808J93226L35387l65811p52808Q43609M27048
$$ plain form
5442 34333890 32368818 30705879 28190726 25741522 23564467 22314575 22405436 21400011
5434 21400011 20443375 19003235 17409643 16819909 16222768 15757651 15709020 15617474 14624248
5425 14624248 13949006 13656004 12255579 12058385 12427293 11536616 10860765 10419612 10986729
5416 10986729 11290828 11106338 11247098 10995911 10613792 10569289 10330813 9815340 9492951 9306543
5406 9306543 7965304 8567849 7827136 7056175 7333176 7343401 7404293 6806840 7561214 7154176
5396 7154176 7035713 7147697 7240769 7005092 6387285 6316714 6023316 5738587 5197207 5584952
5386 5584952 6100681 6352830 6245950 5630825 4491005 4461922 4184300 4431462 4037627 4273095
5376 4273095 4646395 4657410 4002821 3806013 3999239 4334626 3968815 3216007 4059616 4486664
5366D486664K04031o18744J65693l1181l83333M14215J92424p24417L14176o0340
5356C959188o45046m80631L86643K92095j12815n43608L53900j66825P2531k02405
5346B913027j70619P07638O00897k86942J78385o79937q76261p805q4377R3040
5336B387046q926M93210l80439m36233n02016N99652P23121m11262m64410J26452
5326B126195N59359O99679l85052n07997N12744j61530r67234n88789R53632j24600
5316B116407J8632k74587J9309P28884J02892m92020M58645J90293r37459M62568
5306B393564q075j60761M26305r6435L63725N92222n13685K19438j153576l56484
5296A706238j18731o6892N96881J6642j88782M49408K03369J43915J21683j90467
$$ plain form
5366 4486664 4690695 4071951 4237644 4206463 3823130 4237345 4429769 3705352 4019528 3959188
5356 3959188 3314142 2833511 3220154 3512249 3399434 2855826 3209726 3042901 3115432 2913027
5346 2913027 2742408 3450046 4050943 3764001 3942386 3262449 2386188 2378383 2294006 2387046
5336 2387046 2378120 2871330 2490891 2054658 1552642 2152294 2875415 2464153 1999743 2126195
5326 2126195 2685554 3385233 3000181 2492184 3004928 2843398 1876164 1287375 2241007 2116407
5316 2116407 2135039 1860452 1879761 2608645 2711537 2219517 2678162 2868455 1930996 2393564
5306 2393564 2385489 2224728 2651033 2554598 2918323 3510545 2996860 3216298 2062722 1706238
5296 1706238 1587507 1520615 2117496 2134138 1945356 2394764 2598133 2742048 2863731 2673264
5286B673264J98807J74616k85765M2028M58218M8398j08421j02491j41104l50361
5276B607189m48728M95553k53305L05558j05518J51573r3031k7100J16065n35269
5266B212987M45524O9050j049048P64759P13575j187012M6759L24661k73746l23400
5256A744109M75003N54352m95670m91046Q73084L57084k36536m24236n3352J84183
5246B486975j89340o32987M07057k02112J43781j08766k41708J92570j790M36594
5236B290274k7346r3883n41803l17321R0401O70200n18643k39808L27290N56967
5226B196328k14572n57680k88155J53963L20243K71241K86995m47618J37346n97346
5216A260745M61369J70145J88293O97258o78322m54664L17920N01726k12407P29647
$$ plain form
5286 2673264 2872071 3046687 2760922 2802950 3261168 3309566 3201145 3098654 2957550 2607189
5276 2607189 2158461 2654014 2400709 2706267 2600749 2752322 2659291 2632191 2748256 2212987
5266 2212987 2658511 2727561 1678513 2443272 3156847 1969835 2016594 2341255 2067509 1744109
5256 1744109 2219112 2773464 2277794 1786748 2659832 3016916 2780380 2356144 2302792 2486975
5246 2486975 2297635 1664648 2071705 1869593 2013374 1904608 1662900 1855470 1853680 2290274
5236 2290274 2262928 2169045 1627242 1309921 1400322 2070522 1551879 1312071 1639361 2196328
5226 2196328 1981756 1424076 1135921 1289884 1610127 1881368 2168363 1720745 1858091 1260745
5216 1260745 1722114 1892259 2080552 2777810 2099488 1644824 1962744 2464470 2252063 2981710
5206B981710r653M12549M06237p81993m12610k5711m58922J12282K37097j5424
5196B445562K54869L51950K37318r54624L26396O33275K69841m54114l97183q57678
5186A855612M19189J94108Q70749p401r0501J55417m27528j34844j39206P5115
5176B770710M2666M71917l21004q2580M51347Q476O18396R3723l72266J98136
5166C879521l76748Q00895L84772q59295j77209P0177N52475K5221n11084n1402
5156C737323L26830P20512J2800l56852J44615k87178p12959k9725Q30651M57889
5146D843906Q54858n44995m85630K32063M63665N22606l06541q18954O5162L82976
5136E209116j22402L05481P21116o7139J037642J54879l09642K9255K3647j08814
$$ plain form
5206 2981710 2972057 3384606 3790843 3008850 2596240 2570529 2111607 2223889 2460986 2445562
5196 2445562 2700431 3052381 3289699 2335075 2661471 3294746 3564587 3110473 2713290 1855612
5186 1855612 2274801 2468909 3339658 3332257 3241756 3397173 2969645 2834801 2695595 2770710
5176 2770710 2813376 3285293 2964289 2881709 3333056 3341532 3959928 4053651 3681385 3879521
5166 3879521 3502773 4303668 4688440 3829145 3651936 3722113 4274588 4299809 3788725 3737323
5156 3737323 4064153 4784665 4797465 4440613 4585228 4298050 3585091 3555366 4386017 4843906
5146 4843906 5698764 5153769 4668139 4900202 5363867 5886473 5579932 4760978 4826140 5209116
5136 5209116 5086714 5392195 6113311 6046172 7083814 7238693 6929051 6958306 6981953 6873139
5126F873139p44034N34312N11176N39969m30768J38781J58533O45177l7269l1074
5116H157942L70958O55692q0122p57935L9507J253807O62988Q6192j023876j59835
5106I205318N94408K56548L74740L47193J96959M49978k3904l652k12798O6264
5096A1251054K64520L99229k0781N07266J88924R4412p1517q61630K69233M63500
5086A2484210K90248K48829M46905m7662k14728k69810o3420m68384j1561j2137
5076A2382490N83455L30074l72167R4487p64191O64883L16487o30341k88209O71470
5066A2988438L71296N31927r833m05888M96064k29035N02332o92572K39923l11878
5056A3480774J44561l39821J76876m76235q14137K76715K97080K28548o78189
$$ plain form
5126 6873139 6129105 6663417 7174593 7714562 7283794 7422575 7581108 8226285 8189016 8157942
5116 8157942 8528900 9184592 9104470 8346535 8386042 9639849 10302837 10389029 9365153 9205318
5106 9205318 9799726 10056274 10431014 10778207 10975166 11425144 11401240 11397588 11184790 11251054
5096 11251054 11515574 11914803 11894022 12401288 12590212 12684624 12613107 11751477 12020710 12484210
5086 12484210 12774458 13023287 13470192 13422530 13207802 12937992 12874572 12406188 12394627 12382490
5076 12382490 12965945 13296019 12923852 13018339 12254148 12919031 13235518 12605177 12316968 12988438
5066 12988438 13359734 13891661 13881828 13475940 13972004 13742969 14245301 13552729 13792652 13480774
5056 13480774 13625335 13285514 13462390 12986155 12172018 12448733 12745813 12974361 12296172
5047A2296172k35553l66139L41911J42500j73383l68344M78291m1255m51140m21431
5037A1201629J55577k84407m5677Q7996K0464j81676n91023M4154L8782k74230
5027A0171589M20640L6814n68910k43783o11552M79980Q0859o78439j75014n10250
5017H401934K48920L11954o35472l81543k79350N1107L82715k26574K05308M2020
5007H121019q1735M9086n72915l04839O73926k83587j57227L97259m40475r9298
4997G301214m16806K68188K1439L54297K40017J37512j21279l9272k78280l36424
4987G130606K34287l24909l67954J19892k07011N85513m70863m73669R2330l07176
4977F011046l29761R9845P89714J91484K92225l02046j83531K19122n50507K33342
$$ plain form
5047 12296172 12060619 11694480 12036391 12178891 12005508 11637164 12115455 12074200 11623060 11201629
5037 11201629 11357206 11072799 11027122 11115118 11135582 10953906 10362883 10407037 10445819 10171589
5027 10171589 10592229 10629043 10060133 9816350 9204798 9684778 9765637 9087198 8912184 8401934
5017 8401934 8650854 8962808 8327336 7945793 7666443 7717550 8100265 7873691 8078999 8121019
5007 8121019 8039284 8088370 7515455 7210616 7884542 7600955 7443728 7840987 7400512 7301214
4997 7301214 6884408 7152596 7174035 7528332 7768349 7905861 7784582 7745310 7467030 7130606
4987 7130606 7364893 7039984 6672030 6791922 6584911 7170424 6699561 6225892 6318222 6011046
4977 6011046 5681285 5781130 6570844 6762328 7054553 6752507 6568976 6788098 6237591 6470933
4967F470933k688m50605J49291k5331j38810k0959j50528N8707k4592L32209j8740
4956F178887o08804R45561J138032r01113m8933k22218n61660L62583j13875l69395
4946E799065J2843N57333j35410M17187M51901l95853l25770m63241j05064n6334
4936E756657J62659P16830q746m64216p7424L23051k54249Q33503l4118k99336
4926F654611m37080L97820L07044P3078K26775n51221M8166j20710J27625m21673
4916F304435M18963J142232k07965m16907R44919K77368m62858k32381P67265
4907H535071M92716o81826j33718R1339j26863l50440N43574N60029M76101K03518
4897I609501J14286l53955k94108Q8437J65835L19184P49460j56902O951R1494
$$ plain form
4967 6470933 6468245 6017640 6166931 6141600 6002790 5981831 5831303 5890010 5865418 6197627 6178887
4956 6178887 5570083 6515644 7653676 6752563 6703630 6481412 5919752 6282335 6168460 5799065
4946 5799065 5811908 6369241 6233831 6651018 7102919 6707066 6381296 5918055 5812991 5756657
4936 5756657 5919316 6636146 6627400 6163184 6085760 6408811 6154562 6988065 6953947 6654611
4926 6654611 6217531 6615351 6922395 6995473 7222248 6671027 6719193 6598483 6726108 6304435
4916 6304435 6723398 7865630 7657665 7240758 8185677 8463045 8000187 7767806 8535071
4907 8535071 9027787 8345961 8212243 8303582 8176719 7826279 8369853 8929882 9405983 9609501
4897 9609501 9723787 9369832 9075724 9164161 9329996 9649180 10398640 10241738 10248689 10340183
4887A0340183J09913L92687o3233J35786k07779O24439L01263o22738L67829R10907
4877A2289257N10558k06427L4345N02k13737J018360J21454p75782l10470M01388
4867A2869448M53149L70161K21636P68348Q12327N63266N33707m99162m02883
4858A5689997O10879K16992Q94478K34607K66882J065909O46837K40762J260489
4849B1127832Q01413R76632R21273K17974j45666J286881J540194P90155J238193
4840B8754881R06961J473195J733937J128049J202937J966296J268464K276662
4832D0711382K601783K613396J677945J688940L215233L346825K286391L173387
4824F1315282K999110K620762K657214K992960L230542K242550J810678J224289
$$ plain form
4887 10340183 10450096 10842783 10779550 10915336 10707557 11331996 11633259 11010521 11378350 12289257
4877 12289257 12799815 12593388 12627733 12628235 12414498 13432858 13554312 12778530 12468060 12869448
4867 12869448 13322597 13692758 13914394 14682742 15495069 16058335 16592042 16092880 15689997
4858 15689997 16300876 16517868 17412346 17646953 17913835 18979744 19626581 19867343 21127832
4849 21127832 21929245 22905877 23827150 24045124 23899458 25186339 26726533 27516688 28754881
4840 28754881 29661842 31135037 32868974 33997023 35199960 37166256 38434720 40711382
4832 40711382 43313165 45926561 47604506 49293446 52508679 55855504 58141895 61315282
4824 61315282 64314392 66935154 69592368 72585328 75815870 78058420 79869098 81093387
4816H1093387O29183j52349j737700k304628k661798l976466m448452m080882
4808F2360295l966487m115607k944294k159731k788343k143731j579266k632021
4800D0030815k783575j674016q97785p23603j240922j109287p03718k61046n19509
4791C0117354j241987m28976j97351k06804p2196q61635j369885k29468n93375
4782B4915677q38781n02795k55446p69768j086070J29977q46555o7708q9911m32424
4772B0156196j731705j85635n4321o96786m34260O02053q61059n43192K5120K18998
4762A6495409m6775j219621r0103j3282J61746l90254o28854q8895O42948k65766
4752A4556553k71457n28932l40632k57418j21502j22840K47167j11815r6585l08905
$$ plain form
4816 81093387 81722570 81570221 79832521 77527893 74866095 70889629 66441177 62360295
4808 62360295 58393808 54278201 51333907 49174176 46385833 44242102 42662836 40030815
4800 40030815 37247240 35573224 34675439 33951836 32710914 31601627 30897909 30636863 30117354
4791 30117354 28875367 28446391 28249040 28042236 27970040 27108405 25738520 25509052 24915677
4782 24915677 24076896 23574101 23318655 22548887 21462817 21592794 20746239 20678531 20588620 20156196
4772 20156196 18424491 18238856 18184535 17487749 17053489 17655542 16794483 16251291 16276411 16495409
4762 16495409 16448634 15229013 15138910 15125628 15287374 14897120 14268266 14179371 14822319 14556553
4752 14556553 14285096 13756164 13415532 13158114 13036612 12913772 13160939 13049124 12952539 12643634
4742A2643634k25066J78713R1955m06901j31612l62268M4791J5150j43133m80797
4732A1224466K13572j78501J34657j62188m817n29881k78983o91719L532L68864
4722A0099002l1381j58003k62165L69281Q7650j27740p65833n52743L96339j26449
4712H927958l6757J073739o15550K94838m44565p3398N19333n78164J6925N83058
4702I667417j96623r04451p2498J67053K1817l53309q4460q92739K75552M17403
4692H045162l55358N5448j2238Q1085m1627L15R9569Q8768L06589q1786m65441
4681G720486P42906P5794m51921k4425O21279K64571j235861l02554o260o13380
4671F790635N29761L57886N34501J97952j73630m10845o55712R1193P47802J19866
$$ plain form
4742 12643634 12418568 12597281 12689236 12282335 12150723 11788455 11833246 11848396 11705263 11224466
4732 11224466 11438038 11259537 11394194 11232006 11227189 10697308 10418325 9726606 9730138 10099002
4722 10099002 10067621 9909618 9647453 10016734 10104384 9976644 9210811 8658068 9054407 8927958
4712 8927958 8891201 9964940 9349390 9644228 9199663 9126265 9645598 9067434 9084359 9667417
4702 9667417 9470794 8566343 8493845 8660898 8682715 8329406 8244946 7352207 7627759 8045162
4692 8045162 7689804 7745252 7733014 7814099 7772472 7772787 7872356 7961124 8267713 8185927 7720486
4681 7720486 8463392 8539186 8087265 8062840 8684119 8948690 7712829 7410275 7404015 6790635
4671 6790635 7320396 7678282 8212783 8410735 8237105 7826260 7170548 7261741 8009543 8129409
4661H129409j99141K2872k84541J39354k54516Q9564P27848K31953n28442o34305
4651G440055M73870K09158M12503m31918l84396M25489P66616m88644j076280
4642G346453n20410K72506J226819J99509n02203Q39905n06209o51436J124544
4633H829478m00502m5241k76595k71515J026451o1988p52358M70256o40611J80176
4623H057551M55004J99421J58471q50068P06763O55316R4987M1222n54269o64303
4613H300095n22326m76541M2559K15156L08376K54608o8187P22113J12997n34535
4603H354315J43782L86754K49716l73252k53619j93043p11687O31699L96476O69661
4593I300802o67249n76485L83289L12091M75519m56437k79990O05303Q76838k29293
$$ plain form
4661 8129409 7930268 7953140 7668599 7807953 7553437 7643001 8370849 8602802 8074360 7440055
4651 7440055 7913925 8123083 8535586 8103668 7719272 8144761 8911377 8422733 7346453
4642 7346453 6826043 7098549 8325368 8524877 8022674 8862579 8356370 7704934 8829478
4633 8829478 8428976 8383735 8107140 7835625 8862076 8800088 8047730 8517986 7877375 8057551
4623 8057551 8512555 8711976 8870447 8020379 8727142 9382458 9477445 9518667 8964398 8300095
4613 8300095 7777769 7301228 7343787 7558943 7867319 8121927 8053740 8775853 8888850 8354315
4603 8354315 8498097 8884851 9134567 8761315 8507696 8314653 7602966 8234665 8631141 9300802
4593 9300802 8633553 8057068 8440357 8752448 9227967 8771530 8491540 9096843 9973681 9744388
4583I744388m74375r3293L23537M00729r77676n81966J531838j97564N9349l20565
4573I414402N00655O6570m31693Q2559J46839K57717J09928J99569m1673N2775
4563A0357648k74841J93645J051262K84747K41158l80072k56419O59880Q56588
4554A2733596K60529J46765m58785o88093M79440N60604O24736q84775J12492
4545A2886509Q5449L75426N62561j55438J45409L18997K90306m67292K09469M91009
4535A4742405Q58237k17148O43719L93560K36823K17918k96319P12311O24521
4526A7916027J90828l57691o57K93999q4088M27745L69641j58222l44841J024279
4516A9277020O09376R11416p7330q5578j5450M31266j1422M68160R96313N88258
$$ plain form
4583 9744388 9270013 9176720 9500257 9900986 8923310 8341344 9873182 9675618 9734967 9414402
4573 9414402 9915057 9981627 9549934 9632493 9779332 10037049 10146977 10346546 10304873 10357648
4563 10357648 10082807 10276452 11327714 11612461 11853619 11473547 11217128 11877008 12733596
4554 12733596 12994125 13140890 12682105 11994012 12473452 13034056 13658792 12774017 12886509
4545 12886509 12971958 13347384 13909945 13754507 13899916 14218913 14509219 14041927 14251396 14742405
4535 14742405 15600642 15383494 16027213 16420773 16657596 16875514 16579195 17291506 17916027
4526 17916027 18106855 17749164 17748507 18042506 17958418 18386163 18755804 18597582 18252741 19277020
4516 19277020 19886396 20797812 20720482 20634904 20619454 21050720 21039298 21507458 22503771 23092029
4506B3092029M31018P79689J404171L51114K49748j73215K007819K78020R26668
4497B9347061J212568Q93414Q57545J200949J450456J974349J109878J245081
4489C9291301J515569J599279J897372K378958J999913K295820K056195K370618
4481E5405025J923805L242269L519450L607476M026082M512192L781974N223818
4473H5242091N971376P080182Q218355Q241990Q506623Q645380R129934J0396538
4465A51432469J1850929J0970202J1329517J0507702Q791927O884654M202114
4458B15969514N25353l682151n301743q429362j1067296j1682067j3209624j2314605
4450A50808019j2449673j2063218j0865189q974058q773284q410111o997204n359531
$$ plain form
4506 23092029 23523047 24302736 25706907 26058021 26307769 26134554 28142373 28420393 29347061
4497 29347061 30559629 31453043 32310588 33511537 34961993 36936342 38046220 39291301
4489 39291301 40806870 42406149 44303521 46682479 48682392 50978212 53034407 55405025
4481 55405025 57328830 60571099 64090549 67698025 71724107 76236299 80018273 85242091
4473 85242091 91213467 98293649 106512004 114753994 123260617 131905997 141035931 151432469
4465 151432469 163283398 174253600 185583117 196090819 204882746 211767400 215969514
4458 215969514 216494867 212812716 207510973 199081611 188014315 176332248 163122624 150808019
4450 150808019 138358346 126295128 115429939 106455881 97682597 89272486 82275282 76915751
4442G6915751n971216n290626l505165l612641k797706k794037k931187j872678
4434D8140495j676423k213170j504286j570711r40308j036930j646265p06066
4426C6846336j294128j616647p34315n08136j004264r75053l29115K67393q99175
4417B9752896o31242L55522K96253r3603j33111L3115p1485K97497q0498O379
4407B9731723L53772l0002j03268J80747O882J57497j45465J68513m5689m27347
4397B9847363j0953l23179q65619j160670m01796j63369q07675n46433O96153
4388B6263822m90875m34551p28788J20903j57367m60161m25194N05782k11128
4379B3982443M18226M42002J33888n51339j18958m62182q4616j054086n23231
$$ plain form
4442 76915751 70944535 65653909 62148744 58536103 55738397 52944360 50013173 48140495
4434 48140495 46464072 44250902 42746616 41175905 40235597 39198667 37552402 36846336
4426 36846336 35552208 33935561 33201246 32693110 31688846 30713793 30384678 30652071 29752896
4417 29752896 29121654 29477176 29773429 29679826 29546715 29579830 29508345 29805842 29725344 29731723
4407 29731723 30085495 30055493 29952225 30132972 30139854 30297351 30151886 30320399 30274710 29847363
4397 29847363 29836410 29513231 28647612 27486942 27085146 26921777 26114102 25567669 26263822
4388 26263822 25772947 25338396 24609608 24730511 24573144 24112983 23687789 24193571 23982443
4379 23982443 24400669 24842671 24976559 24425220 24306262 23844080 23759464 22705378 22182147
4370B2182147k54596n8073l92927j462610k52630j060461o58675q7566q59145
4361A7095464o51357P2497K94627n70572p36624p50737l31784J9747J66645m02390
4351A4205516j95698m7465k64861l00389p43370k09082L91476K80331o3322m83370
4341A2569766n58985J37073K14666O9076l11570k0650J96856L95556m12329k11651
4331A2067808l34138q93779p20632q0392N01844Q5035n64826o11858P2661L11594
4321I833317r0212J07571K42060M99274k14335l51902L95472J20610O6642n82800
4311A0025697M26123Q28890j329542P0605O47963J24899j427626r75172M95097
4302H886934N6195K49770k36455o53599M15999K8291J81193p34230J09239L54113
$$ plain form
4370 22182147 21927551 21869478 21476551 20013941 19761311 18700850 18042175 17954609 17095464
4361 17095464 16444107 16516604 16811231 16240659 15504035 14753298 14421514 14441261 14607906 14205516
4351 14205516 14009818 13962353 13697492 13397103 12653733 12444651 12836127 13116458 13053136 12569766
4341 12569766 12010781 12147854 12362520 12431596 12120026 12099376 12296232 12691788 12279459 12067808
4331 12067808 11733670 10839891 10119259 10038867 10540711 10625746 10060920 9449062 9521723 9833317
4321 9833317 9743105 9850676 10092736 10592010 10377675 10025773 10421245 10541855 10608497 10025697
4311 10025697 10451820 11280710 9951168 10021773 10669736 10794635 9367009 8391837 8886934
4302 8886934 8943129 9192899 8956444 8302845 8718844 8747135 8928328 8194098 8303337 8657450
4292H657450J85065o82741P6359J76300N69230j005o60608o2203j48373m59353
4282G650121N82516k37059k05092M11710j89413q56080N12321Q0596k67471o44597
4272F837552q2013k01485N7129l29366j89721K51846P23255l20877O14555j67879
4262G192996q20449j5309Q89215K10834J80340n32916r28206K64321M3597R29037
4252G413460n16106o15605Q65306J019195r27408k12807M9381l48591j76326P26832
4242G277331J47224J93661m43181M219L24673n93431m58322J85491r8264k21490
4232F317911k71482r9599n1801j60995P09232O65831N7570R6601l13588K31457
4222G181137N28414m49922K38631R87036r24558o9349J01014P37880m75008J21801
$$ plain form
4292 8657450 8842515 8159774 8236133 8412433 8981663 8980658 8320050 8257847 8109474 7650121
4282 7650121 8232637 7995578 7790486 8202196 8012783 7156703 7669024 7749620 7482149 6837552
4272 6837552 6755539 6554054 6611183 6281817 6092096 6343942 7067197 6746320 7360875 7192996
4262 7192996 6372547 6357238 7246453 7457287 7637627 7104711 6176505 6440826 6484423 7413460
4252 7413460 6897354 6281749 7147055 8166250 7238842 7026035 7075416 6726825 6550499 7277331
4242 7277331 7424555 7618216 7175035 7179254 7503927 6910496 6452174 6637665 6539401 6317911
4232 6317911 6046429 5946830 5895029 5734034 6443266 7109097 7166667 7263268 6949680 7181137
4222 7181137 7709551 7259629 7498260 8485296 7560738 7491389 7592403 8330283 7855275 7977076
4212G977076N8058m21316O83000K73952m80008M55236l56658J22043p13694L72930
4202G970619M55857L63102k41430q41425r71295j092857N4810Q03381N19044M61010
4192G480816q57006j03622j40351L74298L77271j56150j41009k89573l0337L23951
4182F838288m52447K65637l0720q83074K68469Q2718P6727k0739j91800M02843
4172F355902M29006L39045j5595k09273M63938K41578j52235r18237K44511M50560
4162G229200m48382l86496l27332j98812L75680K39107L06265J08429p1097J70909
4152F997471J652455m25764o33997P91505J76672P3230j29399o94499l94650O82150
4142H095174K25397K89592k24015m91925m18500k26095P79846J49905J34967J49773
$$ plain form
4212 7977076 8035134 7613818 8296818 8570770 8090762 8545998 8189340 8311383 7597689 7970619
4202 7970619 8426476 8789578 8548148 7706723 6735428 5642571 5697381 6500762 7019806 7480816
4192 7480816 6623810 6520188 6379837 6754135 7131406 6975256 6834247 6544674 6514337 6838288
4182 6838288 6385841 6651478 6620758 5737684 6006153 6088871 6165598 6144859 5953059 6355902
4172 6355902 6784908 7123953 7108358 6899085 7363023 7604601 7452366 6534129 6778640 7229200
4162 7229200 6780818 6394322 6066990 5868178 6243858 6482965 6789230 6897659 6826562 6997471
4152 6997471 8649926 8224162 7590165 8381670 8558342 8631572 8502173 7807674 7413024 8095174
4142 8095174 8320571 8610163 8386148 7894223 7475723 7249628 8029474 8179379 8314346 8464119
4132H464119j80603k20419J71259K55379O21202q24364l57236l19507k13199K06853
4122G603484Q28718M94869j82250J24411k94447m14357j74278n42268J98328n75373
4112G066837n86764L04323L05646J44615K48253n53690O47330O50392K46181j67544
4102H305579L38916K72079k32941n47833j70190n75376m36306Q95113K31919o21386
4092G459574J91961M67180k50445o0147J24414N041j40789k5360m37462q48961
4082F485006L24076R5852L81351O78162p8445m63841k8819R57096j08622l98926
4072G842890J21725l0883N16956o3031l05543r9659M95067K79432O40871j06588
4062I291237k79223J64387O59317J98963j618145o76545O20086K7492j44652J282909
$$ plain form
4132 8464119 8283516 8063097 8234356 8489735 9110937 8286573 7929337 7609830 7396631 7603484
4122 7603484 8432202 8927071 8744821 8869232 8574785 8160428 7986150 7443882 7642210 7066837
4112 7066837 6480073 6784396 7090042 7234657 7482910 6929220 7576550 8226942 8473123 8305579
4102 8305579 8644495 8916574 8683633 8135800 7965610 7390234 6953928 7849041 8080960 7459574
4092 7459574 7651535 8118715 7868270 7808123 7932537 7937578 7796789 7771429 7333967 6485006
4082 6485006 6809082 6904934 7286285 7964447 7886002 7422161 7393342 8350438 8241816 7842890
4072 7842890 7964615 7933732 8450688 8387657 8082114 7982455 8477522 8756954 9397825 9291237
4062 9291237 9012014 9176401 9835718 10034681 8416536 7739991 8360077 8387569 8242917 9525826
4052I525826q8176q80310L8413M01561J44101j66505j65008m57362L58717J60454
4042H871711M06348K9168K07104N01618K97809m22151n96262K25167N2743N81586
4032A0154841o80811J34838L37033J49158o25455O30233N39602j92185o39272
4023I807982P94683k28164R43624K36506l1075m51313K27858M70980n320K14560
4013A1980321o36633k91940m69850n04906P25841R80936o55848M51112M26247
4004A2005280j01292r5227N4714J82965l65327O57911l63516k05014j3005J166365
3994A2923854n31981n95566M82767R08131j89429o80556M71274m31639K36645
3985A2593500O11075j84127o49910r4014P39644j04292p55413J94028O19420K16271
$$ plain form
4052 9525826 9437650 8557340 8595753 8997314 9141415 8974910 8809902 8352540 8711257 8871711
4042 8871711 9278059 9307227 9514331 10015949 10313758 9891607 9295345 9520512 9573255 10154841
4032 10154841 9474030 9608868 9945901 10095059 9469604 10099837 10639439 10447254 9807982
4023 9807982 10602665 10374501 11318125 11554631 11523556 11072243 11300101 11771081 11765761 11980321
4013 11980321 11343688 11051748 10581898 10076992 10802833 11783769 11127921 11579033 12005280
4004 12005280 11903988 11808761 11863475 12046440 11681113 12339024 11975508 11770494 11757489 12923854
3994 12923854 12391873 11796307 12279074 13187205 12997776 12317220 12788494 12356855 12593500
3985 12593500 13204575 13020448 12370538 12276524 13016168 12911876 12156463 12350491 12969911 13186182
3975A3186182k50804N3894K43341P45584M42996J31450k71206K20973N02587M91201
3965A5496198P6081n80080l14891M48199N05785J04031k92955J96317L61999n27602
3955A5473082o52461J21015m48813j06382k12836L34682J86743O35452K60804
3946A5591286K14955l36628M05990L51240K94561o28671L75115J35684l19710
3937A6083822K9165O31469O28373M10061m40133J23188L48934k39028K99738l95802
3927A7479787l97932M73992J07263J65885l04311l09087N88542N84667k5309N14187
3917A8877684l94840P47426K46724l08405Q60871L04372r5274k88231P17597l09686
3907B0358238K84943P8608J56725n57786R80882O16479m34761L79772L22543k20858
$$ plain form
3975 13186182 12935378 12989272 13232613 13978197 14421193 14552643 14281437 14502410 15004997 15496198
3965 15496198 15572279 14992199 14677308 15125507 15631292 15735323 15442368 15638685 16000684 15473082
3955 15473082 14820621 14941636 14492823 14386441 14173605 14508287 14695030 15330482 15591286
3946 15591286 15806241 15469613 15875603 16226843 16521404 15892733 16267848 16403532 16083822
3937 16083822 16112987 16744456 17372829 17782890 17342757 17465945 17814879 17575851 17875589 17479787
3927 17479787 17081855 17555847 17663110 17828995 17524684 17215597 17804139 18388806 18363497 18877684
3917 18877684 18482844 19230270 19476994 19168589 20029460 20333832 20238558 19950327 20667924 20358238
3907 20358238 20643181 20721789 20878514 20320728 21301610 21918089 21483328 21863100 22185643 21964785
3897B1964785N83029N00099p09494n30247J467503k62663k41075N92453Q8232
3888B3452622k51933K2036N89408N43563m5249K79810P15368N77342j81421k66925
3878B5434621M95067J09967N71754L30484J52959J67213N77907j19682j59619
3869B7560671P04452P20628Q17422N4767J137506P05000r52081j52533j71791
3860C0424041R9422J70345N8124J63083R74806Q01042K29770Q61232R39562M17433
3850C5138860M62488R88103M96911J9263O21234O85428Q17493N3194J147916Q97948
3840D1328838K00940K26454k79292N24703K62339L51840N11947O95622R37900
3831D4761291J029340q4967J385596J162576O03653k50827M24248J748386P45414
$$ plain form
3897 21964785 22547814 23047913 22338419 21808172 23275675 23013012 22771937 23364390 23452622
3888 23452622 23200689 23222725 23812133 24355696 24310447 24590257 25305625 25882967 25701546 25434621
3878 25434621 25929688 26039655 26611409 26941893 27094852 27262065 27839972 27720290 27560671
3869 27560671 28265123 28985751 29803173 29857940 30995446 31700446 30748365 30595832 30424041
3860 30424041 30523463 30693808 30751932 30915015 31889821 32690863 32920633 33781865 34721427 35138860
3850 35138860 35601348 36589451 37086362 37105625 37726859 38412287 39229780 39282974 40430890 41328838
3840 41328838 41529778 41756232 41476940 42001643 42263982 42615822 43127769 43823391 44761291
3831 44761291 45790631 45705664 47091260 48253836 48857489 48606662 49030910 50779296 51524710
3822E1524710N27619J107837J178760J565623J458565J186118J313786J932118
3814F1795136Q89153l14853O08223j341530j882127q36641n05557q80706n55110
3805E6975988r58077O66501J002209N25933q6754L16728J239015R47225R44335
3796F1573103J607784P79630L82110N83966J213522O08125J911662K020326J757068
3787G2437296O75786J012947K094928J821953J473415J388395J378531O58223
3779H2941474R68617J147430Q92160J820952J547629J401094J144507J544973
3771I3408836J379880J809359K274730J018936K222949J832325K465396K165664
3763A08578075L106732J703385K270305J900323K308212K264868J908017J423642
$$ plain form
3822 51524710 52052329 53160166 54338926 55904549 57363114 58549232 59863018 61795136
3814 61795136 62684289 62369436 62977659 61636129 59754002 58917361 58411804 57531098 56975988
3805 56975988 56017911 56684412 57686621 58212554 58125800 58442528 59681543 60628768 61573103
3796 61573103 63180887 63960517 64342627 64926593 66140115 66748240 68659902 70680228 72437296
3787 72437296 73113082 74126029 76220957 78042910 79516325 80904720 82283251 82941474
3779 82941474 83910091 85057521 85949681 87770633 89318262 90719356 91863863 93408836
3771 93408836 94788716 96598075 98872805 99891741 102114690 103947015 106412411 108578075
3763 108578075 111684807 113388192 115658497 117558820 119867032 122131900 124039917 125463559
3755A25463559Q88060O68385J198726J397146K192464K009887J813315K300021
3747A37931563J209218N46232J063468J46572k27449Q48260J515638J856462J354841
3738A46244805N40324J350933K405188J456259J154533J087579J035287J335805
3730A56610713L01583J182676J024787M96100Q60138J065121J642592J253941
3722A64437651J128236K191011K316344J344277J927690K582808L684945L459124
3714A83072086L330885L757163L384022M254561N067905M058222M900034N058942
3706B16883820N482169N589163O078000O480320Q029777P508620P541284R730993
3698B73324146R938769R931953J0257319J1382927J0897057J1363946J0930799
$$ plain form
3755 125463559 126351619 127020004 128218730 129615876 131808340 133818227 135631542 137931563
3747 137931563 139140781 139687013 140750481 140897053 140669604 141517864 143033502 144889964 146244805
3738 146244805 146785129 148136062 150541250 151997509 153152042 154239621 155274908 156610713
3730 156610713 156912296 158094972 159119759 159615859 160475997 161541118 163183710 164437651
3722 164437651 165565887 167756898 170073242 171417519 173345209 175928017 179612962 183072086
3714 183072086 186402971 190160134 193544156 197798717 202866622 206924844 211824878 216883820
3706 216883820 222365989 227955152 234033152 240513472 248543249 256051869 263593153 273324146
3698 273324146 283262915 293194868 303452187 314835114 325732171 337096117 348026916
3691C48026916J0106768R848682P846565O917574L950639J493805r40673k591247
3683C84659029n431559q827802r259906j1717196j4067210j4217809j4176704
3676C06960843j4994990j5696216j4002658j3077048j2500648j1393822r132699
3669B16162762r222314p782697o312182o309305n186382m954106l843381l968200
3661A68584195k815191l549260l622719j387105k288686j860714j956032k708696
3653A48395792k262710k006596k244839k126641k007215k309285k770455k612139
3645A30055912k567767j564711j826820k604691k761563k562868j627290k324717
3637A12215485j961269j769413k125981j772466k521433j734244j492399j597906
$$ plain form
3691 348026916 358133684 367982366 375828931 382746505 386697144 388190949 387250276 384659029
3683 384659029 379227470 370399668 361139762 349422566 335355356 321137547 306960843
3676 306960843 291965853 276269637 262266979 249189931 236689283 225295461 216162762
3669 216162762 206940448 199157751 192845569 186536264 181349882 176395776 172552395 168584195
3661 168584195 165769004 162219744 158597025 157209920 154921234 153060520 151104488 148395792
3653 148395792 146133082 144126486 141881647 139755006 137747791 135438506 132668051 130055912
3645 130055912 127488145 125923434 124096614 121491923 118730360 116167492 114540202 112215485
3637 112215485 110254216 108484803 106358822 104586356 102064923 100330679 98838280 97240374
3629I7240374j683139k063918r47278r80525j113165k138717j641319j512120
3621H5160193j033475p55754j176397j184862o89423n47601j232393r88464l88331
3612G7163493r61824m82108n63658j255774o52024q54048r33210q3760l96612
3603G0980475l55891r26785p89527L8217m77407o68206k00041j498091j230193
3594F4872551l36191p75314l30471q33616m28743L26961l04988o18740m51403
3585F1120046l59486k44271q63279J4786j10809p50322l92275n08750N8907o97039
3575E7267508n46621q44106o93694N6759j219859k11086L08621k2902l83559m22963
3565E3288098N07292k50626n86635j242875r2387l40970j68618K57918o41475
$$ plain form
3629 97240374 95557235 93493317 92546039 91565514 90452349 88313632 86672313 85160193
3621 85160193 84126718 83370964 82194567 81009705 80320282 79772681 78540288 77551824 77163493
3612 77163493 76201669 75719561 75155903 73900129 73248105 72394057 71460847 71377087 70980475
3603 70980475 70624584 69697799 68908272 68946489 68469082 67800876 67600835 66102744 64872551
3594 64872551 64536360 63761046 63430575 62596959 62168216 62495177 62190189 61571449 61120046
3585 61120046 60760560 60516289 59653010 59667796 59556987 58806665 58414390 57905640 57964547 57267508
3575 57267508 56720887 55876781 55183087 55239846 54019987 53808901 54117522 54094620 53711061 53288098
3565 53288098 53795390 53544764 52958129 51715254 51622867 51281897 51113279 51371197 50729722
3556E0729722p20276m50336J36331j29945n83748o02211N77178M25034m34091
3547D8947658j6153O72758j90227p07872Q247L47111q81885O7127m01428j81790
3537D7663546J73392k62675k48844l75056m54277O20693P14243j214559j39926
3528D6476537o509L99272Q25496L6357j76715K20413j39533J45868J92040N98836
3518D8572062N15528J90388M38330R86508K12123j58235Q01260N55269J629726
3509E3742959J263892L13207M98032l22896j28857o54250n72077J062001j405260
3500E3796751j219459M17650j92607n57518O70485R91921j88725P84481Q02609
3491E5305588J27600M69730M65601P57936J46441R91429J791807l84113O08900
$$ plain form
3556 50729722 50009446 49559110 49695441 49565496 48981748 48379537 48956715 49381749 48947658
3547 48947658 48931505 49604263 49414036 48706164 48714411 49061522 48179637 48246764 47845336 47663546
3537 47663546 47836938 47574263 47325419 46950363 46496086 47116779 47831022 46616463 46476537
3528 46476537 46470028 46869300 47694796 47731153 47554438 47774851 47635318 47781186 47973226 48572062
3518 48572062 49087590 49277978 49716308 50702816 50914939 50756704 51557964 52113233 53742959
3509 53742959 55006851 55320058 55818090 55495194 55366337 54712087 54140010 55202011 53796751
3500 53796751 52577292 52994942 52802335 52244817 52915302 53907223 53718498 54502979 55305588
3491 55305588 55433188 55902918 56368519 57126455 57272896 58264325 60056132 59672019 60280919
3482F0280919J042438J07213o64362m6201Q65364O18079J071607J345942K217773
3473F6838772Q96794K002843K398523R43733J274235K260834K282092K065492
3465H0963318K721949K759655K134821K488486K589583K269475L296674L182176
3457A02406137K497607M449356L459945L412093M941840N507913N995149N828170
3449A38498210O931539Q262419R418511R554485J0478065J1572636J2841227J4894718
3441B22451810J6155900J8616134K2385040K5378748K7821230L0506832L2040052
3434C95355746K9289408K4150538J4785152j17790j5893637k8935799l4909360
3427C83724258l4269855l0926516k4624639j9496514j3888587j0081138o799033
$$ plain form
3482 60280919 61323357 61430570 60766208 60720007 61585371 62203450 63275057 64620999 66838772
3473 66838772 67735566 69738409 72136932 73080665 74354900 76615734 78897826 80963318
3465 80963318 83685267 86444922 88579743 91068229 93657812 95927287 99223961 102406137
3457 102406137 104903744 109353100 112813045 116225138 121166978 126674891 132670040 138498210
3449 138498210 145429749 153692168 163110679 172665164 183143229 194715865 207557092 222451810
3441 222451810 238607710 257223844 279608884 304987632 332808862 363315694 395355746
3434 395355746 424645154 448795692 463580844 463463054 447569417 418633618 383724258
3427 383724258 349454403 318527887 293903248 274406734 260518147 250437009 243637976
3420B43637976m411352k189867k35121P98717J219816l73805p66088l045910n697744
3411B28936622r937515j2096785j2336885j1887580j0399253j0389982p090330
3404A54798292p225238o122463n401486o606660o449498n855670n203966n735190
3396A06198121m978874m259686l798878l154055k762001k833322k605812k200766
3388G9604727k428013k444075j538163j892336j680895j437786j412277j250395
3380F5520787p23087j508483j095539r44621j267212j423369j010185j060886
3372E6487405k62238j79010j680452j225174k99479j48323q22897p02842j278339
3363D9888651o86762k73000o80807j2352m79919j3239q56768l32902M56129l15939
$$ plain form
3420 243637976 239226624 237036757 236801636 237600353 238820169 238446364 237680276 234634366 228936622
3411 228936622 218999107 206902322 194565437 182677857 172278604 161888622 154798292
3404 154798292 147573054 141450591 136049105 129442445 122992947 117137277 111933311 106198121
3396 106198121 101219247 96959561 93160683 90006628 87244627 84411305 81805493 79604727
3388 79604727 77176714 74732639 73194476 71302140 69621245 68183459 66771182 65520787
3380 65520787 64797700 63289217 62193678 61249057 59981845 58558476 57548291 56487405
3372 56487405 56225167 56046157 54365705 53140531 52841052 52692729 51869832 51166990 49888651
3363 49888651 49201889 48928889 48248082 48235730 47755811 47742572 46885804 46552902 47009031 46693092
3353D6693092N33653j9186q70938n91970L72786q02417j70801J13559k86781l53242
3343D4617755M92511j052287j22838K42532L40738m2078m45482K96996r95336
3334D3332511l10226j70538j7444J89438K1194m80002m45221r27248L44317k74715
3324D1262066L18934R1651n55L85223r59136k22744o40693l72108N12099k57391
3314D0117346k53592K20324m12264j396704j23971L94439o24624p46161j9147
3305C7155646k13516j10110q53563k44968M56375k31610p74080K0764L31973j30331
3295C5406580L75485j77585J037059K4379m9499N75542L06744K39694o36574K48693
3285C7350518P98425O45737o32083M04721J30441M10050J092936K93450n99031
$$ plain form
3353 46693092 47226745 47207559 46336621 45744651 46117437 45315020 45144219 45257778 44970997 44617755
3343 44617755 45110266 44057979 43935141 44177673 44518411 44476333 44030851 44327847 43332511
3334 43332511 43022285 42851747 42834303 43023741 43044935 42564933 42119712 41192464 41536781 41262066
3324 41262066 41581000 41672651 41672096 42057319 41098183 40875439 40234746 39862638 40374737 40117346
3314 40117346 39863754 40084078 39671814 38275110 38151139 38545578 37920954 37174793 37155646
3305 37155646 36942130 36832020 35978457 35733489 36189864 35958254 35184174 35204938 35536911 35406580
3295 35406580 35782065 35604480 36641539 36665918 36616419 37191961 37498705 37738399 37101825 37350518
3285 37350518 38148943 38794680 38162597 38567318 38697759 39107809 40200745 40494195 39895164
3276C9895164k13870j01994L58073k80347P38480J2098m95363L43376q1729J45146
3266D0319034m90608l4166J30937l4981m82685k27855K75452N92340l43858M73458
3256D0177068K77091K54903L51318K77621j00291l56944J081312R45536r1197
3247D2816417J008741j26983M08437q4886K50752k74200Q293L14836L61460K24455
3237D4907322j00941J05152k22693r1666m57892n45291o16630Q44328n07662q85568
3227D2428459M09636l93362K64082j000822K34168M69470m61932m43664Q92486
3218D2398521m62527p59989M87395M96205j7478n0207K01541K25780L8316J26055
3208D2683612L48652n88559R05572N56907M43584k56503J006337P31371R76305
$$ plain form
3276 39895164 39681294 39579300 39937373 39657026 40395506 40407604 39912241 40255617 40173888 40319034
3266 40319034 39828426 39794260 39925197 39890216 39407531 39179676 39455128 40047468 39703610 40177068
3256 40177068 40454159 40709062 41060380 41338001 41237710 40880766 41962078 42907614 42816417
3247 42816417 43825158 43698175 44106612 44021726 44272478 43998278 44006571 44321407 44682867 44907322
3237 44907322 44806381 44911533 44688840 44597174 44139282 43593991 42977361 43821689 43314027 42428459
3227 42428459 42838095 42444733 42708815 41707993 41942161 42411631 41949699 41506035 42398521
3218 42398521 41935994 41176005 41663400 42159605 42142127 42091920 42293461 42519241 42557557 42683612
3208 42683612 43032264 42443705 43349277 43906184 44349768 44093265 45099602 45830973 46807278
3199D6807278J331572J491801J7638n44076J19218M55181Q5728l16165j23632
3190D9324543l3159n91296p34143j52347J92726r03277R50715M40076k45048n84320
3180D7664470R316P14535k62762K4618k61369M8624j223481j204678l92999k39749
3170D4876525P08649P4250m49188o9903P2298N70029K52633P49290P48711J184866
3160D8718160K68967k94490l264l13754n62235k96898J94285r5604k31006m44891
3150D6939270q8122l84865m30429q42532o31802m20826L61619M98279m29249o33686
3140D3937657M90677R18006K7653N91456P45605J29290O03763r3761N21593R73424
3130D8845363M33264j92685J71760M74310O62698N17166j86565j44840k2263p2090
$$ plain form
3199 46807278 48138850 49630651 49648289 49104213 49223431 49678612 49764340 49448175 49324543
3190 49324543 49291384 48700088 47965945 47813598 48006324 47103047 48053762 48493838 48248790 47664470
3180 47664470 47673786 48388321 48125559 48150177 47888808 47937432 46713951 45509273 45116274 44876525
3170 44876525 45585174 45659424 45210236 45140333 45212631 45782660 46035293 46784583 47533294 48718160
3160 48718160 48987127 48692637 48689373 48375619 47813384 47516486 47710771 47615167 47384161 46939270
3150 46939270 46851148 46466283 46035854 45193322 44561520 44140694 44502313 45000592 44571343 43937657
3140 43937657 44428334 45346340 45373993 45965449 46711054 46840344 47444107 47350346 47871939 48845363
3130 48845363 49278627 49085942 49257702 49732012 50394710 50911876 50725311 50580471 50558208 50486118
3120E0486118o0843K69134J18856K73753o9823P65235j59729O07474M41820k29790
3110E2442205o45384J22965J5137J20964r80912K38083L017m32942j431590N60765
3100E0012308K9689n14809P66772K20351m9329O76585M14653P44384O48769J22141
3090E3071514N00657L93600J006158R80717J007551P57452Q70859K05286K157514
3081F0951308J712074J290475K600818L352894K928101M572063L001222L863261
3073H4272216N440512N911464Q931126J0603070J2978437J5880216J9204793K0656262
3065A83878096J9211535J9393932J2914578n789961l0543208l6904790k8322475
3058A33837707j9236953j2958879r662482o544900n341565m204439l153048k714353
$$ plain form
3120 50486118 50425275 50694409 50813265 51087018 51017195 51782430 51622701 52230175 52671995 52442205
3110 52442205 51796821 51919786 51934923 52055887 51074975 51313058 51316075 50883133 49451543 50012308
3100 50012308 50041997 49527188 50293960 50514311 50464982 51141567 51556220 52300604 52949373 53071514
3090 53071514 53572171 53965771 54971929 55952646 56960197 57717649 58588508 58793794 60951308
3081 60951308 62663382 63953857 66554675 69907569 72835670 77407733 80408955 84272216
3073 84272216 89712728 95624192 104555318 115158388 128136825 144017041 163221834 183878096
3065 183878096 203089631 222483563 235398141 229608180 199064972 162160182 133837707
3058 133837707 114600754 101641875 91979393 85434493 80092928 75888489 72735441 70021088
3050G0021088k295894j616821j545016j550679j713632l77849r40089j141543
3042E8839565o59863m85921M50394q87633r5666m71439O65252K94725j05941j58303
3032E7385170L12004N73639J0415N81799M54207P08705R87044J051241J332507
3023F3396731K61227m31554J464897J452992Q68080R26187J871087J231980K064865
3014G3106492K028189J840919K197374J764761J921492L522777L317836K913427
3006I2613267L086550L639708M899717M663109M468018M953894M952337N432559
2998A28709159M719247L617461M550991K267112R15347j22374k335742k537611
2990A39783590l022640m483724m639474l396823l247338l395763l345131k231538
$$ plain form
3050 70021088 67725194 66108373 64563357 63012678 61299046 60921197 59981108 58839565
3042 58839565 58179702 57693781 58144175 57256542 57160876 56689437 57354689 57649414 57543473 57385170
3032 57385170 57697174 58270813 58281228 58863027 59317234 60025939 61012983 62064224 63396731
3023 63396731 63657958 63226404 64691301 66144293 67012373 67938560 69809647 71041627 73106492
3014 73106492 75134681 76975600 79172974 80937735 82859227 86382004 89699840 92613267
3006 92613267 95699817 99339525 104239242 108902351 113370369 118324263 123276600 128709159
2998 128709159 133428406 137045867 141596858 143863970 144779317 144656943 142321201 139783590
2990 139783590 136760950 132277226 127637752 124240929 120993591 117597828 114252697 112021159
2982A12021159k373734j380757j472258j855111j733548n39034j142781p00843
2974A00823093n05188p74805j056000N1527j130108q16325k07473r09779l72868
2965I5102074j351194m08285j38329j26588q92546j090267p62879j51448N4746
2956I0235284n17191o76091o50884l08965q84743q05359p80744j133646q43357
2947H3634304j384908o19208o46968l49024K42826j239914r76135j050186m59566
2938G7151221l1346j022082k07192j304433q19964o72416j22419q45787q16386
2929G1309196k13065J16915l91753j230802m2923M61944l16513q61660j95494
2920F8635845J70422l18296r51185P74292R19576j95048J55103K0843J03572N58441
$$ plain form
2982 112021159 109647425 108266668 106794410 104939299 103205751 102666717 101523936 100823093
2974 100823093 100317905 99543100 98487100 98538627 97408519 96592194 96384721 95474942 95102074
2965 95102074 93750880 93342595 93204266 93077678 92185132 91094865 90331986 90180538 90235284
2956 90235284 89718093 89042002 88391118 88082153 87197410 86392051 85611307 84477661 83634304
2947 83634304 82249396 81630188 80983220 80634196 80877022 79637108 78660973 77610787 77151221
2938 77151221 77119875 76097793 75890601 74586168 73766204 73093788 72971369 72125582 71309196
2929 71309196 71096131 71213046 70821293 69590491 69547568 70009512 69692999 68831339 68635845
2920 68635845 68806267 68487971 67536786 68311078 69230654 69035606 69190709 69211552 69315124 69873565
2910F9873565N29179O68161K80062n71864P4461J001467Q16528L37373J56452
2901G3165384K47375r8313J90399O42458M02142m2843k45245J68329Q79388J66907
2891G5475981n47723K00323N1763O4431J088P43761o10710p03000k09052J94005
2881G4660867l32950p20605k04682J4467r7726j289526j136467m27418o69055
2872F9796905r44735r92759p44291j646764j154430r85550j115396j115281j126011
2863E9971688p50983j801291q80975q94600l29798j81115j567194j203953j303082
2854E1058697j89855r52176p95980o26773j608772n63583j22302j097219l45990
2845D4756047j470313j234881q09857q49239j90038l03851l45238l64027o03948
$$ plain form
2910 69873565 70402744 71070905 71350967 70779103 70853564 71855031 72671559 73008932 73165384
2901 73165384 73412759 73314446 73504845 74147303 74549445 74506602 74261357 74429686 75309074 75475981
2891 75475981 74928258 75128581 75180344 75244775 75245863 75989624 75378914 74675914 74466862 74660867
2881 74660867 74327917 73607312 73402630 73417097 73319371 72029845 70893378 70465960 69796905
2872 69796905 68852170 67859411 67115120 65468356 64313926 63328376 62212980 61097699 59971688
2863 59971688 59220705 57419414 56538439 55643839 55314041 55132926 53565732 52361779 51058697
2854 51058697 50868842 49916666 49120686 48493913 46885141 46321558 46199256 45102037 44756047
2845 44756047 43285734 42050853 41240996 40391757 40201719 39897868 39552630 39188603 38584655
2836C8584655r28464j433580j073696K0174p59353l01180n61434k63235p38562
2827C2545325m44166l97369l83983q34830Q49733k55624n78075j47324N02795
2818C0856482O6986l13934k85792M19487N23873m57602J10020O64423l40651j79985
2808C1063307o25779Q7444P21728p11053N1248R08179L8831N64460j19830k6162
2798C1952373m6672m80253K6317O28976J70966N4087J95937j159736j93409M03435
2788C1552021Q66197K99042k97449M37742m85905k6681M65780M90848L8126j82106
2778C3157615l35457m51910L84145j13272N19998R93652L37016j45097n30781
2769C3815909o06226M68548P55870L69540R0225O26517J50837R66017N53548J94255
$$ plain form
2836 38584655 37656191 36222611 35148915 35169089 34409736 34108556 33547122 33283887 32545325
2827 32545325 32101159 31703790 31319807 30484977 31334710 31079086 30501011 30353687 30856482
2818 30856482 30923468 30609534 30323742 30743229 31267102 30809500 30919520 31583943 31243292 31063307
2808 31063307 30437528 30524972 31246700 30535647 30586895 31495074 31533905 32098365 31978535 31952373
2798 31952373 31905701 31425448 31451765 32080741 32251707 32305794 32501731 31341995 31148586 31552021
2788 31552021 32418218 32717260 32419811 32857553 32371648 32344967 32810747 33301595 33339721 33157615
2778 33157615 32822158 32370248 32754393 32641121 33161119 34154771 34491787 34346690 33815909
2769 33815909 33209683 33678231 34434101 34803641 34893866 35520383 35671220 36637237 37190785 37385040
2759C7385040J51410P21259O65864P20804L28017R6813P14914J95607n81532O49162
2749D1047358J68995m2336J61562L24023O50257O91772J45541M7472O37681R31143
2739D4763468m24019M25995N51062L39372P64308J25749L55547K84443o6582n11531
2729D6607812K81484M46219Q32087O25523J92378N24177o5174N98689J16437r66868
2719D9192764P39287L98423R08310N24875Q9734J98608J06191J26043K71350M24393
2709E2979978J392365R01508N14666k15054J63589N45990J136541M30734O99433
2700E8549750J048329L27212R01131N85190O71800L46334r2954N28552J874426
2691F4739770J564293L30450l0640M78030N28082Q84127M68954R05959Q9842l01807
$$ plain form
2759 37385040 37536450 38257709 38923573 39644377 39972394 40069207 40784121 40979728 40398196 41047358
2749 41047358 41216353 41174017 41335579 41659602 42309859 43001631 43147172 43194644 43832325 44763468
2739 44763468 44339449 44765444 45316506 45655878 46420186 46545935 46901482 47185925 47119343 46607812
2729 46607812 46889296 47335515 48167602 48793125 48985503 49509680 49444506 50043195 50159632 49192764
2719 49192764 49932051 50330474 51238784 51763659 51853393 52052001 52158192 52284235 52555585 52979978
2709 52979978 54372343 55273851 55788517 55573463 55737052 56283042 57419583 57850317 58549750
2700 58549750 59598079 59925291 60826422 61411612 62083412 62429746 62336792 62865344 64739770
2691 64739770 66304063 66634513 66603873 67081903 67609985 68494112 68963066 69869025 69958867 69657060
2681F9657060J46431J567824P42436J91464J78712O82089M12110J97660Q2862
2672G3858648J009164J014782n6789P18627P8707o06620J18587M65326N96621
2663G7197053O21357R14604R30573L0489O56910J57613L65067P35806P98911L8320
2653H2446703K90604J639496O89391J033168P88034Q54140J312456J174750Q47004
2644I1075746J971844J380371J228300J144660J717146J792101J863242K353288
2636A04526698K935666K459100K032810K227887K764796L237713L027163L593931
2628A26805764K594382L103535L878612M618578L309665K905533L030279L405653
2620A53652001K606945L100409L484704L403497K617380L461664K203997K367799
$$ plain form
2681 69657060 69803491 71371315 72113751 72305215 72483927 73166016 73578126 73775786 73858648
2672 73858648 74867812 75882594 75825805 76544432 76623139 76016519 76135106 76600432 77197053
2663 77197053 77818410 78733014 79663587 79694076 80350986 80508599 80873666 81609472 82408383 82446703
2653 82446703 82737307 84376803 85066194 86099362 86887396 87741536 89053992 90228742 91075746
2644 91075746 93047590 94427961 95656261 96800921 98518067 100310168 102173410 104526698
2636 104526698 107462364 109921464 111954274 114182161 116946957 120184670 123211833 126805764
2628 126805764 129400146 132503681 136382293 141000871 144310536 147216069 150246348 153652001
2620 153652001 156258946 159359355 162844059 166247556 168864936 172326600 174530597 176898396
2612A76898396K958543K857066K431207K122574J472343K100155R69221J428687
2604A93238192J029881J373653Q32705K22808J188805M8608K55952k34385n49548
2595A97406671m58437j223986p25997j190417j030197j223462j009099k134811
2587A88410265j173828j677458j727013j572743j848800j899701k171007k014928
2579A74324787k430999j830279k125435j241374j277280r02592j748671n82401
2571A62185756p22073j342691j043115l87970l42775K97284k76185l66501l15338
2562A57686392J77946P1580Q72045J46294P709P32811Q94618K14797J063683O06323
2552A62474198J039308l25511M99533P58048K47094J576832N90534K28589L78598
$$ plain form
2612 176898396 179856939 182714005 185145212 187267786 188740129 190840284 191809505 193238192
2604 193238192 194268073 195641726 196474431 196697239 197886044 197934652 198190604 197956219 197406671
2595 197406671 196948234 195724248 194998251 193807834 192777637 191554175 190545076 188410265
2587 188410265 187236437 185558979 183831966 182259223 180410423 178510722 176339715 174324787
2579 174324787 171893788 170063509 167938074 166696700 165419420 164516828 162768157 162185756
2571 162185756 161463683 160120992 159077877 158689907 158347132 158644416 158368231 158001730 157686392
2562 157686392 157864338 157935918 158807963 158954257 158961966 159694777 160589395 160804192 161867875 162474198
2552 162474198 163513506 163187995 163687528 164445576 164692670 166269502 166860036 167088625 167467223
2543A67467223J95465J111290l24347M99852M758j90280K78228j91953O4039Q48198
2533A69762473m67936J42723j105172m71592j05844m45123m5032o95075q10011
2524A65759411o59298o94861n22280k49671j039880l84572j098512q79570j311563
2515A58919204m47834j440751q48024k35864j386790r90334o25084j149390j071972
2506A50723161j000953l80403p10518j322994o76446k12255q78232q0456r97373
2497A44463531l07917j168119k89127r4247m74778o56783L85907o53235k30257
2488A40974975m72525m79888k79196K69508j77384r9182n45817n26992O1244n67633
2478A38157110j50446q53722j014108j397840q82350Q8940j233674j486593j407723
$$ plain form
2543 167467223 167662688 168773978 168449631 168949483 168954241 168763961 169042189 168850236 168914275 169762473
2533 169762473 169294537 169437260 168332088 167860496 167754652 167309529 167264497 166569422 165759411
2524 165759411 165100113 164405252 163882972 163633301 162593421 162208849 161110337 160230767 158919204
2515 158919204 158471370 157030619 156182595 155946731 154559941 153569607 152944523 151795133 150723161
2506 150723161 149722208 149341805 148631287 147308293 146631847 146419592 145541360 145460904 144463531
2497 144463531 144155614 142987495 142698368 142604121 142129343 141472560 141858467 141205232 140974975
2488 140974975 140502450 140022562 139743366 140012874 139835490 139736308 139190491 138663499 138724743 138157110
2478 138157110 138006664 137152942 136138834 134740994 133858644 133947584 132713910 131227317 129819594
2469A29819594j888346p54649j262588j241999j932828j810995j537978j978816
2461A17411395j581410j467841k693332k581212j705870j924964k008528k344607
2453A01103631j372654j675134k280670j782604k101046j556871n65268j158940
2445H8610444j955256j517063p07300r87657j334724n22642p53366o43907j187830
2436G9000699j458853q05963J24116r32281m13766o45885m11003N54609L96069
2427G5407742q64700l0657L55447K59427l68465M14729L21397M5352Q86711J83764
2417G6610747Q14104n0687n13225R21120q4015K44546o43338n9897K76464k33308
2407G7282511j16136l54270k08757j400251l07098j53578j081596l09779o54083
$$ plain form
2469 129819594 127931248 127176599 125914011 124672012 122739184 120928189 119390211 117411395
2461 117411395 115829985 114362144 111668812 109087600 107381730 105456766 103448238 101103631
2453 101103631 99730977 98055843 95775173 93992569 91891523 90334652 89769384 88610444
2445 88610444 86655188 85138125 84430825 83443168 82108444 81585802 80832436 80188529 79000699
2436 79000699 77541846 76735883 76859999 75927718 75513952 74868067 74457064 75011673 75407742
2427 75407742 74543042 74512385 74867832 75127259 74758794 75173523 75494920 75540272 76426983 76610747
2417 76610747 77424851 77374164 76860939 77782059 77698044 77942590 77299252 77239355 77515819 77282511
2407 77282511 77166375 76812105 76603348 75203097 74895999 74742421 73660825 73351046 72696963
2398G2696963j002149j704198j949830q63040j468837j391925j025973q66349
2390F2424662r20480j137229j548770k004342j223258j456824j287296j703905
2382E1142558j258880j207215j071687m04428j814795n83911r68556j403859r30592
2373D1498635l87885j010405j023917p74863n92599N65663o30043j009851O21962
2364C7256697l87791l91664J60225o96193L15056K77115K486n40185j99254J93001
2354C5989493L1061k93880q00711q0033l99268K74164J43256M61314Q0592n74832
2344C4831156p91286l25684k23824o8829j468712n28417P41205o47934p78480
2335C0739195r68571m16986K95108r29833k23915m3229m68299p39529j259811
$$ plain form
2398 72696963 71694814 69990616 68040786 67177746 65708909 64316984 63291011 62424662
2390 62424662 61504182 60366953 58818183 56813841 55590583 54133759 52846463 51142558
2382 51142558 49883678 48676463 47604776 47200348 45385553 44801642 43833086 42429227 41498635
2373 41498635 41110750 40100345 39076428 38301565 37708966 38274629 37644586 36634735 37256697
2364 37256697 36868906 36477242 36637467 35941274 36256330 36533445 36535931 35995746 35796492 35989493
2354 35989493 36020554 35726674 34925963 34845930 34446662 34720826 34864082 35325396 35405988 34831156
2344 34831156 34039870 33714186 33490362 33421533 31952821 31424404 32165609 31517675 30739195
2335 30739195 29770624 29353638 29648746 28718913 28494998 28451769 27983470 27243941 25984130
2326B5984130o23925n83361k73773L73338n17074p42317o33915n76671j63701
2317B2242731m58275j38510M54828q63694q54027p08097J19660L47401q41413
2308A9300604k78467m1206J1242k61161o5533q7664o07776r9214r96394n99167
2298A6275264O64241o900J18636m26619m28614p1640J63396l77124r7347l42660
2288A5470633P2747m58207k23521M36731l58548m73980o94121K96944J18376O32455
2278A4819509m06639l22173q1608L01740m8863l90187K49283q17577L44269j39695
2268A3508059K00633Q1781L88230p58576K3764j22505l57347J63349m94273j86968
2258A2446147K29837O13718L59912j485p6990j023145l81309L13351M51148k41925
$$ plain form
2326 25984130 25360205 24776844 24503071 24876409 24359335 23617018 22983103 22406432 22242731
2317 22242731 21784456 21645946 22100774 21237080 20383053 19674956 19794616 20142017 19300604
2308 19300604 19022137 18980931 18992173 18731012 18665479 18577815 17970039 17870825 16874431 16275264
2298 16275264 16939505 16932605 17051241 16624622 16196008 16124368 16287764 15910640 15813293 15470633
2288 15470633 15543380 15085173 14861652 15298383 14939835 14465855 13771734 14068678 14187054 14819509
2278 14819509 14412870 14090697 14009089 14310829 14261966 13871779 14121062 13303485 13647754 13508059
2268 13508059 13708692 13790473 14178703 13420127 13443891 13321386 12964039 13127388 12633115 12446147
2258 12446147 12675984 13289702 13649614 13648129 13571139 12547994 12166685 12480036 12931184 12689259
2248A2689259M55796J237910o45942j185840j81622o562M62803p9819J01921N5374
2238A2903278Q40868K57433j57221J2643r1346l6555J90738P08510n08063K09178
2228A4329463O53120O56811K18478q85131O2344L72727M94509N50631J40776l26431
2218A6267297L5394M48710J35446j69273L72297J093159K33986k53687J48278
2209A8311607K81521Q52364R39920L06150R96710K86102K07967J89376O48103
2200B3019820J604308N43997K08137J522318J144312J737700L55832J728141J498048
2191C3362613K127252K034050J761014K075993K129877K885713L695348L817467
2183E3889327L796114M071126M115024L142108R95876j911986n164783o736639
$$ plain form
2248 12689259 13145055 14382965 13737023 12551183 12369561 12362999 12825802 12745983 12847904 12903278
2238 12903278 13744146 14001579 13844358 13857001 13765655 13729100 13919838 14628348 14120285 14329463
2228 14329463 14982583 15639394 15857872 14972741 15035085 15407812 15902321 16452952 16593728 16267297
2218 16267297 16302691 16751401 16886847 16717574 17089871 18183030 18417016 18163329 18311607
2209 18311607 18593128 19445492 20385412 20691562 21688272 21974374 22182341 22371717 23019820
2200 23019820 24624128 25168125 25376262 26898580 28042892 29780592 30136424 31864565 33362613
2191 33362613 35489865 37523915 39284929 41360922 43490799 46376512 50071860 53889327
2183 53889327 57685441 61756567 65871591 69013699 70009575 68097589 62932806 56196167
2175E6196167o920647n134040l878189l059082l071976j616394j806573j433398
2167B9275868j128594j481027j217645j331436o99936r51892Q8649n61634r45425
2158B1046928N0126n84594j007764K10M11090l67825q06559l96531p39650o71189
2148A6934242m87605n56390j467358k28077L0114l53441O10492n94307l18885
2139A3568785m44569l40109q6734q55319l93181o16030j5710J69689N2808j34495
2129A0905135j95855r20912o62231N77327l19433k20461j76648L98490l89854
2120H995558K37029J72397K64930m67823r66165o04484J89604K82720J90197P49741
2110I043704o72852k1945k65289r61522l30268j70938j19780j33180J57408l57837
$$ plain form
2175 56196167 49275520 44141480 40263291 37204209 34132233 32515839 30709266 29275868
2167 29275868 28147274 26666247 25448602 24117166 23417230 22465338 22553987 21992353 21046928
2158 21046928 21097054 20512460 19504696 19504906 19915996 19548171 18741612 18345081 17605431 16934242
2148 16934242 16446637 15890247 14422889 14194812 14224926 13871485 14481977 13887670 13568785
2139 13568785 13124216 12784107 12697373 11842054 11448873 10832843 10817133 10986822 11039630 10905135
2129 10905135 10709280 9788368 9126137 9703464 9384031 9163570 8986922 9385412 8995558
2120 8995558 9232587 9404984 9669914 9202091 8235926 7631442 7821046 8103766 8293963 9043704
2110 9043704 8370852 8348907 8083618 7122096 6791828 6620890 6501110 6367930 6525338 6167501
2100F167501j09225L30801K40391K90533o69686l12074L375J44941m00932O4656
2090E750281k32955L09986M30879J2350l46762N2687o30644l01513o01042M33052
2080D876319Q7374p14101J028478l61528q4026m68846R39714m2147p98637m81727
2070C980873j0498K10979k61794k08795R2867N61013K74265j014967M39365K18727
2060D282035N48638p26769n07119l3998L77164J70575K75152p90786n11474N14814
2050C598232j82170K65813Q43670M5141l6506L25882o06153q53270n20736K24290
2040C104193L13363l9500j99730L05754n75425K21107L12535k25096l9900O24044
2030C801345n17022m70159P39067N370n72021m2388j38816M6335O6951m15596
$$ plain form
2100 6167501 6058276 6389077 6629468 6920001 6250315 5938241 5941616 6086557 5685625 5750281
2090 5750281 5517326 5827312 6258191 6270541 5923779 5976466 5345822 5044309 4443267 4876319
2080 4876319 4963693 4249592 5278070 4916542 4832516 4363670 5303384 5261237 4462600 3980873
2070 3980873 3970375 4181354 3919560 3710765 3803632 4364645 4638910 3623943 4063308 4282035
2060 4282035 4830673 4103904 3596785 3562787 3939951 4110526 4385678 3594892 3083418 3598232
2050 3598232 3416062 3681875 4525545 4570686 4534180 4860062 4253909 3400639 2879903 3104193
2040 3104193 3417556 3378056 3178326 3484080 2908655 3129762 3442297 3217201 3177301 3801345
2030 3801345 3284323 2814164 3553231 3558601 2986580 2944192 2805376 2851711 2918662 2503066
2020B503066j45214J9602r38212k87158O0602R15227K69969r33419r6115K37491
2010A605839O0151M67165L45650n87885O20838j62111o40933l24863q80371N09326
2000A012806M63922J29537L11615p10279L11250M9069j78228K55974L5629n4269
1990A627026K30739J17817j2618L84900o06338l46586j0899P69963o277j26980
1980B020747p48448M7509P50866q5445n90064o37629N02449N66135q6089L22912
1970B062943L18990J70117m64025j117630o7411P90289J91977K5324n6719j80715
1960A673140l59608L51630l00089N46006o27639l11487J25613M35928L41612M37458
1950B312564j92927l05905n51645J49599Q36420j72664J56531o91185j39734p1422
$$ plain form
2020 2503066 2357852 2377454 1439242 1152084 1212686 2127913 2397882 1464463 1368348 1605839
2010 1605839 1665990 2133155 2478805 1890920 2511758 2349647 1708714 1383851 503480 1012806
2000 1012806 1476728 1606265 1917880 1207601 1518851 1567920 1389692 1645666 1681295 1627026
1990 1627026 1857765 1975582 1962964 2347864 1741526 1394940 1384041 2154004 2147727 2020747
1980 2020747 1272299 1319808 2070674 1985229 1395165 757536 1259985 1826120 1740031 2062943
1970 2062943 2381933 2552050 2088025 970395 902984 1693273 1885250 1910574 1853855 1673140
1960 1673140 1313532 1665162 1365073 1911079 1283440 971953 1097566 1533494 1875106 2312564
1950 2312564 2119637 1813732 1262087 1411686 2248106 2075442 2231973 1540788 1401054 1329632
1940A329632M94933N19046n36700j31995j04j10202k73361p2810m52521j49579
1930F16339Q53504L75724k95401P1224M9101K1255M49561n99937p07368J89577
1920A023579N35872p3309Q70677o3436q12708k11595O21270j91954l23141j49045
1910A226210M66729j161136m7302J76383K67078n5188k26773K5550J002490l01917
1900A372124R6453Q52400O6482o43946l58001m1905N01754l13091m61203Q55565
1890A926632K75472L85564p54903l24263l15273K2292M43078L5980L97619L7924
1880B130122M66688n39511m10873M10650N91150L6063M6284J71587r38538J86053
1870B149675L33488P25606n52668J62270L10641K09912j45996M18376l70154j97145
$$ plain form
1940 1329632 1824565 2343611 1806911 1674916 1674812 1564610 1291249 1218439 765918 616339
1930 616339 1469843 1845567 1550166 1621390 1670491 1691746 2141307 1541370 834002 1023579
1920 1023579 1559451 1486142 2356819 2293383 1480675 1269080 1890350 1698396 1375255 1226210
1910 1226210 1692939 531803 484501 660884 927962 872774 646001 671551 1674041 1372124
1900 1372124 1468577 2320977 2387459 1743513 1385512 1343607 1845361 1532270 1071067 1926632
1890 1926632 2202104 2587668 1832765 1508502 1193229 1215521 1658599 1694579 2092198 2130122
1880 2130122 2596810 2057299 1646426 2057076 2648226 2684289 2730573 2902160 1963622 2149675
1870 2149675 2483163 3208769 2656101 2818371 3129012 3338924 3192928 3611304 3241150 3044005
1860C044005m59172m12283L91957M1266N2949K44043L16513J77887M95656N48805
1850D441626k67473J47069k56490o19782N8834Q0832n36968K10100K19072o59664
1840B817156N69885N51853K51505l3262L18764K33288N42906J22414j16481k05754
1830E052274m20859M32852Q75602m32179o68955K93158L28125L84249k34883K10478
1820E819862M90678L70586N21692K30592K79543j069829q68262L46724p25311
1811E396275l19623o15913n10252K59562N34500j98111k32108N53050l90474N27263
1801E004169M8571m14214r9382L09454k09221J17165L16935L9614p6772M16105
1791E452424N54906n59683P1586l18487k76906Q37235k28032j82207m75288O2093
$$ plain form
1860 3044005 2584833 2172550 2564507 2605773 2658722 2902765 3219278 3397165 3892821 4441626
1850 4441626 4174153 4321222 4064732 3444950 3503784 3584616 3047648 3257748 3476820 2817156
1840 2817156 3387041 3938894 4190399 4157137 4475901 4709189 5252095 5374509 5258028 5052274
1830 5052274 4631415 5064267 5939869 5507690 4838735 5131893 5460018 5844267 5609384 5819862
1820 5819862 6310540 6681126 7202818 7433410 7712953 6643124 5774862 6121586 5396275
1811 5396275 5076652 4460739 3950487 4210049 4744549 4546438 4314330 4867380 4476906 5004169
1801 5004169 5052740 4638526 4539144 4848598 4639377 4756542 5073477 5113091 5036319 5452424
1791 5452424 6007330 5447647 5519233 5200746 4923840 5761075 5533043 5350836 4875548 4937641
1781D937641l02599P1272K62339l07166p01819j89332p985l51358P09990j22790
1771C998193J07794J49559p62195M90911j34043k83897m7001m02342M00650m41381
1761C076248M0586k40168j94221J21669k22436j13345K2197o236l28250o88712
1751A467332N25172L20591o53481j267613J844985O86610j014228P820l16279
1742A600909l6347N46606l21680j81568J45715q22519l34114J25357n56335K71184
1732D37208L12476N56319L64001j011081m1357j31220M81398j89832n06308o26709
1722c55105Q36212M78630l78661M61562j55843M94351j55230j2785m44822j73911
1712E94398N92989o3994l77699K48331r34231K95211j76816k56116N45599R0821
$$ plain form
1781 4937641 4635042 4706314 4968653 4661487 3959668 3770336 3762351 3410993 4120983 3998193
1771 3998193 4105987 4255546 3493351 3984262 3850219 3566322 3519321 3116979 3517629 3076248
1761 3076248 3116834 2876666 2682445 2804114 2581678 2468333 2490530 2484294 2156044 1467332
1751 1467332 1992504 2313095 1659614 392001 2236986 2923596 1909368 1917188 1600909
1742 1600909 1564562 2111168 1789488 1607920 1753635 931116 597002 722359 166024 437208
1732 437208 749684 1306003 1670004 658923 617566 486346 967744 777912 271604 -355105
1722 -355105 481107 959737 581076 1042638 886795 1381146 1225916 1213131 768309 594398
1712 594398 1187387 1123393 745694 994025 59794 355005 178189 -77927 467672 558493
1702E58493p1756O21414r03720o31641K34532j58963P66970k73182k09330k10682
1692b77865J85055l33361K78436J01169J68636l70699K72686n482j79019L25351
1682A64907l72168L14187K55464p86409O59352P15815j78496m60696j83595m27676
1672b99315q9959K46707L29415L5826p40772l85866Q30668M4347k72759K18075
1662h3633K02775p16306M48696M60521m37678l23725K89463j69688m89748M57606
1652c61717L5050k31815K69869N36587o68854J68155M99122n81699M60325M66189
1642E91212j390384o05687Q00049J026271K31890n99515k40720L93340p08501
1633e02045j31556j87586M91566Q75386q3227l54830l01220m28651j72630M93125
$$ plain form
1702 558493 486737 1108151 204431 -427210 -192678 -351641 415329 142147 -67183 -277865
1692 -277865 -92810 -426171 -147735 -46566 122070 -248629 24057 18575 -160444 164907
1682 164907 -207261 106926 362390 -424019 235333 951148 772652 311956 128361 -299315
1672 -299315 -389274 -142567 186848 222674 -518098 -903964 -73296 -28949 -301708 -83633
1662 -83633 119142 -597164 -148468 312053 -125625 -449350 -159887 -329575 -819323 -361717
1652 -361717 -326667 -558482 -288613 247974 -420880 -252725 246397 -335302 125023 591212
1642 591212 -799172 -1404859 -604810 421461 653351 53836 -186884 206456 -502045
1633 -502045 -633601 -821187 -329621 545765 462538 107708 -193512 -622163 -794793 -301668
1623c01668r2184K21577j22840j19876R3933l13429l79811L86451K57376p86454
1613a156925n80431J239897M64333P7223m12116n9484q7394m96431J33298P44541
1603a33489n82346p88177P67754J88740j33845m3743j53708j13318J08756k88669
1593a172045M94482J6377r1596p5166K20011P77802k30204k70223K78734m93140
1583e44968O20346L40385p73538k44517J92389m90874l09777R02908Q1336K73989
1573D7679O4305m82212j4475p1404P8260N90850n18439r26065J25373Q24122j39374
1562d21380q26965K17818q2051J00237O76199M67948m45242j9337n05418j65706
1552a003897o835K86383o6515l46276j57623J039354K5613j48811M6254j20414
$$ plain form
1623 -301668 -393852 -172275 -295115 -414991 -321058 -634487 -1014298 -627847 -370471 -1156925
1613 -1156925 -1737356 -497459 -33126 44097 -368019 -427503 -514897 -1011328 -878030 -133489
1603 -133489 -715835 -1504012 -736258 -547518 -681363 -725106 -878814 -992132 -883376 -1172045
1593 -1172045 -677563 -661186 -752782 -827948 -607937 169865 -60339 -330562 -51828 -544968
1583 -544968 75378 415763 -357775 -602292 -409903 -900777 -1210554 -307646 -226310 47679
1573 47679 111984 -370228 -384703 -456107 -377847 213003 -305436 -1231501 -1106128 -282006 -421380
1562 -421380 -1248345 -1030527 -1112578 -1012341 -336142 131806 -313436 -332773 -838191 -1003897
1552 -1003897 -1010732 -724349 -790864 -1137140 -1294763 -255409 -229796 -378607 -332353 -452767
1542d52767m69788j75078n8403O12345J91324k29216M12470K41430m56863j5048
1532c99594L82930j65733K90461n15132o3912p7090K5426l43986O00284O68800
1522D02454L6648l49210p00966m98136J33189j7340L81616l12592p59266L62772
1512a320831R47302k85414j0903j5602j92428R6154J41410J98390M2958l03380
1502g02344K79265Q12529k77724m49402o09198J82815R29021j53666j38697m65985
1492e93386k05402N42049m15371J71364J69518n43839o1291M18068L04430j80696
1482c94556L0988J28029K34313j51694q04736q3257Q33833q35394n8367L43844
1472g56997L5448M5531k98471j69806M56048P72486l34314j70337o7835L43385
$$ plain form
1542 -452767 -922555 -1097633 -1156036 -543691 -352367 -581583 -169113 72317 -384546 -399594
1532 -399594 -16664 -182397 108064 -407068 -470980 -548070 -522644 -866630 -266346 402454
1522 402454 439102 89892 -611074 -1109210 -976021 -993361 -611745 -924337 -1683603 -1320831
1512 -1320831 -373529 -658943 -669846 -685448 -877876 -781722 -640312 -441922 -398964 -702344
1502 -702344 -423079 389450 111726 -337676 -946874 -764059 164962 11296 -127401 -593386
1492 -593386 -798788 -256739 -672110 -500746 -331228 -875067 -936358 -518290 -213860 -394556
1482 -394556 -363568 -235539 -1226 -152920 -957656 -1040913 -207080 -1042474 -1100841 -756997
1472 -756997 -721549 -676018 -974489 -1144295 -688247 84239 -250075 -420412 -488247 -144862
1462a44862P93503P17695o93627n68884n20093J28907k65750M54931j048820r52317
1452b099317O07310J088002n9666j92763M71671k29006O7123p47713L87637N31730
1442a74992q92820m26363L54895L28888k47007p05841M65668R05494m25026j15607
1432i32711p198k94618P16798L12299L03685M68150N698o25466K35452m1284n57069
1421d16264K01455J05603r80431L89122N51944P1398j77739j47588n98324j10159
1411a110983o75087O10833M62156M41890L28771o02587l04740j19738j9883K93849
1401f95519M29222n39372p6028L18406j00127k41218M20059m06144O34273P52182
1391D95734l84623l10593m13403j16221r37507L21044R17970m52686k8173m7563
$$ plain form
1462 -144862 648641 1366336 672709 103825 -416268 -287361 -553111 -98180 -1147000 -2099317
1452 -2099317 -1492007 -404005 -463671 -656434 -184763 -413769 -346646 -1094359 -706722 -174992
1442 -174992 -1067812 -1494175 -1139280 -810392 -1057399 -1763240 -1297572 -392078 -817104 -932711
1432 -932711 -939909 -1234527 -517729 -205430 98255 566405 572103 -53363 182089 140805 -416264
1421 -416264 -214809 -109206 -1089637 -700515 -148571 -77173 -254912 -402500 -1000824 -1110983
1411 -1110983 -1786070 -1175237 -713081 -271191 57580 -545007 -849747 -969485 -989368 -695519
1401 -695519 -266297 -805669 -881697 -563291 -663418 -904636 -484577 -890721 -256448 495734
1391 495734 111111 -199482 -612885 -729106 -1666613 -1345569 -427599 -880285 -908458 -956021
1381i56021J08601J79112M5530k01831k20335k0624l07724M8113n8224p0822o5005
1370a519230J44290N02640J63249K81085m57016n18277P73712K74881j84172L07920
1360b30918j90328N4011K0790K93482J2534k8619o38947m9034j21175L40575N95911
1349E8282r5033l32000j26991J29071N21915M90951l53832j37860p26057o38614
1339a210168J52044O30543n805j77743M93150m10626k13148o68348M39036L20312
1329f50753j91342l9184O89415j38731j347593J97098M76247l13228M43761J58586
1319g15724L36951j50352K50031r4085k79477N67927M45496m35338r72815J33951
1309i13435M17250l36035R9916L05515j02751P26813K89782j00016l65256r37073
$$ plain form
1381 -956021 -847420 -668308 -622778 -824609 -1044944 -1065568 -1373292 -1325179 -1383403 -1454225 -1519230
1370 -1519230 -1374940 -872300 -709051 -427966 -884982 -1403259 -629547 -354666 -538838 -230918
1360 -230918 -421246 -367235 -346445 -52963 -40429 -69048 -707995 -757029 -878204 -537629 58282
1349 58282 -36751 -368751 -495742 -366671 155244 646195 292363 154503 -571554 -1210168
1339 -1210168 -1058124 -427581 -433386 -611129 -117979 -528605 -741753 -1410101 -971065 -650753
1329 -650753 -842095 -881279 -191864 -330595 -1678188 -1481090 -1004843 -1318071 -874310 -715724
1319 -715724 -378773 -529125 -279094 -373179 -652656 -84729 360767 -74571 -1047386 -913435
1309 -913435 -496185 -832220 -732304 -426789 -529540 197273 487055 387039 21783 -915290
1299i15290l56230L76316N6095L53807k09815P15055j93000k96055n5301n0393
1289e74811o85361M81286J49143k94857N7586j47312M86660k10189O6025N42660
1279a29170j79707k33364J5237j59745J34920j65441J010387o8326n56585K42273
1269h9521K80079p5001j04534n50050n50507J209153M01045l83386r3012R41946
1259I86212j79067P05730q65195Q1338O27237m46290o9740j17818L86533q23136
1249B85804L86069k37960n13158N85378J88528o68403l15677K88304j47295l20696
1239d69106Q54975K12269K94253n50793q07122K40543m12777k48200M68556O95662
1229B78260n27848L46078k8567K80565M39159n46712j29330J57715n1745n37970
$$ plain form
1299 -915290 -1271520 -895204 -839109 -485302 -695117 19938 -173062 -469117 -524418 -574811
1289 -574811 -1260172 -778886 -629743 -924600 -867014 -1014326 -527666 -737855 -671830 -129170
1279 -129170 -308877 -542241 -527004 -686749 -551829 -717270 293117 224791 -331794 -89521
1269 -89521 190558 115557 11023 -539027 -1089534 119619 520664 137278 44266 986212
1259 986212 807145 1512875 647680 729018 1356255 909965 840225 722407 1108940 285804
1249 285804 671873 433913 -79245 506133 694661 26258 -289419 -1115 -148410 -469106
1239 -469106 385869 598138 892391 341598 -465524 -224981 -637758 -885958 -417402 278260
1229 278260 -249588 96490 67923 348488 787647 240935 111605 269320 217575 -320395
1219c20395N67253n75957k0299K46079j13836r2354l68744l57589n64353J119245
1209d80950N80250n96272L55102L98643l57391J50301J38294l49315n66008M02332
1199c25014R96466o0826p31255p41276N25157Q14706J86350J39843j063094n85838
1189h44781J21652n7969j34574L39786O0533P07804l76627j0625K73114l50711
1179b72398j14947Q5036Q6734j22304l232K00543o8743k49475O72222K49870L69542
1168H32848k16271p72021M47900L78397l83289N90496m96817Q9475K06787l1504
1158F46001M05092K3031o98454Q1324m99994Q63839L2437J99656Q3572q19798
1148C16706K36098k33430N8456l71779R8235L00040K32014M17100l6841P94676
$$ plain form
1219 -320395 246858 -329099 -349398 -103319 -217155 -309509 -678253 -1035842 -1600195 -480950
1209 -480950 99300 -496972 -141870 256773 -100618 49683 187977 -161338 -727346 -325014
1199 -325014 671452 610626 -120629 -861905 -336748 477958 664308 804151 -258943 -844781
1189 -844781 -723129 -781098 -915672 -575886 -515353 192451 -184176 -194801 78313 -272398
1179 -272398 -387345 -302309 -215575 -337879 -341111 -140568 -209311 -458786 213436 463306 832848
1168 832848 616577 -155444 292456 670853 287564 878060 381243 470718 677505 646001
1158 646001 1051093 1074124 375670 456994 -43000 820839 853276 1052932 1136504 316706
1148 316706 552804 319374 377830 6051 104286 404326 636340 1053440 1016599 1811275
1138A811275q24950q54331K17718K56904K16694O05888q0804n70891M6193q3381
1128G40315J03999m49249O93680j25790M8829J77728J87910J4254p72897r06971
1118b88192m07835M88800K73261Q01510N62562L08991p36005L7463R64516p92105
1108A212966L07764j43897k74049L08946n61728Q62056j97003l15910Q14782m76673
1098A537254L39214O4807n51680L54241K33246l43869N09394N44858Q10795j88829
1088C309431k39550k38713K14720Q0872L37937m82340p48407P0773M22966l83017
1078B344672p00250J22974J38416L59613p5047L4901o61937P31024K18305r6515
1068B416156k98528p1970L36540L90636m72069R09912N32645k03060K29017k54616
$$ plain form
1138 1811275 986325 131994 349712 606616 823310 1429198 1348394 777503 823696 740315
1128 740315 844314 395065 1088745 962955 1011784 1189512 1377422 1391676 618779 -288192
1118 -288192 -696027 -207227 66034 867544 1430106 1739097 1003092 1040555 2005071 1212966
1108 1212966 1520730 1376833 1102784 1411730 850002 1712058 1515055 1199145 2013927 1537254
1098 1537254 1876468 1941275 1389595 1743836 1977082 1633213 2142607 2687465 3498260 3309431
1088 3309431 3069881 2831168 3045888 3126760 3464697 2982357 2233950 2304723 2727689 2344672
1078 2344672 1644422 1767396 1905812 2265425 2190378 2225279 1563342 2294366 2512671 2416156
1068 2416156 2117628 2045658 2382198 2772834 2300765 3210677 3743322 3540262 3769279 3514663
1058C514663N04329n3380P92873n8151o82629q6261L35204K51109L00665k61858
1048D556564K67736p61060o01998M58919K61132N49053q1837P8733L11415P18214
1038E756871K49877j49527K11208J54500j37959p46016J046070M21897j36375
1029F670546j0938L71583K20299m20014O00787O25626L69856q14689r1373J212296
1019H733979o96612O14151R80889O06702O87173p3272l99898l2380j85742R53468
1009A1188458M11501J00506N21260L85814J813581R72338J466683P89029K67947
1000A7917117K034361K026115P77633M06876P68350K148278J056227J273775J876622
991C0285354J733275L57032J864529J540295K501002L304657L447586L755949
$$ plain form
1058 3514663 4018992 3965612 4758485 4700334 4017705 3931444 4266648 4517757 4818422 4556564
1048 4556564 4824300 4063240 3461242 3920161 4181293 4730346 4648509 4727242 5038657 5756871
1038 5756871 6006748 5857221 6068429 6222929 6084970 5338954 6385024 6806921 6670546
1029 6670546 6659608 7031191 7251490 6831476 7432263 8057889 8427745 7613056 7521683 8733979
1019 8733979 8037367 8651518 9632407 10239109 10926282 10853010 10453112 10420732 10234990 11188458
1009 11188458 11599959 11700465 12221725 12607539 14421120 15393458 16860141 17649170 17917117
1000 17917117 19951478 21977593 22755226 23162102 23930452 26078730 27134957 28408732 30285354
991 30285354 32018629 32375661 34240190 35780485 38281487 41586144 45033730 48789679
983D8789679M699350L351995L962876L854646M730546O328366P726784R465983
975I2910225J2394886J5417241K1171134K8093308L2273586L1519297L3642072
968B67421749K9419417R495980l1248257o1341896m9808328l4987275k3429961
961A05521429j6012539j2395548r626651n584211n030330m062502m083572k183803
953D6542273k273477k005751k022927l138154k351938k675567k774095k073299
945B7227065k544910j427358j392935p43987k001223k58559m57584r94414j64687
936A7241408q84761o20840k51723M31987n53336j502713r88771L83419j120109
927A2134561n675m63141M96342r53158j110739l09537n27079j45341J61188l97250
$$ plain form
983 48789679 53489029 56841024 60803900 64658546 69389092 75717458 83444242 92910225
975 92910225 105305111 120722352 141893486 169986794 202260380 233779677 267421749
968 267421749 296841166 306337146 275088889 213746993 163938665 128951390 105521429
961 105521429 89508890 77113342 67486691 61902480 56872150 52809648 48726076 46542273
953 46542273 44268796 42263045 40240118 37101964 34750026 32074459 29300364 27227065
945 27227065 24682155 23254797 21861862 21117875 19116652 18858093 18400509 17406095 17241408
936 17241408 16356647 15735807 15484084 15916071 15362735 13860022 12871251 13254670 12134561
927 12134561 12128886 11665745 12162087 11208929 10098190 9788653 9261574 9116233 9277421 8880171
917H880171J2539r3247K79590j067760r86179l80112M58430N86601m84076J89797
907G395754r04921j15549K31424k58524q1016j17320p80256o10271J03839p1803
897D791357J49889k25858l88350k60187m64754O36846l4505N90604m89726k91407
887D013909J86972q18031l68628k13319N82893L92796j81157m86383m41209Q3469
877B751312R85249J50389n42738j355479L38338K96335n8712L20671k23995k45419
867B415951j72830O25505l31076l42800l68619l5776J3457J11765r1857l0009
857A793711L15285J91654m17207J9289l65261L56037K05307l10878m03680m06615
847I77642m81067J53647r7263M21134L49738n46061j279236o1241J639979M07197
$$ plain form
917 8880171 8892710 8799463 9079053 8011293 7025114 6645002 7103432 7690033 7205957 7395754
907 7395754 6490833 6375284 6606708 6348184 6267168 6149848 5369592 4759321 4863160 4791357
897 4791357 4941246 4715388 4327038 4066851 3602097 4238943 4204438 4795042 4305316 4013909
887 4013909 4200881 3382850 3014222 2800903 3383796 3776592 3595435 3109052 2667843 2751312
877 2751312 3736561 3886950 3344212 1988733 2327071 2623406 2564694 2885365 2661370 2415951
867 2415951 2243121 2868626 2537550 2194750 1826131 1790355 1803812 1915577 1823720 1793711
857 1793711 2108996 2300650 1883443 1902732 1537471 1893508 2098815 1787937 1384257 977642
847 977642 496575 650222 552959 974093 1323831 777770 -501466 -562707 1077272 1484469
837A484469L07701o13633n93084R12230n7941j06777k41318k58483P4345j88391
827G19118J19895j72857J32644J05347N48910n2250q88314q235N38765j045070
817b047L0848J59245j64200L47978K60168k72867L32621n48241M27229M43864
807A014598m06348l92883N40018M6623m63765L86991J35248m53266j12088j42880
797A52248R1023L54224j84871l47267m68831O8687K32043N99306j54501L8557
787C80618J64583L95765J58543m48146q49941L49456K38607k36730K52859R9606
777E05220l28477k1870O3831L0139j74139r012R75788K65542q79692j250239P21624
766a01285J23571l96045M04211M5993K20819p60746m61873K36784O96667J284848
$$ plain form
837 1484469 1792170 1178537 585453 1497683 1439742 1332965 1091647 833164 907509 719118
827 719118 839013 666156 798800 904147 1453057 1400807 512493 504258 1043023 -2047
817 -2047 28801 188046 23846 371824 631992 359125 691746 143505 570734 1014598
807 1014598 608250 215367 755385 802008 338243 725234 860482 407216 295128 152248
797 152248 243271 597495 412624 65357 -403474 -334787 -102744 496562 342061 380618
787 380618 545201 940966 1099509 651363 -198578 150878 389485 152755 405614 505220
777 505220 176743 154873 218704 248843 74704 65692 1041480 1307022 427330 -822909 -101285
766 -101285 22286 -373759 30452 76445 297264 -463482 -925355 -688571 8096 1292944
756A292944p50890q27352N66164l55833J4904J46618K24701Q2290l04098J56751
746B46199q3688n12834N19333N98291m68220k23174K84230O28160m99736n97976
736a09415j33851P05282K45598j73361K64971p96862K48861K31518n61754K0658
726e8355l23823J34940O19866L16303K17598J21607l20734Q538J75944J8249p3475
715H36658o97065J64035M04029p90981r5847m56472Q1961l0693O35589J31084
$$ plain form
756 1292944 542054 -285298 280866 -74967 -60063 86555 311256 393546 89448 246199
746 246199 162511 -350323 169010 767301 299081 75907 360137 988297 488561 -109415
736 -109415 -243266 462016 707614 534253 799224 2362 251223 482741 -79013 -58355
726 -58355 -382178 -247238 372628 688931 906529 1028136 707402 715940 891884 910133 836658
715 836658 139593 303628 707657 -83324 -179171 -635643 -553682 -584375 51214 182298
$$ [...]
##END NTUPLES=NMR SPECTRUM
##END=
