##TITLE=1H_TG-2324-2
 CDCl3,8 sc, 
 1.04.2021
##JCAMPDX= 6.0         $$ Bruker NMR JCAMP-DX V2.0
##DATA TYPE= NMR SPECTRUM
##DATA CLASS= NTUPLES
##ORIGIN= UXNMR, Bruker Analytische Messtechnik GmbH
##OWNER= root
$$ XWIN-NMR		Version 3.5
$$ Thu Apr  1 13:09:08 2021 Russian Standard Time (UT+4h)  she@DPX200
##.OBSERVE FREQUENCY= 200.131506
##.OBSERVE NUCLEUS= ^1H
##.ACQUISITION MODE= SIMULTANEOUS
##.ACQUISITION SCHEME= undefined
##.AVERAGES= 8
##.DIGITISER RES= 18
##SPECTROMETER/DATA SYSTEM= spect
##.PULSE SEQUENCE= zg30
##.SOLVENT NAME= CDCl3
##.SHIFT REFERENCE= (INTERNAL, CDCl3, 0, 15.9771)
##AUDIT TRAIL= $$ (NUMBER, WHEN, WHO, WHERE, WHAT)
$$ ##TITLE= Audit trail, XWIN-NMR		Version 3.5
$$ ##JCAMPDX= 5.01
$$ ##ORIGIN= Bruker BioSpin GmbH
$$ ##OWNER= she
$$ F:/spectra/data/she/nmr/H-F/1/pdata/1/auditp.txt
$$ ##AUDIT TRAIL=  $$ (NUMBER, WHEN, WHO, WHERE, WHAT)
(   1,<2021-04-01 13:07:58.56 +0400>,<she>,<DPX200>,
      <created by zg, POWCHK disabled, PULCHK disabled
       configuration hash MD5:
       00 E9 B6 7A A2 85 ED C7 34 08 36 98 17 FE 4E 26
       data hash MD5: 16K
       BC 5E 52 24 42 C1 5D 38 F3 D3 F2 AB A2 AE 5A E7>)
(   2,<2021-04-01 13:08:05.67 +0400>,<she>,<DPX200>,
      <Start of raw data processing
       efp BC_mod = 2 LB = 0.24 FT_mod = 6 PKNL = 1 PHC0 = -11120.86 PHC1 = 11.20093 SI = 16K 
       data hash MD5: 16K
       13 5C 2D 6B F8 0C 9A 97 DD 27 72 D0 7A D4 C2 73>)
(   3,<2021-04-01 13:08:27.70 +0400>,<she>,<DPX200>,
      <pk PHC0 = -6.856689 PHC1 = 14.2 
       data hash MD5: 16K
       A1 95 8A D8 35 7E B7 DC EF 12 04 5A 15 4F 1E AF>)
(   4,<2021-04-01 13:08:30.93 +0400>,<she>,<DPX200>,
      <abs ABSG = 5 
       data hash MD5: 16K
       08 AE 4C 88 15 BA 1A 84 4B 05 AC 00 5B 24 FE 7B>)
$$ ##END=
$$ 
$$ hash MD5
$$ EB B2 A4 2A FF 38 E3 B3 1F F0 5A D9 14 18 C3 DF
##$RELAX= 
##$RELAX= 
##$RELAX= 
##$RELAX= 
##$RELAX= 
##$RELAX= 
$$ Bruker specific parameters
$$ --------------------------
##$DU= <F:/spectra>
##$EXPNO= 1
##$NAME= <H-F>
##$PROCNO= 1
##$TYPE= <nmr>
##$USER= <she>
##$AMP= (0..31)
100 100 100 100 100 100 100 100 100 100 100 100 100 100 100 100 100 100 
100 100 100 100 100 100 100 100 100 100 100 100 100 100 
##$AQSEQ= 0
##$AQ_mod= 1
##$AUNM= <au_zg>
##$AUTOPOS= <>
##$BF1= 200.13
##$BF2= 200.13
##$BF3= 200.13
##$BF4= 200.13
##$BF5= 200.13
##$BF6= 200.13
##$BF7= 200.13
##$BF8= 200.13
##$BYTORDA= 1
##$CFDGTYP= 0
##$CFRGTYP= 5
##$CHEMSTR= <none>
##$CNST= (0..31)
1 1 145 1 1 1 1 1 1 1 1 1 1 1 1 1 1 1 1 1 1 1 1 1 1 1 1 1 1 1 1 1 
##$CPDPRG= <>
##$CPDPRG1= <>
##$CPDPRG2= <>
##$CPDPRG3= <>
##$CPDPRG4= <mlev>
##$CPDPRG5= <mlev>
##$CPDPRG6= <mlev>
##$CPDPRG7= <mlev>
##$CPDPRG8= <mlev>
##$CPDPRGB= <>
##$CPDPRGT= <>
##$D= (0..31)
0 1.2 0 0 0 0 0 0 0 0.06 0 0.03 0 0 0 0 0.0002 0 0 0 0 0 0 0 0 0 0 0 0 
0 0 0 
##$DATE= 1617268077
##$DBL= (0..7)
120 120 120 120 120 120 120 120 
##$DBP= (0..7)
150 150 150 150 150 150 150 150 
##$DBP07= 0
##$DBPNAM0= <>
##$DBPNAM1= <>
##$DBPNAM2= <>
##$DBPNAM3= <>
##$DBPNAM4= <>
$$ [...]
##$SUBNAM3= <"">
##$SUBNAM4= <"">
##$SUBNAM5= <"">
##$SUBNAM6= <"">
##$SUBNAM7= <"">
##$SUBNAM8= <"">
##$SUBNAM9= <"">
##$SW= 16.9725357007746
##$SWIBOX= (0..15)
0 0 2 0 0 0 0 0 0 0 0 0 0 0 0 0 
##$SW_h= 3396.73913043478
##$TD= 16384
##$TD0= 1
##$TE= 0
##$TE2= 300
##$TE3= 300
##$TEG= 300
##$TL= (0..7)
0 120 120 120 120 120 120 120 
##$TP= (0..7)
150 150 150 150 150 150 150 150 
##$TP07= 0
##$TPNAME0= <>
##$TPNAME1= <>
##$TPNAME2= <>
##$TPNAME3= <>
##$TPNAME4= <>
##$TPNAME5= <>
##$TPNAME6= <>
##$TPNAME7= <>
##$TPOAL= (0..7)
0.5 0.5 0.5 0.5 0.5 0.5 0.5 0.5 
##$TPOFFS= (0..7)
0 0 0 0 0 0 0 0 
##$TUNHIN= 0
##$TUNHOUT= 0
##$TUNXOUT= 0
##$USERA1= <user>
##$USERA2= <user>
##$USERA3= <user>
##$USERA4= <user>
##$USERA5= <user>
##$V9= 5
##$VALIST= <valist>
##$VCLIST= <CCCCCCCCCCCCCCC>
##$VD= 0
##$VDLIST= <DDDDDDDDDDDDDDD>
##$VPLIST= <PPPPPPPPPPPPPPP>
##$VTLIST= <TTTTTTTTTTTTTTT>
##$WBST= 1024
##$WBSW= 4
##$XGAIN= (0..3)
0 0 0 0 
##$XL= 0
##$YL= 0
##$YMAX_a= 328401
##$YMIN_a= -241397
##$ZGOPTNS= <>
##$ZL1= 120
##$ZL2= 120
##$ZL3= 120
##$ZL4= 120
##$ABSF1= 15.99164
##$ABSF2= -0.9810238
##$ABSG= 5
##$ABSL= 3
##$ALPHA= 0
##$AQORDER= 0
##$ASSFAC= 0
##$ASSFACI= 0
##$ASSFACX= 0
##$ASSWID= 0
##$AUNMP= <proc_1d>
##$AZFE= 0.1
##$AZFW= 0.1
##$BCFW= 0
##$BC_mod= 2
##$BYTORDP= 0
##$COROFFS= 0
##$CY= -3
##$DATMOD= 1
##$DC= 0
##$DFILT= <>
##$DTYPP= 0
##$F1P= 0
##$F2P= 0
##$FCOR= 1
##$FTSIZE= 16384
##$FT_mod= 6
##$GAMMA= 0
##$GB= 0
##$INTBC= 1
##$INTSCL= 2.992141e-10
##$ISEN= 128
##$LB= 0.24
##$LEV0= 0
##$LPBIN= 0
##$MAXI= 10000
##$MC2= 0
##$MEAN= 0
##$ME_mod= 0
##$MI= 1.114404
##$NCOEF= 0
##$NC_proc= -7
##$NLEV= 6
##$NOISF1= 3.799351
##$NOISF2= 2.8
##$NSP= 0
##$NTH_PI= 0
##$NZP= 0
##$OFFSET= 15.97713
##$PC= 1
##$PHC0= -11127.72
##$PHC1= 25.40093
##$PH_mod= 1
##$PKNL= yes
##$PPARMOD= 0
##$PSCAL= 0
##$PSIGN= 0
##$REVERSE= no
##$SF= 200.130006866111
##$SI= 16384
##$SIGF1= 3
##$SIGF2= 2
##$SINO= 5.538805
##$SIOLD= 16384
##$SREGLST= <1H.CDCl3>
##$SSB= 0
##$STSI= 16384
##$STSR= 0
##$SW_p= 3396.73913043479
##$SYMM= 0
##$S_DEV= 0
##$TDeff= 16384
##$TDoff= 0
##$TI= <>
##$TILT= no
##$TM1= 0
##$TM2= 0
##$TOPLEV= 0
##$USERP1= <user>
##$USERP2= <user>
##$USERP3= <user>
##$USERP4= <user>
##$USERP5= <user>
##$WDW= 1
##$XDIM= 16384
##$YMAX_p= 317741503
##$YMIN_p= -855005
$$ End of Bruker specific parameters
$$ ---------------------------------
##NTUPLES= NMR SPECTRUM
##VAR_NAME=  FREQUENCY,     SPECTRUM/REAL,   SPECTRUM/IMAG
##SYMBOL=    X,             R,               I
##VAR_TYPE=  INDEPENDENT,   DEPENDENT,       DEPENDENT
##VAR_FORM=  AFFN,          ASDF,            ASDF
##VAR_DIM=   16384,         16384,           16384
##UNITS=     HZ,            ARBITRARY UNITS, ARBITRARY UNITS
##FACTOR=    0.207333158178282, 1,           1
##FIRST=     3197.50312383611, 0,            0
##LAST=      -199.236006598682, 0,           0
##MIN=       -199.236006598682, -855005,     0
##MAX=       3197.50312383611, 317741503,    0
$$ Real data points
##PAGE= N=1
##DATA TABLE= (X++(R..R)), XYDATA
$$ [...]
8728 5868726 6269205 6386009 6489765 6662581 6781931 7030188 7166080 7454288 7821971 8107243
8718 8107243 8824241 9178419 9493783 9854086 10142095 10847490 11402541 11861002 12546833 13049741
8708 13049741 13513473 14176534 15063936 15702135 16507817 17516285 18715709 19910623 21304323
8699 21304323 22564084 24201097 26335348 28186472 30287340 32591355 34892546 37346267
8691 37346267 39860687 42437569 44814236 46885079 48809125 50079210 50747013 50896598
8683 50896598 50257417 48952279 47460815 45227138 42796015 40085852 37188788 34321463
8675 34321463 31430585 28774993 26279764 24050032 21877465 19922495 18499874 17004832
8667 17004832 15635892 14539926 13488427 12492792 12004458 11129635 10511403 10118422 9550943
8658 9550943 8885732 8464212 8338233 8068140 7548014 6978665 6659048 6424656 6245485 5981668
8648 5981668 5831793 5529312 5302477 5416014 5097239 4792215 4819151 4691178 4407661 4070303
8638 4070303 3915745 3813438 3554910 3362768 3355298 3150119 3349680 3316786 3162131 2996375
8628 2996375 2866797 2714381 2829749 2542633 2425719 2412206 2403384 2292386 2337124 2185754
8618 2185754 2203224 2159914 2046318 2045909 1961365 2007685 2006325 2019805 1923556 2026127 2154789
8607 2154789 2100328 2035441 2121722 1559141 1627241 1578294 1457366 1535232 1672364 1589740 1503773
8596 1503773 1354097 1325518 1464313 1492611 1332909 1136674 1274717 1506265 1439426 1441392
8586 1441392 1329578 1302165 1293555 1215060 1128365 1141133 1252429 1261874 1129503 1112471 1193611
8575 1193611 1062531 1168202 1116088 1150569 1353701 1107227 896685 716959 818046 955012
8565 955012 889128 1157552 1094027 916640 1086178 1070687 1018692 1013178 1103815 938327 804754
8554 804754 756446 697825 817069 886917 899733 832359 659267 763503 1021827 998868 764663
8543 764663 731196 843856 876053 831355 792647 857053 1016489 1027064 986887 1059335 1048042
8532 1048042 1108531 1098844 1024652 972466 992482 995933 896941 814232 1179984 1334241 1252183
8521 1252183 1090211 945742 965800 1049493 949309 1110533 1087817 1006793 1011534 1212632 1463219
8510 1463219 1270646 890811 970348 996760 939419 981668 1151369 985300 975903 1074565 1043406
8499 1043406 903407 965837 980872 936579 959990 1002435 1089736 1246138 1316765 1435956 1203513
8488 1203513 955751 908401 1047849 1151868 1179873 1318661 1315963 1184982 1300590 1370011
8478 1370011 1242576 1205187 1179188 1262477 1192288 1171981 966524 1054323 1045927 1012707 1148402
8467 1148402 1457743 1516363 1301498 1100708 1177487 1056766 1075114 1097123 1039293 1161533
8457 1161533 1117534 1095020 1077217 1063229 1218027 1213873 1358503 1402412 1333617 1424220 1316920
8446 1316920 1159826 1052471 949786 943926 1075857 1188758 1227395 1286378 1148850 1130388
8436 1130388 1077635 1279961 1334166 1491693 1762259 1571852 1336431 1305096 1321429 1251785
8426 1251785 1145109 1140593 1058065 885675 961075 1380850 1397441 1344866 1510859 1506185 1453734
8415 1453734 1315077 1292075 1285463 1072021 1155606 1203237 1399314 1333005 1158246 1253094 1290675
8404 1290675 1254200 1232451 1201393 1208668 1494456 1433780 1519706 1530265 1467855 1420492 1435249
8393 1435249 1192317 1222632 1276831 1355179 1241724 1306443 1523102 1490890 1559585 1706045 1526334
8382 1526334 1455790 1581292 1383966 1449062 1551102 1707104 1535731 1456840 1572457 1281093
8372 1281093 1094327 1184844 1430718 1542220 1457558 1480002 1370095 1293851 1405724 1499135
8362 1499135 1537182 1774451 1503794 1510886 1657979 1533415 1383846 1363207 1260046 1391405
8352 1391405 1409815 1382619 1488684 1420389 1502060 1591075 1507790 1440785 1823577 1958289 1719921
8341 1719921 1447787 1517428 1536049 1601140 1851172 1626577 1512295 1734758 1671399 1729746
8331 1729746 1657763 1734340 1841619 1803585 1696578 1670267 1719006 1715902 1882851 1989465 1733856
8320 1733856 1538603 1787313 1842616 1716813 1647443 1819177 1993090 1804615 1749127 1918390
8310 1918390 2009941 2189949 2104418 1830482 1858663 1845704 1958567 2107184 2118242 2051074 2080984
8299 2080984 2259436 2542750 2377877 2371170 2235640 2221057 2472327 2442110 2300147 2396657
8289 2396657 2420597 2334594 2232951 2352482 2358906 2353621 2468810 2645583 2610571 2420771 2548126
8278 2548126 2621424 2676237 2572794 2333585 2500890 2668454 2802797 2815633 2890011 2859354
8268 2859354 2793009 2995707 3190378 3113538 2986083 3104761 3107760 3237678 3186650 3209683 3114819
8257 3114819 3090438 3166171 3157721 3077554 3262912 3372885 3327030 3262665 3275103 3460408 3540457
8246 3540457 3476953 3491636 3566652 3630625 3594466 3962043 4051337 3869573 3986825 4130183 3992697
8235 3992697 3916867 3729162 3712516 3895435 3775262 3773109 3995879 4270651 4332613 4260445 4125520
8224 4125520 4171727 4243611 4183867 4188922 4157979 4280663 4200681 4175343 4141290 4112649 4109951 4202603
8212 4202603 4327427 4270877 4227757 4510426 4412112 4236862 4185473 4120443 4140875 4217114 3933209
8201 3933209 3989789 4140919 4370966 4275300 4305891 4210625 4220385 4291302 4756290 6391366 5110305
8190 5110305 4490741 4632578 4435169 4358730 4426388 4468583 4498881 4497116 4462497 4379884 4383490
8179 4383490 4401883 4415988 4453979 4457147 4437534 4445249 4288738 4324287 4737399 4684500 4710619
8168 4710619 4600709 4481213 4705053 4691001 4478875 4589271 4454823 4671880 4636462 4407142
8158 4407142 4353394 4428299 4478702 4519595 4670093 4675869 4458954 4505272 4474837 4513599 4447214
8147 4447214 4521945 4690998 4707573 4638908 4648490 4708611 4777361 4823831 4857738 4790493 4955744
8136 4955744 4958646 5018457 5133928 5213600 5253282 5186744 5074257 5090874 4962626 4593869 4856336
8125 4856336 4905387 5051970 5113430 5131765 5120271 5226179 5116395 5013621 5086394 5090226 5249933
8114 5249933 5199513 5066787 5107155 5142737 5282362 5360008 5343377 5391329 5330290 5397785 5424434
8103 5424434 5405006 5414103 5583916 5529551 5551493 5419530 5372391 5610576 5598671 5507699 5646345
8092 5646345 5822701 5813339 5954605 5860802 5929029 5895140 5967638 6177597 6163395 6186303 6067858
8081 6067858 6079776 6173829 6144964 6104861 6186404 6406299 6316074 6198096 6488606 6587105 6578187
8070 6578187 6622707 6928929 6948925 7031985 6918395 6606516 6591294 6334684 6587230 6592081 6836938
8059 6836938 6907822 6907176 6985133 7276864 7094884 7124615 7307475 7248946 7281658 7285890 7420028
8048 7420028 7363210 7319794 7320512 7412266 7433040 7352282 7419268 7368182 7372839 7495189 7557499 7606281
8036 7606281 7721829 7858138 7978846 8224473 8077124 8024081 8214877 8179416 8169153 8092456
8026 8092456 8055565 8158307 8319561 8409253 8388922 8526848 8898570 8922478 8964562 8909886 8918955
8015 8918955 9095288 9183753 9407954 9498737 9712505 9888412 10003032 10094140 10216623 10223138
8005 10223138 10375364 10437743 10524719 10622735 10848943 11027275 11243151 11708547 11879337 11973561
7995 11973561 12339726 12426373 12724619 13157227 13735510 14192843 14845974 15317584 15799213 16546607
7985 16546607 17534453 18716089 20005875 21895966 24213222 26870972 29490806 31953624
7977 31953624 34142023 34627216 32776352 29247066 25614178 22465785 19985075 18450346
7969 18450346 17344953 16303038 15655785 14983385 14438808 14113301 13778200 13538009 13401891
7960 13401891 13191501 12927090 12893179 13050509 13061341 13155533 13118694 12866837 12654756 12673639
7950 12673639 12812639 12884311 12923137 12979071 13089193 13162272 13353109 13566184 13763791 13932286
7940 13932286 14089319 14037527 13986088 14017857 14093884 14311031 14662351 14888925 15022475 15238291
7930 15238291 15737943 15912874 16113283 16406934 16633479 17101794 17269809 17395118 17714458
7921 17714458 17794640 17879726 17713659 17627464 17699868 17634104 17761665 17947939 17775104 18050374
7911 18050374 18235608 18304931 18465447 18508507 18438725 18768902 19129062 19264072 19382443 19835497
7901 19835497 20030124 20168279 20331089 20410898 20396570 20467671 20285122 20208243 20188510 20104603
7891 20104603 20262330 20253966 20273084 20365701 20621756 20951815 21313488 21599611 21829042 22094372
7881 22094372 22249489 22340905 22457817 22393384 22398216 22219067 22109253 22122349 22149554 22027371
7871 22027371 21917411 21925933 21956321 21891084 22098738 22179700 22423990 22757667 22967839 23245187
7861 23245187 23354649 23590087 23781996 23786606 23763929 23689349 23494146 23211588 23032030 22892321
7851 22892321 22695192 22497953 22316312 22239999 22195678 22004565 21971409 21776901 21849789 22017437
7841 22017437 22226101 22223449 22201853 22223977 22017417 22274811 22384138 22347604 22617938 23077862
7831 23077862 23360084 23476343 23544542 23899658 24080372 24350787 24752879 24998037 25328169 25816259
7821 25816259 26479410 26908979 27681403 28303250 29024886 29838352 30330890 30768129 31191973
7812 31191973 31670376 31890837 32049524 32335055 32412027 32560718 32629628 32570977 32656119 32715287
7802 32715287 32704600 32937850 33007608 33137738 33261264 33376538 33709752 34112020 34153287 34410356
7792 34410356 34639976 34618658 35026465 35107630 35088869 35126552 35255943 35158806 35247777 35302486 35115565
7781 35115565 35156965 35536476 35954140 36151531 36263769 36516147 36968643 37635565 37997071 38451890
7771 38451890 38578268 38840937 38903048 38917147 38982425 39022988 39164711 39100524 38989936 38974177
7761 38974177 39172898 39135455 39077358 39091850 39246562 39575633 39803673 39988673 39998918 40286429
7751 40286429 40864826 41246382 41542789 41883435 42294076 42723711 43290674 43555861 43668726
7742 43668726 43648101 43642725 43600916 43365816 42721980 42228804 41780177 41191189 40541501 40025108
7732 40025108 39468114 38920153 38303269 37580544 36920112 36228425 35607356 34730433 33811570
7723 33811570 33094443 32382574 31666802 30907083 30194395 29613849 29269105 28843709 28516168
7714 28516168 28241013 28300546 28465215 28300417 28207826 28329802 28512937 28750318 28770144 28713567
7704 28713567 29073362 29465552 29922657 30766215 31591063 32397775 33403273 34498850 35472361
7695 35472361 36264610 37049311 37781056 38430090 38772516 39053383 39627551 40112071 40217856
7686 40217856 40322284 40495551 40684280 40404163 39753353 39358560 38796828 38222642 37591124
7677 37591124 36586647 35560249 34540732 33391552 32289359 31049435 29774670 29111422
7669 29111422 28039136 27274452 26794776 26629441 26405691 25734362 25365068 25218847 24927453
7660 24927453 24849216 24733954 24521069 24558123 24466547 24436712 24300872 24218608 24163832 24501902
7650 24501902 24719778 24930643 25113414 25358926 25993048 26334198 26419272 26543670 26738726 26764631
7640 26764631 26829035 26452159 26319282 26401146 26249083 26080549 25940115 26115398 26370666 26350552
7630 26350552 26064204 25569158 25205142 24986304 24699513 24077824 23364751 23251603 22929979
7621 22929979 22502449 22083507 21849158 21994035 21913994 21569936 21302833 21279352 21285846 21264436
7611 21264436 21316870 21255923 21267184 21361104 21491312 21640592 21794682 22065937 22055004 22051923 22146929
7600 22146929 22427292 22843266 22980984 23286543 23503585 23892314 24463236 24852790 25022511
7591 25022511 25187657 25484389 25607978 25634720 25725131 25931767 25953784 25928216 26076494 26309419
7581 26309419 26721548 27004552 27116588 27208247 27293990 27383987 27212027 26973541 26665700 26333125
7571 26333125 26072500 25842538 25584699 25385594 25553801 25509714 25292238 25125617 24997605 24850475
7561 24850475 24895009 24799953 24615676 24660432 24842042 25097178 25313275 25448137 25549637 26475848
7551 26475848 27517306 27924920 28492966 29182313 29743918 30203849 30505143 30761115 31135101
7542 31135101 31334798 31518728 31738001 32107285 32646854 33102268 33615336 33982579 34264568
7533 34264568 34315011 34275180 33988124 33500654 33106142 32669234 32093786 31586036 30830106 30251019
7523 30251019 29961046 29686386 29252562 28436310 27993644 27624854 27307362 26497288 25747230
7514 25747230 25139741 24593459 24287791 23707462 23267892 23092067 22917584 22821884 22779034 22956661
7504 22956661 22970069 22831307 22701370 22446266 22530820 22616597 22719931 22497439 22542530 22626626
7494 22626626 23021169 23290824 23510196 23701345 23676331 23788886 23784867 23532715 23310590 23118663
7484 23118663 22748734 22255947 21958965 21770164 21487718 21067532 21055419 20661696 20145380 19658705
7474 19658705 19173977 18616223 17863034 17352616 16720345 16055145 15782554 15494311 14968810
7465 14968810 14536784 14011345 13585198 13135954 12698238 12174533 11729253 11529148 11424102
7456 11424102 11066080 10952623 10843481 10772640 10656152 10509203 10212454 10190067 10148789 10039848
7446 10039848 9994993 9960023 10058526 9963570 9860156 9880896 9643310 9455599 9249226 9282805
7436 9282805 9278976 9037747 8785678 8708789 8595060 8409597 8378764 8312778 7876326 7626070
7426 7626070 7370768 7239247 7168378 7011768 6793224 6725326 6288191 6001602 5955703 5805556
7416 5805556 5617740 5557765 5427297 5242253 5172066 5149307 5082693 5042546 4995371 4966710 4683422
7405 4683422 4540429 4605145 4371370 4454345 4365443 4250851 4250363 4115402 3917040 3880089 3767795
7394 3767795 3908516 3919713 3849564 3776053 3715300 3711076 3704821 3589066 3661113 3457195 3256380
7383 3256380 3227751 3544603 3505354 3248107 3134379 3188639 3193737 3249114 3125930 3198898 3066052
7372 3066052 2824562 2908785 2988430 2959643 2856750 2747527 2659218 2747412 2761053 2625612 2556443
7361 2556443 2486203 2607673 2708257 2783395 2636875 2480859 2491173 2442954 2458666 2299560
7351 2299560 2235881 2543919 2631241 2559605 2454056 2267043 2262659 2165152 2007991 2151030 2261144
7340 2261144 2151004 2030292 2106194 2277600 2475040 2425132 2242881 1937840 1951282 2033738
7330 2033738 1843777 1721338 1640578 1680646 1666078 1790683 1752794 1765857 1718358 1646680 1531312
7319 1531312 1673516 1749876 1710217 1604407 1619604 1674544 1677245 1506366 1722869 1672345 1594762
7308 1594762 1696396 1640354 1673296 1571024 1515643 1397282 1564633 1507034 1257321 1311924
7298 1311924 1379350 1387079 1339711 1414302 1327063 1237084 1213402 1207371 1226450 1211886 1204031 1327728
7286 1327728 1347662 1197799 1091200 1148437 1379766 1208199 1194234 1147771 1088809 1272147
7276 1272147 1006032 1121380 1150359 1148433 1250703 1262476 1069469 1114110 1338918 1436829 1357711
7265 1357711 1212636 1198497 1265895 1048289 1002401 892480 669199 826087 762314 721408
7255 721408 907650 888717 846814 955038 863465 817452 913440 974340 692764 773910 923535
7244 923535 935413 933824 837837 842864 606881 526786 724701 807126 747258 612210 692645
7233 692645 608889 560647 716267 809861 510302 288584 427458 545659 469123 585898
7223 585898 783707 828766 696979 553665 492771 182387 230139 426853 487326 585066 724681
7212 724681 880937 852078 773742 574253 428829 410126 492840 560240 378511 482278 328971
7201 328971 201059 353858 266302 399966 559319 532543 531541 370406 347607 303802 522066
7190 522066 630520 336956 416651 323804 188004 243595 460331 535470 587202 545189 400229
7179 400229 395055 442375 348512 190327 142459 348899 274918 509102 505469 316218 427749
7168 427749 577395 396233 252639 324468 467721 388601 301110 506660 447381 326580
7158 326580 266671 310674 453067 333398 214549 196443 31250 350806 271031 257020 195538
7147 195538 150475 327029 268744 152204 256927 405913 298206 408319 426279 441192
7137 441192 428622 344132 239020 343757 243286 75064 48843 102743 170810 362951 487897
7126 487897 349990 309988 359325 262379 58596 270881 344316 223528 67012 16912 -62649
7115 -62649 -173983 123379 129074 110125 163913 8811 72308 179943 -41768 42164 243890
7104 243890 249752 279166 230052 243304 238530 43937 49133 117013 73938 168739 128572 17121
7092 17121 -26464 -49690 -170928 -218645 -60530 141449 -36579 -31676 -47400 -135847 -169073
7081 -169073 -59392 -225373 -83424 -213359 -296098 -130930 -117789 -120192 -326483 -487570
7071 -487570 -362819 -174399 -212389 -229852 -173887 -36551 32930 -268720 -448908 -358722 -161919
7060 -161919 -258408 -134874 55012 -11363 -224943 -240134 -105600 -97933 -143683 -256388 -327108
7049 -327108 -462151 -416983 -322959 -123034 -181975 -270280 -95835 -128624 -133790 -92858 -230183
7038 -230183 -304668 -69650 -190160 -256129 -278696 -392307 -147250 -88434 -280249 -388480
7028 -388480 -412180 -365480 -256406 -360323 -360850 -534651 -467469 -225626 -407167 -489084 -300050
7017 -300050 -199552 -251376 -468572 -461727 -197349 -52521 -328663 -400333 -483442 -270012 -348644
7006 -348644 -490521 -441633 -257010 -253197 -305762 -388598 -74147 -69553 -254955 -383303 -397672
6995 -397672 -285116 -298312 -327401 -306303 -291122 -278350 -368359 -329381 -451036 -521393 -330596
6984 -330596 -355719 -353231 -329289 -296965 -309745 -310006 -494930 -348087 -344202 -370569 -473939 -460923
6972 -460923 -675510 -422427 -138724 -2643 -164155 -410720 -389988 -548362 -367428 -390518
6962 -390518 -291118 -183230 -462412 -491331 -391667 -470788 -490528 -447447 -393465 -192421 -207602
6951 -207602 -189755 -254623 -251504 -155521 -101352 -98440 -180471 -223913 -144439 -136094 -103698 -114047
6939 -114047 -263786 -103718 -225228 -253046 -112102 -146357 -165861 -31432 -117424 -179133 -143497
6928 -143497 -337841 -279943 -381295 -362910 -268771 -449428 -480952 -318116 -162035 -102542 -178875
6917 -178875 -136484 171192 170743 -163460 -212012 -338818 -356228 -248505 -183670 -150019 -235996
6906 -235996 -320241 -204899 -264851 -229650 71454 7062 -19219 -211110 -170725 42448 105861
6895 105861 83484 31003 39170 -49374 -144655 -182665 -276443 -427575 -114536 11885 41737
6884 41737 -45502 -164820 -67235 -126115 -149718 77068 -24432 -122219 -187288 -394385 -261630
6873 -261630 -246534 -264256 -445230 -583182 -581544 -395932 -441519 -428509 -371478 -352363 -316575
6862 -316575 -338256 -456151 -578173 -709937 -596185 -405813 -473332 -588465 -591596 -581584 -675364
6851 -675364 -648014 -460706 -408215 -358988 -373739 -529147 -653588 -528722 -339258 -402793 -625368
6840 -625368 -632033 -529540 -690934 -591036 -547517 -411554 -296944 -414511 -292734 -421264
6830 -421264 -428199 -290720 -453720 -633431 -686309 -592882 -472155 -380219 -588288 -610530 -402352
6819 -402352 -457515 -661198 -679167 -663749 -508130 -438256 -462967 -666670 -674051 -579950 -301485
6808 -301485 -417041 -534563 -400246 -356089 -342555 -490728 -487760 -557559 -532669 -533227 -591427
6797 -591427 -625374 -397884 -364640 -463022 -428111 -276691 -101015 -141408 -290744 -608601 -420824
6786 -420824 -301648 -363114 -380648 -337405 -207279 -129824 -233493 -173938 -36899 -68585 174453
6775 174453 96857 -15701 -187969 -73815 -256258 -225916 -197925 -163785 -108153 -56950 -122689
6764 -122689 -350424 -284820 -258319 -162786 -188463 -187746 -281659 -289922 -246487 -217752 -294694 -214604
6752 -214604 -154089 -210528 -228179 -45395 -159497 -326116 -288918 -279995 -99384 -307189 -401878
6741 -401878 -472653 -498571 -620825 -529239 -481542 -592150 -491909 -544508 -592390 -386003 -306409
6730 -306409 -255508 -222238 -324865 -241964 -154650 -298761 -482506 -502291 -567551 -460550 -475010
6719 -475010 -315977 -460530 -467590 -352978 -268952 -186976 -268779 -496997 -511492 -523871 -491599
6708 -491599 -399087 -410107 -289704 -476583 -268532 -363165 -454864 -347590 -451004 -452134 -478831
6697 -478831 -426468 -424816 -327137 -223390 -135893 -307926 -392340 -345925 -142251 -256005 -457932
6686 -457932 -507933 -605956 -640362 -602914 -392638 -434967 -380842 -373837 -270146 -381394 -193268
6675 -193268 -123169 -266030 -164365 -282745 -468899 -394409 -290851 -127926 -434963 -426157
6665 -426157 -193737 -170793 -220408 -327457 -263018 -321707 -214038 -316190 -380408 -578709 -566437
6654 -566437 -288891 -462560 -368933 -302285 -338333 -378656 -284673 -299677 -387114 -413436 -381897
6643 -381897 -329837 -316527 -276577 -360271 -108790 -44418 -140482 -162145 -126289 -344326 -237186
6632 -237186 -101661 -215113 -320641 -454755 -345298 -280241 -286886 -316088 -370209 -119431 -66383
6621 -66383 -207814 -304432 -420230 -305876 -126339 -209648 -306732 -317760 -358037 -463967 -329784
6610 -329784 -427825 -208010 -115970 -190281 -225646 -242896 -88333 -44694 -209415 -267838 -323697
6599 -323697 -219827 -130018 -346382 -415547 -451118 -344513 -292438 -422372 -437110 -387641 -413949
6588 -413949 -317113 -366928 -389905 -398383 -260663 -306518 -185780 62983 -44147 68624 41948
6577 41948 -166226 -175392 -173790 -209447 -288719 -293439 -114430 -115160 -228398 -321189 -148004 -222776
6565 -222776 -328188 -79609 -144268 -306418 -206108 -130536 -225723 -280038 -185778 -205836 -114168
6554 -114168 -22120 -97210 24410 -10960 -170625 -301704 -237623 -283906 -164499 -330283 -326087
6543 -326087 -423234 -323288 -133253 -113551 -172827 -52299 199559 -19031 -45040 -73320 -263247
6532 -263247 -424738 -354755 -13509 87838 67799 -74183 -89338 -75040 -19958 -26035 -120604
6521 -120604 -128937 36326 -76620 284 -119904 -334615 -408300 -383232 -165666 44541 82659
6510 82659 70998 -11197 -1067 85267 -195409 -203087 -124133 -22068 -114708 -185599 -183567 -68220
6498 -68220 -113559 -201159 -87960 54078 -31167 -18142 22457 -50468 -171958 -247843 -266934
6487 -266934 -339734 -465994 -205503 -46127 54389 -119598 -106078 115678 190416 -37678
6477 -37678 -65876 -162973 -155747 29691 -65413 41576 -23776 -78856 18475 156519 42039
6466 42039 -70475 49870 323441 197551 -84425 -168718 -9021 69663 35070 -24943 88817
6455 88817 323750 344591 411694 413990 202114 137751 250106 180844 278049 128015 22396
6444 22396 161806 212573 274135 345344 204612 288372 424112 251694 20006 29250 92379
6433 92379 205855 335254 308304 430062 363695 499983 393687 81873 204870 272575
6423 272575 323227 95539 178025 268880 262898 344893 347155 469048 730085 702352 511289
6412 511289 270399 306263 468125 453599 386841 345960 456994 592866 706206 654755 736205
6401 736205 791805 833268 770268 729923 676503 831995 948775 1075980 1046122 1104789 1177490
6390 1177490 947880 928520 1134924 1136666 1289409 1318608 1220775 1165412 1264827 1575977 1587488
6379 1587488 1419953 1404968 1334129 1379740 1257095 1318800 1306271 1229431 1201523 1234899 1230285
6368 1230285 1224656 1063946 1083785 1062942 924268 1088749 1174340 1178982 1116524 1073212 1007527
6357 1007527 1048736 1009206 1031378 867561 793270 767120 746331 702344 885396 947967 1046055
6346 1046055 852528 583991 788276 902491 940901 808018 698191 786310 1106654 1091147
6336 1091147 981665 831998 793686 878659 917624 858755 639351 780090 979733 949418
6326 949418 844157 938763 1163180 1128997 868832 698284 918992 949675 871554 890115 848571
6315 848571 1065586 1157090 1348333 1215875 1030547 1208644 1349196 1100651 1013855 919451
6305 919451 982587 1144161 1284996 1195864 1042452 1266622 1435070 1308927 1400942 1469563
6295 1469563 1465368 1642851 1593121 1549796 1599178 1555825 1315631 1467286 1504910 1347644 1449747
6284 1449747 1401736 1382726 1331908 1365628 1311496 1262683 1046254 980246 1258838 1385394 1207193
6273 1207193 1127650 1287437 1283799 1109029 844408 991133 1176938 1069628 874006 813319
6263 813319 874329 984335 975389 1069737 1157452 1103857 1056693 981074 858927 903401 834512
6252 834512 917205 950017 849618 773541 721587 644605 667939 743187 920786 1033028 1200671
6241 1200671 1099249 975962 863785 1003850 962430 733444 645740 727593 679671 694297
6231 694297 819849 803827 1102221 1077423 826804 727102 778735 865988 823322 722137 745653
6220 745653 772695 783379 626828 662277 782919 860490 710161 865551 1020251 962909 877994
6209 877994 704514 766011 905697 760861 958565 902262 765736 761165 858459 1025061 1059167
6198 1059167 947683 762044 722071 710249 955774 1016840 1011246 963441 964228 845439 887890
6187 887890 852462 1016038 1248483 1262947 1099355 898205 749952 811135 834190 882190 1086841
6176 1086841 1057667 1117861 1144908 1339424 1388573 1346388 1220147 1431575 1256132 1096947
6166 1096947 1076521 1219734 1134908 1120942 1086593 1123475 1216709 1184209 1155503 1258058 1364433
6155 1364433 1455200 1523500 1170817 932287 1034860 1057701 1158799 1105995 1131183 1200563 1347936
6144 1347936 1534564 1336831 1377142 1256478 1477525 1463414 1344744 1289677 1450956 1581440
6134 1581440 1528903 1187193 1287099 1344958 1320990 1338066 1183511 981690 1017861 1110072 1078770
6123 1078770 1062187 1232390 1352347 1427137 1540711 1548720 1566655 1683935 1668971 1493133 1441187
6112 1441187 1277220 1143663 1246525 1084610 1320431 1591500 1548681 1516345 1492581 1599609
6102 1599609 1538482 1458093 1390191 1540771 1542361 1453940 1614039 1653065 1470468 1418200 1442294
6091 1442294 1483695 1606127 1585322 1676992 1818186 1616476 1627224 1731015 1842099 1999718
6081 1999718 1953889 1966556 2045472 2075408 2111390 1931128 2158969 2417045 2544011 2634965 2502592
6070 2502592 2495436 2548212 2683606 2964495 3180739 3190449 3156487 3248666 3213890 3138261 3023312
6059 3023312 3001660 2962838 2616596 2417657 2481063 2544267 2521788 2357324 2413140 2449999 2362020
6048 2362020 2202801 2172705 2407870 2575154 2426420 2269135 2123357 2213743 2009909 2021514
6038 2021514 1981841 1939590 2095728 1950667 1818495 1861329 1914504 2053706 2086550 2031782 2019960
6027 2019960 1975382 2115769 2211450 2381786 2241197 2238861 2189560 2297140 2367666 2600388 2692440
6016 2692440 2574581 2732832 2719826 2786091 2868158 2825672 2929258 2874094 2811022 2835965 2771256
6005 2771256 2875009 2713738 2431062 2575037 2662413 2316861 1978247 2092484 2319503 2322593
5995 2322593 2061771 1936638 1997706 1906576 1623612 1639526 1937082 1844955 1704917 1667109
5985 1667109 1599714 1482036 1477286 1403238 1477536 1539732 1367310 1477303 1674233 1655597 1497757
5974 1497757 1563966 1499306 1460494 1333206 1393443 1448490 1498734 1369370 1406383 1584741 1467100
5963 1467100 1730265 1591841 1543071 1489492 1441307 1390731 1465981 1676965 1438503 1266286
5953 1266286 1335981 1510106 1514910 1429503 1267852 1189062 1252402 1430227 1450431 1567367 1485768
5942 1485768 1568388 1698770 1357812 1167862 1172686 1155984 1197626 1237340 1069324 1100340 1131623
5931 1131623 1008444 840142 953499 1151523 1301882 1360545 1388111 1218361 1087635 1205146
5921 1205146 1306385 1204189 1117601 1246342 1238224 1130725 1119228 1153980 1204702 1148004 1338580
5910 1338580 1533056 1548483 1557690 1473225 1377753 1411324 1458608 1294558 1297722 1325059 1306141
5899 1306141 1291995 1313511 1396714 1628678 1746681 1881182 1856986 1598883 1718365 1844236
5889 1844236 1795391 1682236 1586571 1621009 1571937 1445045 1424453 1596295 1595960 1465991 1217919
5878 1217919 1290061 1439357 1347305 1455825 1369237 1246126 1449217 1725071 1716917 1608843
5868 1608843 1791246 1688979 1511870 1464199 1499840 1557902 1527291 1460051 1299479 1551783
5858 1551783 1428715 1376387 1525160 1634842 1839985 1817565 1800130 1846615 1882515 1799257 1610783
5847 1610783 1868854 2005618 1788589 1623347 1662571 1832783 1790790 1750941 1628714 1858186
5837 1858186 2142655 2144244 1918706 1802522 1920537 1722595 1597990 1544581 1484260 1606258
5827 1606258 1711599 1549975 1709257 1787314 1740485 1805278 1595992 1734200 1925783 1796036
5817 1796036 1706145 1651487 1735539 1892950 1938929 1806476 1642304 1622549 1449529 1583879
5807 1583879 1660092 1861200 1853249 1724259 1791602 1600028 1363306 1406023 1655260 1599376 1677088
5796 1677088 1805827 1744148 1635642 1520229 1388387 1233074 1214495 1308792 1417121 1436113
5786 1436113 1403339 1412648 1384380 1471418 1280283 1117500 1087033 946694 1067935 1163928 1273327
5775 1273327 1305029 1331282 1263423 1247015 1252361 1204122 1075833 1251894 1518187 1488387 1560677
5764 1560677 1331093 1366006 1221699 1126773 1246751 1237888 1307780 1191693 1361314 1373667 1574619
5753 1574619 1534382 1443650 1463428 1429782 1326000 1156454 1054617 1152372 1327259 1330978 1284298
5742 1284298 1051746 1100437 1089778 1402834 1545387 1547218 1473396 1423018 1444758 1477305 1546625
5731 1546625 1455756 1365640 1311577 1257858 1389870 1389867 1138146 1009012 993751 1040753 1293199
5720 1293199 1229683 1417379 1418319 1163924 1229004 1164743 1300242 1415118 1487614 1408084 1404632
5709 1404632 1348184 1442420 1482383 1369999 1219063 1244986 1383505 1422140 1601813 1662852 1505852
5698 1505852 1557535 1592185 1529765 1414666 1345814 1532441 1612439 1522901 1419721 1517198 1452021
5687 1452021 1624739 1560666 1413425 1409994 1445199 1577882 1674637 1666625 1582202 1648647 1623784
5676 1623784 1833554 1861391 1612449 1501866 1506824 1583984 1677844 1851614 1960335 2071852
5666 2071852 2125267 2019980 2148532 2198609 2132872 1944282 2009871 2167333 2262768 2025215
5656 2025215 1980279 2103340 2203325 2007068 1771592 1691870 1785864 1952705 1915791 1896832 1746051
5645 1746051 1807031 2036788 1926970 1751605 1790078 1808070 2015909 2088260 1887730 1985897
5635 1985897 2149408 1960994 1906807 1796389 1842078 2147374 2290797 2200076 2277458 2348037
5625 2348037 2663195 2673415 2545927 2642670 2727742 3001041 3000717 2961517 3093436 3181265 3186721
5614 3186721 3262870 3194610 3333995 3479019 3678344 3550751 3522424 3752027 3723057 3613682
5604 3613682 3435715 3501787 3356756 3613957 3852006 3877778 3740432 3703731 3759796 3707468
5594 3707468 3800665 3776502 3621265 3452985 3373158 3417609 3467498 3343565 3359631 3404478 3394445
5583 3394445 3520687 3373307 3239342 3116097 3093168 2932263 3035553 3176154 2924465 3026358
5573 3026358 2967565 3000520 3115198 3254184 3224523 3220597 3252781 3328631 3330601 3386984 3324227
5562 3324227 3484257 3349253 3283738 3503809 3489591 3661510 3789449 3979382 4095873 3969172
5552 3969172 4011420 4086982 3960127 4149445 4295583 4429663 4583131 4765909 4860589 5070314
5542 5070314 5155995 5374385 5590202 5813555 5998416 6003270 6016315 6097256 6048654 5998704 5910645
5531 5910645 5824937 5854930 5693392 5685234 5739111 5715513 5657481 5706008 5639917 5811080 5996471
5520 5996471 6164670 6262203 6121228 6305823 6288873 6166326 6360053 6549524 6703150 6714968
5510 6714968 6737543 6938043 7029724 7089986 7079066 7336204 7683478 7972866 8182175 8250843
5500 8250843 8335891 8398682 8525109 8597736 8781873 9003232 9360144 9772971 10026436 10368208
5490 10368208 10788023 11222432 11434374 11839772 12426676 12929710 13463561 13978069 14344744
5481 14344744 15109025 15932396 16503436 17105053 17395202 18093711 19037080 19711234 20452926
5472 20452926 21196219 21842099 22738576 23507824 24307242 25313782 26428592 27851674 29308656
5463 29308656 30901931 32861858 34824863 36986080 39397761 42228110 45484939 49249575
5455 49249575 53438472 58015346 62970167 68148912 73524713 78526113 82976540 86529334
5447 86529334 89193050 90881883 91385929 91018194 89575702 87205894 83629759 79599650
5439 79599650 74886100 69979289 65225875 60353603 55456089 50841464 46871653 43230882
5431 43230882 39818188 36814237 34139644 31811023 29618653 27683595 26073180 24511559
5423 24511559 23097488 22000161 20887978 19784904 19012971 18393951 17809506 17046528 16429568
5414 16429568 15907491 15377843 14638402 14062796 13539111 13228036 12934242 12623062 12221957
5405 12221957 12015979 11680706 11293616 11157635 10917217 10666648 10509042 10046221 9726599
5396 9726599 9409359 9119426 8919742 8699858 8319256 8045843 7958006 7804910 7647543 7494537
5386 7494537 7492536 7566081 7608485 7486974 7154603 7038007 6971543 6796811 6597654 6382427
5376 6382427 6427692 6230387 5924959 5844727 5922042 5813940 5594133 5593074 5423207 5373226 5344131
5365 5344131 5226293 5302160 5297296 5098097 4919562 4739376 4474834 4799470 4805911 4926246
5355 4926246 4902455 4768086 4721518 4798432 4718780 4575736 4707528 4662415 4843812 4835989 4525276
5344 4525276 4313503 4403915 4381926 4315307 4227285 4094524 4057448 3845157 3826114 3953607 3897491
5333 3897491 3920819 3900361 3915692 3783960 3842395 3988323 3941058 3698691 3543431 3510056 3513134
5322 3513134 3469043 3300194 3281473 3446398 3367278 3398440 3428558 3363567 3376590 3463879 3639187
5311 3639187 3607244 3318022 3329620 3409698 3240029 3279658 3224898 3456547 3224315 3228297 3376598
5300 3376598 3330799 3252136 3132381 3052872 3160982 3240672 3336186 3268665 3252541 3480845 3333115
5289 3333115 3224644 3183102 3356319 3384748 3468805 3603387 3566554 3637013 3684106 3673337 3586202
5278 3586202 3641128 3783314 3906048 3874119 3970207 3962884 3997946 4098616 3989083 3863695 3757426
5267 3757426 3829761 3865604 3881547 3561023 3459842 3512900 3339455 3242209 3281908 3322964 3465334
5256 3465334 3164113 3148655 3302401 3245752 3192490 3183964 2959431 3012057 3013499 2630322 2436051
5245 2436051 2453669 2381657 2362245 2434210 2222596 2011934 2091854 2188445 2171168 2186238 2085294
5234 2085294 1911165 2054325 2099432 2026095 1986785 1830301 1995151 1925427 1990574 2056282 1946727
5223 1946727 1932217 1817788 1676313 1797751 1768465 1730867 1771373 1736004 1734911 1488891 1402086
5212 1402086 1609522 1626726 1696699 1753276 1819791 1960831 2117578 1913890 1769192 1637148
5202 1637148 1667888 1738828 1761540 1637111 1828914 2016221 2080199 1804806 1652585 1629865
5192 1629865 1674964 1751952 1673932 1733920 1770266 1924415 1880054 1680514 1747927 1839174 1809478
5181 1809478 1790956 1802090 1821917 1880675 1859445 1731018 1777246 1757574 1724986 1747372 1664007
5170 1664007 1592133 1746163 1849496 2106189 1947001 1744973 1682272 1889219 1660720 1512654
5160 1512654 1576824 1652807 1890549 1764765 1721135 1756594 1890294 1850302 1726528 1858969
5150 1858969 1926141 1930232 1603898 1615506 1545198 1489192 1497757 1520393 1623450 1734822 1688895
5139 1688895 1798806 1883821 1860904 2028847 1977025 1884394 1812225 1778054 1814662 1850770 1874196
5128 1874196 1851021 1796007 1687892 1746858 1776763 1882433 1871287 2070369 2171999 2021319
5118 2021319 2062381 1974796 2121497 2225299 2238045 2217757 2130802 2113679 2109838 2237445 1937891
5107 1937891 1897833 1828138 1592580 1989695 1969008 1873033 1854927 1946707 2047330 2167554 2148368
5096 2148368 2263695 2327141 2161291 2154764 2213276 2156399 2150561 2214102 2310265 2210777 2350383
5085 2350383 2455443 2526213 2519304 2316214 2177493 2064622 2094045 2162172 2169849 2150868 1899902
5074 1899902 2012455 1902123 1837455 1981535 2118904 1949074 1954146 2018359 1966583 2071586
5064 2071586 1953981 1835292 1722630 1911692 2000904 1765248 1759406 1645113 1555514 1644076
5054 1644076 1688847 1752785 1774354 1738574 1656014 1824730 1807638 1791693 1902083 1771237 1643329
5043 1643329 1844925 1862027 1883155 1957972 1715006 1643123 1762021 1866986 1829457 1855467 1931446
5032 1931446 1728696 1636284 1686117 1580183 1514854 1668064 1668263 1625524 1546946 1416797 1452566
5021 1452566 1665686 1785018 2002783 2196223 2092044 1868783 1828265 1943736 1886925 1812609
5011 1812609 1874410 2004548 2110459 1941741 1879676 2023252 2204459 2139306 2101539 1884085
5001 1884085 1944181 2180491 2115077 2106204 2206561 2118975 2057172 2079177 2190497 2085844 2289173
4990 2289173 2250797 2316414 2297145 2149713 2194814 2218466 2166696 2162059 2203377 2413024 2445256
4979 2445256 2504714 2705628 2527622 2672295 2548075 2574613 2267601 2159699 2263716 2422713
4969 2422713 2467964 2568092 2633085 2495725 2452241 2318726 2216542 2310082 2601928 2660975
4959 2660975 2541450 2535887 2542551 2344958 2417492 2612704 2701397 2857117 2701679 2731450 2839811
4948 2839811 2739101 2932044 2909540 2762230 2734349 2455552 2618788 2618801 2672211 2740883 2663924
4937 2663924 2851353 2785221 2762236 2671638 2659590 3025477 3089519 3101499 3145578 3130912 3053979
4926 3053979 2966831 2920500 3175249 3327348 3522309 3527693 3532599 3551507 3761212 3962475 4182667
4915 4182667 4171811 3998950 4243149 4317900 4663149 4768087 4952311 5328735 5371204 5374680
4905 5374680 5596169 5792544 6044311 6314084 6662701 7021726 7426677 8127968 8570375 8920903
4895 8920903 9572453 10009838 10135335 10161531 10059086 9997217 9670329 9343363 9089641 8623198
4885 8623198 8485959 8237803 7616270 7266528 7184188 6985149 6729278 6431619 6313653 6226361
4875 6226361 6289784 6352888 6422251 6249769 6185319 6279989 6206941 6275777 6437528 6524771 6599651
4864 6599651 6583322 6564583 6630755 6698940 6937720 7272159 7331498 7466245 7593040 7687654 7751376
4853 7751376 7888245 8057092 8530683 8821670 8794505 8886946 9227713 9659043 9925277 10258868
4843 10258868 10570352 11005651 11413271 11713086 12155024 12558362 13128143 13650474 14358367
4834 14358367 15196910 15803622 16605265 17534622 18538625 19733986 21040158 22030063 23304224
4825 23304224 24743237 26207955 27905514 29837539 32003283 34214755 36533072 39012164
4817 39012164 41566269 44029300 46703810 48666609 50024900 51357317 52210934 52664313
4809 52664313 52694964 52353843 51737829 50974533 50291451 49305463 48233476 47246525 45937145
4800 45937145 44495045 42762458 41128492 38938692 36580550 34471834 32335140 30317125
4792 30317125 28464211 26742154 25197939 23826315 22779672 21702433 20749803 19913672
4784 19913672 18995450 17921780 17018022 16350835 16000490 15249152 14478178 13972346 13384050
4775 13384050 13023753 12761316 12413294 11894873 11307523 10996150 10936779 10511226 10102423 9946990
4765 9946990 9796682 9657662 9409806 9344957 9412105 9371936 9177475 9002773 9004557 8800896
4755 8800896 8791167 8800722 8735236 8460148 8344808 8252116 8118590 7967194 7929355 7859373 7704780
4744 7704780 7674137 7671995 7608240 7648240 7667317 7615255 7609927 7509559 7464549 7566630 7664063
4733 7664063 7547193 7623514 7479816 7469371 7472795 7410301 7297078 7391353 7408103 7514181 7502007
4722 7502007 7338786 7318748 7399063 7518655 7651509 7594607 7355091 7521734 7332142 7514224
4712 7514224 7634285 7744434 7843716 7881537 8003719 7996210 7999972 8071568 7784065 7806389 7971456
4701 7971456 8058727 7927309 7913520 8054317 8202516 8317294 8354808 8556728 8727141 8634127
4691 8634127 8585405 8638479 8504755 8432552 8383362 8402502 8323627 8112940 7993477 7988236 8011959
4680 8011959 8007390 7664450 7837874 7849117 7769451 7656194 7660110 7589476 7269043 7217905 7323576
4669 7323576 7129151 7047810 7173457 7261869 7251377 6848608 6822988 6816651 6605713 6372492 6313748
4658 6313748 6319911 6445997 6427023 6412458 6441916 6450125 6433190 6289765 6188289 6091659 6221319
4647 6221319 6166755 5965058 5950799 5803569 5785143 5764599 5726545 5534258 5331129 5369079 5332210
4636 5332210 5304852 5295248 5172421 5068433 4975783 4805516 4587596 4302689 4230515 4218800 4116066
4625 4116066 4005343 3937061 3861129 3808981 3789988 3923808 3839294 3808441 3813540 3898262 3780630
4614 3780630 3533112 3680364 3472607 3406636 3505541 3446656 3470978 3582463 3456565 3543302
4604 3543302 3609527 3351236 3418641 3414926 3415148 3178895 3030015 2881256 3180699 3502213 3632235
4593 3632235 3481869 3323778 3328480 3149391 3140738 3040946 3239785 3193728 3174976 3226875 3223055
4582 3223055 3109142 3161585 3357154 3231489 3017111 3138018 3129519 3161325 3172751 3256147 3287973
4571 3287973 3079449 3064044 3099737 3048802 2874263 2805289 2909423 2966606 2875788 2863998 2957386
4560 2957386 3069438 3031425 2966025 3054527 3229857 3188512 3064299 3107461 3324993 3339689 3142233
4549 3142233 2900339 3182819 3161780 2961290 2876064 2752627 2883754 3074278 3282799 3383481
4539 3383481 3181639 2907700 2962089 3025834 2947607 3014520 3282615 3517645 3508110 3353119 3360799
4528 3360799 3540163 3643899 3554715 3349855 3370161 3410112 3450654 3619688 3551420 3470572 3806721
4517 3806721 3919744 3756424 3619551 3721014 4007880 4032033 3815011 3764996 3601388 3694604
4507 3694604 3758871 3705030 3879910 3906222 3923854 3870801 3941273 3778338 3717877 3833427 3809265
4496 3809265 3758346 3809704 3669923 3726456 3850730 4067627 4095886 4008038 3970975 3937259 3843352
4485 3843352 3992021 3943510 3661035 3567278 3728314 3925663 4107337 4068230 4063384 4188780
4475 4188780 4118864 3965685 3921280 3965140 4095423 4417997 4529009 4392521 4355900 4471070
4465 4471070 4443063 4446948 4470411 4451903 4561519 4533581 4531939 4515907 4606311 4744774 4687567
4454 4687567 4597529 4443257 4559227 4742223 4904829 5030461 5027106 5287693 5345279 5244968
4444 5244968 5324867 5683974 5916917 5990192 5899570 5865891 5790574 5605906 5760998 5956269
4434 5956269 5905423 5615226 5690317 5796364 5834631 5712530 5708728 5740315 5901972 5983862 6050022
4423 6050022 5959598 6170154 6301346 6545359 6605442 6596927 6883913 6959420 6911400 6813119 6560514
4412 6560514 6561378 6673204 6594216 6853264 6890521 6814982 6744423 6866212 6921628 6944346 6978620
4401 6978620 6808195 6830804 6973432 7115600 7225672 7299310 7405845 7598166 7638636 7736368
4391 7736368 7605308 7469796 7410721 7310404 7337917 7318063 7280971 7150651 7290050 7385862
4381 7385862 7397668 7469979 7505350 7696364 7754174 7604203 7659125 7965708 7916956 7878044 7864737
4370 7864737 7965918 8055931 8089633 8203785 8244635 8135498 8358807 8608308 8668071 9102504
4360 9102504 9064378 9174463 9491487 9389175 9392178 9627667 9417681 9448889 9470714 9380494 9148527
4349 9148527 8639050 8376653 8357548 8303285 8216549 8169631 8038028 8032217 8004476 7795226 7531874
4338 7531874 7410244 7306476 7028638 6994424 6972409 6972751 7196693 7176749 7161573 7152576 7155522
4327 7155522 7351156 7253638 7420500 7505902 7592408 7714398 7752866 7726616 7790372 7833977 7789532
4316 7789532 7783995 7835027 7728626 7450706 7521680 7536573 7304634 7258895 7060109 6895680 6689511
4305 6689511 6387336 6572316 6657008 6654208 6732222 6850910 6954298 7014543 6961538 7021531 7237200
4294 7237200 7503352 7874360 8024533 8107325 8203611 8309794 8619669 8763911 9019257 8998738
4284 8998738 9095992 9124438 8979455 8963475 8897268 8964780 8887288 8578654 8350412 8131011 8094828
4273 8094828 7876845 7404498 7301101 7219646 7044343 6802057 6729096 6764191 6877194 6784501
4263 6784501 6794994 6868347 6857527 7133241 7154655 7250705 7329380 7406329 7560031 7529731 7574712
4252 7574712 7630585 7747511 8010279 8191611 8357162 8210333 8113591 8055762 8089644 8023028
4242 8023028 7995734 7864897 7385689 7026162 6856932 6716094 6540081 6388514 6071717 6019707
4232 6019707 6088337 5745941 5536946 5383723 5017734 5126967 5136807 4929724 4806421 4787900
4222 4787900 4893411 4778456 4645433 4565228 4609050 4566282 4537871 4502031 4502295 4538271 4525953
4211 4525953 4383401 4252707 4075578 4172064 4186215 4171386 4212065 4150190 4123427 4152866 4181400
4200 4181400 4007247 4130763 4218533 4122143 4188486 4243705 3958729 4255330 4214227 4020257
4190 4020257 4197894 4260944 4166527 4044628 4019782 4180530 4263916 4330926 4115903 4171347 4367517
4179 4367517 4405531 4520795 4638026 4384571 4576160 4768744 4745569 4565829 4610652 4756324
4169 4756324 4611946 4692314 4666566 4767012 4990716 5115163 5163875 5259828 5467660 5708241
4159 5708241 5724366 5725716 5841569 6057070 6349653 6534641 6854427 7149511 7421318 7908817
4149 7908817 8042580 8373614 8635611 9231012 9606854 9898537 10378489 10748830 10943693 11343341
4139 11343341 11498116 11373314 11161774 11169640 11287547 11326727 11368829 11421189 11687989 11589626
4129 11589626 11456435 11096993 10559873 10186969 9615500 9133690 8853587 8443840 8044178
4120 8044178 7748421 7384346 6905302 6862666 6735095 6277195 6097402 5988540 6006591 5883496
4110 5883496 5742181 5780398 5749348 5691288 5732186 5617692 5742668 5805149 5714973 5731092 5619233
4099 5619233 5592264 5662228 5584189 5474214 5430206 5437275 5548445 5555060 5590645 5812136 6106717
4088 6106717 6171661 6204071 6355336 6481942 6527809 6369470 6315518 6634790 6926876 7022145
4078 7022145 7231756 7745478 7833122 8075384 8329654 8494941 8688210 8604373 8628142 8769402
4068 8769402 9043401 9305674 9380667 9387226 9399585 9229450 9168026 9183360 8794071 8679363 8693887
4057 8693887 8566657 8067971 7762333 7423498 7094630 7053802 6760278 6531323 6346630 6312358
4047 6312358 6259034 6270717 6289800 6146065 6074325 6029774 5939014 5783263 5737194 5861329 5949582
4036 5949582 6052400 5928885 5947052 6017797 5952797 6010883 5862931 5755884 5917686 5906420
4026 5906420 5990127 6065566 5891627 5937480 5890400 5964883 5868000 5817145 5809602 5843689 5888901
4015 5888901 5856863 6034729 6076860 6090623 6109231 5953322 5947093 6259039 6248392 6119663 6137455
4004 6137455 6204363 6290366 6397266 6295250 6211280 6354659 6577227 6486419 6534328 6637515
3994 6637515 6762133 6898548 6799451 6803138 6769939 6728583 6822831 7008847 7273215 7331265 7198075
3983 7198075 7144276 7105491 7042218 7110403 7278131 7308410 7156725 7197249 7353080 7334384 7361072
3972 7361072 7564158 7500845 7346522 7421980 7563624 7480760 7517464 7802120 7903311 7971042
3962 7971042 8141302 8262618 8266517 8191968 8304049 8387506 8286611 8277566 8350371 8332405 8151280
3951 8151280 8116443 8400625 8518448 8567048 8682388 8511210 8374333 8577124 8633430 8654031
3941 8654031 8810133 8795603 8733241 8888818 8814818 8777130 9056232 8881856 9022788 9349841
3931 9349841 9273857 9234482 9214966 9214278 9310666 9469714 9685941 9804658 9915754 10079890 10158647
3920 10158647 10235916 10400626 10314129 10438880 10541798 10427580 10621656 10699807 10782247 11054189
3910 11054189 11194494 11143814 11102148 11164179 11389253 11434940 11433651 11670640 11974884 11912218 12093415
3899 12093415 12531625 12571941 12659857 12900568 13044958 13224390 13450362 13570167 13978910 14273748
3889 14273748 14561524 14706264 14927181 15140837 15302351 15543114 15860966 16049329 16203434
3880 16203434 16361819 16639056 16904519 16949823 17233264 17629393 17863642 18213308 18676814 19250286
3870 19250286 19451920 19746260 19998035 20247118 20664429 21091799 21369453 21761002 22119126
3861 22119126 22649144 23284544 23706973 24311983 24725866 25130369 25504971 25879093 26308312
3852 26308312 26458529 26556734 26948809 27249035 27278657 27359161 27708911 27891837 28197715 28463138
3842 28463138 28723989 29105298 29419291 29511629 30057436 30686759 31496003 32411271 33181749 34253678
3832 34253678 35444733 36634421 38076459 39241128 40789841 42332793 43936627 45557064
3824 45557064 46952963 48672632 50574843 52251143 53966637 56025055 58149591 60471472
3816 60471472 62963822 66028646 69465494 73257629 77731155 82724395 88439570 94684434
3808 94684434 101821012 110122472 120014286 132170534 147056162 164592652 184451570 205870781
3800 205870781 226258533 242626622 251236710 251822910 246400110 238201293 229553698 219176922
3792 219176922 205297473 187243157 167053781 148192977 132780344 120940313 111617150
3785 111617150 104198411 98714976 94349383 90687379 87743316 85332857 83580610 81876756
3777 81876756 80640932 79612073 78629760 77980784 77698765 77673798 77749166 78201423 78792782
3768 78792782 79438049 80167525 81073978 82122259 83484416 84719589 85889871 87044840 88469020
3759 88469020 90016871 91262036 92717173 94579650 96671748 98940407 101454299 104326167
3751 104326167 107718899 111447360 115533993 119857407 124400931 129191381 134358899 140326653
3743 140326653 147127031 155029232 164875445 177003318 192047403 210604599 231835667
3736 231835667 255314197 278894337 298706577 312005716 317741503 316846639 309676953 297436381
3728 297436381 281198734 261937851 240190971 218092098 198426996 182350778 170062995
3721 170062995 160475382 153036268 147122430 142349645 138553849 135458145 133028376 130731493
3713 130731493 128517930 126156919 123867961 121424520 118662415 116071360 113429962 110832036
3705 110832036 108071816 105858294 103967769 102251951 101192186 100398681 99785101 99433599
3697 99433599 99077294 98669048 98154981 97682560 96870291 95851151 94560224 93220014 91752060
3688 91752060 90094744 88328791 86586989 84866788 83569517 82060522 80527250 79262233
3680 79262233 77748293 76466190 75271143 74250980 73146475 72209767 71311945 70548156 69929591
3671 69929591 69527182 69208525 68611270 68173628 67714268 67298333 67090522 66573540 66097422
3662 66097422 65311144 64552474 63418147 62296016 60899226 59658758 58477617 57288381
3654 57288381 56110795 54957481 53835148 52446047 51224235 49947298 48754286 47864591
3646 47864591 47308999 46335166 45209487 44416133 43766569 43091982 42459522 41808858 41166974
3637 41166974 40365283 39510130 39023724 38496275 37843794 37438127 36948667 36464165 36095821
3628 36095821 35699166 35087333 34524646 34143591 33332307 32751609 32317904 32058517 31666095
3619 31666095 31055459 30657512 30443057 30012446 29437628 29163168 28872072 28455927 27848259
3610 27848259 27804942 27690446 27440218 27162012 27088873 27015027 26804278 26686176 26541089 26234869
3600 26234869 26272233 26208346 26106108 25988169 25893182 25991090 25999222 26064895 26173333 25953384 26060966
3589 26060966 26104283 25869694 25843192 25634115 25408214 25121090 25087234 24853949 24706055 24687369
3579 24687369 24635378 24633045 24569039 24496959 24651406 24808045 24720618 24742360 24831388 25094384 24990966
3568 24990966 24977723 25075195 25149920 25403783 25427023 25300354 25257131 25169879 25095826 24900835 24803826
3557 24803826 24749726 24504551 24394994 24402911 24047415 24055955 23829921 23484921 23505648 23694537
3547 23694537 23573186 23361449 23449386 23464219 23628621 23677358 23703145 23749206 23850326 23861090
3537 23861090 23929030 23859227 23814896 23845509 23927030 23877982 23860465 24076306 23897934 23959575 24040453
3526 24040453 23727777 23679864 23647180 23605282 23571617 23673021 23734203 23595210 23539229 23592270 23861354
3515 23861354 24032308 24051152 24355559 24485551 24608190 24652388 24923058 24892648 24915964 25113055
3505 25113055 25203689 25520988 25875795 26075158 26171227 26454678 26557130 26356190 26716476 27125303
3495 27125303 27297049 27481916 27478901 27370635 27307416 27417314 27314902 27285284 27407168 27535863
3485 27535863 27472992 27450155 27588939 27691710 28091965 28127952 28037457 27919501 28100622 28245128
3475 28245128 28373685 28468543 28639043 28860690 29302618 29515410 29338462 29412658 29573574 29635361
3465 29635361 29640882 29600725 29590912 29467906 29329166 28973998 28967415 29001176 29277702 29422404 29456241
3454 29456241 29778666 30050999 30428392 30844107 31354551 31592518 31961895 32265986 32683725
3445 32683725 32955315 33343413 33839495 34368394 34779283 35397168 35983062 36663925 37629864
3436 37629864 38634670 39513051 40619516 41900734 42861339 43816057 44804834 45500197 46247192
3427 46247192 46857056 47483925 48009618 48505541 49148778 49978198 50773030 51706430 53170931
3418 53170931 54796510 56441462 58477774 60744279 63158324 65827940 68749053 72041022
3410 72041022 75473870 79382172 83759783 88739953 94389342 100773215 107980945 115242158
3402 115242158 122600319 129064976 134223109 137636079 139142700 139835189 139651628 138336885
3394 138336885 136093265 133302611 130775050 127993470 125135720 121904870 117878044 113318967
3386 113318967 108091467 102194873 96089395 89795560 83704728 77747706 72273580 67737744
3378 67737744 63430662 59408635 56397061 53707086 51218658 48920715 46969408 44906526
3370 44906526 43032937 41652962 40043373 38710037 37518378 36379899 35232292 34405303
3362 34405303 33626488 32646101 31844720 31161550 30621496 30133164 29225270 28726433 28238029
3353 28238029 27868582 27297336 26722714 26271467 25795597 25618401 25335390 24959493 24518171
3344 24518171 24202514 24005420 23658121 23329565 23019343 22730492 22465199 22105005 21920745
3335 21920745 21787621 21741021 21591347 21402849 21156902 20970467 21001623 20732572 20415983 20236440
3325 20236440 19973456 19901447 20071714 19785068 19828017 19704255 19568667 19570097 19428997 19296199
3315 19296199 19282314 19041496 18891722 18710234 18572143 18734633 18798113 18929744 19092618 19129139
3305 19129139 19358144 19505025 19486497 19637943 19809580 19759470 19942940 20263537 20511003 20718179
3295 20718179 20888135 21193302 21469789 21563795 21614933 21792395 21682735 21642137 21774479 21766010
3285 21766010 21802369 21741963 21595377 21354985 21308710 21210447 21188906 21171669 21203411 21356936 21418291
3274 21418291 21342170 21261425 21217509 20985941 20854419 20798066 20618422 20326911 20073237 20013164
3264 20013164 19954997 19759841 19720994 19718158 19518384 19591861 19701377 19589566 19606080 19621194 19703606
3253 19703606 19741337 19981788 20029286 20164945 20281342 20492023 20718828 20625344 20740506 20893505
3243 20893505 21018419 21460470 21625279 21668790 21825722 22345441 22577549 22949966 23325754 23654020
3233 23654020 23965359 24235362 24788802 25249454 25570764 25833463 26157470 26411913 26470629 26402690
3223 26402690 26318092 26188925 25919539 25677341 25276272 24904203 24822806 24759997 24516784 24458396
3213 24458396 24295512 24251624 24331886 24282543 24596987 24535125 24420181 24518411 24617015 24530635 24406958
3202 24406958 24326617 24025542 23961987 23846856 23804087 23763190 23924368 24087986 24074743 24090081
3192 24090081 24044675 24137926 24295268 24356370 24540730 25121477 25558980 26058969 26690491 27196621
3182 27196621 27746764 28640727 29462750 30637507 31767190 32976203 34410350 35942145 37726080
3173 37726080 39902514 42219669 44794503 47737967 50588452 53176915 55625867 57638201
3165 57638201 59203390 59870113 59206955 58109553 56326565 54455025 51813970 48568610
3157 48568610 45600718 42930555 40284323 37972031 36009858 34261261 32855268 31637679
3149 31637679 30519338 29258848 28387636 27515432 26892934 26490324 25920965 25417237 24854122
3140 24854122 24444240 24129601 23829860 23486087 23500122 23235487 22792503 22802568 22690221 22519209
3130 22519209 22327158 21968137 21900045 21860110 21586832 21279747 21016169 20922801 20757115 20625273
3120 20625273 20309669 20262723 20115174 20158833 19965176 20046800 19978824 20136711 20111369 20085720
3110 20085720 20240376 20173955 20166097 20089454 20335668 20611440 20748845 20748926 20862088 21071510 21358125
3099 21358125 21606697 21830700 21924131 22369009 22752845 22932539 23259192 23588415 23974692 24448799
3089 24448799 24708757 24910244 24996828 25197187 25497236 25570758 25760344 26156139 26275758 26566437
3079 26566437 26935863 27246990 27664819 27877232 28400516 29113566 29541902 30220675 30814626
3070 30814626 31586437 32276343 32827403 33248059 33777339 34454906 34965676 35787723 36511759
3061 36511759 37369452 38195664 39150916 40233144 41024113 42059752 42728880 43305788 43977043
3052 43977043 44810826 45631105 46166795 46707723 47276413 47961120 48433425 49049299 49512197
3043 49512197 50082150 50797083 51286186 52194774 53287880 54201883 55072229 55800847 56644457
3034 56644457 57191804 57399831 57424782 57261273 57014917 56690139 56520867 56287882 56221707 56141298
3024 56141298 56099489 55912178 55803075 55923040 55928010 55906584 55982906 55825163 55831857 55632037 55236507
3013 55236507 54763116 54077067 53692992 53448038 53079133 52608236 52153989 51701892 51296627
3004 51296627 50857268 50410538 50042478 49766411 49367477 49011490 48542695 47942860 47758949
2995 47758949 47460331 47052223 46827319 46340983 45856276 45630869 45429384 45158636 44994949
2986 44994949 44819709 44555517 43948833 43712808 43481267 43437301 43100252 42758136 42470305 42307640
2976 42307640 42325545 42203224 42045236 41971449 41550337 41375378 41328158 41015435 40958563 40871570
2966 40871570 40689850 40527068 40563781 40524492 40344291 40345041 40164196 39923731 39772718 39604628
2956 39604628 39350422 39037898 38974466 38947821 38836822 38589972 38500134 37999876 37635857 37483228
2946 37483228 37255274 36929611 36685941 36306636 35876669 35492105 35325795 35086250 34837276
2937 34837276 34459851 34287313 33969100 33671002 33125135 32579692 32262308 32147461 31911330
2928 31911330 31554623 31237667 31026804 30846594 30625053 30307214 29869420 29884323 29648165 29553558
2918 29553558 29175061 28861913 28762666 28859806 28842555 28710582 28653946 28637845 28673778 28443940
2908 28443940 28152746 28252716 28356061 28111560 28094226 28088374 28050465 28043708 27959608 27814133 27849457
2897 27849457 27884232 27625574 27642780 27521608 27506228 27689064 27603199 27547281 27261638 27013768
2887 27013768 27063117 26829100 26580749 26682545 26955943 26906301 26612038 26397629 26386401 26192610
2877 26192610 26117141 26270031 26170687 26150372 26061087 26105395 26226171 26216030 25990286 26015598 26021395
2866 26021395 26125371 26144174 26262544 26368271 26454558 26730957 26746390 26920815 27010649 27075106
2856 27075106 27484127 27954656 27956523 27997100 28524454 29001176 29391294 29773065 29931392 30254778
2846 30254778 30650799 31128547 31609300 31891229 32357054 33153692 33724713 34323456 34729419
2837 34729419 35343657 35960928 36074815 36274406 36660443 37083566 37715442 38248987 38537363
2828 38537363 38929859 39233369 39607175 39888770 39966528 40063699 40377825 40866830 40998453 41114167
2818 41114167 41247900 41591036 41721560 41639052 41680216 41905017 42170314 42396628 42665506 42907783
2808 42907783 43055546 43277570 43354393 43364757 43516367 43751466 44228892 44491116 44641150 44815037
2798 44815037 45166862 45494771 45652551 45660539 46357971 46740168 47130040 47575179 47961027 48471743
2788 48471743 49056991 49827660 50259067 50734190 51364157 51782136 52178005 52782596 53119685
2779 53119685 53290281 53674067 53969807 54209185 54333357 54569956 54695536 54782264 55087759 55129098
2769 55129098 55125341 55014595 54967097 54906868 54926351 54961546 54660528 54322089 54281948 54263649 53816174
2758 53816174 53660250 53680506 53676583 53635898 53363301 53147185 52963550 53004603 53135557 52815912
2748 52815912 52704271 52736987 52447820 52528142 52199963 51904395 51779708 51635430 51392580 51121100
2738 51121100 50746615 50541068 50406941 50070073 49636567 49154535 48733726 48118889 47469758
2729 47469758 46898091 46181992 45584472 44894479 44190701 43289826 42674491 41766770 40848548
2720 40848548 40100663 39250744 38455048 37505458 36805276 36188642 35705660 34897655 34274929
2711 34274929 33855317 33194167 32733170 32333943 31846686 31702392 31441481 31221176 30883760
2702 30883760 30563394 30293177 30101094 30224197 30473399 30329462 30173990 30223642 30513471 30546140
2692 30546140 30578944 30718805 30712643 30808961 31030824 30939046 31072406 31357343 31793822 31815405
2682 31815405 31992690 32024736 32168657 32442740 32319942 32209384 32298785 32692971 32905366 32937410
2672 32937410 32815584 32839141 32950547 32987683 32930784 33259330 33398231 33512681 33520395 33717307
2662 33717307 33929316 34212323 34629233 34764768 34703527 34710720 34895126 35362171 35617253 35811624
2652 35811624 36171503 36667252 37147033 37437922 37746537 38068636 38526549 38875061 39334388
2643 39334388 39824919 40241157 40847799 41499981 41904194 42206436 42547650 42687691 43077466
2634 43077466 43587407 43912115 44291057 44620444 45204927 45659013 46210477 46653664 46865854
2625 46865854 47310008 47527700 48098205 48650968 49031769 49528844 50172544 50656037 51212841
2616 51212841 51834145 52494755 53053314 53574236 54348666 55222020 56107158 57121637 58114977
2607 58114977 59220536 60330837 61544647 62919333 64182822 65478118 66892521 68270258
2599 68270258 69956025 71333428 72922012 74698799 76099039 77671240 79216160 80778910
2591 80778910 82531309 84153539 85753972 87433611 88877546 90237376 91862655 93435222
2583 93435222 94697225 96114843 97525839 98603037 99532516 100575466 101658202 102325919
2575 102325919 103060337 103767488 104193935 104884576 105341249 105672823 106046978 106338824 106648117
2566 106648117 106939045 107163234 107347638 107564268 108069061 108292356 108709614 109159829 109623650
2557 109623650 109898600 110219994 110612202 111108729 111657297 112100295 112457227 112872715 113432310
2548 113432310 114094081 114793516 115512488 115925495 116462805 117006961 117341964 117884591 118302482
2539 118302482 118547131 119012814 119526532 119809341 120054287 120305256 120721383 120745294 120652628 120402397
2529 120402397 120072533 119831804 119183569 118436434 117584323 116713751 115720521 114565753 113251286
2520 113251286 112090011 111035103 109461622 107960929 106300687 104755537 103148874 101449613
2512 101449613 99701047 98023746 96250278 94480566 92909387 91135329 89565922 87950568
2504 87950568 86140882 84405883 82788682 81185542 80087911 78475794 77165178 76108231
2496 76108231 75013623 74064544 72967918 71977161 71164487 70446283 69664268 68908465 68334841
2487 68334841 67685138 66805919 66088166 65517104 65043568 64410510 63628199 62899278 62248311
2478 62248311 61538094 61110087 60443013 59999866 59536701 58848950 58104997 57357067 56832439
2469 56832439 56175165 55292398 54576357 53801080 52765012 51998986 51395832 50415794 49414771
2460 49414771 48604339 47865109 46857797 46131581 45439901 44573940 43913366 43202980 42671041
2451 42671041 42041396 41140470 40434460 39631088 38714645 37937670 37317492 36682575 36070728
2442 36070728 35559103 34875997 34254159 33825088 33404891 32879517 32402931 32030855 31483266
2433 31483266 31073862 30632295 30206679 29741550 29390022 29105841 28641563 28270912 27971711
2424 27971711 27711941 27443349 27170162 26886189 26718119 26352006 25930112 25693159 25385367
2415 25385367 25163214 25050113 24799856 24277673 23945686 23602237 23338935 23229960 22974205
2406 22974205 22541286 22142109 21926576 21670826 21542390 21366245 21217881 20775637 20573610
2397 20573610 20392228 19866867 19492069 19322854 19048123 18964386 18761423 18593859 18307307 18175277
2387 18175277 18166928 17967024 17702957 17496688 17287394 17259546 16854661 16705898 16718648 16615549
2377 16615549 16498756 16354836 16289463 16146394 16007388 15816586 15759022 15489672 15377082 15214222
2367 15214222 15133252 15228850 15277181 15138281 15126782 14721599 14565058 14643429 14428989 14259399
2357 14259399 14113514 14190757 14411954 14379602 14072969 13865290 13824410 13851005 13884351 14046771
2347 14046771 13940471 13831889 13825910 13543029 13516620 13725308 13608650 13327299 13358388 13535905
2337 13535905 13406842 13315429 13318120 13228666 12936428 12633606 12758336 12848059 12873570 12921575 12929086
2326 12929086 12829799 12899781 12981290 12761628 12815949 13092820 13027668 12870003 12935976 13215671
2316 13215671 13331132 13323985 13358412 13579925 13590930 13449544 13505233 13457420 13515670 13546949 13538994
2305 13538994 13548501 13364847 13474978 13386876 13298851 13116955 13156612 13345278 13122237 12957705
2295 12957705 12678678 12404108 12196249 12180530 12038898 11878156 11636792 11631117 11763772 11577372
2285 11577372 11422676 11283025 11285216 11352513 11076067 10963809 10904429 10777510 10843142 10982452
2275 10982452 11014879 10866836 11004697 10861381 10782761 10641033 10630864 10712020 10566443 10810892
2265 10810892 11013534 11047190 10891827 10979373 11119669 11005133 11176013 11243870 11096111 11020193
2255 11020193 11018198 11178862 11239828 11273796 11200680 11078667 11243797 11375031 11410142 11488379 11641613
2244 11641613 11626324 11576435 11748988 11687503 11816357 11929238 12207046 12430788 12475514 12262169
2234 12262169 12446553 12641255 12618485 12723616 12946245 13054962 13081698 13306590 13358475 13425791
2224 13425791 13636182 13779614 13939024 13842432 13788992 14248039 14531296 14480111 14374416 14549155
2214 14549155 14643852 14878810 15101462 15223362 15552841 15819138 15922309 15989303 16011108 16430745
2204 16430745 16751169 16996573 17154941 17481428 17861808 18262134 18449606 18701325 19090428
2195 19090428 19462624 19780616 20331215 20840137 21482475 22011115 22664517 23336130 23942385
2186 23942385 24817015 25500159 26591392 27353939 28559963 29714003 30956033 32282589 33678979
2177 33678979 35142071 36929606 38507342 40367732 42397961 44314762 46090380 47399782
2169 47399782 48410736 48934171 49164647 48766432 47890744 46962178 45805238 44838861 43831829
2160 43831829 42805360 42115932 41352019 40657876 39876470 38948395 38033910 37129592 35944740
2151 35944740 34782945 33735383 32627388 31177813 29889504 28628134 27391700 26086826
2143 26086826 24669034 23376462 22243643 21394115 20682724 19870808 18773446 17927681 17541401
2134 17541401 17091667 16717712 16003849 15369128 14989986 14720903 14271396 13738977 13319165
2125 13319165 13002549 12643046 12290977 12099507 11738229 11610359 11590149 11369665 11048509 10595032
2115 10595032 10414559 10290406 10051189 9857963 9692143 9653166 9638978 9343143 9227889 9201067
2105 9201067 9037767 8910074 8733824 8591244 8536296 8238420 8116959 8183913 7907126 7985653
2095 7985653 8054933 7789167 7769584 7955436 7704186 7534242 7492185 7619290 7688522 7649336
2085 7649336 7548455 7358009 7265501 7085970 6981023 7037238 7094383 7114392 6877897 6646060
2075 6646060 6571788 6532495 6666570 6675599 6485860 6117705 6100003 6119209 6236869 6193094 5880096
2064 5880096 5750668 5773756 5754232 5651312 5341655 5372689 5605976 5439120 5114467 5115186 5147325
2053 5147325 5180301 5290943 5035026 4870122 5000688 5230712 5175264 5199679 5230510 5013781
2043 5013781 5035360 4948832 4771693 4749776 4758237 4680951 4717477 4860281 4830009 4735744 4695029
2032 4695029 4565793 4485935 4654583 4509740 4709285 4522542 4382179 4235250 4148599 4146504
2022 4146504 4410174 4629794 4548249 4582526 4427271 4446248 4423058 4397679 4303851 4113008 4193324
2011 4193324 4204513 4077843 3905795 3815944 3918809 4117124 4041806 3925737 3780510 4058419
2001 4058419 4076408 3768773 3758196 3885386 3949988 3937469 3967246 4047463 4038045 3858467 3888786
1990 3888786 3847161 3692768 3750737 3849315 3871382 3854229 3706571 3882551 4071235 4014516 3830799
1979 3830799 3667402 3721514 3635710 3702198 3862593 3819842 3963515 3820674 3650767 3511741
1969 3511741 3488268 3491229 3605603 3434567 3432659 3719281 3678812 3573856 3630820 3528026 3397188
1958 3397188 3301133 3201858 3037034 3301125 3450402 3328777 3190263 3211733 3296360 3258729
1948 3258729 3379047 3433542 3284632 3431536 3356816 3402607 3293556 3324538 3451911 3394322
1938 3394322 3255625 3216061 3251442 3262365 3228748 3060945 2968991 2934177 3090845 3292911 3282100
1927 3282100 3184587 3200401 3190714 3152233 3287785 3379863 3168566 3317677 3272068 3233245 3265142
1916 3265142 3208217 3208439 3181981 3089492 3071382 3011538 3261355 3296640 3126969 3343479 3461292
1905 3461292 3352816 3446221 3427647 3285019 3130988 3203419 3091953 3150267 3228286 3414550
1895 3414550 3690731 3870315 3783404 3362794 3291127 3514007 3510334 3597057 3491432 3515700 3641521
1884 3641521 3589336 3733212 3761521 3614765 3488583 3438543 3487793 3485764 3440187 3417556 3271567
1873 3271567 3325346 3514440 3272330 3262140 3511938 3510011 3562950 3492437 3575991 3677176 3832071
1862 3832071 3695917 3667104 3671413 3742679 3630621 3349365 3527578 3895070 4163496 4177776
1852 4177776 4233241 4340471 4418812 4282358 4205677 4100973 4294737 4414592 4514182 4616788
1842 4616788 4786962 5144187 5215661 5340317 5474027 5525771 5566421 5510433 5319572 5491543
1832 5491543 5577581 5494159 5562227 5543108 5304734 5400671 5417593 5425747 5427828 5460548 5524411 5441156
1820 5441156 5653434 5874696 6013202 5947437 6015970 6238584 6320892 6716688 6869487 6931011
1810 6931011 7188568 7386098 7532281 7622651 7704267 7726580 7658599 7390827 7294546 7005230
1800 7005230 6543965 6370922 6099053 6115629 5990195 5926593 5884897 5768851 5608206 5686908
1790 5686908 5866882 5609935 5588547 5546647 5655150 5933544 5754215 5741186 5738422 5891003
1780 5891003 6268527 6381013 6450088 6579386 6604678 6443542 6420480 6277272 6104427 5946024
1770 5946024 5673435 5532701 5235479 5000534 4882162 4835853 4573076 4496824 4556337 4555109
1760 4555109 4520883 4145819 3863354 3885692 4053202 3790161 3615389 3622097 3712475 3740052 3676060
1749 3676060 3412366 3367574 3426261 3549901 3265937 3020865 3017858 3006125 3029590 3007938 3048918
1738 3048918 2962372 2923530 2936971 2830511 2663776 2619254 2760274 2668247 2584950 2508432 2525400
1727 2525400 2549197 2629050 2531051 2338097 2420616 2514974 2410810 2332897 2440707 2253088 2328008
1716 2328008 2466310 2400809 2422069 2410311 2496402 2431404 2187899 2235000 2218662 2327296 2418501
1705 2418501 2316947 2412504 2201219 2064293 2126818 2198056 2290035 2208025 2286699 2374583 2316883
1694 2316883 2246908 2079623 2145703 2244576 1968149 1856645 1862789 1936710 1844649 1782611 1714291
1683 1714291 1769493 1679066 1652927 1818369 1746564 1686752 1513917 1530189 1439413 1334097 1562768
1672 1562768 1683667 1687500 1688670 1499269 1476239 1350089 1320687 1357737 1369586 1523312 1745723
1661 1745723 1631209 1594814 1483320 1436713 1467890 1539894 1620583 1590626 1618789 1571981 1693465
1650 1693465 1569097 1351055 1349458 1263688 1334354 1324559 1325062 1558229 1466658 1400643 1104981
1639 1104981 1145249 1130363 1145271 1108990 1208295 1185028 1190579 1066495 1105604 1281118 1342057
1628 1342057 1088617 1000890 1139143 1247251 1176690 1018637 972068 1212141 1059885 1003171
1618 1003171 1011859 970409 1082532 1048906 990229 920614 1000284 848596 846781 837965 1013824
1607 1013824 1118355 1199117 1212002 1084508 1039427 1067599 1144064 1126451 1005389 921229 781277
1596 781277 824404 1002395 1047156 1058573 931653 774793 860755 1129742 1175429 1083541 1147446
1585 1147446 1134759 969924 905304 906297 960031 1099296 912862 914025 1035677 1124803 940815
1574 940815 979845 1003104 1119335 1085184 960123 765057 732099 768090 839528 728378 544093
1563 544093 475216 710911 836982 734284 681693 799560 811825 762474 707877 667024 776352
1552 776352 656890 826097 675690 682093 782809 769896 764225 835083 837569 860811 799253
1541 799253 511601 570121 740067 775334 712482 845013 815206 711392 684341 801297 811434
1530 811434 846901 770382 766656 894884 875068 841851 637023 599870 524723 584396 676631
1519 676631 784900 766415 799257 859033 880381 706013 586519 725325 936897 913290 841662
1508 841662 865954 779878 796125 853748 728780 542534 644197 588405 725529 597860 404652
1497 404652 488101 690254 973710 623769 464865 696033 831241 667606 443160 639243
1487 639243 756529 772456 595136 645208 864296 799001 754522 769816 550202 664848 637898
1476 637898 531062 634600 694779 914515 915083 702113 508774 499493 599876 588927 447320
1465 447320 564378 486643 541227 685491 564230 595999 600910 686482 700928 503393 372695
1454 372695 507298 590017 438788 583016 745402 651938 593380 740615 578777 539834
1444 539834 321773 345141 499865 540431 469314 527218 549482 407945 334206 458839 488463
1433 488463 555521 701377 776595 564783 439971 447405 387454 343108 205123 41346 179462
1422 179462 391480 492261 544919 608485 634465 529406 440891 346078 402356 473566 471229
1411 471229 376697 501637 553622 566578 521039 410631 237129 278054 430816 613212 494744
1400 494744 385965 418514 562239 670406 691088 617594 536543 756851 743343 730063 737494
1389 737494 680292 435086 194809 45475 62123 326884 476803 381961 402258 378096 505134
1378 505134 404861 385344 421967 332927 355091 228912 271441 258523 203175 83171 233777
1367 233777 287016 366843 254770 452322 521799 271377 73605 87492 231291 424367
1357 424367 356212 324529 298494 284489 324375 198108 197831 50579 66956 222047 377489
1346 377489 312934 289573 178362 293950 468964 328282 391132 361954 461408 333164 254218
1335 254218 252792 448921 413459 225989 70266 149694 216153 108515 204960 333481 48711
1324 48711 22978 212302 234055 431943 323739 135180 433658 399902 110853 105379 50164
1313 50164 -12093 -162413 -102757 -71477 176098 301097 317544 131929 68242 373918 481462
1302 481462 277396 177405 292471 324031 230866 104693 129194 383962 422747 452635 267217
1291 267217 134873 347866 485452 330318 181803 139763 39505 -69702 25727 47643
1281 47643 61151 61031 165539 243936 185517 340080 462170 301712 363461 211659 57970
1270 57970 136185 14363 128390 124357 167800 433914 455830 297338 240778 295755 309614
1259 309614 201924 91016 192945 424034 456356 493020 336130 203880 245076 323536
1249 323536 407235 274144 87519 213342 460933 687822 714313 674478 467455 394688
1239 394688 265294 324729 277578 214798 324236 334007 310725 175667 172190 40518 157005
1228 157005 156212 -50442 -153038 85661 390037 575492 315427 158044 124953 199702 167342
1217 167342 127362 -5146 -51286 102939 193247 13465 135286 256399 205012 229086 168175
1206 168175 62194 46428 -44924 -8317 161626 165026 154255 99356 32242 -38782 38983
1195 38983 20467 -66446 -33722 16031 56584 113346 231189 182247 75455 260378 163024
1184 163024 54298 19783 166626 286903 319381 281532 250912 396116 334288 347945 226925
1173 226925 127836 226797 103778 30626 61901 109213 -10363 -76959 -111428 -1258 -86956
1162 -86956 -142012 63704 -59691 -237334 -31422 -181577 -89718 -143502 -139474 12697 -134520
1151 -134520 -62665 220051 80741 83523 25777 -16481 5402 -230631 -59978 30731 2596
1140 2596 90582 -11219 27372 232431 -6826 -127386 16504 -154875 -142416 112593 64350
1129 64350 -60737 58246 218012 66484 -6506 -161103 -176927 81079 161708 106742 205753
1118 205753 172636 106871 255074 344348 479419 344679 57199 -11226 49983 342959 290111
1107 290111 192000 196074 100880 76353 20433 48344 51653 218424 365762 445642 423063 348765
1095 348765 407133 342393 378300 505439 522309 456348 425738 159730 142938 224357 314772
1084 314772 298216 186399 254312 243390 355129 329738 215808 251174 369710 276436 232519
1073 232519 240594 266698 233617 137630 65892 294123 387356 241596 235312 352713 361516 160788
1061 160788 115981 213369 431701 476252 414596 395476 310243 180311 234523 306598 404502
1050 404502 361166 497476 673754 770888 667574 666102 540387 430035 556618 581054 633932
1039 633932 705319 791496 914967 928411 991664 1116130 1054187 885963 684786 638968 715186
1028 715186 763074 775378 690193 641714 680580 672221 896463 1055029 1180454 1215947 1184742
1017 1184742 959579 926510 1060022 1209531 1247518 933932 999065 1197166 1266954 1249783
1007 1249783 1326844 1397684 1616570 1753251 1647216 1544840 1548568 1679730 1906057 1914552 2108899
996 2108899 2295989 2501842 2712910 2960509 3168427 3271912 3622857 3870827 4090970 4161618
986 4161618 4296947 4463592 4769564 5108031 5515600 6028949 6525092 6828912 7139353 8033038
976 8033038 9130643 9859956 10733959 11588247 12392317 13330889 14424769 15757261 17829223
967 17829223 20234402 23572148 28055188 33937884 40823974 47076782 53585815 59434320
959 59434320 59302055 54762334 48753487 40572681 32746032 26786881 22693864 19703024
951 19703024 17580331 15825246 14246938 12860063 11862798 11227021 10793339 10337398 9885168
942 9885168 9596480 9092339 8417385 7758251 7088844 6631742 6272184 5857195 5321274 5030111
932 5030111 4959905 4844342 4901327 4857923 4475903 4368834 4133295 4002300 3803263 3753225
922 3753225 3873517 3717783 3677241 3601488 3313883 3054392 2793378 2792627 2614059 2551305 2646026
911 2646026 2496222 2521792 2513999 2452889 2434349 2297564 2025480 1885777 1830893 2006274 2114421
900 2114421 2230267 2147738 2024520 1958726 1907569 1862442 1754097 1610853 1450713 1353863 1310628
889 1310628 1403919 1486491 1475832 1518040 1357098 1409283 1375052 1444490 1415816 1213473 1073282
878 1073282 1022578 1099198 1121494 877952 1112155 956768 896567 1088660 1223369 1111488
868 1111488 884819 824834 887142 934278 754615 686479 714836 776676 917551 859186 708142
857 708142 911209 1072240 983594 913137 685822 577482 688746 551985 517567 606629 603412
846 603412 538467 655218 664741 702398 531115 681988 551420 256062 384779 413929 391643
835 391643 472189 497171 593950 384559 270357 528412 513188 413386 594205 601838 483420
824 483420 454057 274084 244590 287599 25695 79482 235180 464596 481763 406573 326530
813 326530 367926 319335 277886 290084 120820 172360 220950 38975 236398 191485 208016
802 208016 238241 301724 263438 138946 55156 222719 81734 -20361 34912 163042 348322
791 348322 229022 166178 160503 182289 95186 159963 161077 258627 230321 155924 162073 129848
779 129848 91529 321926 356471 230471 280922 286772 158527 240506 81697 23178 -57463
768 -57463 -9502 -150653 -127937 -27576 272243 360571 260226 378918 454596 120722 -47783
757 -47783 -24728 -236304 -381355 -73665 15391 193491 219461 287066 330295 121999 103087
746 103087 -71938 67248 20076 26325 64706 133734 327524 159589 -57068 -174106 -165765
735 -165765 199528 55413 -47670 -87448 -147908 -177347 -222893 -249175 -51891 14932 -68830
724 -68830 -128498 -428955 -397022 -319445 -70124 70456 887 63224 -25801 -14254 -29878
713 -29878 157023 217069 91424 174936 165015 104056 -169697 -324075 -236040 -292329 -366109
702 -366109 -310259 -150620 -54127 146970 75765 171171 135293 -19335 -195994 -284873 -139187
691 -139187 -108275 -107295 -83145 106762 -120345 -135241 33513 -53631 -301349 -242891 -80466
680 -80466 40181 -95861 -206314 -73782 113519 159511 162122 55998 150220 269168 283110
669 283110 150774 -53681 41308 109447 77687 -109109 -401168 -289655 -37440 -118520 -28286
658 -28286 -143885 -19765 -17353 -5879 -60625 -40816 -140394 -44093 -294548 -554032 -403815
647 -403815 -186787 -223642 -303116 -354338 -602294 -220706 -101585 -333632 -430178 -434145 -107696
636 -107696 -190950 -323668 -298882 -231171 -134859 -276142 -203821 -278356 -290142 -294222 -229035 -211880
624 -211880 -198384 -186338 -413681 -644144 -508651 -303792 -331245 -358874 -368402 -360027 -175869
613 -175869 -420558 -413031 -403479 -464204 -257658 -327602 -429917 -465985 -417968 -213827 -524214
602 -524214 -555080 -603411 -404147 -163696 -389533 -512336 -382253 -297433 -335207 -320610 -512463
591 -512463 -574918 -478556 -268732 -413773 -557675 -471914 -268092 -204214 -319075 -320176 -238243
580 -238243 -205174 -361952 -531994 -465065 -493200 -527783 -412026 -298842 -211572 -212537 -398845
569 -398845 -384761 -503510 -518099 -457186 -412659 -480884 -382276 -448092 -572540 -350565 -611330
558 -611330 -505810 -339832 -304662 -415027 -418611 -294966 -321768 -341000 -372137 -546478 -514996
547 -514996 -329369 -327746 -167112 -265036 -302439 -159364 -38651 -220706 -558380 -556268 -580993
536 -580993 -734560 -687122 -613482 -517894 -519242 -393359 -254581 -79298 -179130 -240656 -393271
525 -393271 -742242 -732664 -522430 -365242 -509243 -466106 -410222 -379322 -389621 -499329 -516926
514 -516926 -552833 -545387 -476624 -406019 -378890 -340053 -340811 -388259 -463962 -456649 -344897 -218932
502 -218932 -345266 -401482 -391174 -436543 -447915 -572264 -673965 -606469 -608582 -524114 -624454
491 -624454 -606008 -575188 -480157 -395044 -472485 -340452 -314193 -664265 -599222 -679268 -824724
480 -824724 -780485 -827506 -502385 -352563 -288025 -341846 -480289 -502896 -506869 -481253 -409617
469 -409617 -712259 -699456 -607354 -439731 -473761 -612344 -653107 -670554 -643268 -771523 -855005
458 -855005 -595970 -611259 -712298 -744905 -700946 -658610 -780334 -575997 -445069 -626270 -593583
447 -593583 -737602 -764467 -683121 -752117 -539309 -645857 -733372 -627265 -635596 -692983 -833045
436 -833045 -667839 -610081 -531211 -433663 -488842 -545063 -611826 -653930 -531339 -689670 -623275
425 -623275 -435607 -424750 -533967 -671745 -638768 -529057 -580567 -502384 -606403 -476276 -360066
414 -360066 -489571 -522164 -628063 -743963 -625403 -549526 -894521 -893673 -775044 -521203 -656691
403 -656691 -876902 -711820 -481140 -527144 -590311 -730959 -512561 -544478 -538592 -550826 -665562
392 -665562 -664579 -565610 -668107 -909441 -1042335 -886384 -681899 -749871 -718932 -726901 -801423
381 -801423 -710979 -642095 -824682 -841828 -727301 -775820 -698133 -648763 -703820 -584115 -445314
370 -445314 -510627 -774016 -775322 -639802 -659838 -631334 -779488 -652131 -678038 -813182 -517959
359 -517959 -612929 -620704 -599682 -626458 -839699 -859711 -762232 -691321 -646199 -684429 -718612 -889755
347 -889755 -939636 -806773 -890874 -965229 -779711 -792750 -577101 -626549 -636322 -673757 -873917
336 -873917 -884451 -818418 -853890 -916723 -948063 -928236 -918609 -864539 -840735 -852852 -748724 -839402
324 -839402 -911485 -903420 -1061476 -960099 -911593 -828385 -855603 -866763 -947694 -1073285 -1047570
313 -1047570 -875299 -870669 -790831 -738656 -903096 -927857 -905519 -896311 -998106 -1032850 -1104260
302 -1104260 -974691 -875489 -783668 -783353 -772308 -747924 -539390 -716956 -856611 -711767 -828507
291 -828507 -975147 -1153126 -1257525 -1048872 -929159 -870664 -900178 -887814 -908602 -937560 -884500
280 -884500 -1162249 -1173840 -1090169 -956855 -830039 -1081306 -984430 -929799 -873925 -773679 -761465
269 -761465 -878663 -1013045 -946639 -1050415 -1264246 -1225887 -1083156 -930851 -1021708 -958286 -842517
258 -842517 -785438 -715184 -791671 -1164348 -1083977 -1082914 -994306 -1023747 -1145703 -1137718 -1152064 -846346
246 -846346 -819667 -950678 -882972 -879679 -901268 -859537 -947362 -950056 -1007740 -977162 -900005 -878416
234 -878416 -914571 -806633 -872376 -960207 -853752 -932487 -931545 -1011068 -1172916 -1197118 -1218538 -1210785
222 -1210785 -1215327 -1108352 -962114 -915064 -845811 -867484 -838070 -1003436 -1186964 -1157137 -1108149
211 -1108149 -1059554 -1160290 -1072098 -1114351 -953958 -1100139 -1044715 -1065511 -1110924 -1120301 -1036611
200 -1036611 -1263359 -1135475 -1273252 -1369112 -1225898 -1376557 -1250069 -1105789 -1166617 -1224535
190 -1224535 -1147098 -1181603 -1203104 -1235308 -1202071 -1094589 -1128722 -1194013 -1262403 -1300158 -1263831
179 -1263831 -1233794 -1080480 -1024237 -1065905 -1366883 -1223326 -954101 -1162280 -1363624 -1259565
169 -1259565 -1354827 -1152725 -1210258 -1321286 -1339499 -1289861 -1178847 -1032202 -1133726 -1107710 -1091022
158 -1091022 -1363028 -1419333 -1424890 -1337165 -1242930 -1282182 -1253969 -1243937 -1192090 -1092940 -1186418 -1245290
146 -1245290 -1187839 -1095809 -1157077 -1253696 -1320967 -1283161 -1251213 -1177941 -1198956 -1175488 -1100686 -1046928
134 -1046928 -1123269 -1133587 -1153641 -1184139 -1284106 -1287649 -1091902 -1039742 -1203467 -1358470 -1424351
123 -1424351 -1349937 -1297887 -1237661 -1042066 -1157942 -1212376 -1102727 -1119046 -1259457 -1430251 -1446801
112 -1446801 -1353602 -1426879 -1499465 -1391187 -1331060 -1255056 -1187756 -1257604 -1325893 -1436087 -1380590
101 -1380590 -1285324 -1462730 -1476951 -1427446 -1162804 -1230907 -1304538 -1111557 -1161913 -1337835 -1471448
90 -1471448 -1684721 -1664636 -1605926 -1650929 -1525882 -1508415 -1393951 -1372137 -1315361 -1244466 -1403606
79 -1403606 -1394999 -1287917 -1333008 -1395841 -1509274 -1422617 -1358817 -1369910 -1465510 -1421495 -1432039 -1425913
67 -1425913 -1546360 -1646859 -1479125 -1473021 -1385779 -1502795 -1469435 -1380425 -1299178 -1314393 -1613482
56 -1613482 -1534732 -1375091 -1312981 -1297762 -1254806 -1305757 -1381698 -1549574 -1488833 -1470269 -1551798
45 -1551798 -1487283 -1357526 -1468282 -1490901 -1496606 -1428308 -1449610 -1457836 -1369839 -1326296 -1349224 -1387670
33 -1387670 -1440242 -1406886 -1634312 -1676389 -1462567 -1438975 -1537835 -1507911 -1405003 -1454557 -1557841
22 -1557841 -1569985 -1470884 -1513256 -1555513 -1549012 -1560041 -1443978 -1480572 -1598434 -1538027 -1702881
11 -1702881 -1675498 -1500621 -1547306 -1680387 -1513682 -1513565 -1544983 -1507456 -1544563 -1563801 -1490479
0 -1490479
$$ Imaginary data points
##PAGE= N=2
##DATA TABLE= (X++(I..I)), XYDATA
16383 -3577021 -3573044 -3335175 -3274507 -3326765 -3312010 -3281924 -3278052 -3189677 -3101608 -2991422 -2847063
16372 -2847063 -2849127 -2929415 -2879945 -2785563 -2738449 -2664259 -2689622 -2677497 -2576950 -2376082 -2404498
16361 -2404498 -2382626 -2427105 -2422457 -2297485 -2246604 -2380629 -2384954 -2144793 -2045043 -2035531 -1900772
16350 -1900772 -1713627 -1741632 -1747129 -1819891 -1932030 -1755955 -1788738 -1643221 -1425605 -1585155
16340 -1585155 -1658241 -1511660 -1378768 -1279438 -1303701 -1206664 -1254027 -1202066 -1207544 -1094000 -888415
16329 -888415 -919809 -910822 -858338 -984987 -879804 -889446 -858419 -766352 -647628 -519595 -412484
16318 -412484 -470388 -649169 -523103 -395858 -291905 -413293 -343148 -285128 -280915 -183087 -101505
16307 -101505 -206489 -170298 -7405 -5441 -102042 -78537 256659 399926 355915 310691 327552
16296 327552 340669 361690 355595 210705 350957 481125 506667 538535 472460 593596 686429
16285 686429 739975 637999 650303 759211 855532 961259 863673 840615 968570 1012468 1113211
16274 1113211 922908 788076 936079 991985 1186848 1198464 1179733 1300679 1408610 1305402
16264 1305402 1232964 1351977 1296855 1436471 1417628 1453799 1313638 1297768 1477640 1623574
16254 1623574 1567200 1855047 1903251 1827744 1800024 1715045 1742235 1740037 1825013 1791444 1883499
16243 1883499 1961271 2026023 1964683 2085072 2201250 2532022 2499164 2282139 2035795 1925648
16233 1925648 1958577 2093404 2115859 2147114 2197004 2377080 2546938 2495097 2463112 2482654 2629160
16222 2629160 2476893 2389831 2311394 2280322 2389058 2426024 2441784 2382968 2400758 2426411 2521906
16211 2521906 2518635 2545738 2672213 2647805 2407487 2548622 2584795 2632582 2684781 2666823 2786194
16200 2786194 2831852 2903407 2815748 2782017 2898304 2754920 2741797 2695692 2704148 2895226 2949352
16189 2949352 3163859 3248468 3285002 3388187 3485286 3498812 3147572 3036792 2933262 2925100
16179 2925100 3001968 3136277 3204313 3170254 3224150 3186985 3170379 3304620 3359449 3361194 3391485
16168 3391485 3347053 3204295 3279653 3454709 3443542 3313478 3247403 3280389 3359790 3410295 3422349
16157 3422349 3644792 3522986 3378986 3413119 3416133 3383668 3291217 3208491 3264987 3343127 3408084
16146 3408084 3593880 3566178 3612003 3732572 3679023 3655458 3564321 3364449 3475687 3549577
16136 3549577 3566294 3549124 3536279 3570589 3610878 3670349 3501763 3501356 3356010 3387215 3321347
16125 3321347 3498509 3501713 3512428 3680238 3759257 3691233 3720308 3580234 3525594 3479181 3488973
16114 3488973 3538575 3665465 3706551 3603868 3559182 3695798 3865434 3711986 3675818 3673247
16104 3673247 3664114 3729559 3745570 3666975 3687983 3607012 3659220 3663965 3583599 3495194 3486796 3624905
16092 3624905 3814994 3777625 3671253 3783529 3741155 3637928 3618535 3801866 3867129 3868452
16082 3868452 3906178 3923093 3831889 3688095 3886442 3737849 3630396 3793626 3914374 3991128
16072 3991128 3855878 3787873 3778398 3609729 3728492 3837808 3707128 3664456 3598207 3749834
16062 3749834 3793103 3788082 3805734 3728548 3689562 3742756 3928952 4055932 3912033 3947937 4023556
16051 4023556 3883421 3894237 4040068 4003788 3970607 3823393 3994261 3975938 3787105 3720005
16041 3720005 3862162 3934677 3878661 3748051 3739224 3800057 3920669 3966067 3867728 3835440 3696948
16030 3696948 3828183 3837457 3884241 4007564 3910034 3848224 3824647 3902165 3978890 4054261 3902834
16019 3902834 3695309 3938426 3911287 3990342 3658754 3619296 3893703 3992816 3876416 3860840
16009 3860840 3752724 3774477 3781236 3774387 3871153 4058433 4073326 4042184 3821777 3688756 3737823
15998 3737823 3905649 3941229 3858201 3906499 3846561 3839129 3836584 3720367 3828064 3915545 4046170
15987 4046170 4107194 4016816 3734807 3751277 3817281 3809610 4030001 4013626 4121525 4231425 4170767
15976 4170767 4037223 4008953 3934278 3985571 4054017 3920023 3962806 3859156 3846122 3939015 3894895
15965 3894895 3933705 4034570 3856693 3814986 3667707 3720673 3779574 3787353 4050119 3999000 4001475
15954 4001475 4046298 3980144 3700109 3694486 3786320 3887919 3735759 3877470 4030609 4008148
15944 4008148 4231698 4102439 4112396 4261196 4117653 4071007 3959598 3704875 3557689 3570455
15934 3570455 3649962 3806780 3852265 3770254 3734990 3747111 3819965 3846901 3881024 4108591 4062111
15923 4062111 4240806 4097129 3982922 4019393 3816835 3729211 3838901 3739535 3749183 3872756
15913 3872756 4185301 4225319 4008790 3805295 3695523 3763612 3838346 3949984 3938597 3979880
15903 3979880 4197338 4036812 4180145 4254959 4186862 4042475 3857234 3846120 3894110 3874083
15893 3874083 3870965 3794956 3933667 3915525 4254943 4299685 4070107 4058354 3965785 3973511 4024906
15882 4024906 3998530 3790818 3718518 3917316 3984490 3845370 3875217 4073071 4061691 3836357
15872 3836357 3926520 3947726 4242018 3910008 3799494 3745361 3742098 3811938 3743618 3861821 3745066
15861 3745066 4041028 4058172 3889992 4013050 3925462 3786686 3852615 4159008 4000659 3994908
15851 3994908 3887326 4013612 3962715 4038973 4151813 4131769 3809805 3740828 3809024 3910330
15841 3910330 3938126 3810241 3826037 3782190 3890246 3954790 3820878 3663131 3753893 3925898
15831 3925898 4077428 4046261 4315225 4158221 4013852 3856515 3642200 3522728 3654913 3836738
15821 3836738 3898321 3894949 3961089 4104914 3951447 3959941 4039418 3998915 3943230 3926301 3700797
15810 3700797 3683904 3831200 3895961 3958812 3942038 3950737 3985767 3959273 3857998 3807730 3829481
15799 3829481 3706190 3880461 3941806 3881440 3807575 3979654 3963897 3979074 3855526 3852128 4029331
15788 4029331 4018721 3977156 4030179 4119922 4120532 4038039 3783957 3708352 3978552 3982883 3967905
15777 3967905 3953864 4107167 4093371 3802570 3773309 3698103 3906486 3987325 3766007 3848205
15767 3848205 3953431 4015074 4137973 4041295 3961427 3840362 3834166 3860858 3949506 3713287 3740693
15756 3740693 3900240 4116517 4137348 4144056 4158451 4243564 4116022 3865457 3802318 3885008 4085867
15745 4085867 4027204 3856909 3861443 3851804 4046512 4016193 3879969 3845678 3794763 3855114 3971138
15734 3971138 4023618 3947177 3922117 4105192 3954145 3569364 3697559 3729193 3879966 3748046
15724 3748046 3789410 4168545 4204530 4204149 4174144 4142714 4180159 4125593 3978416 3914579 3753253
15713 3753253 3915059 3921607 3934708 4041195 3923368 3942330 3924387 3862843 3931604 3854094 3854638
15702 3854638 4121246 4130876 3998198 4010423 4072075 4177731 4183801 3954533 3976485 3926065 3884670
15691 3884670 3756075 3912268 4037238 4117361 4164042 4082835 4066364 4148714 4293843 4019519
15681 4019519 4139105 4343620 4298192 4128954 3955968 4001811 3998056 4068579 4323945 4121381
15671 4121381 4008082 4060922 4144913 4222865 4210270 4127668 4087029 3836727 3721029 3839655
15661 3839655 3903870 4089195 4023787 3940322 4002562 4155388 4164978 4098018 4148018 4039910 3909991
15650 3909991 4029421 4223478 3963295 4102841 4216577 4153789 4281086 4091197 3996896 3941668
15640 3941668 4150352 4095578 3988986 4192749 4188143 4127298 4165931 4263629 4274016 4163089 4011436
15629 4011436 3889039 3866660 3944781 4046703 3787067 3678525 3858124 3730479 3834041 3920508
15619 3920508 3825836 4092657 4246390 4140347 4153238 4106291 4098581 4115913 3969606 4046739 3935915
15608 3935915 3917202 4029404 4267459 4413737 4339209 4294211 4061981 3922505 4110351 4032740
15598 4032740 3916632 4089856 3998971 3884901 3961612 4233199 4234128 3959347 3827103 3824232 4090246
15587 4090246 4072707 3789183 3688482 3842206 3908415 3956702 3928819 4015558 4019313 4106610 4357386
15576 4357386 4198346 4061978 4019453 4182454 4128209 3912582 3959742 4055475 3968100 3757988
15566 3757988 3839318 3927242 4040347 4032748 4001055 4062379 4128867 4097977 4287087 4204417 4132325
15555 4132325 4286330 4230229 4245628 4244748 4163891 4118510 3944412 3831133 3958054 4066600 3832962
15544 3832962 4185535 4121048 4090099 4060685 4035657 4005670 3799682 4009032 3993585 3963404 4053482
15533 4053482 4082092 3950527 4158492 4088962 3934587 4117100 3954464 3866626 3951202 3968753
15523 3968753 4124979 4216134 4258217 4119183 4273314 4351993 4225665 4081494 3973661 3823049
15513 3823049 3950413 4060590 4239608 4228927 4165559 4164794 4079272 3910319 3974213 3989598 3974413
15502 3974413 4053164 4100301 4129366 4001376 3930719 4072314 4023572 4060708 4160688 4007583 3916340
15491 3916340 4086250 4244728 4267520 3897677 3769014 3762756 3938757 4169229 4118959 3859596
15481 3859596 4063884 4268369 4334856 4143595 3922412 3979614 4019014 4118722 3916934 3803230
15471 3803230 3733031 3984555 4102266 4017410 4113438 4357391 4152989 4026648 4051448 3969788
15461 3969788 4091937 4148165 4159824 3967465 3798612 3931390 4242166 4023326 3770583 3828233
15451 3828233 4141232 4163922 4009065 4066859 4146897 4006477 3891722 3980487 4041554 4107115
15441 4107115 4124337 4167304 4163945 4074768 4075705 4002767 4117163 4109071 4012277 3995981 3957062 3990922
15429 3990922 3939305 3972787 4160552 4204442 3999129 4278032 4387193 4179769 3900489 4005885
15419 4005885 4124907 4035358 4028301 4073872 4036645 4309544 4336834 4153394 4233664 4324173 4194677
15408 4194677 4120068 4083373 4213826 4260323 4320146 4134803 4132533 4016892 4102424 4237392 4254227
15397 4254227 4007394 3949316 4140387 4151318 3995496 4056279 4141220 4136964 4124044 4196247 4411017
15386 4411017 4375918 4211343 4164620 4048257 3867570 3897773 3837442 4111043 4020987 3971178
15376 3971178 4222658 4246997 4320602 4296400 4232769 4256889 4150837 4195528 4052055 4039787 4223426
15365 4223426 4255007 4208133 4243659 3988849 4167094 4218696 4276338 4330472 4116409 4214204 4163769
15354 4163769 4118202 4185123 4115684 4162533 4334740 4196311 4109042 3944034 4006425 4018841 4065744
15343 4065744 4197399 4379042 4258801 4191910 4200374 4020341 4046227 4079810 4101017 4112749 4190790
15332 4190790 4274618 4081768 4178380 4234482 3983672 3922448 3985855 3905853 3982890 4137113 4106459
15321 4106459 4170974 4212233 4277682 4184679 3967279 3871304 3948694 3942346 4072064 4079108 4100517
15310 4100517 4159709 4264936 4126570 4037611 4010892 4098968 3998945 4083569 4167494 3988175
15300 3988175 4005695 4159615 4355841 4238299 4295524 4382406 4208658 4121213 4157728 4190762
15290 4190762 4159537 4397059 4336235 4263782 4195938 4056126 3920616 3899384 4003032 3968251
15280 3968251 4017971 4113778 3931730 4024473 4366262 4288259 4078697 4176467 4254719 4264103 4190406
15269 4190406 4238966 4242296 4270680 4329842 4315890 4127155 4060524 4075294 4061290 4121312 4122354
15258 4122354 4195600 4250775 4236689 4357823 4322229 4298649 3982402 4038186 4275431 4390058
15248 4390058 4451174 4421112 4407099 4333095 4365017 4229409 4084859 3988358 4243186 4246460 4345640
15237 4345640 4388715 4115883 4079694 4258638 4110745 4278519 4239538 4132951 3900086 3908295
15227 3908295 4103019 4330041 4190909 4144938 3890450 4041896 4201527 4296078 4302593 4070889
15217 4070889 4088118 4290516 4297347 4109561 4115297 4047381 4227610 4215599 4134499 3904996 4114569
15206 4114569 4375977 4456819 4301817 4120003 4478859 4531678 4423518 4197734 4126774 4233292
15196 4233292 4207745 4153946 4101899 4150966 4280727 4345971 4206261 4137978 4065424 4235375 4207975
15185 4207975 3987832 3969345 4085987 4218764 4140914 4392560 4130365 4157193 4353415 4405164
$$ [...]
##END NTUPLES=NMR SPECTRUM
##END=
